##TITLE=abcd
##JCAMPDX= 6.0         $$ Bruker NMR JCAMP-DX V2.0
##DATA TYPE= NMR FID
##DATA CLASS= NTUPLES
##ORIGIN= UXNMR, Bruker Analytische Messtechnik GmbH
##OWNER= root
$$ XWIN-NMR		Version 3.5
$$ Sun Jul 13 12:51:20 2025 Russian Standard Time (UT+4h)  servis@DPX200
##.OBSERVE FREQUENCY= 200.131235884673
##.OBSERVE NUCLEUS= ^1H
##.DELAY= (6, 6)
##.ACQUISITION MODE= SIMULTANEOUS
##.ACQUISITION SCHEME= undefined
##.AVERAGES= 32
##.DIGITISER RES= 18
##SPECTROMETER/DATA SYSTEM= spect
##.PULSE SEQUENCE= zg
##.SOLVENT NAME= CDCl3
##.SHIFT REFERENCE= (INTERNAL, CDCl3, 0, 16.5164)
##AUDIT TRAIL= $$ (NUMBER, WHEN, WHO, WHERE, WHAT)
$$ ##TITLE= Audit trail, XWIN-NMR		Version 3.5
$$ ##JCAMPDX= 5.01
$$ ##ORIGIN= Bruker BioSpin GmbH
$$ ##OWNER= servis
$$ F:\spectra/data/av/nmr/H1/1/audita.txt
$$ ##AUDIT TRAIL=  $$ (NUMBER, WHEN, WHO, WHERE, WHAT)
(   1,<2025-07-13 12:49:21.67 +0400>,<servis>,<DPX200>,
      <created by zg, POWCHK disabled, PULCHK disabled
       configuration hash MD5:
       00 E9 B6 7A A2 85 ED C7 34 08 36 98 17 FE 4E 26
       data hash MD5: 32K
       39 F0 25 C7 D2 53 D6 F5 8A 20 08 FC 76 D4 51 C1>)
$$ ##END=
$$ 
$$ hash MD5
$$ 53 07 D6 F4 A1 7C 71 71 98 FE 30 98 20 29 FD AC
##$RELAX= 
##$RELAX= 
##$RELAX= 
##$RELAX= 
##$RELAX= 
##$RELAX= 
##$RELAX= 
##$RELAX= 
$$ Bruker specific parameters
$$ --------------------------
##$DU= <F:\spectra>
##$EXPNO= 1
##$NAME= <H1>
##$PROCNO= 1
##$TYPE= <nmr>
##$USER= <av>
##$AMP= (0..31)
100 100 100 100 100 100 100 100 100 100 100 100 100 100 100 100 100 100 
100 100 100 100 100 100 100 100 100 100 100 100 100 100 
##$AQSEQ= 0
##$AQ_mod= 1
##$AUNM= <au_zg>
##$AUTOPOS= <>
##$BF1= 200.13
##$BF2= 200.13
##$BF3= 200.13
##$BF4= 200.13
##$BF5= 500.13
##$BF6= 500.13
##$BF7= 500.13
##$BF8= 500.13
##$BYTORDA= 1
##$CFDGTYP= 0
##$CFRGTYP= 5
##$CHEMSTR= <none>
##$CNST= (0..31)
1 1 145 1 1 1 1 1 1 1 1 1 1 1 1 1 1 1 1 1 1 1 1 1 1 1 1 1 1 1 1 1 
##$CPDPRG= <>
##$CPDPRG1= <>
##$CPDPRG2= <>
##$CPDPRG3= <>
##$CPDPRG4= <mlev>
##$CPDPRG5= <mlev>
##$CPDPRG6= <mlev>
##$CPDPRG7= <mlev>
##$CPDPRG8= <mlev>
##$CPDPRGB= <>
##$CPDPRGT= <>
##$D= (0..31)
0 2 0 0 0 0 0 0 0 0.06 0 0 0 0 0 0 0.0002 0 0 0 0 0 0 0 0 0 0 0 0 0 0 
0 
##$DATE= 1752396561
##$DBL= (0..7)
120 120 120 120 120 120 120 120 
##$DBP= (0..7)
150 150 150 150 150 150 150 150 
##$DBP07= 0
##$DBPNAM0= <>
##$DBPNAM1= <>
##$DBPNAM2= <>
##$DBPNAM3= <>
##$DBPNAM4= <>
##$DBPNAM5= <>
##$DBPNAM6= <>
##$DBPNAM7= <>
##$DBPOAL= (0..7)
0.5 0.5 0.5 0.5 0.5 0.5 0.5 0.5 
##$DBPOFFS= (0..7)
0 0 0 0 0 0 0 0 
##$DE= 6
##$DECBNUC= <off>
##$DECIM= 32
##$DECNUC= <off>
##$DECSTAT= 4
##$DIGMOD= 1
##$DIGTYP= 9
##$DL= (0..7)
0 120 120 120 120 120 120 120 
##$DP= (0..7)
150 150 150 150 150 150 150 150 
##$DP07= 0
##$DPNAME0= <>
##$DPNAME1= <>
##$DPNAME2= <>
##$DPNAME3= <>
##$DPNAME4= <>
##$DPNAME5= <>
##$DPNAME6= <>
##$DPNAME7= <>
##$DPOAL= (0..7)
0.5 0.5 0.5 0.5 0.5 0.5 0.5 0.5 
##$DPOFFS= (0..7)
0 0 0 0 0 0 0 0 
##$DQDMODE= 0
##$DR= 18
##$DS= 0
##$DSLIST= <SSSSSSSSSSSSSSS>
##$DSPFIRM= 0
$$ [...]
##$SUBNAM0= <"">
##$SUBNAM1= <"">
##$SUBNAM2= <"">
##$SUBNAM3= <"">
##$SUBNAM4= <"">
##$SUBNAM5= <"">
##$SUBNAM6= <"">
##$SUBNAM7= <"">
##$SUBNAM8= <"">
##$SUBNAM9= <"">
##$SW= 20.6817932712277
##$SWIBOX= (0..15)
0 0 3 0 0 0 0 0 0 0 0 0 0 0 0 0 
##$SW_h= 4139.07284768212
##$TD= 32768
##$TD0= 1
##$TE= 0
##$TE2= 300
##$TE3= 300
##$TEG= 300
##$TL= (0..7)
0 120 120 120 120 120 120 120 
##$TP= (0..7)
150 150 150 150 150 150 150 150 
##$TP07= 0
##$TPNAME0= <>
##$TPNAME1= <>
##$TPNAME2= <>
##$TPNAME3= <>
##$TPNAME4= <>
##$TPNAME5= <>
##$TPNAME6= <>
##$TPNAME7= <>
##$TPOAL= (0..7)
0.5 0.5 0.5 0.5 0.5 0.5 0.5 0.5 
##$TPOFFS= (0..7)
0 0 0 0 0 0 0 0 
##$TUNHIN= 0
##$TUNHOUT= 0
##$TUNXOUT= 0
##$USERA1= <user>
##$USERA2= <user>
##$USERA3= <user>
##$USERA4= <user>
##$USERA5= <user>
##$V9= 5
##$VALIST= <valist>
##$VCLIST= <CCCCCCCCCCCCCCC>
##$VD= 0
##$VDLIST= <DDDDDDDDDDDDDDD>
##$VPLIST= <PPPPPPPPPPPPPPP>
##$VTLIST= <TTTTTTTTTTTTTTT>
##$WBST= 1024
##$WBSW= 30
##$XGAIN= (0..3)
0 0 0 0 
##$XL= 0
##$YL= 0
##$YMAX_a= 1509827
##$YMIN_a= -1449760
##$ZGOPTNS= <>
##$ZL1= 120
##$ZL2= 120
##$ZL3= 120
##$ZL4= 120
##$ABSF1= 10
##$ABSF2= 0
##$ABSG= 5
##$ABSL= 3
##$ALPHA= 0
##$AQORDER= 0
##$ASSFAC= 0
##$ASSFACI= 0
##$ASSFACX= 0
##$ASSWID= 0
##$AUNMP= <proc_1d>
##$AZFE= 0.1
##$AZFW= 0.1
##$BCFW= 1
##$BC_mod= 2
##$BYTORDP= 0
##$COROFFS= 0
##$CY= 19
##$DATMOD= 1
##$DC= 2
##$DFILT= <>
##$DTYPP= 0
##$F1P= 11.0000007629395
##$F2P= -0.999999237060547
##$FCOR= 0.5
##$FTSIZE= 0
##$FT_mod= 4
##$GAMMA= 1
##$GB= 1
##$INTBC= 1
##$INTSCL= 1
##$ISEN= 128
##$LB= 0.05
##$LEV0= 0
##$LPBIN= 0
##$MAXI= 10000
##$MC2= 0
##$MEAN= 0
##$ME_mod= 0
##$MI= 0
##$NCOEF= 0
##$NC_proc= 0
##$NLEV= 6
##$NOISF1= 0
##$NOISF2= 0
##$NSP= 1
##$NTH_PI= 0
##$NZP= 0
##$OFFSET= 16.51637
##$PC= 1
##$PHC0= -272.4572
##$PHC1= 1.101538
##$PH_mod= 0
##$PKNL= yes
##$PPARMOD= 0
##$PSCAL= 4
##$PSIGN= 0
##$REVERSE= no
##$SF= 200.13
##$SI= 16384
##$SIGF1= 0
##$SIGF2= 0
##$SINO= 400
##$SIOLD= 16384
##$SREGLST= <1H.CDCl3>
##$SSB= 0
##$STSI= 0
##$STSR= 0
##$SW_p= 4139.07284768211
##$SYMM= 0
##$S_DEV= 0
##$TDeff= 0
##$TDoff= 0
##$TI= <>
##$TILT= no
##$TM1= 0
##$TM2= 0
##$TOPLEV= 0
##$USERP1= <user>
##$USERP2= <user>
##$USERP3= <user>
##$USERP4= <user>
##$USERP5= <user>
##$WDW= 1
##$XDIM= 8192
##$YMAX_p= 0
##$YMIN_p= 0
$$ End of Bruker specific parameters
$$ ---------------------------------
##NTUPLES= NMR FID
##VAR_NAME=  TIME,          FID/REAL,        FID/IMAG
##SYMBOL=    X,             R,               I
##VAR_TYPE=  INDEPENDENT,   DEPENDENT,       DEPENDENT
##VAR_FORM=  AFFN,          ASDF,            ASDF
##VAR_DIM=   16384,         16384,           16384
##UNITS=     SECONDS,       ARBITRARY UNITS, ARBITRARY UNITS
##FACTOR=    0.0002416,     1,               1
##FIRST=     0,             0,               0
##LAST=      3.9581328,     0,               0
##MIN=       0,             -1449760,        0
##MAX=       3.9581328,     1509827,         0
$$ Real data points
##PAGE= N=1
##DATA TABLE= (X++(R..R)), XYDATA
$$ plain form
0 0 0 0 0 0 0 0 0 0 0 0 0 0 0 0 0 0 0 0 0 0 0 0 0 0 0 0 -3 1 -1 6 -4 6 -7 7 -9 8 -6 8 -6 4 -6 5 0 2 -3 -2 3 -3 4 -6 8
51 8 -3 6 0 -4 14 -20 43 -69 105 -170 264 -409 655 -1080 1882 -3592 7940 -23683 192791 1509827
71 1509827 1321847 -305985 -1298309 -808458 281317 721749 390431 -23075 -127985 -216470
81 -216470 -414600 -298411 333390 837939 497499 -473390 -1028021 -475322 621581 997811
91 997811 255706 -646665 -717154 -119535 355143 365928 158671 -6949 -142878 -299161
101 -299161 -276550 115413 538826 397390 -235548 -579614 -229611 298008 350771 -6486
111 -6486 -202220 -25168 104250 -128572 -325967 743 510262 438298 -227392 -666007
121 -666007 -315084 416703 660881 139291 -482136 -450670 72872 321655 64695 -164079
$$ packed form
0@%%%%%%%%%%%%%%%%%%%%%%%%%%lMkPj0J0j3J4j6J7j4J4j4J0j0J1nKnJNoPj0J4
51Hj1RomJ8l4O3j12J74k75M34o73J064j735K962n474J1532l1623K16474J317036
71A509827j87980j627832r92324M89851J089775M40432l31318m13506j04910q8485
81b16470j98130J16189O31801N04549l40440r70889n54631N52699J096903L76230
91I97811p42105r02371p0489N97619M74678J0785k07257j65620j35929j56283
101b99161K2611L91963M23413j41436o32938l44066L50003N27619N2763l57257
111f486j95734J77052J29418k32822j97395L26710N09519p1964o65690m38615
121f66007L50923P31787K44178n21590o21427L1466N23542K48783k56960k28774
$$ plain form
131 -164079 9590 229781 15073 -415638 -356866 303145 725610 243388 -592982 -705372
141 -705372 37364 688524 497283 -211261 -564266 -248556 209375 261883 35699 -50885
151 -50885 13477 -39047 -186835 -134525 167614 362377 141568 -284071 -385351 -12453 364328
162 364328 279704 -116997 -318730 -136968 129527 152654 -10758 -73116 18244 34575 -87326
173 -87326 -98515 108280 235578 34546 -251846 -201936 151735 321612 44204 -317822
183 -317822 -264048 133128 331890 83551 -256463 -245898 65121 250495 102003 -125875
193 -125875 -115593 59881 96780 -48124 -104704 56028 188829 35320 -244094 -244597 94520
204 94520 342795 152073 -243325 -332283 -12676 291981 217462 -80415 -197329 -46153
$$ packed form
131a64079J73669K20191k14708m30711N8772O60011M22465m82222q36370j12390
141g05372P42736O51160j91241p08544l53005L15710M57931N2508k26184q6584
151e0885O4362n2524j47788N2310L02139J94763k20809m25639j01280L72898L76781
162C64328q4624l96701k01733J81762K66495K3127j63412o2358R1360J6331j21901
173h7326j1189K06795J27298k01032k86392M9910L53671J69877k77408l62026
183c17822N3774L97176J98762k48339l40014J0565L11019J85374j48492k27878
193a25875J0282J75474L6899j44904n6580J60732J32801j53509k79414n03L39117
204I4520K48275j90722l95398q8958L19607L04657p4519k97877j16914J51176
$$ plain form
214 -46153 93861 48367 -31465 10012 71318 -3633 -138810 -123428 65012 190176 70705
225 70705 -148517 -177831 15033 175025 113745 -60626 -118005 -5539 95514 36007 -78063
236 -78063 -54288 66773 75557 -55390 -124929 -21959 110120 81977 -64998 -111448 18668
247 18668 125983 41885 -96744 -69917 78149 119305 -12575 -140128 -87271 82519 139152
258 139152 1714 -137775 -95544 46604 98721 30212 -41516 -31824 22717 26515 -27304 -27503
270 -27503 57815 87649 -23246 -134357 -81285 78855 143346 21518 -140902 -130538 40360
281 40360 138566 53837 -57483 -53073 8163 23500 3220 4923 34597 36278 -33556 -98212
293 -98212 -43794 79697 101120 -12462 -113458 -85675 34908 117614 66349 -55251 -85137
$$ packed form
214d6153J40014m5494p9832M1477O1306p4951j35177J5382J88440J25164j19471
225G0705k19222k9314J92864J59992o1280j74371n7379J12466J01053n9507j14070
236g8063K3775J21061Q784j30947o9539J02970J32079k8143j46975m6450J30116
247A8668J07315q4098j38629K6827J48066M1156j31880j27553N2857J69790N6633
258A39152j37438j39489M2231J42148N2117o8509p1728R692N4541L798n3819j99
270b7503Q5318K9834j10895j11111N3072J60140O4491j21828j62420J0364J70898
281D0360R8206q4729j11320M410O1236J5337k0280J703K9674J681o9834o4656
293i8212N4418J23491K1423j13582j00996K7783J20583Q2706n1265j21600k9886
$$ plain form
304 -85137 635 62063 30943 -11443 -6589 8182 -10026 -45548 -38734 32582 76384 3032
316 3032 -96558 -66537 53329 96722 24782 -53892 -51520 15181 58196 21022 -33416 -20389
328 -20389 18660 4926 -32079 -26675 7767 26497 12616 -26068 -39134 10061 56927 24862
340 24862 -33689 -26491 24200 41099 6166 -38482 -34638 19911 42263 -15154 -61018 -18389
352 -18389 39739 28488 -14075 -23720 878 25526 20080 -9268 -10949 22738 25115 -18656 -37765
365 -37765 -6322 22244 17117 -11146 -38846 -28554 21900 43826 4459 -30981 -13657 19395
377 19395 27437 12505 -7858 -9546 7280 2320 -24284 -16113 22037 19303 -26186 -41585 -6808
390 -6808 31208 34327 884 -31279 -16782 25028 33526 8225 -6881 -8104 -13414 -11088 1434
$$ packed form
304h5137Q5772O1428l1120m2386M854J4771j8208l5522O814P1316M3802p3352
316C032r9590L0021J19866M3393p1940p8674K372O6701M3015l7174n4438J3027
328b0389L9049j3734l7005N404L4442J8730j3881l8684j3066M9195M6866l2065
340B4862n8551P198N0691J6899l4933m4648L844N4549K2352n7417m5864M2629
352a8389N8128j1251m2563r645K4598K4648n446k9348j681L3687K377m3771j9109
365c7765L1443K8566n127k8263k7700J0292N0454K1926l9367l5440J7324L3052
377A9395Q042j4932k0363j688J6826m960k6604Q171L8150k734m5489j5399L4777
390f808L8016L119l3443l2163J4497M1810Q498k5301j5106j223n310K326J2522
$$ plain form
403 1434 5330 3111 1029 -14509 -29290 -10258 27126 35423 9385 -19305 -23980 3519 34382
416 34382 25215 -9259 -18676 -6645 -9062 -15264 105 18178 10851 -13567 -29842 -18452 15785
429 15785 36972 22167 -3522 -13174 -12099 -6140 11813 24936 12989 -13349 -30937 -30106 -7923
442 -7923 23529 32337 6777 -27028 -36121 -10902 29879 47332 23763 -13007 -27107 -21591 -7231
455 -7231 15829 35453 23626 -21460 -59400 -46070 12942 60126 46093 -12039 -52418 -39128
467 -39128 8638 50283 52576 13078 -33686 -48466 -22927 16301 37415 27990 -3964 -38114
479 -38114 -51465 -26618 27358 64495 42915 -19639 -61472 -42536 18737 65571 54801 -2453
491 -2453 -54796 -59762 -15800 39116 54186 14178 -36595 -49273 -23609 8953 32269 40264 24800
$$ packed form
403A434L896k219k082j5538j4781J9032L7384Q297k6038k8690m675K7499L0863
416C4382r167l4474r417J2031k417o202J5369J8073p327k4418j6275J1390L4237
429A5785K1187j4805k5689r652J075N959J7953J3123j1947k6338j7588Q31K2183
442g923L1452Q808k5560l3805r093K5219M0781J7453k3569l6770j4100N516J4360
455g231K3060J9624j1827m5086l7940J3330N9012M7184j4033n8132m0379J3290
467c9128M7766M1645K293l9498m6764j4780K5539L9228K1114r425l1954l4150
479c8114j3351K4847N3976L7137k1580o2554m1833J8936O1273M6834j0770n7254
491b453n2343m966M3962N4916J5070m0008n0773j2678K5664L2562K3316P995j5464
$$ plain form
504 24800 -10923 -44153 -42777 5466 62512 63766 -851 -67424 -72889 -16305 52656 70199 15106
517 15106 -54133 -63370 -12383 37880 46640 23590 -3280 -16450 -22172 -25450 -5796 40768 59812
530 59812 9149 -64487 -80734 -22131 58032 84922 25483 -61269 -81664 -19392 54269 74280
542 74280 31767 -29955 -52831 -23627 10754 20346 23066 22109 -5204 -45841 -54392 -14746 46388
555 46388 74949 30819 -52714 -84906 -27838 57312 91036 43820 -47083 -92234 -38614 47312
567 47312 66579 15429 -34042 -41357 -17996 4759 8706 10810 28880 29252 -15705 -57237 -34544
580 -34544 33944 77278 47588 -38322 -95581 -50299 50459 85073 21606 -54974 -64582 -10609
592 -10609 41245 35163 -5443 -13189 13488 13590 -20034 -29965 5026 43960 40310 -14351 -68681
$$ packed form
504B4800l5723l3230J376M8243N7046J254o4617o6573n465N6584O8961J7543n5093
517A5106o9239r237N0987N0263Q760k3050k6870j3170n722l278J9654M6564J9044
530E9812n0663p3636j6247N8603Q0163K6890n9439q6752k0395O2272P3661K0011
542G4280m2513o1722k2876K9204L4381R592K720r57k7313m0637q551L9646O1134
555D6388K8561m4130q3533l2192N7068Q5150L3724m7216r0903m5151N3620Q5926
567D7312J9267n1150m9471p315K3361K2755L947K104J8070L72m4957m1532K2693
580c4544O8488M3334k9690q5910n7259M5282J00758L4614o3467p6580r608N3973
592a0609N1854o082m0606p746K6677J02l3624r931L4991L8934l650n4661n4330
$$ plain form
605 -68681 -53064 23603 70710 37581 -30573 -64887 -34874 31607 63550 25871 -26384 -30677
617 -30677 -3585 11474 9195 3047 1304 5047 -769 -24542 -33098 -1676 37458 37154 -2408 -44789
631 -44789 -45664 12194 71047 51857 -27762 -68800 -28105 37707 54187 7476 -45731 -40494 10030
644 10030 31451 3082 -22323 -10510 15527 21068 -1363 -24085 -8035 32637 35791 -12546
656 -12546 -46426 -20732 29165 41614 -280 -49472 -41534 18077 50701 15793 -32317 -33357
668 -33357 4543 34887 28632 -5265 -26348 -11816 12332 14840 1518 -9564 -12300 -5004 2634
681 2634 -2756 -9766 1899 17389 10773 -9273 -16567 -2748 19085 27594 7505 -23853 -29190
694 -29190 -3097 23657 23595 -4133 -33306 -28433 8255 29503 11201 -13364 -10844 8294 14535
$$ packed form
605f8681J5617P6667M7107l3129o8154l4314L0013O6481L1943l7679n2255m293
617c0677K7092J5059k279o148j743L743n816k3773q556L1422L9134l04l9562m2381
631d4789q75N7858N8853j9190p9619m1038M0695O5812J6480m6711n3207N237N0524
644A0030K1421k8369k5405J1813K6037N541k2431k2722J6050M0672L154m8337
656a2546l3880K5694M9897J2449m1894m9192P938N9611L2624l4908m8110j040
668c3357L7900L0344o255l3897k1083J4532K4148K508j3322j1082k736P296P638
681B634n390p010J1665J5490o616k0046p294J3819K1833Q509k0089l1358n337
694b9190K6093K6754o2k7728k9173M873L6688K1248j8302k4565K520J9138O241
$$ plain form
707 14535 557 -12413 -1350 21325 18734 -14924 -35813 -15873 19689 29684 4170 -27796
719 -27796 -30241 259 27312 22655 -115 -11686 -6460 2481 4108 1703 5390 11937 2209 -21701
733 -21701 -28613 -4696 23467 23640 -1607 -24910 -22837 1791 24540 26771 9047 -13627 -23197
746 -23197 -9877 14534 24304 9688 -14224 -25927 -17714 2837 17644 14242 -624 -13036 -13533
759 -13533 -2429 12334 18552 12559 -868 -13877 -16278 -2224 16309 16785 -3538 -23099 -21526
772 -21526 10 19329 14756 -5215 -13307 -3416 6822 8498 6470 4348 725 -2499 -5090 -5064
786 -5064 107 3952 -396 -6843 -7497 -3656 1907 6449 3866 -2841 -1513 7010 7095 -140 -1723 1570
802 1570 2665 -213 -4732 -7048 -2878 2424 -540 -4584 -762 1562 -1413 -873 5025 6635 3611
$$ packed form
707A4535j3978j2970J1063K2675k591l3658k0889J9940L5562R995k5514l1966
719b7796k445L0500K7053m657k2770j1571N226Q941J627k405L687O547r728k3910
733b1701o912K3917K8163J73k5247k3303K073K4628K2749K231j7724k2674r570
746b3197J3320K4411R770j4616k3912j1703Q213K0551J4807l402j4866j2412m97
759a3533J1104J4763O218n993j3427j3009k401J4054J8533M76k0323j9561J573
772b1526K1536J9319m573j9971q092R891J0238J676k028k122l623l224k591K6
786e064N171L845m348o447o54L841N563M542k583o707J328Q523Q5p235j583L293
802A570J095k878m519k316M170N302k964m044L822K324k975N40N898J610l024
$$ plain form
817 3611 1371 -1563 -1966 3295 3660 -3579 -6577 -2780 -2025 -1522 1446 -650 -5185 -1479 5221 4675
833 4675 2192 2860 1717 -301 1383 1673 -619 -166 -2055 -7746 -5480 4915 4744 -5385 -6560 -903
849 -903 2321 5664 7973 2419 -3110 -826 999 1108 4758 3422 -6294 -9682 -3262 488 1476 3818
865 3818 -274 -8505 -5230 6095 9543 5946 1979 -4182 -5292 2733 6794 969 -2380 -1630 -6512
880 -6512 -7819 930 5950 753 -3035 -2880 -2182 3707 8708 4097 -2190 -875 285 -1550 2223 4594
896 4594 -3108 -7713 -2849 -440 -2244 -73 2379 -1124 -1406 2103 2730 3381 4982 767 -4047 835
912 835 4335 -1199 -4273 -1184 -1359 -4434 -2482 -129 -734 1337 2659 -689 -743 4410 3597 52 1883
929 1883 2602 -899 -1978 33 -2230 -3932 -147 24 -3989 -3310 241 2699 4449 3140 -2676 -2814
$$ packed form
817C611k240k934m03N261L65p239k998L797P55N03K968k096m535L706O700n46
833D675k483O68j143k018J684K90k292M53j889n691K266J0395j71j0129j175N657
849i03L224L343K309n554n529K284J825J09L650j336r716l388O420L750R88K342
865C818m092q231L275J1325L448l597l967o161j110Q025M061n825l349P50m882
880f512j307Q749N020n197l788J55O98N889N001m611o287J315J160j835L773K371
896D594p702m605M864K409j804K171K452l503k82L509O27O51J601m215m814M882
912H35L500n534l074L089j75l075J952K353o05K071J322l348n4N153q13l545J831
929A883P19l501j079K011k263j702L785J71m013O79L551K458J750j309n816j38
$$ plain form
945 -2814 4918 7190 891 -1950 71 -2072 -4246 -2416 -332 652 482 -3168 -6177 -627 6762 6242
961 6242 1165 -1065 -1680 245 5081 5728 -319 -4295 -3251 -3567 -3768 -312 2366 1201 -2156 -5226
977 -5226 -3937 4284 10000 5088 -3627 -3386 2094 3898 1855 -662 -2128 -1821 -2790 -5436 -4014 2178
993 2178 5020 442 -4230 -3642 917 6130 7416 2806 -2028 -2382 -300 434 35 -108 -749 -2276 -4858
1010 -4858 -5520 -469 5342 4121 -1967 -3400 1115 4973 3970 1598 1695 2569 -791 -6727 -6100 2675
1026 2675 7215 119 -9686 -9764 -427 8784 7534 -2113 -5941 1013 7895 4783 -2278 -3821 1356
1041 1356 5783 163 -9912 -9635 3322 10192 462 -11285 -9331 3657 12720 6970 -5144 -6293
1055 -6293 4231 9170 1867 -5668 -4015 1108 3189 -134 -6569 -7694 -637 4639 2996 -1113 -2258
$$ packed form
945b814P732K272o299k841K021k143k174J830K084R84j70l650l009N550P389n20
961F242n077k230o15J925M836O47o047l976J044l16k01L456K678j165l357l070
977e226J289Q221N716m912q715K41N480J804k043k517j466L07r69k646J422O192
993B178K842m578m672N88M559N213J286m610m834l54K082P34l99j43o41j527k582
1010d858o62N051N811j221o088j433M515L858j003k372R7Q74l360n936O27Q775
1026B675M540p096r805p8R337R211j250r647l828O954O882l112p061j543N177
1041A356M427n620j0075K77J2957O870r730j1747J954J2988R063n750j2114j149
1055f293J0524M939p303p535J653N123K081l323o435j125P057N276j643m109j145
$$ plain form
1070 -2258 -1008 2933 6298 4280 -609 -1697 -1024 -840 1201 1219 -4017 -6346 -541 3848 -990 -6878
1086 -6878 -4906 5221 12770 6220 -9799 -12106 5867 18030 7228 -11458 -14686 -1484 11383
1099 11383 7143 -10077 -14870 920 13413 3803 -10821 -9074 6942 18140 9058 -12828 -17914
1112 -17914 3179 21055 10212 -12731 -18857 -5163 10273 9876 -4999 -11776 -587 9532 3198
1125 3198 -5518 -2052 6424 9008 3683 -6240 -10563 -1403 9939 8023 -2777 -10850 -11882 -3484
1139 -3484 9898 12113 529 -9509 -7851 1198 10074 11293 20 -9290 -3437 6041 2414 -6724
1153 -6724 -6429 2523 8560 1102 -14562 -15976 7578 25318 10726 -16886 -20841 1025 22474
1166 22474 18349 -6629 -21328 -6809 13016 8831 -8589 -11678 1084 10350 3645 -11757 -13719
$$ packed form
1070b258J250L941L365k018m889j088O73J84K041J8n236k329N805M389m838n888
1086f878J972J0127P549o550j6019k307J7973J2163j0802j8686l228J3202J2867
1099A1383m240j7220m793J5790J2493r610j4624J747J6016J1198r082k1886n086
1112a7914K1093J7876j0843k2943o126J3694J5436l97j4875o777J1189J0119o334
1125C198q716L466Q476K584n325r923m323R160J1342j916j0800q073j032Q398
1139c484J3382K215j1584j0038J658R049Q876J219j1273r310N853R478l627r138
1153f724K95Q952O037p458j5664j414K3554J7740j4592k7612l955K1866K1449
1166B2474m125k4978j4699J4519J9825m185j7420l089J2762R266o705j5402j962
$$ plain form
1179 -13719 6345 22695 9881 -14699 -17755 1583 17662 13694 -4709 -16841 -8607 5860
1191 5860 6178 -2564 -2395 1209 -563 -2810 -1700 1101 5595 7347 1422 -4807 -3855 -293 851 3968
1207 3968 5312 -2330 -11143 -9529 1621 10763 9376 -3416 -14604 -6735 10834 14994 1541 -8417
1221 -8417 -4591 4792 6212 -3655 -10403 -1006 12154 4841 -14166 -16052 3042 18332 11543 -8857
1235 -8857 -17823 -2970 16775 14265 -4286 -12391 -2561 6987 4149 -5466 -7674 1319 8269 63
1249 63 -11975 -8132 7660 13244 3471 -8406 -7347 3443 10011 4004 -4771 -3945 1256 -17 -4184
1264 -4184 -2565 2987 3745 -2145 -7352 -3466 5638 8413 506 -4315 -571 4572 2603 -2818 -3057
1279 -3057 2271 4643 -1621 -9054 -6255 4547 8588 -222 -9192 -6099 5823 10537 1977 -7148
$$ packed form
1179a3719K0064J6350j2814k4580l056J9338J6079l968j8403j2132Q234J4467
1191E860L18q742J69L604j772k247J110K801M494J752n925o229R52L562J144L117
1207C968J344p642q813J614J1150R142j387j2792j1188P869J7569M160j3453r958
1221h417L826R383J420r867o748R397J3160p313j9007j886J9094J5290o789k0400
1235h857q966J4853J9745k510j8551q105R830R548k838r615k208Q993O950q206
1249F3j2038L843J5792N584r773j1877J059J0790O568o007q775Q26N201j273m167
1264d184J619N552P58n890n207L886R104K775p907m821L744N143j969n421k39
1279c057N328K372o264p433K799J0802M041q810q970L093J1922M714q560r125
$$ plain form
1293 -7148 -3760 6685 6991 -3300 -8060 -560 7367 3321 -8093 -10593 443 9393 4380 -6479
1307 -6479 -6957 2785 9377 4531 -4635 -4913 3420 7106 -391 -7538 -3621 4202 4075 -4162 -8631 -2687
1323 -2687 6994 6496 -3582 -6954 1274 8720 4716 -3617 -4664 1811 6292 945 -7178 -5356 3465
1338 3465 4322 -3413 -6965 -1020 5473 4650 -1614 -5135 211 7609 5211 -3418 -4969 1531 4782
1353 4782 513 -5181 -5280 835 4759 -611 -6890 -2301 6831 5847 -2217 -5150 694 6752 5698 -2612
1369 -2612 -6730 57 6346 885 -7053 -5533 2368 4564 -63 -5229 -3495 4595 7717 -9 -6262
1384 -6262 -1051 6729 4951 -1675 -5657 -2875 3299 3701 -4215 -7519 -151 6072 1509 -4546 -3282
1399 -3282 2884 6476 2828 -3956 -3712 4483 6656 -1514 -6420 -1926 2904 1206 -3212 -4958 -1138
$$ packed form
1293g148L388J0445L06j0291m760P500P927m046j1414k500J1036Q950n013j0859
1307f479m78R742O592m846r166k78Q333L686p497p147L917P823j27q237m469N944
1323b687R681m98j0078l372Q228P446m004q333j047O475M481n347q123J822Q821
1338C465Q57p735l552N945O493q23o264l521N346P398k398q629j551O500L251
1353D782m269n694r9O115L924n370o279M589R132r84q064k933N844O058j054q310
1369b612m118O787O289n461p938J520P901K196m627n166J734Q090L122p726o253
1384f262N211P780j778o626l982K782O174M02p916l304P368O223m563o055J264
1399c282O166L592l648o784K44Q195K173q170m906M494M830j698m418j746L820
$$ plain form
1414 -1138 4321 3244 -3580 -3852 3396 6509 1768 -2483 -2072 1763 4084 482 -5554 -4351 2679
1429 2679 3237 -3193 -5139 -260 3777 2836 -1491 -3581 1193 7223 3734 -4324 -3829 2309 3873 -824
1445 -824 -4334 -3683 698 3174 -984 -5309 -1559 4528 3267 -1469 -2374 835 4551 4145 -1409 -5055
1461 -5055 -472 4562 1609 -4633 -4258 368 2537 244 -3175 -2443 2851 5254 310 -3685 145
1476 145 4755 3180 -1511 -3416 -1282 1920 1882 -2615 -4430 -104 2687 -38 -2166 -648 1925 3105
1492 3105 1493 -1489 -1214 2599 3239 -996 -3241 -960 1368 184 -1959 -3089 -1046 2514 1472
1507 1472 -2373 -1487 3274 3970 337 -2114 -497 1948 2471 -442 -3464 -1546 1576 895 -2549 -2761
1523 -2761 -268 1780 2042 -344 -1718 469 3810 2179 -1515 -1869 754 2016 295 -2074 -2829 -570
$$ packed form
1414a138N459j077o824k72P248L113m741m251M11L835K321l602o036J203P030
1429B679N58o430j946M879M037r41m327k090M774O030l489q058M95O138J564m697
1445h24l510O51M381K476m158m325L750O087j261m736r05L209L716m06n554l646
1461e055M583N034k953o242L75M626K169k293l419P32N294K403m944l995L830
1476A45M610j575m691j905K134L202l8m497j815M326K791k725k128J518K573J180
1492C105j612k982K75L813O40m235k245K281K328j184k143j130K043L560j042
1507A472l845Q86M761O96l633k451J617K445N23k913l022J918L122o81l444k12
1523b761K493K048K62k386j374K187L341j631l694l54K623J262j721k369p55K259
$$ plain form
1539 -570 1386 -412 -2859 -971 1983 1866 196 -450 488 1818 1182 -194 -969 716 1032 -838 -2067
1556 -2067 -1447 -168 162 -175 -935 -699 1228 1612 316 -114 861 1500 1361 -17 -1077 -429 1058 263
1574 263 -2339 -2569 -368 900 706 -401 -1241 203 1310 1344 656 144 879 817 161 -3 -894 -819 -93
1593 -93 -300 -1171 -1576 -555 349 952 899 54 -511 337 1910 1367 994 -145 -1553 -1069 428 192 -1565
1612 -1565 -1530 -788 -258 321 -152 -574 297 2484 1585 -746 -514 807 1903 1566 -374 -2626 -2445 426
1630 426 1650 -74 -1881 -1979 -635 1827 2168 -300 -1325 1366 2868 1075 -1060 -987 71 1365
1646 1365 1195 -2428 -4135 -850 2346 1586 -1064 -2630 -1576 2031 4498 1639 -2525 -1441 2165
1661 2165 2365 82 -2035 -2503 154 2041 -303 -3720 -1938 1698 2323 609 -1197 -1761 635 3941
$$ packed form
1539e70J956j798k447J888K954j17j670o46R38J330o36j376p75J685L16j870j229
1556b067O20J279L30l37p60K36J927L84j296m30R75O39j39j378j060O48J487p95
1574B63k602k30K201J268j94j107q40J444J107L4o88n12P35o2o56j64q91P5P26
1593i3k07q71m05J021R04O03n3q45n65Q48J573n43l73j139j408M84J497k36j757
1612a565L5P42N30N79m73m22Q71K187q99k331K32J321J096l37j940k252J81K871
1630D26J224j724j807r8J344K462L41k468j025K691J502j793k135P3J058J294
1646A365j70l623j707L285L196p60k650j566J054L607K467k859m164J084L606
1661B165K00k283k117m68K657J887k344l417J782L636O25j714j806n64K396L306
$$ plain form
1677 3941 2935 -1420 -2756 -744 1094 1537 -196 -2781 -2654 908 1669 -864 -1868 -114 1388 2065
1693 2065 1555 -745 -1904 1215 3683 799 -2359 -3194 -1169 1590 2617 -1408 -5036 -2170 2924
1708 2924 3264 -278 -1997 -693 2352 3531 874 -3213 -1802 2559 2486 -782 -3747 -2735 519 3230
1724 3230 781 -3775 -3310 2350 4596 1699 -1565 -1794 817 3698 2166 -2612 -3154 297 1704 66
1740 66 -2199 -2444 -976 1949 2439 -755 -1710 481 2643 2179 696 -1096 -1554 503 1929 -43 -2341
1757 -2341 -1950 -583 569 620 -417 -1955 -474 2443 2582 6 -1118 -365 1478 2627 456 -3007
1773 -3007 -2307 1049 1905 -578 -3225 -1972 975 2886 1140 -1813 -1877 1855 3581 872 -1407 -1208
1789 -1208 593 2268 764 -3039 -3043 199 1688 -47 -2085 -1524 935 2358 1362 -1205 -1109 1298 2247
$$ packed form
1677C941j006m355j336K012J838M43j733k585J27L562P61k533j004J754J502O77
1693B065n10k300j159L119K468k884l158q35K025K759J027m025l628K866N094
1708B924L40l542j719J304L045J179k657m087J411M361p3l268k965J012L254K711
1724C230k449m556M65N660K246k897l264k29K611K881j532m778n42L451J407j638
1740F6k265k45J468K925M90l194r55K191K162m64j483j792m58K057J426j972k298
1757b341L91J367J152N1j037j538J481K917J39k576j124P53J843J149k171l463
1773c007P00L356Q56k483k647J253K947J911j746k953o4L732J726k709k279J99
1789a208J801J675j504l803mL242J489j735k038N61K459J423r96k567R6K407R49
$$ plain form
1806 2247 527 -1141 -1184 -276 333 -223 -1224 -1627 -51 502 -196 -111 244 232 569 854 806 543 24 183
1826 183 -124 6 19 -1131 -1461 -607 826 152 -660 -1190 57 1752 1645 -339 -1030 1069 2258 675
1844 675 -1187 -1582 -359 1227 49 -2161 -2019 432 1566 219 -1269 -726 1155 2492 963 -1269
1860 -1269 -895 1425 1858 -472 -1912 -1300 394 836 -551 -1827 -798 1353 1304 -610 -675 780 1813
1877 1813 1443 -49 -884 86 1188 -68 -1381 -1079 176 -134 -699 -770 -298 669 862 -100 -325 888
1895 888 1469 594 -389 -273 -53 613 17 -1343 -1284 405 677 -1013 -1563 145 1270 1096 -192 -672
1913 -672 563 2131 1154 -1350 -1232 444 925 -311 -1536 -1314 24 649 47 -1588 -767 1818 1726
1930 1726 -3 -486 327 1314 1546 -34 -1591 -851 1169 435 -1374 -1627 -208 388 290 -499 -730 855
$$ packed form
1806B247j720j668m3R08O09n56j001m03J576N53o98Q5L55j2L37K85m8k63n19J59
1826A83l07J30J3j150l30Q54J433o74q12n30J247J695j07j984o91K099J189j583
1844F75j862l95J223J586j178k210J42K451J134j347j488N43J881J337j529k232
1860a269L74K320M33k330j440O12J694M42j387j276J029K151m9j914o5J455J033
1877A813l70j492q35R70J102j256j313L02J255l10n65p1M72R67J93r62k25J213
1895H88N81q75r83J16K20O66n96j360N9J689K72j690n50J708J125j74j288m80
1913f72J235J568r77k504J18J676M81j236j225K22J338O25o02j635Q21K585r2
1930A726j729m83Q13R87K32j580j557P40K020p34j809k53J419N96r8p89k31J585
$$ plain form
1948 855 2093 726 -874 -28 1576 768 -319 -727 -667 -158 284 -854 -1673 -380 898 197 -692 142
1966 142 1090 904 1047 -9 -841 715 1656 -351 -1748 -408 172 -212 -790 -1166 -614 782 933 -460
1984 -460 -668 1338 1831 610 -451 -185 197 361 57 -1501 -1481 355 387 -1276 -930 251 792 802 170
2003 170 -700 297 1745 1358 -602 -966 640 747 -333 -1076 -1304 -623 689 180 -1663 -577 1599
2020 1599 1229 -209 -268 483 856 1082 427 -1107 -808 407 -119 -1110 -986 -229 46 -144 76 -477 389
2039 389 1290 888 -247 44 1136 402 -145 -283 -674 -289 -139 -707 -1054 -40 566 -220 -872 420 1097
2058 1097 1075 488 -185 -124 994 838 -733 -1370 -474 75 -283 -963 -1292 -465 762 815 -384 -513 899
2077 899 1960 679 -371 -610 292 873 202 -1214 -1441 -192 508 -264 -816 -734 391 845 295 -165
$$ packed form
1948H55J238j367j600Q46J604q08j087m08O0N09M42j138q19J293J278p01q89Q34
1966A42R48j86J43j056q32J556R41k007j397J340N80l84n78l76N52J396J51j393
1984d60k08K006M93j221j061K66L82J64l04j558K0J836L2j663L46J181N41J0o32
2003A70q70R97J448l87j960l64J606J07j080p43k28O81J312n09j843J086K176
2020A599l70j438n9P51L73K26o55j534K99J215n26r91J24P57K75j90K20n53Q66
2039C89R01m02j135K91J092p34n47j38l91L85J50n68l47J014O06p86o52J292O77
2058A097k2n87o73O1J118j56j571o37Q96N49l58o80l29Q27J227N3j199j29J412
2077H99J061j281j050k39R02N81o71j416k27J249P00p72n52Q2J125M54n50m60
$$ plain form
2095 -165 248 1087 903 312 -509 -234 -17 -169 -554 -893 -263 -133 -306 -568 18 548 438 240 281 422
2115 422 1015 537 -520 -789 245 374 -430 -1425 -1069 -60 322 -438 -992 -418 1285 1251 425 -147 188
2134 188 969 752 170 -1022 -938 204 -55 -603 -1007 -316 226 395 256 -119 224 1015 926 26 -295 402
2154 402 417 -221 -324 -407 -227 -512 -624 -663 23 474 -192 -439 508 957 670 336 229 -154 458 750 -606
2175 -606 -1473 -128 312 -206 -817 -900 -449 985 1213 -344 -671 247 1879 868 -374 -666 -262 605
2193 605 613 -860 -1648 -450 382 104 -195 -349 -377 516 1309 483 -526 -122 1008 787 29 -499 -984 -522
2213 -522 289 246 -1013 -1110 -39 34 610 583 -210 -510 737 1553 548 -412 -244 -25 346 394 -1171 -1715
2233 -1715 -136 1100 -53 -977 -660 -33 877 1295 194 -1006 39 1529 903 -51 -824 -682 -62
$$ packed form
2095a65M13Q39j84n91q21K75K17j52l85l39O30J30j73k62N86N30j10j98M1J41
2115D22N93m78j057k69J034J29q04r95L56J009L82p60n54N74J703l4q26n72L35
2134A88P81k17n82j192Q4J142k59n48m04O91N42J69j39l75L43P91q9r00l21O97
2154D02J5o38j03q3J80k85j12l9O86M51o66k47R47M49k87l34j07l83O12K92j356
2175f06q67J345M40n18o11q3M51J434K28j557l27R18J632j011j242k92M04Q67
2193F05Qj473p88J198Q32k78k99j54k8Q93P93q26j009M04J130k21p58n28m85M62
2213e22Q11m3j259r7J071P3N76k7p93l00J247Q16j005r60J68K19L71M8j565n44
2233a715J579J236j153r24L17O27R10M18j101j200J045J490o26r54p73J42O20
$$ plain form
2250 -62 798 -347 -1714 -779 822 1048 -12 -189 -440 542 1645 1141 -817 -863 502 707 -72 -628
2268 -628 -1349 -893 641 902 -752 -1298 -85 1277 1067 310 -819 -343 1426 1583 -352 -1343 -579 264
2286 264 392 -230 -1416 -1260 312 1139 -67 -886 -126 967 1237 948 -73 -805 373 1125 -35 -1250
2304 -1250 -737 29 -451 107 -197 -783 -430 731 735 285 246 -26 324 953 1000 -570 -1127 -298 300 172
2324 172 -401 -1081 -899 442 984 -509 -1260 231 1403 1306 243 -596 -749 937 1461 -451 -1975 -962
2342 -962 722 745 -504 -1360 -994 1134 1514 98 -958 281 1521 1209 -164 -999 -470 571 670 -711
2360 -711 -1562 -893 246 232 -427 -510 -207 866 910 87 -221 243 718 62 -425 -76 -69 -415 -571 -526 -322
2381 -322 -140 -382 -601 498 1042 626 4 -120 746 1055 732 -790 -1419 -32 633 -443 -1339 -1251 99
$$ packed form
2250f2Q60j145j367R35J601K26j060j77k51R82J103n04j958m6J365K05p79n56
2268f28p21M56J534K61j654n46J213J362k10p57j129M76J769J57j935r91P64Q43
2286B64J28o22j186J56J572Q27j206q19P60J093K70k89j021p32J178P52j160j215
2304a250N13P66m80N58l04n86L53J161Mm50l9k72L50O29M7j570n57Q29N98j28
2324A72n73o80J82J341N42j493p51J491J172r7j063q39j53J686N24j912j524J013
2342i62J684K3j249q56L66K128L80j416j056J239J240l12j373q35N29J041R9j381
2360g11q51O69J139j4o59q3L03J073M4q23l08M64M75o56m87L49Pl46j56M5K04
2381c22J82k42k19J099N44m16o22j24Q66L09l23j522o29J387O65j076q96Q8J350
$$ plain form
2400 99 822 74 -893 -693 1024 1677 70 -1086 -477 1093 1335 4 -1536 -1237 481 511 -994 -1672
2418 -1672 -411 736 782 -56 -542 288 1316 871 -516 -712 470 789 170 -869 -780 -259 406 -218
2436 -218 -1044 -251 915 719 -281 -265 653 1193 664 -133 -772 352 728 -427 -1595 -822 574 232
2454 232 -849 -688 -86 1105 1125 -510 -869 807 1900 628 -596 -661 42 669 132 -1472 -1576 179
2472 179 934 -252 -1128 -461 850 1241 544 -489 -372 1176 1576 -571 -1294 -119 420 -84 -859 -952
2490 -952 -395 697 664 -690 -539 921 1337 7 -59 390 805 587 -3 -952 -536 703 155 -1519 -1171
2509 -1171 372 1011 -59 -403 -415 419 1619 589 -992 -362 1036 875 -589 -1192 -712 486 660
2526 660 -637 -1740 -214 1566 704 -797 -347 665 1142 776 10 -996 47 971 -202 -1305 -601
$$ packed form
2400I9P23p48r67K00J717O53j607j156O09J570K42j331j540K99J718L0j505o78
2418a672J261J147M6q38m86Q30J028m45j387j96J182L19o19j039Q9N21O65o24
2436b18q26P93J166j96j000J6R18N40n29p97o39J124L76j155j168P73J396l42
2454B32j081J61O02J191K0j635l59J676J093j272j224o5P03O27n37j604j04J755
2472A79P55j186q76O67J311L91o97j033J17J548M00k147p23J175N39n04p75r3
2490i52N57J092l3j354J51J460M16j330o6M49M15k18n90r49M16J239n48j674L48
2509a171J543O39j070l44j2Q34J200j030j581O30J398j61j464o03M80J198J74
2526F60j297j103J526J780q62j501M50J012M77l66p66j006J043R24j173j103P04
$$ plain form
2543 -601 584 176 -502 -821 -527 830 1012 82 -745 691 1597 350 -683 -255 304 522 94 -1197
2561 -1197 -1220 544 1038 -818 -1335 -119 1293 920 74 -581 119 1201 1090 -727 -1147 135 847 -533
2579 -533 -1150 -946 -240 769 327 -1167 -707 978 1208 131 -547 25 592 711 -99 -1232 -377 658
2597 658 212 -1577 -1011 134 468 10 -444 -233 645 1180 118 -678 99 1142 616 -605 -628 -275 424
2616 424 257 -1263 -1607 235 1290 377 -611 -446 673 1225 515 -550 -493 1016 1124 -589 -1512 -604
2634 -604 374 183 -651 -1067 -584 1007 958 -334 -653 353 991 673 44 -195 59 438 113 -1084 -766
2653 -766 -64 280 -733 -540 20 400 514 86 -58 680 973 623 -565 -377 534 340 -543 -1228 -700
2672 -700 384 509 -96 -1215 -215 834 897 -115 -240 390 1182 968 -348 -1068 -175 602 -59 -1086
$$ packed form
2543f01J185m08o78l19K94J357J82r30q27J436R06j247j033M28N59K18m28j291
2561a197k3J764M94j856n17J216J412l73q46o55P00J082j11j817m20J282P12j380
2579e33o17K04P06J009m42j494M60J685K30j077o78N72N67J19q10j133Q55J035
2597F58m46j789N66J145L34m58m54K11Q78N35j062p96P77J043n26j221k3L53O99
2616D24j67j520l44J842J055r13r88J65J119N52p10j065N7J509J08j713r23R08
2634f04R78j91q34m16M83J591m9j292l19J006O38l18o29k39K54L79l25j197L18
2653g66P02L44j013J93N60L80J14m28j44P38K93l50j188J88R11j94q83o85N28
2672g00J084J25o05j119J000J049O3j012j25O30P92k14j316p20Q93P77o61j027
$$ plain form
2690 -1086 -1038 -240 428 273 -372 -630 448 846 223 -130 422 577 330 -13 -518 -460 -4 -201 -784 -739
2710 -739 107 290 -283 -88 242 374 683 420 -224 257 905 61 -1059 -605 2 432 -132 -918 -1009 116
2730 116 857 -63 -718 -34 1000 1205 518 -191 -473 237 751 -153 -1112 -723 83 48 -311 -584 -860 193
2750 193 837 264 -183 -36 910 699 386 -35 -284 -394 101 -201 -724 -606 -390 -458 66 300 -13 55 379
2771 379 922 593 370 26 -476 123 542 -8 -1107 -533 -32 150 -197 -704 -696 371 1081 707 -444 -206
2791 -206 430 690 327 -282 -935 -323 596 -38 -1323 -978 -8 397 152 -247 -355 367 1126 877 -430
2810 -430 -299 200 234 41 61 -714 -968 -204 67 -268 -601 -211 -180 356 864 140 -190 716 1162 131 -108
2831 -108 -139 -40 -149 309 -361 -1309 -431 548 284 35 -214 -194 310 966 318 -617 -21 522 388 -238 -310
$$ packed form
2690a086M8P98O68j55o45k58J078L98o23l53N52J55k47l43n05N8M56j97n83M5
2710g39Q46J83n73J95L30J32L09k63o44M81O48q44j120M54O07M30n64p86r1J125
2730A16P41r20o55O84J034K05o87p09k82P10N14r04r59L89Q06l5l59k73k76J053
2750A93O44n73m47J47R46k11l13m21k49j10M95l02n23J18K16o8N24K34l13O8L24
2771C79N43l29k23l44n02N99M19n50j099N74N01J82l47n07QJ067P10l74j151K38
2791b06O36K60l63o09o53O12R19o34j285L45R70M05k45l99j08P22P59k49j307
2810d30J31M99L4j93K0p75k54P64K71l35l33L90L1N36N08p24l30R06M46j031k39
2831a08l1R9j09M58o70r48Q78R79k64k49k49K0N04O56o48r35N96N43j34o26p2
$$ plain form
2852 -310 -886 -389 226 -214 -803 -579 118 292 381 365 -67 -1 989 973 -31 -409 -244 138 -74 -112 -502
2873 -502 -607 89 371 -2 -261 54 354 637 739 47 -493 102 992 303 -544 -687 -408 97 211 -509
2893 -509 -924 -283 682 353 -297 -183 272 552 897 268 -308 -50 314 347 -532 -781 -353 -260 312 -87 -404
2914 -404 -285 475 310 303 334 180 252 301 417 123 -403 -347 -430 -176 -25 -442 -380 -107 762 306 116 309 33
2937 33 819 995 -21 -551 -70 432 517 -566 -1016 -847 -10 202 -217 -957 1 893 544 200 -220 297
2957 297 724 410 -240 -807 -63 265 91 -666 -782 -390 -7 620 -49 -341 186 953 550 153 539 388
2977 388 123 -158 -442 -492 -190 -22 -795 -526 -39 42 38 -110 271 670 671 200 -436 419 899 334 -629 -594
2999 -594 -216 226 54 -922 -1030 -92 966 29 -619 118 952 1013 410 -406 -528 242 901 -292 -1015 -787
$$ packed form
2852c10n76M97O15m40n89K24O97J74Q9j6m32O6R90j6j004l78J65L82k12l8l90
2873e02j05O96K82l73k59L15L00K83J02o92n40N95Q90o89q47j43K79N05J14p20
2893e09m15O41R65l29o50J14M55K80L45o29n76K58L64L3q79k49M28R3N72l99l17
2914d04J19P60j65pL1j54P2M9J16k94n26N6q3K54J51m17O2K73Q69m56j90J93k76
2937C3P86J76j016n30M81N02Q5j083m50J69Q37K12m19p40R58Q92l49l44m20N17
2957B97M27l14o50n67P44L28j74p57j16L92L83O27o69k92N27P67m03l97L86j51
2977C88k65k81k84n0L02J68p73K69M87Q1mj48L81L99Jm71o36Q55M80n65r63L5
2999e94L78M42j72r76j08R38J058r37o48P37Q34O1o03q16j22P70O59j193p23K28
$$ plain form
3019 -787 137 356 -421 -736 -313 444 923 101 -384 414 957 423 -173 15 -6 234 39 -421 -846 -601
3039 -601 217 -563 -448 287 645 -119 -159 -37 325 939 502 -519 -510 413 272 -484 -825 -265 -130 222 -356
3060 -356 -647 8 1127 838 -504 -348 460 990 521 -459 -984 -327 380 -195 -1089 -854 266 372 -21
3079 -21 -284 -135 472 953 517 -508 45 611 421 -409 -622 -387 -231 346 -412 -825 -17 464 -141 -565
3099 -565 275 862 539 375 -122 -142 537 518 -749 -792 5 175 -466 -756 -218 17 714 602 -669 -356
3119 -356 872 1129 -61 -492 -49 79 217 -133 -1164 -878 338 371 -604 -723 -155 627 520 9 -207
3138 -207 381 1169 784 -470 -407 424 376 -289 -747 -618 -305 286 83 -385 -301 619 239 -123 -53 362 744
3159 744 222 -375 -594 -16 320 52 -1036 -563 209 83 48 -455 38 853 693 68 -445 588 1011 98
$$ packed form
3019g87R24K19p77l15M23P57M79q22m85P98N43n34n96J88k1K40j95m60m25K45
3039f01Q18p80J15P35L58p64m0J22L62O14m37j021RR23j41p56l41N60J35L52n78
3060c56k91O55J119k89j342J56Q08N30m69r80n25O57P07n75q94K35J120J06l93
3079b1k63J49O07M81m36j025N53N66j90q30k13K35J56N77p58m13Q08M81o05m24
3099e65Q40N87l23j64m97k0O79j9j267m3P97J70o41k90N38K35O97j12j271L13
3119c56J228K57j190m31M43J28J38l50j031K86J216L3r75j19N68P82j07n11k16
3138b07N88P88l85j254O3Q31m8o65m58J29L13N91k03m68Q4R20l80l62P0M15L82
3159G44n22n97k19N78L36k68j088M73P72j26l5n03M93Q15j60o25n13J033M23r13
$$ plain form
3179 98 -716 -655 -117 365 -4 -967 -1112 185 601 135 -355 -118 354 742 460 -177 -33 379 354 -269 -649
3200 -649 -191 124 -292 -564 -708 -274 423 440 -197 -129 653 600 46 -407 -113 296 257 -6 -464 -249 321
3221 321 -274 -750 -260 84 645 435 -241 -334 528 848 198 -393 -179 659 666 -121 -762 -731 97 357 -174
3242 -174 -726 -82 378 420 -6 -34 215 933 587 -296 -429 -19 359 -300 -388 -635 -240 45 103 -171 -167 505
3264 505 356 18 -61 504 648 221 -128 -274 142 428 66 -973 -383 406 270 -492 -577 52 697 731 -76
3285 -76 -296 67 840 199 -512 -622 -68 258 71 -507 -1010 -35 916 -44 -652 -208 442 845 536 -22
3305 -22 -82 327 951 46 -678 -224 -93 -124 -350 -463 -60 8 264 -61 -91 569 608 266 342 381 -141 -101 -165
3328 -165 -366 -347 -121 -136 -829 -90 453 303 114 -6 353 268 950 515 -325 -295 638 176 -613 -438 -329
$$ packed form
3179I8q14O1N38M82l69r63j45J297M16m66m90K37M72L88k82o37J44M12k5o23l80
3200f49M58L15m16k72j44M34O97J7o37O8P82n3n54m53K94M09l9k63m58K15N70
3221C21n95m76M90L44N61k10o76r3Q62L20o50n91K14Q38Pp87o41L1Q28K60n31
3242a74n52O44M60M2m26k8K49P18l46q83j33M10L78o59q8k47L95K85N8k74MO72
3264E05j49l38p9N65J44m27l49j46M16K86l62j039N90P89j36p62q5O29O45L4q07
3285g6k20L63P73o41p11j10N54L26j87n78n03R75R51r60o08M44O50M03l09n58
3305b2o0M09O24r05p24M54J31l1k26j13M03O8K56l25l0O60L9l42P6L9n22M0o4
3328a65k01J9K26j5o93P39N43j50j89j20L59q5O82m35q40L0R33m62p89J75J09
$$ plain form
3349 -329 168 298 -257 -1004 -247 808 506 -138 -92 286 616 633 100 -551 -179 450 217 -599 -707 -93
3369 -93 -46 -194 -298 -312 74 692 524 -71 162 479 -66 49 -9 -226 -481 -134 -318 -396 12 -261 -409 -350
3391 -350 300 583 70 257 197 235 237 344 -506 -234 421 298 -273 -627 -577 -104 451 95 -256 -122 320 691
3413 691 307 -56 -94 356 476 56 -376 -767 23 180 -342 -432 -299 -287 206 483 -139 -125 302 511 136
3434 136 217 -87 -55 -302 91 -306 -514 -236 -542 -243 -109 138 -1 238 400 251 169 -70 -64 -73 151 103 -640
3457 -640 -309 180 -84 -310 -256 -108 -116 207 431 112 -143 427 431 297 -189 -201 -36 114 -101 -375 -1013 -210
3479 -210 -32 50 -37 -14 -68 297 248 394 125 181 304 -114 135 -319 -246 -296 -58 -158 -276 -159 -11 76 404
3502 404 111 -85 127 510 330 350 91 -158 -140 -38 -68 -430 -437 -8 -178 -51 38 96 11 23 383 249 48
$$ packed form
3349c29M97J30n55p47P57J055l02o44M6L78L30J7n33o51L72O29k33q16j08O14
3369i3M7j48j04j4L86O18j68n95K33L17n45J15n8k17k55L47j84p8M08k73j48N9
3391c50O50K83n13J87o0L8KJ07q50K72O55j23n71l54N0M73N55l56l51J34M42L71
3413F91l84l63l8M50J20m20m32l91P90J57n22r0J33J2M93K77o22J4M27K09l75
3434A36Q1l04L2k47L93l97k08K78l06K99J34K47j39K39J62j49q2k39OrK24m8p43
3457f40L31M89k64k26N4J48qL23K24l19k55N70Mj34m86j2J65J50k15k74o38Q03
3479b10J78Q2q7K3n4L65m9J46k69N6J23m18K49m54P3n0K38j00j18J17J48Q7L28
3502D04k93j96K12L83j80K0k59k49J8J02l0l62pM29j70J27Q9N8q5J2L60j34k01
$$ plain form
3525 48 165 370 -43 -77 -337 -351 -153 -149 -235 -499 -334 72 233 351 73 39 166 340 387 25 -153 90 57
3548 57 229 -434 -460 -73 177 173 -272 -238 28 162 730 413 -234 269 395 253 -63 -191 -421 -457 76 -265
3570 -265 -577 -476 4 107 199 -81 -32 323 479 322 88 67 98 -236 12 -261 -274 -114 -248 260 -2 -109
3592 -109 86 235 27 615 186 -287 135 432 374 -143 -47 -530 -104 644 -321 -796 -543 206 496 -89 25
3613 25 -61 136 589 343 -350 61 549 342 -91 -531 -363 -230 122 -142 -524 -255 413 212 -243 134 320
3634 320 246 493 -39 -331 -165 387 -208 -282 -367 -383 -609 -183 191 -62 -148 151 78 -154 473 485 -213 -115 8
3657 8 30 38 -169 -579 -687 249 197 -433 -294 343 497 234 8 6 224 529 389 -444 -593 194 115 -499 -297
3680 -297 -381 -160 403 -48 -439 -427 548 560 252 -87 -64 337 294 48 -268 -294 84 2 -367 -154 177 33
$$ packed form
3525D8J17K05m13l4k60j4J98Mq6k64J65M06J61J18k78l4J27J74M7l62j78K43l3
3548E7J72o63k6L87K50mm45L4K66J34N68l17o47N03J26j42l16j28k30l6N33l41
3570b65l12J01M80J03R2k80M9L55J56j57k34k1L1l34K48k73j3J60j34N08k62j07
3592a09J95J49k08N88m29m73M22K97n8n17R6m83M26P48r65m75K53P49K90n85J14
3613B5q6J97M53k46o93M11M88k07m33m40J68J33L52k64l82K69O68k01m55L77J86
3634C20p4K47n32k92J66N52n95p4q5j6k26M26L74k53q6K99p3k32O27J2o98R8J23
3657HK2Qk07m10j08R36n2o30J39O37J54k63k26kK18L05j40q33j49P87p9o14K02
3680b97q4K21N63m51l91J2R75J2l08l39K3M01m3k46l16k6L78q2l69K13L31j44
$$ plain form
3702 33 -103 -74 -92 446 635 210 -57 228 345 -27 -167 -90 -301 -101 -411 -216 -246 -46 262 -192 -259 277
3724 277 509 363 254 -205 -261 267 98 -185 -522 -25 63 -351 -399 -293 -204 467 120 -246 -149 420 660 105
3746 105 86 -361 -9 363 126 -350 -302 62 56 -487 -198 22 443 389 236 -257 177 518 285 -250 -110 -53
3768 -53 -200 -235 -280 -450 137 -61 -228 -308 140 483 159 -21 -142 240 199 337 -355 -325 214 105 -335 -828
3790 -828 -425 96 113 -12 -363 -186 359 913 -46 -315 32 111 135 -221 -467 -444 265 -211 -690 -531 64
3811 64 221 90 -101 107 252 542 154 59 57 573 -233 -201 -194 -136 59 -156 -471 -253 -9 222 111 -107 112
3834 112 411 108 223 -198 31 288 170 -347 -710 -253 301 -66 -318 -234 34 135 311 148 -108 435
3854 435 446 19 -55 -37 241 -105 -66 -311 -565 46 207 -45 -326 -28 -36 164 154 -70 105 105 262 -418 -48
$$ packed form
3702C3j36K9j8N38J89m25k67K85J17l72j40P7k11K00l10J95l0K00L08m54o7N36
3724B77K32j46j09m59n6N28j69k83l37M97Q8m14m8J06Q9O71l47l66R7N69K40n55
3746A05j9m47L52L72k37m76M8L64on43K89K20M21n4j53m93M34L41k33n35J40N7
3768e3j47l5m5j70N87j98j67q0M48L43l24j80j21L82m1J38o92L0N39j09m40m93
3790h28M03N21J7j25l51J77N45N54r59k69L47P9K4l56k46K3P09m76m79J59N95
3811F4J57j31j91K08J45K90l88r5kN16q06L2PN8J95k15l15K18K44K31j11k18K19
3834A12K99l03J15m21K29K57j18n17l63M57N54l67k52Q4K68J01J76j63k56N43
3854D35J1m27p4J8K78l46L9k45k54O11J61k52k81K98qK00j0k24J75%J57o80L70
$$ plain form
3877 -48 284 -2 -306 -125 58 -209 67 -21 -165 109 168 130 65 -36 452 344 26 64 -274 -49 154 -106
3899 -106 -520 -325 -56 -208 -124 -43 -70 133 341 -6 85 24 464 -120 -120 -126 -95 -134 169 -433 -409 -265 366 -43
3923 -43 -247 183 372 22 81 181 -8 238 130 -264 -270 -83 -102 -328 -332 38 -107 -65 43 -245 60 411 556
3946 556 -87 109 239 196 164 -142 9 -289 235 -243 -303 -291 108 168 -51 193 13 199 134 -6 -321 141
3968 141 31 -103 -402 -199 -262 -62 -103 -201 -276 -54 61 155 -34 283 119 24 193 238 195 -99 66 -122 -371
3991 -371 -164 -154 -79 115 35 -47 72 182 67 180 399 405 29 -14 -24 -24 -93 -111 -261 -147 205 -283 -54 -297
4015 -297 213 282 209 232 4 265 448 110 -104 -67 -5 -368 50 -463 -344 -116 101 75 15 194 -86 206
4037 206 266 225 158 -316 279 228 -97 -282 -267 -142 -131 -6 -152 -212 21 322 217 127 157 146 230 123 89 -226
$$ packed form
3877d8L32k86l04J81J83k67K76q8j44K74N9l8o5j01M88j08l18L8l38K25K03k60
3899a06m14J95K69j52Q4Q1k7K03K08l47R1o1M40n84%oL1l9L03o02K4J44O31m09
3923d3k04M30J89l50N9J00j89K46j08l94oJ87j9k26mL70j45M2J08k88L05L51J45
3946E56o43J96J30m3l2l06J51k98N24m78o0J2L99O0k19K44j80J86o5j40l15M62
3968A41j10j34k99K03o3K00m1r8p5K22J15R4j89L17j64r5J69M5m3k94J65j88k49
3991c71K07J0P5J94q0q2J19J10j15J13K19Ol76m3j0%o9j8j50J14L52m88K29k43
4015b97N10O9p3K3k28K61J83l38k14L7O2l63M18n13J19K28K17k6o0J79k80K92
4037B06O0m1o7m74N95n1l25j85J5J25J1J25j46o0K33L01j05r0L0j1Q4j07l4l15
$$ plain form
4061 -226 6 122 -212 -56 -219 -325 -189 145 -89 114 144 226 284 445 171 211 165 178 -39 -326 -211 -159
4083 -159 27 189 35 -223 -396 135 268 -96 250 -122 -98 315 279 -104 -42 29 -31 96 29 -220 -150 -183 190
4106 190 -75 -140 43 496 326 276 79 -227 -67 212 291 -309 -26 -108 -302 45 35 -9 -26 118 222 -94
4128 -94 -1 257 -229 334 66 -190 -142 -178 181 -234 -339 -105 -247 -224 115 0 -54 101 514 106 313 308 -15
4151 -15 40 355 -299 -271 -193 76 -182 -178 -480 -402 28 425 -21 -262 94 339 304 -64 22 -29 2 -54 -45 -390 -205
4176 -205 -26 -36 229 -16 196 -56 528 244 -62 181 28 -79 146 117 -327 -220 85 56 -70 -65 -214 4
4198 4 4 326 -177 147 236 155 98 -2 100 78 -84 60 -261 -386 -244 109 70 281 296 -275 104 356 185
4221 185 -117 184 388 30 41 -118 -193 -107 197 -110 -368 -70 73 360 348 63 33 60 311 289 48 124 210
$$ packed form
4061b26K32J16l34J56j63j06J36L34k34K03L0Q2N8J61k74M0m6J3k17k87J15N2
4083a59J86J62j54k58j73N31J33l64L46l72K4M13l6l83O2P1o0J27o7k49P0l3L73
4106A90k65o5J83M53j70n0j97l06J60K79P9o00K83q2j94L47j0m4j7J44J04l16
4128i4R3K58m86N63k68k56M8l6L59m15j05K34j42K3L39j15n4J55M13m08K07nl23
4151a5N5L15o54K8P8K69k58Ml02P8M30L97m46k41L56K45l5l68Q6n1L1n6Rl45J85
4176b05J79j0K65k45K12k52N84k84l06K43j53j07K25k9m44J07L05k9j26Nj49K18
4198D%L22n03L24Q9q1n7j00J02k2j62J44l21j25J42L53l9K11J5n71L79K52j71
4221A85l02L01K04l58J1j59p5Q6L04l07k58K98J43K87j2k85l0K7K51k2k41P6Q6
$$ plain form
4244 210 -88 -163 -293 -502 -138 106 84 -297 40 61 -7 81 69 82 153 267 193 146 -52 -115 -262 -238 71 167
4268 167 -269 -36 -149 -74 206 -159 -45 226 410 26 133 -263 21 3 18 -199 -276 -262 62 105 -177 -52
4290 -52 2 -9 59 103 44 109 332 -28 -163 -89 -122 97 -268 -182 -208 -59 104 -149 -286 -22 265 340 53 54 135
4315 135 36 173 168 -292 -317 -316 -213 -61 -22 -21 -193 -307 -87 14 253 282 -13 71 164 365 -184 -279 -18 -138
4339 -138 -259 -196 -343 -123 204 -103 -144 19 203 392 232 94 -51 110 374 178 -185 71 -410 -103 -157
4360 -157 -186 -217 -168 114 73 -8 99 209 229 218 171 160 -204 46 -71 -64 174 -230 -65 -4 51 -1 101 -37 104
4385 104 241 252 304 176 122 175 -43 -318 -186 -331 -99 163 -35 -193 44 70 233 2 344 235 134 247
4407 247 188 -59 -9 -28 -20 -97 -176 101 28 -55 158 -34 73 170 212 215 35 126 -30 91 196 -386 -194 -5 -94
$$ packed form
4244B10k98p5j30k09L64K44k2l81L37K1o8Q8j2J3P1J14p4m7j98o3j47K4L09R6
4268A67m36K33j13P5K80l65J14K71J84l84J07l96K84j8J5k17p7J4L24M3k82J25
4290e2N4j1O8M4n9O5K23l60j35P4l3K19l65Q6k6J49J63k53j37K64K87P5k87JQ1
4315A35r9J37nm60k5JJ03J52L9Jj72j14K20J01K39K9k95Q4R3K01n49r5K61j20
4339a38j21O3j47K20L27l07m1J63J84J89j60j38j45J61K64j96l63K56m81L07n4
4360a57k9l1M9K82m1q1J07J10K0j1m7j1l64K50j17PK38m04J65O1N5n2J02j38J41
4385A04J37J1N2j28n4N3k18k75J32j45K32K62j98j58K37K6J63k31L42j09j01J13
4407B47n9k47N0j9Qp7p9K77p3q3K13j92J07R7M2Lj80R1j56J21J05n82J92J89q9
$$ plain form
4432 -94 -83 -270 -100 203 11 18 -73 18 122 -3 16 176 124 -305 -158 -165 -140 -309 -290 -535 -163 99 289 -113
4456 -113 -88 239 233 159 133 231 -111 294 -129 35 -113 -91 143 -95 -141 23 -78 35 92 106 27 362 450 163
4480 163 -20 107 68 26 -309 -412 -3 -92 84 -369 -299 4 152 65 123 -289 142 60 47 -278 136 214 -347
4503 -347 -75 96 -237 -195 152 -33 -85 89 325 -106 59 271 351 -80 72 74 -178 -148 27 -154 -47 117
4525 117 27 -119 -31 206 -37 221 128 52 9 126 38 -277 -380 -101 -189 -138 54 -161 -294 -185 13 -68 -6
4548 -6 81 308 124 -44 92 46 412 -27 -162 -258 -256 -57 -223 -34 -75 -24 347 26 -88 33 203 -91 212
4571 212 135 80 68 72 196 -262 -95 -45 -14 -279 197 83 148 -74 155 184 -129 44 63 36 100 -64 -298 -223
4595 -223 -56 20 62 -172 8 -155 128 -41 -15 -159 126 49 -75 23 -16 203 88 -199 -33 -98 -31 77 -315
$$ packed form
4432i4J1j87J70L03j92Pr1R1J04j25J9J60n2m29J47pK5j69J9k45L72K62J90m02
4456a13K5L27op4k6R8l42M05m23J64j48K2K34k38m6J64j01J13N7J4p9L35Q8k87
4480A63j83J27l9m2l35j03M09q9J76m53P0L03J48q7N8m12M31q2j3l25M14P8n61
4503c47K72J71l33M2L47j85n2J74K36m31J65K12Q0m31J52Kk52L0J75j81J07J64
4525A17r0j46Q8K37k43K58r3p6m3J17q8l15j03K79q8N1J92k15j33J09J98q1O2
4548fQ7K27j84j68J36m6L66m39j35r6KJ99j66J89m1N1L71l21j14J21J70k94L03
4571B12p7n5j2MJ24m58J67N0L1k65M76j14O5k22K29K9l13J73J9k7O4j64k34P5
4595b23J67P6M2k34J80j63K83j69K6j44K85p7j24R8l9K19j15k87J66o5O7J08l92
$$ plain form
4618 -315 -73 -282 -146 215 108 9 -17 480 240 -34 -211 -216 -241 20 25 -209 -342 88 -101 158 -186 140
4640 140 -95 187 338 -202 55 -39 31 165 356 12 -349 127 -196 -174 152 -118 -209 -54 30 -36 -24 16 70
4663 70 110 235 195 -288 181 19 -206 -491 -143 -146 56 -130 59 -172 197 201 91 95 155 46 -63 41 -99
4686 -99 -65 -125 -255 -2 -303 -269 -55 0 -139 -173 -9 140 213 -104 36 -33 80 3 -102 -10 -228 84 -160
4709 -160 -195 -277 8 116 168 104 236 62 -108 66 231 175 -7 29 -416 -88 -72 11 -125 -180 211 66 -169
4732 -169 85 91 25 207 78 111 288 56 -31 -111 8 -485 -249 -149 -99 -77 -57 264 -100 84 210 -45 113
4755 113 178 164 -264 -80 -8 4 -247 -71 -278 -276 -98 44 -19 -14 146 -194 38 118 124 -119 86 -62 -3 -126
4779 -126 -169 -261 49 41 -164 -352 350 129 164 -84 194 177 78 112 -157 -171 -113 -97 -99 -109 -173 36 -5 192 -97
$$ packed form
4618c15K42k09J36L61j07r9k6M97k40k74j77nk5K61Nk34j33M30j89K59l44L26
4640A40k35K82J51n40K57r4P0J34J91l44l61M76l23K2L26k70r1J55Q4o6J2M0N4
4663G0M0J25m0m83M69j62k25k85L48lK02j86J89k31L69Mj10MO0j09j09J04j40
4686i9L4o0j30K53l01L4K14N5j39l4J64J49P3l17J40o9J13p7j05R2k18L12k44
4709a60l5q2K85J08N2o4J32j74j70J74J65n6j82L6m45L28J6Q3j36n5L91j45k35
4732a69K54Oo6J82j29L3J77k32q7q0J19m93K36J00N0K2K0L21l64J84J26k55J58
4755A13O5j4m28J84P2J2k51J76k07KJ78J42o3NJ60l40K32Q0Ok43K05j48N9j23
4779a26m3r2L10qk05j88P02k21L5k48K78j7r9L4k69j4N8J6kj0o4K09m1J97k89
$$ plain form
4804 -97 -236 94 224 49 238 8 205 190 93 -151 -116 47 92 -151 -295 127 -42 31 -15 227 49 48 62
4827 62 151 273 -83 -149 -17 -159 313 -187 -309 -87 -92 18 149 167 -16 -10 171 -136 94 -1 111 -94 -11
4850 -11 -72 -385 -94 27 -285 -208 -56 69 187 32 -3 -96 135 163 30 347 70 275 24 112 -362 -233
4872 -233 -134 -238 -89 112 -240 209 133 38 306 139 0 100 37 -31 -96 -9 -473 -255 14 -37 8 -91 151
4895 151 203 372 -94 75 79 380 386 -11 334 -56 140 108 183 28 -234 208 -153 -127 199 107 99 -4 -100 103
4919 103 -16 47 109 -143 150 14 -124 -369 134 -56 24 27 -22 -57 -19 290 -101 60 -34 156 44 -111 -32
4942 -32 -45 165 -354 -203 -121 -44 -20 -22 -71 181 27 318 373 -115 109 100 114 -160 -20 -355 -106 263 64 -185
4966 -185 -289 161 115 -53 69 173 -17 187 214 -27 -3 338 -104 -92 -87 -314 164 -181 242 -26 117 -38
$$ packed form
4804i7j39L30J30j75J89k30J97j5r7k44L5J63M5k43j44M22j69P3m6K42j78jJ4
4827F2Q9J22l56o6J32j42M72n00j22K22nJ10J31J8j83OJ81l07K30r5J12k05Q3
4850a1o1l13K91J21l12P7J52J25J18j55l5r3K31K8j33L17k77K05k51Q8m74J29
4872b33R9j04J49K01l52M49p6r5K68j67j39J00o3o8o5Q7m64K18K69n1M5r9K42
4895A51N2J69m66J69ML01Ol97L45l90J96l2P5j55k62M42l61K6L26r2qj03r6K03
4919A03j19O3O2k52K93j36j38k45N03j90Q0Lm9l5L8L09l91J61r4J90j12j55P9
4942c2j3K10n19J51Q2P7K4km9K52j54K91N5m88K24rJ4k74J40l35K49L69j99k49
4966a85j04M50m6j68J22J04j90K04K7k41K4L41m42J2Nk27M78l45M23k68J43j55
$$ plain form
4988 -38 -199 -21 210 89 -235 190 152 -150 -17 43 -289 109 228 149 -220 -168 -133 -64 -106 219 -170 111 331
5011 331 352 -225 -18 95 148 -227 13 -217 -130 -35 17 -133 -18 54 -77 -145 119 116 246 -91 -75 -224 0
5034 0 219 88 -223 -133 20 -53 89 -228 -155 -51 141 301 92 33 -35 130 37 -13 -65 -213 79 -415 71
5057 71 54 11 -29 -90 68 -231 75 211 135 109 -9 124 4 -184 -104 -36 -67 -103 -361 64 -94 -129 -28 192
5081 192 143 134 64 107 88 -222 52 77 104 -152 87 -12 -357 -192 -147 63 125 131 -12 188 434 29 99 -23 -5
5106 -5 29 109 -185 -349 -144 88 -203 -83 -68 11 -39 321 92 -128 -42 270 130 -101 98 -76 57 -294 -101
5129 -101 -201 -106 -168 87 -267 188 228 -39 -232 129 112 17 180 52 -142 -195 -224 -130 -260 -124 -185 -29 -157
5152 -157 122 89 257 -6 151 139 137 178 21 33 -84 -132 -230 -39 -205 -233 -22 -82 -38 -127 8 100 -10 104
$$ packed form
4988c8j61J78K31j21l24M25l8l02J33O0l32L98J19p9l69N2L5O9m2L25l89K81K20
5011C31K1n77K07J13N3l75K40k30Q7R5N2j50J15P2j31o8K64lJ30l37J6j49K24
5034@K19j31l11R0J53p3J42l17P3J04J92J60k09n9o8J65r3n0n2j48K92m94M86
5057G1j7m3m0o1J58k99L06J36p6k6j18J33j20j88Q0O8l1l6k58M25j58l5J01K20
5081A92m9rp0M3j9l10K74K5K7k56K39r9l45J65M5K10O2Oj43K00K46m05P0j22J8
5106eL4Q0k94j64K05K32k91J20J5P9n0L60k29k20Q6L12j40k31J99j74J33l51J93
5129a01j00R5o2K55l54M55M0k67j93L61j7r5J63j28j94n3k9R4j30J36o1J56j28
5152a57K79l3J68k63J57j2kM1j57J2j17m8r8J91j66k8K11o0M4q9J35R2j10J14
$$ plain form
5176 104 -61 -23 -111 -278 42 -78 189 -354 -47 -96 -89 -78 -119 -252 -157 121 371 87 282 112 -204 182 -21
5199 -21 -145 -291 74 128 20 200 11 -294 -4 74 85 260 207 145 -162 -53 30 -49 -13 -163 -141 -41 -280
5222 -280 56 -383 -99 217 -114 35 -124 -115 25 158 -20 24 -116 -18 19 -76 167 -175 97 -291 168 -89
5244 -89 -142 195 -134 113 98 148 156 211 15 -95 -92 58 96 -183 -247 -44 -300 -101 -92 -79 -95 214 -200 -56 126
5269 126 53 -30 38 31 161 10 -126 -195 -114 -264 41 59 119 71 202 107 111 206 117 87 53 -189 -159 265 25 -89
5295 -89 -60 -10 -215 76 -92 -39 129 -41 206 112 -114 77 -131 105 78 -159 -203 -138 54 -375 -43 -33 46
5318 46 148 109 91 -36 188 27 62 37 16 133 -212 -11 -74 -258 -54 97 33 33 172 22 191 202 56 232
5342 232 205 27 -122 86 -134 -102 -138 86 -287 -12 -328 -40 136 83 34 -360 -75 146 -13 -28 34 99 -147
$$ packed form
5176A04j65L8q8j67L20j20K67n43L07m9PJ1m1j33R5K78K50k84J95j70l16L86k03
5199b1j24j46L65N4j08J80j89l05K90P8J1J75n3o2l07J09Q3p9L6j50K2J00k39
5222b80L36m39K84L16l31J49j59RJ40J33j78M4j40R8L7r5K43l42K72l88M59k57
5244h9n3L37l29K47j5N0QN5j96j10LJ50L8k79o4K03k56J99RJ3j6L09m14J44J82
5269A26p3q3O8pJ30j51j36o9Q1j50L05J8O0m8J31r5MR5q9l0l4k42L0M24k40j14
5295h9K9N0k05K91j68N3J68j70K47r4k26J91k08K36k7k37m4O5J92m29L32J0P9
5318D6J02l9j8j27K24j61L5k5k1J17l45K01o3j84K04J51o4%J39j50J69J1j46J76
5342B32k7j78j49K08k20L2l6K24l73K75l16K88J76n3m9l94K85K21j59j5O2O5k46
$$ plain form
5365 -147 -34 -175 -106 87 112 -91 -12 86 -38 -32 -105 199 158 -209 183 253 8 11 -64 -180 -136 -259 -73 -131 21
5390 21 163 -203 -146 125 -315 42 164 -34 -45 -92 -71 166 -199 -235 -150 9 -154 35 24 17 107 175 -27 97
5414 97 109 -109 175 -8 -31 -151 -90 22 -222 166 -96 -206 18 -71 64 7 140 -320 -29 105 133 115 -146
5437 -146 220 -10 -63 -46 -74 -61 107 -169 -162 31 -21 6 149 -77 -160 72 -69 79 -181 -238 23 -206 -15
5460 -15 -77 -42 83 69 348 -64 2 148 249 130 122 40 -112 1 178 -29 -91 -91 -160 -161 222 -36 33 197 127
5485 127 -188 163 265 122 61 323 97 -11 -130 -30 45 12 30 -76 8 -3 161 -87 -6 32 -43 36 269
5508 269 98 -106 91 -275 -294 -150 -62 -1 -68 87 55 2 113 -87 121 199 64 98 208 -108 -89 -99 187
5531 187 -33 -162 -135 87 -16 74 85 49 47 159 97 24 12 152 38 138 9 -50 -208 -35 -167 -131 182 -18
$$ packed form
5365a47J13j41O9J93K5k03P9R8j24Op3L04m1l67L92P0k45Lp5j16M4j23J86n8J52
5390B1J42l66N7K71m40L57J22j98j1m7K1K37l65l6Q5J59j63J89j1pR0O8k02J24
5414I7J2k18K84j83k3j20O1J12k44L88k62j10K24q9J35n7J33m60K91J34K8j8k61
5437a46L66k30n3J7k8J3J68k76PJ93n2K7J43k26q3K32j41J48k60n7K61k29J91
5460a5o2L5J25j4K79m12O6J46J01j19qq2j52J13J77k07o2%o9jL83k58O9J64p0
5485A27l15L51J02j43o1K62k26j08j19J00P5l3J8j06Q4j1J64k48Q1L8p5P9K33
5508B69j71k04J97l66j9J44Q8O1o7J55l2n3J11k00K08P8j35L4J10l16J9j0K86
5531A87k20j29K7K22j03R0J1l6kJ12o2p3j2J40j14J00j29n9j58J73j32L6L13k00
$$ plain form
5555 -18 -122 77 90 -10 149 343 -161 -22 63 128 82 -155 19 193 -12 -88 171 -54 103 14 -81 58 192
5578 192 12 53 175 73 38 -8 -90 -130 -64 -109 -1 28 -96 2 -103 -226 108 -95 -96 72 -150 -134 198 -227
5602 -227 -196 -381 79 -42 -140 178 -27 92 113 47 -199 65 131 42 16 -205 321 -256 -124 -142 -59 -261 114
5625 114 -115 -156 38 -98 -100 45 117 118 15 107 -69 -14 136 179 102 -152 47 -34 -196 -165 7 -58 4 -32 224
5650 224 90 202 -78 -48 -65 -10 -205 -47 56 82 6 140 61 -20 -112 -106 -232 7 305 63 -159 63 39 22
5674 22 143 -132 -282 -98 -84 108 36 43 76 82 -13 -43 113 55 61 86 -210 60 84 97 181 54 -85 60 -179 -200
5700 -200 205 -15 -158 -108 69 299 -34 -135 101 103 152 -13 -119 -76 -118 136 -221 -172 22 -244 14 -45 137
5723 137 -87 256 169 169 346 -140 -158 135 130 -131 -62 -169 37 -203 -101 181 147 -87 33 127 151 83 -129 -17
$$ packed form
5555a8j04J99J3j00J59J94n04J39Q5O5m6k37J74J74k05p6K59k25J57q9r5J39J34
5578A92j80M1J22j02l5m6q2m0O6m5J08K9j24R8j05j23L34k03jJ68k22J6L32m25
5602b27L1j85M60j21r8L18k05J19K1o6k46K64O6q9k6k21N26n77J32j8Q3k02L75
5625A14k29m1J94j36kJ45P2Jj03R2j76N5J50M3p7k54J99q1j62L1J72o5O2l6K56
5650B24j34J12k80L0j7N5j95J58J03K6p6J34p9q1r2Oj26K39K98k42k22K22k4j7
5674B2J21k75j50J84J4J92p2PL3Or5l0J56n8OK5k96K70K4J3Q4j27j39J45k39k1
5700b00M05k20j43N0J77K30l33j01K36KM9j65j06M3m2K54l57M9J94k66K58n9J82
5723A37k24L43q7%J77m86j8K93nk61O9j07K06k40J02K82l4k34J20R4K4o8k12J12
$$ plain form
5747 -17 34 -4 -1 -173 -265 64 -39 216 -48 116 43 44 51 73 5 20 42 55 24 -187 -186 5 10 -28 -212 -13 100
5774 100 -65 169 136 35 226 -51 409 116 -17 -33 -115 140 -165 -95 -24 125 -74 -312 21 75 286 -44
5796 -44 61 -36 -104 -60 57 -1 -123 -54 -93 -130 -56 -192 65 156 50 15 -120 -165 -158 113 77 175 -63 -254 12
5821 12 69 86 226 -99 -24 115 151 -30 -149 -114 84 308 257 -90 -79 60 -286 35 -122 254 -310 34 70
5844 70 96 -58 164 -84 59 158 63 -225 213 241 -49 -43 75 -8 75 101 -58 -4 -35 -214 -268 211 -47 -204
5868 -204 338 65 218 31 186 86 -14 -52 139 8 44 -20 68 -185 -221 -24 80 97 44 113 -14 185 -155
5891 -155 172 30 -101 -27 -126 -140 28 -226 112 -262 161 -97 -282 30 -37 63 68 3 116 -8 -210 54
5913 54 27 -154 -125 -59 -121 -140 172 -57 81 -158 1 138 -44 194 32 -49 159 -201 -28 114 7 -94
$$ packed form
5747a7N1l8Lj72r2L29j03K55k64J64p3JPK2o8J5K2J3l1k11JJ91Nl8j84J99J13
5774A00j65K34l3j01J91k77M60k93j33j6q2K55l05P0P1J49j99k38L33N4K11l30
5796d4J05r7o8M4J17n8j22O9l9l7P4j36K57R1j06l5j35m5PK71l6R8k38j91K66
5821A2N7J7J40l25P5J39L6j81j19L5J98K24n1l47J1J39l46L21j57L76n64L44L6
5844G0K6j54K22k48J43R9r5k88M38K8k90OJ18q3Q3K6j59N4l1j79n4M79k58j57
5868b04N42k73J53j87J55j00j00l8J91j31L6o4Q8k53l6J97J04J7n3O9j27J99l40
5891a55L27j42j31P4r9j4J68k54L38l74M23k58j85L12o7J00No5J13j24k02K64
5913E4k7j81K9O6o2j9L12k29J38k39J59J37j82K38j62q1K08l60J73J42j07j01
$$ plain form
5935 -94 64 -127 -330 -83 -68 86 143 141 87 49 103 -1 32 9 180 46 14 196 40 -19 -45 108 -72 60
5959 60 -74 123 -70 184 -154 155 -158 78 -75 -128 23 -39 125 -96 -53 150 73 -138 -164 -190 182 146 188
5982 188 182 218 -106 -210 120 129 81 -13 3 168 129 99 -48 -154 -126 -118 108 -24 32 130 68 93 109 -13 -110 6
6008 6 -114 140 154 11 -150 100 -88 -23 -152 135 55 58 -68 206 -123 25 -2 97 -41 124 -47 -89 78
6031 78 -74 -141 -64 99 -155 0 -38 123 -139 -4 -137 64 229 -25 39 -117 71 -22 -58 -133 33 133 252
6054 252 43 43 4 335 -110 55 -57 -5 65 -1 53 -12 -192 -183 -6 54 170 -110 340 -149 -132 -38 10 -143 86
6079 86 -87 -65 -194 -136 121 -17 -138 136 112 54 -99 -26 -72 -62 93 75 7 -67 84 -16 -160 -38 147 -28
6103 -28 50 19 121 43 175 -2 28 -41 -74 -12 133 94 -190 -274 -38 -101 -132 170 7 -82 49 121 -167 52 174
$$ packed form
5935i4J58j91k03K47J5J54N7kn4l8N4j04L3k3J71j34l2J82j56n9k6J53j80J32
5959F0j34J97j93K54l38L09l13K36j53n3J51o2J64k21M3K03p7k11k6k6L72l6M2
5982A88oL6l24j04L30Rm8r4J6J65l9l0j47j06K8QK26j32N6R8o2K5J6j22r7J16
6008Fj20K54J4j43j61K50j88O5j29K87q0Lj26K74l29J48k7R9j38J65j71m2J67
6031G8j52o7P7J63k54J55l8J61k62J35j33K01J65k54O4j56J88r3l6p5J66J00J19
6054B52k09%l9L31m45J65j12N2P0o6N4o5j80RJ77O0J16k80M50m89J7R4M8j53K29
6079H6j73K2j29N8K57j38j21K74k4n8j53P3m6J0J55j8o8p4J51j00j44J22J85j75
6103b8P8l1J02p8J32j77L0o9l3O2J45l9k84q4K36o3l1L02j63q9J31P2k88K19J22
$$ plain form
6128 174 -117 53 69 -98 -136 -262 -37 94 -113 9 -64 26 38 -85 34 237 6 -50 -181 105 203 73
6150 73 -38 156 9 -18 -114 112 21 82 -114 21 108 78 46 21 235 -24 -62 -34 51 -11 -124 250 100 241
6174 241 -90 -119 28 -5 13 -71 155 10 154 -130 138 -4 -96 115 40 40 180 -171 75 -152 58 -155 86
6197 86 -84 -32 103 -98 -197 43 3 174 31 -41 69 -64 210 -26 94 16 64 -177 -29 -327 62 131 270
6220 270 184 236 -95 25 -112 115 -82 -387 14 -60 -93 78 -218 49 16 53 122 -16 -47 -169 -203 54 -142
6243 -142 101 -13 -7 32 25 -46 139 -185 -146 -77 57 -95 -124 -10 74 63 -85 -65 39 -129 -20 -56 172 35
6267 35 38 -147 -25 -60 293 50 11 25 83 -229 -40 89 -16 -75 -50 101 -47 32 -106 -5 -100 117 -154 -143
6291 -143 -54 124 -31 106 60 -77 -6 132 -40 43 -183 182 -160 -198 -23 84 81 14 -38 141 62 -124 40
$$ packed form
6128A74k91J70J6j67l8j26K25J31k07J22p3R0J2j23J19K03k31n6j31K86R8j30
6150G3j11J94j47k7r6K26r1O1j96J35Q7l0l2k5K14k59l8K8Q5o2j13L74j50J41
6174B41l31k9J47l3J8q4K26j45J44k84K68j42r2K11p5%J40l51K46k27K10k13K41
6197H6j70N2J35k01r9K40m0J71j43p2J10j33K74k36J20p8M8k41J48k98L89O9J39
6220B70q6N2l31J20j37K27j97l05M01p4l3J71k96K67l3L7O9j38l1j22l4K57j96
6243a42K43j14OL9pp1J85l24L9O9J34j52k9J14Q4j1j48K0J04j68J09l6K28j37
6267C5Lj85J22l5L53k43l9J4N8l12J89J29j05n9K5J51j48P9j38J01r5K17k71J1
6291a43Q9J78j55J37m6j37P1J38j72Q3k26L65l42l8J75J07lo7n2J79p9j86J64
$$ plain form
6314 40 -88 146 -16 -16 -114 -243 -14 -43 87 -90 -70 -143 74 15 -177 -111 -72 262 -28 -99 -176 24 -6 43 -71
6339 -71 15 30 -69 57 91 131 80 60 355 85 62 -106 -199 -59 17 24 -113 -15 63 19 118 -62 -174 -125 34 -55
6365 -55 -68 142 135 -162 66 -248 -107 -60 54 -234 44 134 40 -117 145 36 -4 -35 -70 36 -115 -29 62 -191
6389 -191 -58 -102 -208 238 -15 -109 -30 83 -38 -111 112 -141 7 -21 -71 30 -159 65 -16 -135 -193 -72 -115
6412 -115 -48 25 -84 -138 -29 87 35 27 -170 -108 148 214 -188 -2 -102 -138 -44 -71 46 -200 -143 98 74 -365
6436 -365 -80 -67 -198 392 -11 -45 -27 -210 16 80 131 19 -9 40 185 -33 -95 27 25 93 -33 127 -19 170
6460 170 20 -37 -228 202 -156 205 254 92 268 42 -66 -49 -74 39 124 64 -93 -112 -203 -158 -34 -58 -277
6483 -277 -20 71 27 197 27 255 84 31 -150 30 -63 58 62 -220 -157 -174 -43 -124 -32 -13 -138 -98 251 -249
$$ packed form
6314D0j28K34j62%r8j29K29k9J30j77K0p3K17n9j92O6L9L34k90p1p7K00l0M9j14
6339g1Q6J5r9J26L4M0n1k0K95k70k3j68r3J40P6Pj37R8P8m4R9j80j12M9J59q9
6365e5j3K10pk97K28l14J41M7J14k88K78R0r4j57K62j09m0l1l5J06j51Q6R1k53
6389a91J33m4j06M46k53r4P9J13j21p3K23k53J48k8n0J01j89K24q1j19n8J21m3
6412a15O7P3j09n4J09J16n2qj97O2K56O6m02J86j00l6R4k7J17k46N7K41k4m39
6436c65K85J3j31N90m03l4J8j83K26O4N1j12k8M9J45k18o2J22kO8j26J60j46J89
6460A70j50n7j91M30l58L61M9j62J76k26j08J7k5J13Q5o0j57j9r1M5J24k4k19
6483b77K57R1m4J70j70K28j71n3j81J80r3J21Mk82O3j7J31q1R2J9j25M0L49n00
$$ plain form
6507 -249 -72 -49 22 -40 53 -74 257 249 60 -172 -58 -39 -106 248 -31 70 -292 82 -22 -81 349 274 139
6530 139 14 26 116 -95 -57 35 -79 137 -1 142 70 -155 -253 279 18 51 -188 -24 132 -187 -61 -98 -34
6553 -34 161 -72 127 243 -62 -46 38 -169 45 -58 105 -62 -55 -28 32 68 -137 108 -49 -147 -282 -47 -75
6576 -75 100 -33 -68 -201 288 60 130 136 58 -13 -159 130 83 -91 90 -56 -180 354 -82 -97 -6 -20 90 17
6600 17 67 -31 70 42 35 47 -240 123 -62 39 -32 25 -188 -300 117 -394 -63 -112 13 -31 -136 110 -206 46
6624 46 112 126 163 51 -363 -46 -166 100 25 -91 227 -149 143 145 228 -52 3 70 46 -83 -13 60 -228 247
6648 247 -127 157 -77 -54 101 -143 170 -14 -82 -60 -137 -117 12 150 -49 -243 -106 -125 24 19 -69 -104 -50 8
6672 8 58 69 131 13 -51 0 157 -24 -118 -185 73 -99 147 62 68 89 83 56 -57 -18 32 88 201 229 -40 65 -208
$$ packed form
6507b49J77K3P1o2R3j27L31qj89k32J14J9o7L54k79J01l62L74j04n9M30p5j35
6530A39j25J2R0k11L8R2j14K16j38J43p2k25r8N32k61L3k39J64J56l19J26l7O4
6553c4J95k33J99J16l05J6Q4k07K14j03J63j67PK7O0L6k05K45j57r8j35K35k8
6576g5J75j33l5j33M89k28P0Op8p1j46K89m7j74J81j46j24N34m36j5R1j4J10p3
6600A7N0r8J01k8pJ2k87L63j85J01p1N7k13j12M17n11L31m9J25m4j05K46l16K52
6624D6O6J4L7j12m14L17j20K66p5j16L18l76K92KQ3k80N5O7k4j29P0P3k88M75
6648B47l74K84k34K3J55k44L13j84o8K2p7K0J29J38j99j94J37j9J49nq8l5N4N8
6672HN0J1O2j18o4N1J57j81r4o7K58j72K46q5OK1ok7j13L9N0N6J13K8k69J05k73
$$ plain form
6699 -208 -24 -195 138 79 150 -72 126 100 215 -303 253 182 -28 64 -160 -50 -111 105 -98 116 9 -296
6721 -296 -155 -121 53 -46 104 -24 -151 202 25 -44 -208 185 -61 80 18 151 -32 -138 24 146 107 131
6743 131 -47 122 141 72 187 15 200 227 -27 90 -199 -136 117 -22 -107 -44 -103 -68 157 89 40 -24 1 -21
6767 -21 -193 -164 4 211 -171 -40 82 -152 -172 -73 -29 8 -204 -2 45 -58 26 -16 279 29 35 55 -117 -58
6791 -58 -43 170 86 48 -146 22 20 -147 -94 157 60 83 -20 -328 55 -74 -171 -385 -101 21 220 -49 -84 154
6815 154 -107 1 51 -118 -203 -164 101 -101 -24 87 -19 -128 -269 66 -65 137 -218 250 -64 -27 179 355
6837 355 -40 -430 37 56 6 -35 -173 93 -120 -38 -48 -89 -139 2 -2 110 -167 152 168 -46 -148 -63 -14 -29
6861 -29 85 -108 -160 -30 -60 141 -162 165 117 -90 57 -86 -37 51 -33 -39 213 -61 142 -80 34 -104 -28
$$ packed form
6699b08J84j71L33n9P1k22J98k6J15n18N56p1k10R2k24J10o1K16k03K14j07l05
6721b96J41L4J74r9J50j28j27L53j77o9j64L93k46J41o2J33j83j06J62J22l9K4
6743A31j78J69J9o9J15j72J85K7k54J17k89O3K53j39q5O3n9L5K25o8m9o4K5k2
6767b1j72K9J68K07l82J31J22k34k0R9M4L7k12K02M7j03Q4m2K95k50OK0j72N9
6791e8J5K13q4l8j94J68kj67N3K51r7K3j03l08L83j29r7k14K84J22J99k69l5K38
6815A54k61J08N0j69q5L9K65k02P7J11j06j09j41L35j31K02l55M68l14L7K06J76
6837C55l95l90M67J9n0m1j38K66k13Q2j0m1n0J41mJ12k77L19J6k14j02Q5M9j5
6861b9J14j93n2J30l0K01l03L27m8k07J47j43M9Q8q4oK52k74K03k22J14j38P6
$$ plain form
6884 -28 -74 -53 5 28 -6 112 -109 -33 113 231 48 128 161 -141 -68 114 -144 -33 168 20 -118 -150 94 181
6908 181 6 -90 -118 -207 52 164 118 124 92 14 -36 -136 -216 -190 -213 -1 8 -71 195 40 199 -92 -34 129 46 114
6934 114 -9 -30 -23 -15 104 -175 -74 53 -249 170 117 -39 143 -130 280 -26 13 55 157 -168 -222 -159 59
6957 59 68 -209 -38 132 -55 29 74 168 -61 215 16 174 -199 -237 -193 -238 48 6 -215 97 11 2 290 92
6981 92 20 -107 18 171 -82 -3 112 80 -77 -131 22 -24 -85 56 -318 -182 107 -176 -32 123 15 -115
7003 -115 291 130 60 -1 240 -189 -97 109 -140 -244 91 -142 -163 19 -162 -123 -78 -108 -45 83 -143 -216 37
7026 37 75 125 307 -123 -90 160 75 3 23 -132 -257 -89 173 -61 260 23 137 138 13 -82 -147 -60 -89 101
7050 101 -29 -230 -133 -112 -184 166 -99 21 123 105 124 104 -348 255 107 -68 119 -35 -82 -124 -3 -50 -39
$$ packed form
6884b8m6K1N8K3l4J18k21P6J46J18j83Q0L3l02P3J82k58J11K01j48j38l2K44Q7
6908A81j75r6k8q9K59J12m6Ol2p8n0j00q0K6k3K12Rp9K66j55J59k91N8J63q3O8
6934A14j23k1PQJ19k79J01J27l02M19n3j56J82k73M10l06L9M2J02l25n4O3K18
6957E9Rk77J71J70j87Q4M5R4k29K76j99J58l73l8M4m5K86m2k21L12q6rK88j98
6981I2p2j27J25J53k53P9J15l2j57n4J53m6o1J41l74J36K89k83J44J55j08j30
7003a15M06j61p0o1K41m29R2K06k49j04L35k33k1J82j81L9M5l0O3J28k26p3K53
7026C7L8N0J82m30L3K50q5p2K0j55j25J68K62k34L21k37J14Jj25r5o5Q7k9J90
7050A01j30k01R7K1p2L50k65J20J02j8J9k0m52O03j48j75J87j54m7m2J21m7J1
$$ plain form
7073 -39 -18 -53 -178 13 -86 -123 19 -23 -33 117 148 -88 -23 52 -54 222 -74 -12 176 79 -145 63 174 -63
7097 -63 140 -43 116 62 39 -98 -166 -29 -194 -190 120 44 -27 -54 144 24 -54 126 89 -78 -144 -160 -190 -7 144
7122 144 11 -19 -195 -19 -3 196 11 -61 56 8 84 -71 -76 54 -70 6 -9 -216 -50 156 -41 35 -115
7145 -115 125 -38 34 -176 -49 144 223 39 -139 -34 -172 9 -71 -2 26 155 117 -74 152 35 99 163 -90
7168 -90 186 111 -230 0 -113 -67 -106 -231 30 -21 133 25 61 187 87 72 -18 50 -190 108 -86 162 -87
7191 -87 -179 -93 -65 -375 -73 3 -222 60 -55 13 -146 0 -95 213 280 -40 -33 -11 -104 -134 85 -35 106 72 -59
7216 -59 -36 -94 324 -5 -10 62 65 -105 249 296 -124 60 219 188 72 -131 -42 -169 -16 -45 121 1 -88 -37 -22
7241 -22 -162 -12 201 -60 228 -168 -249 26 33 -160 -59 -55 70 -26 106 -12 -80 29 98 -43 -8 119 -57
$$ packed form
7073c9K1l5j25J91r9l7J42m2j0J50L1k36O5P5j06K76k96O2J88r7k24K08J11k37
7097f3K03j83J59n4k3j37o8J37j65ML10p6p1k7J98j20p8J80l7j67o6j6l0J83J51
7122A44j33l0j76J76J6J99j85p2J17m8P6j55nJ30j24P6j5k07J66K06j97P6j50
7145a15K40j63P2k10J27J93P9j84j78J05j38J81q0O9K8J29l8j91K26j17O4O4k53
7168i0K76p5l41K30j13M6l9j25K61n1J54j08L6J26j00j5r0O8k40K98j94K48k49
7191h7r2Q6K8l10L02P6k25K82j15O8j59J46r5L08O7l20PK2r3l0K19j20J41l4j31
7216e9K3n8M18l29nP2Lj70L54M7m20J84J59l1j16k03Q9j27J53k9J66j20q9N1J5
7241b2j40J50K13k61K88l96q1K75Pj93J01MJ25r6J32j18o8J09O9j41L5J27j76
$$ plain form
7264 -57 -111 58 64 -56 -54 45 -338 0 -276 -359 -140 101 -3 -46 210 -213 117 227 -100 -6 -138 -73 -48 -233
7288 -233 42 -8 -180 -37 -19 -132 284 -258 125 -14 -113 240 138 -117 16 -388 -29 -38 164 164 -57 222
7310 222 -47 178 86 27 -99 194 90 -64 97 -131 -36 54 79 -103 -154 38 -81 -92 -154 0 -46 54 32
7333 32 -163 -16 72 84 68 -84 -100 -55 -160 18 -122 39 52 -36 -158 163 -181 -28 82 108 232 -121 -22
7356 -22 -73 70 -147 -210 -93 276 215 -26 84 -11 157 -24 34 182 73 28 -94 15 -148 -150 -125 -231 -51
7379 -51 -126 -16 63 -181 199 138 23 124 -277 7 -25 34 207 137 -58 2 -171 -183 19 -42 -207 134 -63
7402 -63 -82 157 94 149 -71 89 84 91 -28 53 -11 137 -179 -123 -16 33 70 88 -240 101 175 272 302 -5 54 96
7428 96 177 -81 -226 -149 -198 -177 53 -90 -108 -36 -96 -121 73 303 -55 192 -251 71 0 141 76 -80 258 -197
$$ packed form
7264e7n4J69Oj20KR9l83L38k76q3K19K41j04m3K56m23L30J10l27R4j32O5K5j85
7288b33K75n0j72J43J8j13M16n42L83j39r9L53j02k55J33m04L59rK02%k21K79
7310B22k69K25r2n9j26K93j04j54J61k28R5R0K5j82n1J92j19j1o2J54m6J00k2
7333C2j95J47Q8J2j6j52j6M5j05J78j40J61J3q8j22L21l44J53J10K6J24l53R9
7356b2n1J43k17o3J17L69o1k41J10r5J68j81N8J48j09m5j22J09j63kK5j06J80
7379e1p5J10P9k44L80o1j15J01m01K84l2N9J73p0j95O0j73j2K02o1j65L41j97
7402f3j9K39o3N5k20J60nPj19Q1o4J48l16N6J07M9L7J8l28L41P4R7L0l07N9M2
7428I6Q1k58j45P7m9K1K30j43j8P2o0k5J94K30l58K47m43L22p1J41o5j56L38m55
$$ plain form
7452 -197 -69 -80 -79 -54 63 -123 -31 83 176 -107 165 94 59 57 85 -141 -54 155 -213 -163 158 -59 28 -183 16
7477 16 254 -220 137 -184 3 96 -3 -116 147 -301 -36 -400 256 -147 -81 161 -25 205 98 330 158
7498 158 24 88 53 -9 -232 -355 35 -372 37 47 173 -332 -83 142 -26 210 -105 -128 226 65 29 16
7520 16 -15 80 -404 58 -125 -116 102 -10 -128 -138 28 -93 -206 28 52 14 45 -31 -149 -33 49 -136 29 -198
7544 -198 51 3 -225 14 -82 18 -52 -125 137 -8 183 54 -62 -26 12 -106 4 -210 -62 106 -184 28
7566 28 25 39 164 48 129 97 10 -17 307 -156 -179 87 -170 0 -8 -183 -150 -55 59 62 -166 217 21 11 30 103
7592 103 43 -77 -91 8 -87 -188 -154 200 -80 -239 -118 80 98 117 204 -191 -42 12 156 90 12 87 -97 -5
7616 -5 -171 -52 -68 32 -200 20 77 207 215 81 43 -52 114 -17 -56 -2 -17 -101 -63 -113 1 80 204 -13 158
$$ packed form
7452a97J28j1JK5J17j86R2J14R3k83K72p1l5kK8k26Q7K09l68N0L21k17Q7k11J99
7477A6K38m74L57l21J87R3r9j13K63m48K65l64O56m03O6K42j86K30j07K32j72
7498A58j34O4l5o2k23j23L90m07M09J0J26n05K49K25j68K36l15k3L54j61l6j3
7520A6l1R5m84M62j83RK18j12j18j0J66j21j13K34K4l8L1p6j18J16Q2j85J65k27
7544a98K49m8k28K39r6J00p0p3K62j45J91j29j16L6L8j18J10k14J48J68k90K12
7566B8lJ4J25j16Q1l2q7k7L24m63k3K66k57J70qj75L3R5J14Lk28L83j96j0J9P3
7592A03o0j20j4R9r5j01L4L54k80j59J21J98J8J9Q7l95J49N4J44o6p8P5j84R2
7616ej66J19j6J00k32K20N7J30Qj34l8r5J66j31l9N4j5q4L8n0J14P9J24k17J71
$$ plain form
7641 158 25 -141 114 275 65 156 84 122 -23 -31 -145 -47 -135 44 78 12 67 89 -82 132 38 -149 212 181
7665 181 106 209 -217 -47 -259 -19 106 -151 -7 75 -191 -142 -140 10 -13 67 94 219 -207 219 29 59 -87
7688 -87 92 -66 -20 108 -205 -102 -340 240 -37 164 -57 21 -33 -130 109 136 96 -219 7 77 17 -95 67
7711 67 -38 48 -5 157 77 211 -161 127 91 46 -106 60 -7 -89 -121 -259 -66 -109 -112 -2 -5 -56 -33 -18 71 -4
7737 -4 4 78 0 -191 -24 -112 183 11 156 75 -133 133 -32 -257 175 166 -73 143 -15 -16 37 -62 93 32 -223
7762 -223 -133 -231 -102 -110 -154 19 -101 -144 -100 99 -88 58 52 -128 -53 -243 -12 -149 -83 105 -110 -19 46 -176
7786 -176 -92 65 11 38 -77 123 -37 -58 55 162 -174 -5 174 -90 9 -28 235 242 163 87 103 88 -195 -16
7810 -16 42 11 180 -183 -204 157 -78 -127 128 -2 -96 -22 42 -110 -202 57 173 -211 80 33 -189 270 -40
$$ packed form
7641A58j33j66K55J61k10R1p2L8j45qj14R8q8J79L4o6N5K2j71K14r4j87L61l1
7665A81p5J03m26J70k12K40J25k57J44Q2k66M9KJ50k3Q0K7J25m26M26j90L0j46
7688h7J79j58M6J28l13J03k38N80k77K01k21P8n4r7K39K7m0l15K26P0o0j12J62
7711F7j05Q6n3J62q0J34l72K88l6m5j52J66o7q2l2j38J93m3lJ10ln1K3J5Q9p5
7737dQP4p8j91J67q8K95j72J45q1k08K66j65k25M32rk39K16j58jN3r9J55o1k55
7762b23R0r8J29qm4J73j20m3M4J99j87J46oj80P5j90K31j37O6J88k15R1O5k22
7786a76Q4J57n4K7j15K00j60k1J13J07l36J69J79k64R9l7K63Pp9p6J6j5k83J79
7810a6N8l1J69l63k1L61k35m9K55j30r4P4O4j52r2K59J16l84K91m7k22M59l10
$$ plain form
7833 -40 -254 259 156 66 38 -352 195 -62 61 -21 -126 13 -86 143 16 94 100 -50 51 -91 -68 26 94 133
7857 133 -159 -198 -23 77 -48 -71 -50 -88 304 -38 -92 -69 0 134 -99 -51 -200 -310 80 -436 27 11 20 -132
7881 -132 -249 222 -93 88 103 102 -84 8 -62 -1 -13 -44 99 18 -143 72 13 52 153 -16 71 180 122 -110
7905 -110 -55 -101 -258 108 -55 96 -71 47 103 -133 57 76 57 -47 163 20 29 108 -73 -145 146 -7 45
7928 45 79 27 47 -174 -4 -87 118 155 65 326 139 100 15 -55 -223 -310 -35 -75 -78 -145 195 -83 -244 -22 -17 76
7954 76 -45 -30 307 -43 130 8 -147 95 -67 -260 141 -64 7 -219 55 209 108 162 51 -17 428 -80
7976 -80 181 -21 -178 -38 136 -296 -38 -159 24 -257 -148 -35 -29 45 -69 -27 -30 83 -155 -92 -46 -350 -10
7999 -10 -83 -253 -143 -123 -136 -130 45 95 39 -212 117 -100 -41 115 -108 72 251 36 -322 -23 -110 79 -123
$$ packed form
7833d0k14N13j03r0k8l90N47k57J23q2j05J39r9K29j27P8Oj50J01j42K3R4O8L9
7857A33k92l9J75J00j25k3K1l8L92l42n4K3O9J34k33M8j49j10L90n16M63j6Rj52
7881a32j17M71l15J81J5jj86R2p0O1j2l1J43q1j61K15n9L9J01j69Q7J09n8k32
7905a10N5m6j57L66j63J51j67J18N6k36J90J9j9j04K10j43RP9j81p2K91j53N2
7928D5L4n2K0k21J70q3K05L7r0K61j87l9q5p0j68q7K75m0lo7L40k78j61K22NR3
7954G6j21J5L37l50J73j22j55K42j62j93M01k05P1k26K74J54j01N4j11o8M45n08
7976h0K61k02j57J40J74m32K58j21J83k81J09J13OP4j14M2lJ13k38O3M6l04L40
7999a0p3j70J10K0j3OJ75N0n6k51L29k17N9J56k23J80J79k15l58K99q7J89k02
$$ plain form
8022 -123 -247 -55 150 -198 -153 -16 -33 7 -119 53 29 -29 178 -104 -103 100 -187 35 -189 13 -71 -66 102
8045 102 14 82 39 -100 151 260 -106 -109 127 -60 -59 -183 43 -150 -42 118 -219 83 -190 139 -189 6
8067 6 62 -83 -308 187 56 -31 -106 24 50 -252 107 -326 155 183 36 119 -110 48 -60 -269 222 -99 62
8090 62 -11 122 217 229 89 63 81 -19 -45 181 139 81 140 216 88 35 140 234 49 50 28 221 -50 5 75 -99
8116 -99 -2 74 58 -99 -61 165 137 -71 103 -84 127 -46 -90 35 -53 101 -61 240 -73 -265 204 257 -120
8139 -120 -256 71 132 -31 51 112 -94 -78 35 -154 -249 -56 155 -302 44 99 -121 -197 25 82 28 -52 -16 -193
8163 -193 -61 -177 -172 -211 -11 -20 -36 29 83 -196 177 232 63 194 -108 235 -75 73 -54 5 -120 -286 -29
8186 -29 93 -209 -218 -5 68 223 79 193 -23 148 9 57 98 -201 163 71 86 -46 -61 -75 -45 4 -32 -89 -248
$$ packed form
8022a23j24J92K05l48M5J37j7M0j26J72k4n8K07k82JK03k87K22k24K02q4NJ68
8045A02q8O8m3j39K51J09l66lK36j87Jj24K26j93J08J60l37L02k73L29l28J95
8067FN6j45k25M95j31q7p5J30K6l02L59m33M81K8j47Q3k29J58j08k09M91l21J61
8090F2p3J33R5J2j40k6J8j00k6K26m2n8N9P6j28n3J05R4j85Jk2J93k71N5P0j74
8116i9R7P6j6j57L8K26k8k08J74j87K11j73m4J25q8J54j62L01l13j92M69N3l77
8139a20j36L27O1j63Q2O1k06J6J13j89r5J93K11m57L46N5k20p6K22N7n4q0L6j77
8163a93J32j16Nl9K00rj6O5N4k79L73N5j69J31l02L43l10J48j27N9j25j66K57
8186b9J22l02rK13P3J55j44J14k16J71j39M8M1k99L64r2J5j32j5j4L0M9l6n7j59
$$ plain form
8211 -248 -190 78 8 113 1 173 49 -13 -23 -68 -31 -99 35 -102 155 59 39 76 -26 204 139 145 129 -132 238
8236 238 86 -166 292 70 275 -188 107 -105 -410 28 127 237 -31 10 -40 -140 -7 59 -69 -115 -102 -135
8258 -135 -74 23 -25 79 -1 -157 4 101 -234 -74 -81 156 -258 -5 116 -61 55 40 -263 31 -3 -75 48
8281 48 -177 20 -124 76 -41 39 -73 -137 -134 42 -120 68 -32 40 111 -178 31 55 -153 -222 -132 -63 173 -18
8305 -18 -32 136 -48 253 -263 70 -31 -18 -78 -88 -250 -228 197 -119 10 -270 195 -112 -140 4 209 -232
8327 -232 -184 30 184 -124 -54 73 -80 -34 6 -136 56 -58 -22 12 51 -37 -132 125 133 60 -235 -94 -174 108
8351 108 -73 204 -159 -123 100 -41 -74 114 -76 108 97 63 47 6 -133 117 -133 -397 115 3 -160 -65
8373 -65 151 70 148 36 39 30 146 4 -224 244 144 58 158 6 -48 269 33 -136 -6 -48 44 84 221 -179
$$ packed form
8211b48N8K68p0J05j12J72j24o2j0m5L7o8J34j37K57r6k0L7j02K30o5Oj6k61L70
8236B38j52k52M58k22K05m63K95k12l05M38R9J10k68M1n0j00J33O6j28m6J3l3
8258a35O1R7m8J04q0j56J61R7l35J60pK37m14K53J21j77J16j5l03K94l4p2J23
8281D8k25J97j44K00j17Q0j12o4LJ76j62J88j00P2P1k89K09K4k08o9R0O9K36j91
8305a8j4J68j84L01n16L33j01J3o0j0j62K2M25l16J29k80M65l07k8J44K05m41
8327b32M8K14J54l08P0J27j53M6M0j42J92j14L6L4L9q8r5K57Qp3k95J41q0K82
8351A08j81K77l63L6K23j41l3J88j90J84j1l4j6m1j39K50k50k64N12j12j63R5
8373f5K16q1P8j12LrJ16j42k28M68j00q6J00j52n4L17k36j69J30m2R2M0J37m00
$$ plain form
8397 -179 -60 -69 141 132 -126 136 -78 -10 -72 -294 -143 -139 16 -4 100 16 245 340 -101 -53 -108 -82 39 -94 -34
8422 -34 42 -114 -208 -33 10 -163 25 155 145 -165 48 201 117 24 40 143 106 -31 46 -64 48 50 -207 16
8446 16 273 -5 -218 77 0 -70 -140 -119 95 59 -194 -9 51 -246 42 30 -74 132 41 17 -84 -25 17 213
8470 213 257 402 98 12 100 89 -121 210 -144 124 -55 -192 125 181 175 276 199 -86 2 176 -226 -294 195
8493 195 -297 -341 -313 -9 64 -147 -118 -182 -163 -146 -78 15 190 -157 -137 -1 243 219 -136 -18 200 74 -17 130
8517 130 30 -8 154 2 6 -214 -80 -173 123 -9 -13 -31 -150 -21 -123 -256 -35 -10 -54 203 15 85 -111
8540 -111 172 135 56 202 88 -229 -99 -42 -14 -42 57 -154 87 125 -64 271 -188 34 233 -76 41 -1 -44
8563 -44 108 -149 80 262 21 -66 117 31 -41 90 30 21 -90 163 -142 -126 -85 -20 -130 -136 -33 -31 111 148 -177
$$ packed form
8397a79J19rK10rk58K62k14O8o2k22J51MJ55k0J04q4K29R5m41M8n5K6J21j33O0
8422c4P6j56r4J75M3j73J88J30j0l10K13J53q4r3J6J03l7j37P7j10J12Kk57K23
8446A6K57k78k13K95p7p0p0K1K14l6k53J85O0k97K88j2j04K06r1k4j01N9M2J96
8470B13M4J45l04q6Q8j1k10L31l54K68j79j37L17N6oJ01p7k85Q8J74m02o8M89
8493A95m92m4K8L04P3k11K9o4J9J7O8R3J75l47K0J36K44k4l55J18K18j26r1J47
8517A30j00l8J62j52Mk20J34r3K96j32mj8j19J29j02j33K21K5m4K57j88P0j96
8540a11K83l7p9J46j14l17J30N7K8k8R9k11K41L8j89L35m59K22J99l09J17m2m3
8563d4J52k57K29J82k41q7J83q6p2J31o0rj11K53l05J6M1O5j10oJ03KJ42L7l25
$$ plain form
8588 -177 -319 -150 59 2 152 -42 60 116 157 -163 68 -37 160 -116 141 117 -80 136 -100 -21 -63 -25
8610 -25 -17 44 65 71 230 -112 16 58 -87 -16 62 274 154 127 -6 159 174 -42 -104 -42 1 -96 -99 -39 63 241
8636 241 -25 91 1 -112 69 -100 15 -93 -33 152 99 -64 -188 -121 -24 122 -9 -27 -48 -17 -8 122 -81
8659 -81 -30 20 23 -389 -94 55 -76 -35 -112 -90 -140 30 -39 -104 194 171 133 43 10 -292 77 -35 -94 -119 -186 -222
8685 -222 -182 64 -62 51 166 21 -107 -111 -179 75 -188 46 8 112 45 9 160 -93 -111 86 121 -22 71
8708 71 175 -48 -231 116 101 243 119 -100 -74 -27 17 -151 -80 3 102 41 -67 -131 -119 37 13 85 -125 -289
8732 -289 67 136 89 -304 6 -121 -262 -99 -14 77 -150 130 -76 63 -187 213 3 11 139 3 -111 47
8754 47 -227 -73 -4 -124 -28 -50 -82 -42 -177 197 -187 83 21 46 -44 -158 38 32 -33 -132 -46 -12 187 56 -26
$$ packed form
8588a77j42J69K09n7J50j94J02N6M1l20K31j05J97k76K57k4j97K16k36P9m2L8
8610b5QO1K1OJ59l42J28M2j45P1P8K12j20k7j33J65J5k16o2O2M3r7lO0J02J78
8636B41k66J16r0j13J81j69J15j08O0J85n3j63j24O7R7J46j31j8k1L1RJ30k03
8659h1N1N0Lm12K95J49j31M1p7K2n0J70o9o5K98k3l8r0l3l02L69j12n9k5o7l6
8685b22M0K46j26J13J15j45j28mo8K54k63K34l8J04o7l6J51k53j8J97L5j43R3
8708G1J04k23j83L47j5J42j24k19K6M7M4j68P1Q3R9o1j08o4J2J56k4P2k10j64
8732b89L56O9m7l93L10j27j41J63Q5R1k27K80k06J39k50M00k10QJ28j36j14J58
8754D7k74J54O9j20R6k2l2M0j35L74l84K70o2K5r0j14J96oo5r9Q6L4J99j31q2
$$ plain form
8779 -26 44 9 161 177 97 112 64 -249 -37 -133 -77 -214 -273 -159 -27 215 -90 -30 -40 -126 -63 -113 185 -26 175
8804 175 -63 9 -242 52 -224 83 -166 -222 -59 -92 50 7 -31 4 110 22 86 242 -15 262 -82 -192 -56
8827 -56 -176 -6 148 -239 75 182 27 -134 104 305 135 -151 127 132 91 -40 -26 -112 -89 -37 46 16 308
8850 308 -265 -94 -2 -66 -106 177 -12 179 21 -213 -2 113 -145 7 -90 -133 -60 -8 112 -52 92 120 -292
8873 -292 115 46 -57 -95 -315 118 144 -334 -251 86 -193 -242 -304 -104 -136 104 20 95 -108 57 114 101 75 -277
8897 -277 -90 -226 -33 -61 10 49 57 53 93 -44 73 -7 20 74 17 86 -86 -54 -60 -86 -88 310 -117 -119 -100 78 227
8924 227 126 52 65 231 226 54 -218 -87 122 76 -103 -96 35 128 78 -125 221 -147 -55 -128 6 44 172 -17
8948 -17 -136 -175 62 -18 49 11 149 201 -79 -23 -281 46 -140 94 -98 -143 29 163 115 11 -66 115 7
$$ packed form
8779b6P0l5J52J6q0J5m8l13K12r6N6j37n9J14J32K42l05O0j0q6O3n0K98k11K01
8804A75k38P2k51K94k76L07k49n6J63l3J42m3l8L5J06q8O4J56k57K77l44j10J36
8827e6j20J70J54l87L14J07j55j61K38K01j70k86K78Nm1j31J4q6K3N2Q3l0K92
8850C08n73J71R2o4m0K83j89J91j58k34K11J15k58J52r7m3P3N2J20j64J44K8m12
8873b92M07o9j03l8k20M33K6m78Q3L37k79m9o2K00l2K40q4P5k03J65N7j3k6l52
8897b77J87j36J93k8P1L9QmM0j37J17q0K7N4n7O9j72L2ok6kL98m27kJ9J78J49
8924B27j01p4J3J66nj72k72J31K09m6j79PJ31R3n0k03L46l68R2p3J34L8J28j89
8948a7j19l9K37q0O7l8J38N2k80N6k58L27j86K34j92m5J72J34m8j04p7J81j08
$$ plain form
8971 7 83 197 24 96 -81 -294 34 -17 116 -108 170 -36 -165 111 -171 -88 108 -138 -99 -140 3 -6 101
8994 101 7 22 -195 194 243 -80 156 21 66 -275 297 -27 -64 21 80 -65 1 -183 -275 -198 -204 118 -46 186
9018 186 61 17 114 13 -198 -65 -17 -264 191 -86 -52 63 -96 -13 -64 76 231 -29 98 51 -33 -56 -233
9041 -233 149 -386 -52 -141 -182 -3 -84 -175 101 -138 10 18 66 6 105 147 -79 324 76 87 -37 264 -79 -126
9065 -126 66 -64 206 -148 122 147 57 -83 75 36 -48 195 -27 73 -48 -283 -39 6 -81 152 -163 -27
9087 -27 24 -228 -147 -64 173 184 97 -25 -257 154 -23 140 -29 17 25 -125 -171 22 107 245 134 -201 31 84
9111 84 -137 52 107 -219 2 -221 78 -257 25 -35 -164 -108 58 -1 -70 -22 191 145 -132 74 -102 -141 53
9134 53 -221 69 1 356 -18 -67 85 -57 -233 -123 -77 -91 50 -161 -92 219 23 6 222 143 122 81 -74
$$ packed form
8971GP6J14j73P2j77k13L28n1J33k24K78k06j29K76k82Q3J96k46L9m1J43rJ07
8994A01r4J5k17L89M9l23K36j35M5l41N72l24l7Q5N9j45O6j84r2P7oL22j64K32
9018A86j25m4R7j01k11J33M8k47M55k77L4J15j59Q3n1J40J55k60J27m7q4k3j77
9041b33L82n35L34q9m1J79q1r1K76k39J48QM8o0R9M2k26M03k48J1j24L01l43m7
9065a26J92j30K70l54K70K5r0j40J58l9q4K43k22J00j21k35K44M5q7K33l15J36
9087b7N1k52Q1Q3K37J1q7j22k32M11j77J63j69M6Qj50m6J93Q5J38j11l35K32N3
9111H4k21J89N5l26K21k23K99l35K82o0j29N6J66n9o9M8K13m6k77K06j76l9J94
9134E3k74K90o8L55l74m9J52j42j76J10M6j4J41k11O9L11j96j7K16p9k1m1j55
$$ plain form
9157 -74 57 40 -11 54 170 -187 -61 -20 -142 80 -53 -57 -74 -19 92 65 -16 37 -79 -146 -26 -143 266 -64
9181 -64 -52 -2 -8 -238 143 137 245 84 -13 -52 36 141 231 24 -74 61 -94 74 -81 75 -132 -221 -88 147
9205 147 -55 66 231 163 137 -50 183 -13 -43 -96 -87 90 129 19 106 -72 53 21 -4 138 -111 -52 -1 107
9229 107 -2 261 226 135 -1 -6 155 -94 -124 105 -108 -13 47 -44 -60 -215 -48 118 174 -109 -28 -126 -77 93
9253 93 -27 12 27 -146 43 61 -40 100 -2 85 92 -100 -18 159 29 68 1 -236 -160 -66 83 -86 55 -266
9277 -266 -4 189 -41 -140 113 132 0 -200 74 25 -89 -101 -274 154 24 -6 135 238 -41 -134 -149 300
9299 300 -11 -195 103 -112 94 2 -39 -9 40 126 -90 -28 -10 149 -29 -5 -94 101 -82 72 396 -20 117
9322 117 -211 -264 -189 168 186 -96 -115 -78 130 -56 222 -46 116 -91 191 30 -80 -102 -37 146 26 80 -27
$$ packed form
9157g4J31j7n1O5J16l57J26M1j22K22j33mj7N5J11k7q1N3j16o7J20j17M09l30
9181f4J2N0ok30L81oJ08j61r7l9Q8J05R0k07r8J35j55J68j55J56k07q9J33K35
9205A47k02J21J65o8k6j87K33j96l0n3RJ77L9j10Q7j78J25l2k5J42k49N9N1J08
9229A07j09K63l5r1j36nJ61k49l0K29k13R5O0r1j6j55J67J66N6k83Q1r8M9J70
9253I3j20L9J5j73J89J8j01J40j02Q7Pj92Q2J77j30L9o7k37P6R4J49j69J41l21
9277b66K62J93k30r9K53J9j32k00K74m9j14j2j73M28j30l0J41J03k79r3j5M49
9299C00l11j84K98k15K06r2m1L0M9Q6k16O2J8J59j78K4q9J95j83J54L24m16J37
9322A17l28n3P5L57J8k82j9L7K08j86K78k68J62k07K82j61j10k2O5J83j20N4j07
$$ plain form
9345 -27 -83 24 70 59 13 -102 -136 -54 -279 39 -118 -85 -49 5 -31 -77 -78 -197 53 -281 -38 26 56 94 -242 78
9371 78 -175 -189 -160 -224 129 -42 7 163 36 -294 156 -135 3 -68 229 154 -145 194 195 -34 -21 -84 55 -245
9395 -245 226 -168 -44 183 -129 -7 -36 129 -46 2 74 70 -26 5 -94 -23 80 263 -199 156 172 279 -27
9418 -27 -224 144 -23 0 -159 30 71 159 59 83 -44 15 -120 -112 67 152 -130 -96 -38 -164 153 11 99 83
9442 83 53 -16 60 8 -57 -46 125 23 11 -170 -134 -62 69 38 211 149 55 -78 8 25 1 143 72 200 -50 -222
9468 -222 -239 28 -15 -228 12 109 2 -67 134 -130 69 93 69 115 27 -74 -80 -131 42 260 -178 3 -122 -11
9492 -11 172 -117 -31 -2 -14 67 -177 209 -97 85 32 34 97 18 -54 -200 50 -46 93 86 135 92 175 53 70 195
9518 195 -204 83 -37 -65 29 -82 -46 -93 5 47 -43 138 238 -168 86 -62 -165 82 -79 203 -226 157
$$ packed form
9345b7n6J07M6j1m6j15l4Q2k25L18j57L3L6N4l6m6jj19K50l34K43O4L0L8l36L20
9371G8k53j4K9o4L53j71M9J56j27l30M50k91J38p1K97p5k99L39Jk29J3o3J39l00
9395b45M71l94J24K27l12J22k9J65j75M8P2mr6L1r9P1J03J83m62L55J6J07l06
9418b7j97L68j67K3j59J89M1Q8j00K4j27N9j35QJ79Q5k82L4N8j26L17j42Q8j6
9442H3l0o9P6n2o5J1J71j02j2j81L6P2J31l1J73o2r4j33Q6J7k4J42p1J28k50j72
9468b22j7K67m3k13K40R7j07o9K01k64J99K4k4M6q8j01on1J73K18m38J81j25J11
9492a1J83k89Q6K9j2Q1k44L86l06J82n3KO3p9p2j46K50r6J39pM9m3Q3j22J7J25
9518A95l99K87j20k8R4j11L6m7R8M2r0J81J00m06K54j48j03K47j61K82m29L83
$$ plain form
9540 157 98 -9 94 -177 26 182 2 -77 -70 6 -142 -161 -20 29 -222 111 -126 46 -36 119 -49 -98 163
9563 163 84 -6 17 -12 68 51 79 -90 10 -3 -128 -216 -74 -48 -112 -110 -8 -24 -118 -89 204 -158 -40 122 46 5
9589 5 -94 -132 134 -69 -90 -38 96 -1 195 140 58 38 63 23 -111 -125 -55 -90 117 -139 -94 -215 55 -151 119
9614 119 9 -7 -99 62 20 67 89 -25 -10 -95 -72 -153 198 18 -13 92 49 91 61 -79 88 -140 205 -212
9638 -212 71 -99 13 126 209 -83 -121 -112 85 -27 35 -87 -25 1 204 -167 24 -137 71 -50 -10 -43 -11
9661 -11 72 41 36 0 64 -260 -11 75 -144 -149 -100 -19 300 -12 -252 -60 119 34 133 -6 182 -189 -101 -174 237
9686 237 14 64 -97 57 -164 -242 -216 -23 -110 -32 61 -78 145 -53 -4 44 160 8 -148 54 108 129 -287
9709 -287 107 0 -22 -29 -63 7 -88 -142 229 58 195 7 45 142 -55 -81 155 41 -102 -94 114 -179 -142 -37
$$ packed form
9540A57n9j07J03k71K03J56j80p9PP6j48j9J41M9k51L33k37J72q2J55j68m9K61
9563A63p9r0K3k9Q0j7K8j69J00j3j25q8J42K6o4KJ02j6r4K9K93l62J18J62p6m1
9589Er9l8K66k03k1N2J34r7J96n5q2k0K5m0j34j4P0l5K07k56M5j21K70k06K70
9614A19j10j6r2J61m2M7K2j14J5q5K3q1L51j80l1J05m3M2l0j40J67k28L45m17
9638b12K83j70J12J13Q3k92l8RJ97j12O2j22O2K6K03l71J91j61K08j21M0l3L2
9661a1Q3l1nl6O4l24K49Q6k19nM9Q1L19l12k40J92J79q5R9j39J88l71Q8p3M11
9686B37k23N0j61J54k21p8K6J93q7P8R3j39K23j98M9M8J16j52j56K02N4K1m16
9709b87L94j07k2pl4P0r5n4L71j71J37j88L8R7j97k6K36j14j43QK08k93L7J05
$$ plain form
9733 -37 -169 213 166 104 -94 -2 -124 -189 272 223 -7 -16 -113 63 6 -235 -162 47 -38 -49 -88 -123 37 -21 -67 -186
9759 -186 -158 168 -169 7 -129 -79 -3 -25 -32 -137 -56 23 144 38 58 29 -111 -5 -79 29 -27 -23 60 -87 -60
9784 -60 38 -30 54 58 98 -63 -229 -5 82 11 -23 -230 -12 -135 28 79 -89 47 -134 -102 -103 166 173 -93 -116 57
9810 57 139 93 6 -21 -250 4 -135 -38 -12 -94 151 296 75 16 5 -154 -164 84 69 -32 65 234 132 -36
9834 -36 236 96 -209 -54 -65 108 -183 50 135 6 -207 -128 43 20 31 236 -207 -158 -42 -159 78 -221
9856 -221 133 -22 55 -225 -130 -182 4 -22 44 -49 -10 280 101 94 -172 -239 76 -12 -110 208 -9 -52 1 -237 298
9881 298 138 -75 -24 -13 19 11 -68 15 73 47 203 -51 -155 15 280 75 9 -31 45 -144 -168 -85 -101 15 -89
9906 -89 -124 -275 -149 191 -59 -86 -80 -49 -108 -81 95 160 -100 -100 13 35 71 84 -185 -139 49 -42 41 112 69 36 -106
$$ packed form
9733c7j32L82m7o2j98R2j22o5M61m9k30rr7J76n7k41P3K09q5j1l9l5J60n8m6j19
9759a86K8L26l37J76j36N0P6k2pj05Q1P9J21j06K0k9j40J06p4J08n6MQ3j47K7
9784f0R8o8Q4MM0j61j66K24Q7p1l4k07K18j23J63N1j68J36j81L2jK69Pk66k3J73
9810E7Q2m6q7k7k29K54j39R7K6q2K45J45k21n9j1j59j0K48j5j01R7J69j02j68
9834c6K72j40l05J55j1J73k91K33Q5j29k13P9J71k3J1K05m43M9J16j17K37k99
9856b21L54j55P7k80R5n2J86k6O6r3L9K90j79pk66o7L15q8r8L18k17m3N3k38N35
9881B98j60k13N1J1L2qp9Q3N8k6J56k54j04J70K65k05o6m0P6j89k4Q3j6J16j04
9906h9l5j51J26L40k50k7OL1n9K7J76O5k60%J13K2L6J3k69M6J88r1Q3P1m3l3j42
$$ plain form
9933 -106 2 42 -163 -39 -147 77 -92 -50 -202 -123 71 -78 90 76 70 61 30 -275 -72 -77 -53 -15 -58 298 -14
9958 -14 -67 49 119 176 10 71 -292 -134 -57 79 -204 137 -67 66 28 -33 122 7 -78 -21 73 23 8 63 44
9983 44 45 69 57 119 64 -94 92 -85 64 64 80 -327 129 22 4 85 25 73 110 163 -111 27 -157 60 -114
10008 -114 31 139 -97 -4 -209 -145 41 209 156 47 -68 -102 -10 38 -73 0 107 -40 -19 133 -225 -46
10030 -46 31 -130 30 160 -66 -16 -136 71 -141 -7 18 -23 -16 84 171 -143 317 102 -138 -99 -99 -164 -161 -62 -90
10055 -90 -113 152 -223 66 64 58 4 -54 -31 -172 68 125 145 19 -95 -88 11 -205 211 -6 125 143 125 -28 135
10080 135 -7 -67 -28 -245 122 -29 -202 -284 66 96 -36 -215 -76 -104 -26 13 -11 -220 -77 -219 -143 6 19
10103 19 20 165 -88 -113 29 -216 -357 16 -50 30 35 -57 -6 -14 8 -51 -108 -120 -57 74 -58 105 131 32 -63 -85 -121
$$ packed form
9933a06J08M0k05J24j08K24j69M2j52P9J94j49J68j4orl1l05K03nK4L8m3L56l12
9958a4n3J16P0N7j66O1l63J58P7J36k83L41k04J33l8o1J55j15q5N7R4n0j5N5j9
9983D4JK4j2O2n5j58J86j77J49%J6m07M56j07j8Q1o0M8L7N3k74J38j84K17j74
10008a14J45J08k36R3k05O4J86J68n3j09j15l4R2M8j11P3J07j47K1J52l58J79
10030d6P7j61J60J30k26N0j20K07k12J34K5m1PJ00Q7l14M60k15k40L9%o5LR9k8
10055i0k3K65l75K89kon4n8K3j41K40N7K0j26j14PR9k16M16k17J31J8j8j53J63
10080A35j42o0L9k17L67j51j73q2L50L0j32j79J39k8P8L9k4k09J43j42P6J49J3
10103A9JJ45k53k5J42k45j41L73o6Q0Nr2N1qK2n9n7j2O3J31j32J63K6r9r5k2l6
$$ plain form
10130 -121 -6 -121 15 182 -91 -102 7 -97 165 -112 -215 128 120 -201 -129 -83 -19 -158 -39 41 129 -84
10152 -84 -120 -112 214 -102 -71 -224 150 107 -122 20 34 253 26 -78 -129 34 -160 -112 169 -96 -106 -107 -22 24
10176 24 198 -53 35 196 -25 143 -14 -167 41 -51 -193 -124 216 53 -29 -27 157 158 -239 162 -230 67 -112
10199 -112 -171 269 -199 -146 -3 172 -12 -126 273 103 21 58 103 -66 -204 237 -111 7 -255 -91 183
10220 183 3 175 -15 74 126 -150 175 115 65 155 140 -32 -162 -80 -81 24 90 -118 -52 -34 10 57 -120 20
10244 20 192 89 96 -92 -171 172 -136 165 37 37 43 88 -38 38 -145 -217 -17 120 124 -97 -14 69 -208 158 20
10269 20 -27 -38 -89 166 -249 -179 44 46 -127 -103 181 -222 -33 57 -80 -336 -23 71 112 30 -35 -86 -59 27 -128
10294 -128 195 -91 -23 97 -100 148 -66 152 -159 65 71 46 199 11 -62 -15 72 122 -116 124 -90 -170 89
$$ packed form
10130a21J15j15J36J67k73j1J09j04K62k77j03L43ql21P2M6O4j39J19Q0Q8k13
10152h4l6QL26l16L1j53L74m3k29J42J4K19k27j04n1J63j94M8K81k65j0jQ5M6
10176B4J74k51Q8J61k21J68j57j53K08r2j42O9L40j63q2KJ84Jl97M01l92K97j79
10199a12n9M40m68N3J43J75j84j14L99j70q2L7M5j69j38M41l48J18k62J64K74
10220A83j80J72j90Q9N2k76L25o0n0R0j5j72j30Q2jJ05O6k08O6J8M4M7j77J40
10244B0J72j03Pj88p9L43l08L01j28%OM5j26P6j83p2K00J37Mk21Q3Q3k77L66j38
10269B0m7j1n1K55m15P0K23Kj73K4K84m03J89R0j37k56L13R4M1q2o5n1K7Q6j55
10294a28L23k86O8J20j97K48k14K18l11K24Ok5J53j88p3M7Q7N0k38K40k14q0K59
$$ plain form
10317 89 337 3 -82 97 -65 142 -36 87 -6 42 226 -12 -112 16 -307 24 178 109 94 -101 -27 164
10339 164 237 30 -13 -74 -50 52 40 -27 119 -86 144 147 -83 47 86 -27 -143 -154 137 -101 -90 282 -111
10362 -111 107 -140 156 151 -33 -9 -47 125 38 67 -71 20 -43 108 75 62 -162 -82 -45 -6 33 55 -164 5 -338
10387 -338 3 -63 -37 159 -33 106 196 177 -221 -196 266 124 180 -120 -138 -73 82 -78 -38 186 -104 27 18
10410 18 121 163 103 189 -12 89 -50 150 39 -109 395 77 -43 -128 -155 69 38 370 21 -65 -61 -141 -183 -6
10434 -6 -138 -67 -254 -239 -160 272 -75 -209 124 -21 -160 -25 29 118 -19 138 -20 22 -52 -51 -39 -133 -50 96
10458 96 99 80 -49 72 218 217 69 119 -141 -76 -57 -128 30 64 19 -111 57 40 184 -118 -117 -51 -50 111 -198 -50
10484 -50 59 -72 -64 93 146 -23 -120 -47 -246 139 86 136 151 -5 -42 -18 52 31 -78 -70 173 127 -59 -251 -120
$$ packed form
10317H9K48l34q5J79j62K07j78J23r3M8J84k38j00J28l23L31J54o9j5j95P4J91
10339A64P3k07m3o1K4J02j2o7J46k05K30Lk30J30L9j13j16j1K91k38J1L72l93
10362a11K18k47K96nj84K4l8J72q7K9j38R1o3J51l3j3k24Q0L7L9L9K2k19J69l43
10387c38L41o6K6J96j92J39R0j9l98K5M62j42N6l00j8O5J55j60M0K24k90J31r
10410A8J03M2o0Q6k01J01j39K00j11j48N04l18j20q5k7K24l1L32l49q6Mq0m2J77
10434fj32P1j87J5P9M32l47j34L33j45j39J35N4Q9j37J57j58M2p4JJ2r4Q3J46
10458I6Lj9j29J21J46jj48N0k60O5J9p1J58L4m5j30J68j7J44l02JO6JJ61l09J48
10484e0J09j31QJ57N3j69r7P3j99L85n3N0J5j56l7K4P0k1j09QK43m6j86j92J31
$$ plain form
10509 -120 -14 120 -350 53 -8 13 -44 -147 79 22 173 105 96 6 75 58 129 110 6 -64 -174 102 -28 165
10533 165 -213 102 124 9 14 -139 -12 -65 52 -66 -42 -3 239 -237 116 56 -58 -159 -153 3 -37 74 -162
10556 -162 -70 89 266 83 -10 -58 -250 321 -51 31 -323 -32 -70 43 -18 -276 -84 118 -48 106 99 -22
10578 -22 -188 -108 1 -108 57 124 127 89 181 96 -69 219 3 70 50 168 111 -200 109 159 -104 117 29 -201
10602 -201 128 283 63 -43 -54 -81 -130 118 48 13 -174 204 70 -46 -114 158 -53 -55 31 48 -125 192 33
10625 33 -11 -60 -44 137 41 -50 -59 -32 -62 -286 -189 131 152 -43 -24 94 -47 56 35 218 -79 182 -42 27 46
10650 46 -104 66 350 -18 213 -56 14 -23 -12 22 18 -19 -26 107 -98 67 51 81 170 2 -36 -111 -27 4 62 -36
10676 -36 -14 8 81 -217 -69 -82 -43 184 -49 20 27 106 -338 -132 -52 396 -124 9 -228 -274 11 -139 -16 -132
$$ packed form
10509a20J06J34m70M03o1K1n7j03K26n7J51o8rr0O9j7P1j9j04p0j10K76j30J93
10533A65l78L15K2j15Nj53J27n3J17j18K4L9K42m76L53o0j14j01OJ56m0J11k36
10556a62R2J59J77j83r3m8j92N71l72Q2l54K91l8J13o1k58J92K02j66J54pj21
10578b2j66Q0J09j09J65O7Ll8R2q5j65K88k16O7k0J18n7l11L09N0k63K21q8k30
10602b01L29J55k20j06j1k7m9K48p0l5j87L78j34j16o8K72k11kQ6J7j73L17j59
10625C3m4m9J6J81r6r1rK7l0k24R7L20K1j95J9J18j41J03k1J83k97K61k24O9J9
10650D6j50J70K84l68K31k69P0l7J1L4ml7pJ33k05J65j6L0Q9j68l8p5Q4L1N8r8
10676c6K2K2P3k98J48j3L9K27k33O9PP9m44K06Q0M48n20J33k37m6K85j50J23j16
$$ plain form
10700 -132 218 -142 174 242 -314 73 -50 -52 -61 273 -57 128 47 111 -30 -105 91 -10 -29 64 2 209 176 -73
10724 -73 -195 -177 -217 -288 -170 -70 8 -285 -3 35 -49 -247 95 -54 131 2 -10 -2 106 -125 -155 122 -209
10747 -209 -142 193 86 -8 95 -155 -134 112 17 205 -5 312 172 185 -72 -67 146 70 -167 163 8 -128
10769 -128 -140 93 122 -162 53 -22 -129 40 -56 -107 -59 75 -230 -8 126 -280 149 -115 176 -129 148 -76
10791 -76 13 -68 -43 68 295 14 219 2 -32 18 -122 21 -103 -157 -33 -97 103 44 88 -79 50 74 108 -167
10815 -167 -33 -256 -43 67 121 -92 -49 -48 -347 9 -33 -78 67 183 -114 67 75 -220 62 -137 255 -164
10837 -164 -83 -91 76 -69 56 188 -91 -3 13 -123 -90 143 -57 -37 197 34 100 -192 271 -36 112 -22
10859 -22 271 -54 -203 86 -98 -10 -235 32 -121 17 -195 -19 -44 -6 251 90 -169 264 228 0 19 -122
$$ packed form
10700a32L50l60L16O8n56L87j23krL34l30J85q1O4j41p5J96j01j9R3o2K07l3k49
10724g3j22J8m0p1J18J00P8k93K82L8q4j98L42j49J85j29j2QJ08k31l0K77l31
10747b09O7L35j07r4J03k50K1K46r5J88k10L17j40J3k57NK13p6k37L30j55j36
10769a28j2K33K9k84K15p5j07J69r6n1M8J34l05K22J34m06M29k64K91l05K77k24
10791g6Q9q1K5J11K27k81K05k17l4N0j40J43j24n4J24o4K00n9M4j67J29K4L4k75
10815a67J34k23K13J10N4k13M3Jk99L56m2m5J45J16k97J81Qk95K82j99L92m19
10837a64Q1qJ67j45J25J32k79Q8J6j36L3K33k00K0K34j63O6k92M63l07J48j34
10859b2K93l25j49K89j84Q8k25K67j53J38k12J76k5L8K57j61k59M33l6k28J9j41
$$ plain form
10881 -122 46 83 109 114 94 74 117 58 250 -171 -82 177 -160 -205 137 -139 -74 68 57 -41 -92 -129 -217 146 -69
10906 -69 -287 -55 16 87 -111 -60 100 -82 -62 117 58 -143 -375 133 -94 98 -69 -69 114 301 -25 6 -163
10929 -163 121 118 -116 39 159 -62 -112 143 -9 155 122 0 18 68 -54 121 21 -169 -207 122 21 71
10951 71 -80 123 -125 -88 -91 -150 24 23 154 13 -11 -24 5 53 -67 -64 118 183 -138 9 -109 -120 -60 65 19
10976 19 101 41 -21 127 94 -90 -5 -308 121 -344 12 110 -3 6 246 -125 -42 -7 62 21 42 183 -37 109
11000 109 -188 161 -189 68 -161 -152 -100 353 42 -229 50 -183 139 -322 24 -48 -247 -11 21 97 -169 133
11022 133 20 5 -249 46 134 39 41 92 -141 -163 86 296 260 -167 177 89 297 -198 2 -21 -114 -34 -146 -3
11046 -3 52 -162 11 -198 237 90 105 -141 111 -161 132 89 -101 -39 21 183 -115 58 -47 -96 46 -101
$$ packed form
10881a22J68L7K6Nk0k0M3n9J92m21Q9K59l37m5L42k76O5J42j1r8n1l7q8L63k15
10906f9k18K32P1P1j98N1J60j82K0J79n9k01k32N08k27J92j67%J83J87l26L1j69
10929a63K84lk34J55J20k21n0K55j52J64l3j22J8N0j22J75j00j90l8L29j01N0
10951G1j51K03k48L7ln9J74jJ31j41k4j3K9M8j20LJ82O5l21J47j18j1O0J25m6
10976A9Q2o0o2J48l3j84Q5l03M29m65L56R8j13RK40l71Q3L5O9m1K1J41k20J46
11000A09k97L49l50K57k29RN2M53l11k71K79k33L22m61L46p2j99K36L2P6k66L02
11022A33j13j5k54K95Q8r5KN1k33k2K49K10l6m27L44q8K08m95K00k3r3Q0j12J43
11046cN5k14J73k09M35j47J5k46K52k72K93m3j90O2O0J62k98J73j05m9J42j47
$$ plain form
11068 -101 77 32 221 -409 47 -306 -92 188 0 -130 -38 143 -17 43 72 -124 164 -54 -195 13 -44
11089 -44 -3 30 142 -163 15 -225 -245 -7 338 66 51 -185 -25 24 -5 176 -37 -100 -65 -65 -93 -75 -323 -38
11113 -38 77 -158 127 -107 131 116 -262 51 142 30 163 33 -10 259 347 -82 -8 -133 187 -230 5 -110
11135 -110 -229 179 -32 190 -120 20 195 -163 -112 5 -17 -44 223 191 -82 334 35 -133 83 31 68 169
11157 169 109 19 -179 -97 -29 -186 46 109 -113 -80 -136 103 255 -199 38 103 19 128 -69 175 -18 63 110
11180 110 148 -46 37 -25 38 -71 172 -216 70 202 32 -388 -49 -63 -160 192 49 27 -129 -152 89 39 204
11203 204 37 -35 -20 -125 7 -120 -54 -100 38 -49 36 212 -27 -18 21 96 -10 57 310 175 -301 68 29 117
11227 117 -4 -144 -10 -62 10 41 161 26 99 146 35 62 88 -63 -118 -273 -4 160 -31 -208 72 -93
$$ packed form
11068a01J78m5J89o30M56l53K14K80j88j30R2J81j60O0K9j96K88k18j41K08n7
11089d4M1L3J12l05J78k40k0K38L45k72j5k36J60M9k9J81k13o3L5%k8J8k48K85
11113c8J15k35K85k34K38j5l78L13R1j12J33j30m3K69Q8m29P4j25L20m17K35j15
11135a10j19M08k11K22l10J40J75l58N1J17k2k7K67l2k73M16k99j68K16n2L7J01
11157A69o0r0j98Q2O8j57K32O3k22L3n6K39J52m54K37O5q4J09j97K44j93Q1M7
11180A10L8j94Q3o2O3j09K43l88K86J32j70m20L39j4r7L52j43k2j56k3K41n0J65
11203B04j67p2J5j05J32j27O6m6J38q7Q5J76k39RL9P5j06O7K53j35m76L69l9Q8
11227A17j21j40J34n2P2L1J20j35P3M7j11K7K6j51n5j55K69J64j91j77K80j65
$$ plain form
11249 -93 -171 -69 -42 151 -140 -51 49 -111 -188 -14 151 -38 18 55 -355 -51 280 -83 -71 25 222 48 65
11272 65 -19 183 -204 76 -129 20 -4 -105 131 -128 34 97 52 18 -104 53 -90 5 -245 74 0 54 68
11295 68 -56 -56 -50 199 17 -12 -231 77 -65 32 255 169 39 42 94 154 132 -83 -190 -180 14 33 -47 4 62 -143
11321 -143 100 68 -103 95 -26 -26 118 -18 57 -48 276 145 204 -50 34 76 96 -139 39 -27 139 103 -112
11344 -112 10 64 -184 -73 -57 -69 -227 -116 80 72 287 -6 64 80 74 100 -114 -233 24 159 -9 -259 282
11367 282 -10 232 7 -31 10 199 33 -159 184 -271 74 57 10 -66 -120 -37 -124 224 57 78 -41 -77 -131
11390 -131 111 115 -81 -14 46 -109 -130 150 -118 55 4 -4 -69 61 -10 -40 -26 -46 143 -50 -2 -92 -244 39 201
11415 201 220 -8 -207 -108 -22 -5 -73 248 110 247 119 286 -90 45 -51 -333 -153 -25 73 -121 -278 -115
$$ packed form
11249i3p8J02K7J93k91Q9J00j60p7J74J65j89N6L7m10L04L31l63J2R6J97j74J7
11272F5q4K02l87K80k05J49k4j01K36k59J62O3m5l4j22J57j43R5k50L19p4N4J4
11295F8j24%OK49j82k9k19L08j42R7K23q6j30LN2O0k2k15j07J0J94J9q0N1N8k05
11321a43K43l2j71J98j21%J44j36P5j05L24j31N9k54Q4M2K0k35J78o6J66l6k15
11344a12J22N4k48J11J6j2j58J11J96qK15k93P0J6oK6k14j19K57J35j68k50N41
11367B82k92K42k25l8M1J89j66j92L43m55L45j7m7p6n4Q3q7L48j67K1j19l6n4
11390a31K42Mj96O7O0j55k1K80k68J73n1qo5J30p1l0J4k0J89j93M8r0j52K83J62
11415B01J9k28j99R9Q6J7o8L21j38J37j28J67l76J35r6k82J80J28R8j94j57J63
$$ plain form
11437 -115 2 103 -388 -349 -106 -244 76 -107 61 143 -160 -43 -70 -148 -293 -59 6 -77 -84 109 -184 0
11459 0 169 -182 27 3 31 65 -11 -29 -269 -328 -6 -153 23 -9 -214 6 51 -144 -145 -125 5 178 326 -123
11483 -123 13 12 -6 -2 -109 -161 178 82 81 159 -62 23 -70 27 -213 57 -159 -61 144 45 -155 19 119 252 22
11508 22 -253 -112 187 -37 112 -117 51 -113 -56 -221 25 167 126 -80 115 250 -39 95 29 -51 138
11529 138 -31 106 -6 -10 191 -124 140 112 112 -101 158 251 181 113 -55 -22 -124 -57 -30 -151 -34 -68 134 159
11553 159 87 -168 -173 78 -134 79 -20 19 193 195 38 32 87 223 56 -132 62 87 62 92 19 -148 -48 -136 -29
11578 -29 -5 -140 19 -166 -128 -45 -24 -50 -28 -104 69 -54 218 -96 -22 2 -111 -37 -77 -138 -154 -170 22 119 14
11603 14 120 86 -27 -116 30 -73 -68 154 -252 439 130 270 85 115 225 -89 -106 -37 47 -182 97 -6 38
$$ packed form
11437a15J17J01m91L9K43j38L20j83J68Q2l03J17k7p8j45K34O5q3pJ93k93J84
11459@J69l51K09k4K8L4p6j8k40n9L22j47J76l2k05K20M5j95jK0J30J73J48m49
11483a23J36jj8Mj07n2L39r6jP8k21Q5r3R7k40K70k16R8K05r9k00J74J00J33k30
11508B2k75J41K99k24J49k29J68j64N7j65K46J42m1k06J95J35k89J34o6q0J89
11529A38j69J37j12mK01l15K64k8%k13K59R3p0o8j68L3j02O7K7j21J17l4K02K5
11553A59p2k55nK51k12K13r9L9J74Kj57oN5J36j67j88J94K5k5L0p3j67J00q8J07
11578b9K4j35J59j85L8Q3K1k6K2p6J73j23K72l14P4K4j13P4m0o1j6j6J92R7j05
11603A4J06l4j13q9J46j03NK22m06O91l09J40j85L0J10l14j7O9Q4k29K79j03M4
$$ plain form
11626 38 26 185 -28 35 66 -131 147 -70 88 150 218 103 69 -209 89 91 20 177 91 -14 -154 141 -106
11649 -106 142 77 -81 70 -7 18 -113 93 127 -69 105 154 321 377 167 198 42 -108 91 -44 116 -48
11671 -48 26 -45 122 192 -36 -124 -4 -74 149 -154 -20 -235 -213 -59 -179 204 110 -215 124 72 -22 72 -295
11694 -295 -229 78 -65 -144 -44 140 -95 -90 -217 -122 -85 -166 56 -30 -84 70 145 -9 -2 -45 -4 -20 219 -58 185
$$ packed form
11626C8j2J59k13O3L1j97K78k17J58O2O8j15l4k78K98Kp1J57q6j05j40K95k47
11649a06K48o5j58J51p7K5j31K06L4j96J74M9J67N6k10L1j56j50J99j35J60j64
11671d8P4p1J67P0k28q8J20p0K23l03J34k15K2J54j20L83r4l25L39n2r4R4l67
11694b95O6L07j43p9J00J84k35Nj27R5L7q1K22q6n4J54P5j54Pm3M1j6K39k77K43
$$ [...]
16383C6
##END NTUPLES=NMR FID
##END=
