##TITLE=abcd
##JCAMPDX= 6.0         $$ Bruker NMR JCAMP-DX V2.0
##DATA TYPE= NMR FID
##DATA CLASS= NTUPLES
##ORIGIN= UXNMR, Bruker Analytische Messtechnik GmbH
##OWNER= root
$$ XWIN-NMR		Version 3.5
$$ Sat Jun 28 18:07:59 2025 Russian Standard Time (UT+4h)  servis@DPX200
##.OBSERVE FREQUENCY= 200.131235884673
##.OBSERVE NUCLEUS= ^1H
##.DELAY= (6, 6)
##.ACQUISITION MODE= SIMULTANEOUS
##.ACQUISITION SCHEME= undefined
##.AVERAGES= 32
##.DIGITISER RES= 18
##SPECTROMETER/DATA SYSTEM= spect
##.PULSE SEQUENCE= zg
##.SOLVENT NAME= CDCl3
##.SHIFT REFERENCE= (INTERNAL, CDCl3, 0, 16.5164)
##AUDIT TRAIL= $$ (NUMBER, WHEN, WHO, WHERE, WHAT)
$$ ##TITLE= Audit trail, XWIN-NMR		Version 3.5
$$ ##JCAMPDX= 5.01
$$ ##ORIGIN= Bruker BioSpin GmbH
$$ ##OWNER= servis
$$ F:\spectra/data/av/nmr/H1/1/audita.txt
$$ ##AUDIT TRAIL=  $$ (NUMBER, WHEN, WHO, WHERE, WHAT)
(   1,<2025-06-28 18:07:11.17 +0400>,<servis>,<DPX200>,
      <created by zg, POWCHK disabled, PULCHK disabled
       configuration hash MD5:
       00 E9 B6 7A A2 85 ED C7 34 08 36 98 17 FE 4E 26
       data hash MD5: 32K
       00 F8 80 55 59 E0 90 22 DD A5 96 71 1F 8F 10 DC>)
$$ ##END=
$$ 
$$ hash MD5
$$ 52 C9 F5 D3 7B AD BB 69 CB 8C AE 24 6B 9F F6 33
##$RELAX= 
##$RELAX= 
##$RELAX= 
##$RELAX= 
##$RELAX= 
##$RELAX= 
##$RELAX= 
##$RELAX= 
$$ Bruker specific parameters
$$ --------------------------
##$DU= <F:\spectra>
##$EXPNO= 1
##$NAME= <H1>
##$PROCNO= 1
##$TYPE= <nmr>
##$USER= <av>
##$AMP= (0..31)
100 100 100 100 100 100 100 100 100 100 100 100 100 100 100 100 100 100 
100 100 100 100 100 100 100 100 100 100 100 100 100 100 
##$AQSEQ= 0
##$AQ_mod= 1
##$AUNM= <au_zg>
##$AUTOPOS= <>
##$BF1= 200.13
##$BF2= 200.13
##$BF3= 200.13
##$BF4= 200.13
##$BF5= 500.13
##$BF6= 500.13
##$BF7= 500.13
##$BF8= 500.13
##$BYTORDA= 1
##$CFDGTYP= 0
##$CFRGTYP= 5
##$CHEMSTR= <none>
##$CNST= (0..31)
1 1 145 1 1 1 1 1 1 1 1 1 1 1 1 1 1 1 1 1 1 1 1 1 1 1 1 1 1 1 1 1 
##$CPDPRG= <>
##$CPDPRG1= <>
##$CPDPRG2= <>
##$CPDPRG3= <>
##$CPDPRG4= <mlev>
##$CPDPRG5= <mlev>
##$CPDPRG6= <mlev>
##$CPDPRG7= <mlev>
##$CPDPRG8= <mlev>
##$CPDPRGB= <>
##$CPDPRGT= <>
##$D= (0..31)
0 2 0 0 0 0 0 0 0 0.06 0 0 0 0 0 0 0.0002 0 0 0 0 0 0 0 0 0 0 0 0 0 0 
0 
##$DATE= 1751119630
##$DBL= (0..7)
120 120 120 120 120 120 120 120 
##$DBP= (0..7)
150 150 150 150 150 150 150 150 
##$DBP07= 0
##$DBPNAM0= <>
##$DBPNAM1= <>
##$DBPNAM2= <>
##$DBPNAM3= <>
##$DBPNAM4= <>
##$DBPNAM5= <>
##$DBPNAM6= <>
##$DBPNAM7= <>
##$DBPOAL= (0..7)
0.5 0.5 0.5 0.5 0.5 0.5 0.5 0.5 
##$DBPOFFS= (0..7)
0 0 0 0 0 0 0 0 
##$DE= 6
##$DECBNUC= <off>
##$DECIM= 32
##$DECNUC= <off>
##$DECSTAT= 4
##$DIGMOD= 1
##$DIGTYP= 9
##$DL= (0..7)
0 120 120 120 120 120 120 120 
##$DP= (0..7)
150 150 150 150 150 150 150 150 
##$DP07= 0
##$DPNAME0= <>
##$DPNAME1= <>
##$DPNAME2= <>
##$DPNAME3= <>
##$DPNAME4= <>
##$DPNAME5= <>
##$DPNAME6= <>
##$DPNAME7= <>
##$DPOAL= (0..7)
0.5 0.5 0.5 0.5 0.5 0.5 0.5 0.5 
##$DPOFFS= (0..7)
0 0 0 0 0 0 0 0 
##$DQDMODE= 0
##$DR= 18
##$DS= 0
##$DSLIST= <SSSSSSSSSSSSSSS>
##$DSPFIRM= 0
$$ [...]
##$SUBNAM0= <"">
##$SUBNAM1= <"">
##$SUBNAM2= <"">
##$SUBNAM3= <"">
##$SUBNAM4= <"">
##$SUBNAM5= <"">
##$SUBNAM6= <"">
##$SUBNAM7= <"">
##$SUBNAM8= <"">
##$SUBNAM9= <"">
##$SW= 20.6817932712277
##$SWIBOX= (0..15)
0 0 3 0 0 0 0 0 0 0 0 0 0 0 0 0 
##$SW_h= 4139.07284768212
##$TD= 32768
##$TD0= 1
##$TE= 0
##$TE2= 300
##$TE3= 300
##$TEG= 300
##$TL= (0..7)
0 120 120 120 120 120 120 120 
##$TP= (0..7)
150 150 150 150 150 150 150 150 
##$TP07= 0
##$TPNAME0= <>
##$TPNAME1= <>
##$TPNAME2= <>
##$TPNAME3= <>
##$TPNAME4= <>
##$TPNAME5= <>
##$TPNAME6= <>
##$TPNAME7= <>
##$TPOAL= (0..7)
0.5 0.5 0.5 0.5 0.5 0.5 0.5 0.5 
##$TPOFFS= (0..7)
0 0 0 0 0 0 0 0 
##$TUNHIN= 0
##$TUNHOUT= 0
##$TUNXOUT= 0
##$USERA1= <user>
##$USERA2= <user>
##$USERA3= <user>
##$USERA4= <user>
##$USERA5= <user>
##$V9= 5
##$VALIST= <valist>
##$VCLIST= <CCCCCCCCCCCCCCC>
##$VD= 0
##$VDLIST= <DDDDDDDDDDDDDDD>
##$VPLIST= <PPPPPPPPPPPPPPP>
##$VTLIST= <TTTTTTTTTTTTTTT>
##$WBST= 1024
##$WBSW= 30
##$XGAIN= (0..3)
0 0 0 0 
##$XL= 0
##$YL= 0
##$YMAX_a= 257914
##$YMIN_a= -205175
##$ZGOPTNS= <>
##$ZL1= 120
##$ZL2= 120
##$ZL3= 120
##$ZL4= 120
##$ABSF1= 10
##$ABSF2= 0
##$ABSG= 5
##$ABSL= 3
##$ALPHA= 0
##$AQORDER= 0
##$ASSFAC= 0
##$ASSFACI= 0
##$ASSFACX= 0
##$ASSWID= 0
##$AUNMP= <proc_1d>
##$AZFE= 0.1
##$AZFW= 0.1
##$BCFW= 1
##$BC_mod= 2
##$BYTORDP= 0
##$COROFFS= 0
##$CY= 19
##$DATMOD= 1
##$DC= 2
##$DFILT= <>
##$DTYPP= 0
##$F1P= 11.0000007629395
##$F2P= -0.999999237060547
##$FCOR= 0.5
##$FTSIZE= 0
##$FT_mod= 4
##$GAMMA= 1
##$GB= 1
##$INTBC= 1
##$INTSCL= 1
##$ISEN= 128
##$LB= 0.05
##$LEV0= 0
##$LPBIN= 0
##$MAXI= 10000
##$MC2= 0
##$MEAN= 0
##$ME_mod= 0
##$MI= 0
##$NCOEF= 0
##$NC_proc= 0
##$NLEV= 6
##$NOISF1= 0
##$NOISF2= 0
##$NSP= 1
##$NTH_PI= 0
##$NZP= 0
##$OFFSET= 16.51637
##$PC= 1
##$PHC0= -273.2733
##$PHC1= 1.101538
##$PH_mod= 0
##$PKNL= yes
##$PPARMOD= 0
##$PSCAL= 4
##$PSIGN= 0
##$REVERSE= no
##$SF= 200.13
##$SI= 16384
##$SIGF1= 0
##$SIGF2= 0
##$SINO= 400
##$SIOLD= 16384
##$SREGLST= <1H.CDCl3>
##$SSB= 0
##$STSI= 0
##$STSR= 0
##$SW_p= 4139.07284768211
##$SYMM= 0
##$S_DEV= 0
##$TDeff= 0
##$TDoff= 0
##$TI= <>
##$TILT= no
##$TM1= 0
##$TM2= 0
##$TOPLEV= 0
##$USERP1= <user>
##$USERP2= <user>
##$USERP3= <user>
##$USERP4= <user>
##$USERP5= <user>
##$WDW= 1
##$XDIM= 8192
##$YMAX_p= 0
##$YMIN_p= 0
$$ End of Bruker specific parameters
$$ ---------------------------------
##NTUPLES= NMR FID
##VAR_NAME=  TIME,          FID/REAL,        FID/IMAG
##SYMBOL=    X,             R,               I
##VAR_TYPE=  INDEPENDENT,   DEPENDENT,       DEPENDENT
##VAR_FORM=  AFFN,          ASDF,            ASDF
##VAR_DIM=   16384,         16384,           16384
##UNITS=     SECONDS,       ARBITRARY UNITS, ARBITRARY UNITS
##FACTOR=    0.0002416,     1,               1
##FIRST=     0,             0,               0
##LAST=      3.9581328,     0,               0
##MIN=       0,             -205175,         0
##MAX=       3.9581328,     257914,          0
$$ Real data points
##PAGE= N=1
##DATA TABLE= (X++(R..R)), XYDATA
0 0 0 0 0 0 0 0 0 0 0 0 0 0 0 0 0 0 0 0 0 0 0 0 0 0 0 0 0 0 0 0 0 0 0 0 0 0 0 0 0 0 0 -2 5 -9 11 -14 14 -17 21 -21 22 -24 27 -30
54 -30 33 -34 34 -35 37 -36 35 -28 17 12 -66 174 -412 1084 -3611 32126 257914 222603 -58808 -199620
74 -199620 -100427 67921 110833 32946 -25369 -14438 -18382 -60428 -44569 60418 126818 67440
86 67440 -47844 -96081 -31770 76174 105507 24552 -63352 -67319 -15291 28913 42766 29538
98 29538 7046 -608 -845 -3754 18088 61004 57855 -8605 -57627 -29717 33863 54391 8086
111 8086 -43777 -25639 37081 46430 -2913 -14225 34133 53137 1937 -48983 -25798 46428
123 46428 69226 -2724 -76821 -39646 60603 79376 -947 -57677 -19443 47699 45615 -24678
135 -24678 -61511 -3413 66847 41249 -42051 -60925 4682 63497 49620 -11353 -47670 -24828
147 -24828 14459 14743 -8534 -9976 1829 -6284 -22908 -17939 10938 37317 29350 -13616 -42693
160 -42693 -19149 22225 24949 -8633 -33734 -26686 -3034 4666 -12952 -20602 5623 27853 5076
173 5076 -31925 -27922 10142 29527 4982 -30581 -30841 -555 8739 -16386 -25872 3919 25111
186 25111 -1090 -38803 -33661 11268 38228 9956 -37341 -39074 3685 26797 5161 -19657
198 -19657 -13255 6860 6890 -13544 -23102 -3670 17970 5928 -24736 -29725 -1801 23297 18798
211 18798 -6126 -21182 -8065 15112 17501 -39 -11548 -8837 -4135 -4303 -4276 1030 8055 4236
225 4236 -12946 -18306 5670 33095 26402 -7716 -28299 -11943 22436 32969 5478 -23881 -19124
238 -19124 4250 13064 6540 3281 5435 2873 -5143 -7094 8086 27016 20452 -8783 -21168 -152
252 -152 23295 20783 706 -13036 -7078 8605 11671 343 -3013 6533 8911 -82 -3237 5032
266 5032 14542 15781 4375 -9385 -5233 12908 16639 1468 -10028 -6937 1959 7953 5251 -2969
280 -2969 -2052 7271 6346 -2458 707 11358 10952 706 -6678 -5575 3918 11423 2188 -12976 -10162
295 -10162 4331 6674 -1260 -4898 -2165 3307 7085 1112 -7146 -1195 9781 5123 -7142 -8211
309 -8211 -2289 835 181 -4582 -9013 -3860 2885 -3009 -8778 -112 7908 1858 -6251 -6749 -1887 5441
325 5441 6431 -5648 -14953 -6874 3347 211 -6058 -6768 -6551 -4070 556 -422 -3733 962 3424 -4190
341 -4190 -7113 408 4255 134 -4564 -8966 -8964 -132 4380 -4791 -10623 -3470 1856 -591 -1060 247
357 247 -209 1536 2127 -3363 -3863 3631 3682 -5458 -7369 -2364 -356 213 54 -4394 -5099 2698 5732
374 5732 182 -979 2982 2602 1017 2049 645 -1046 1862 1138 -5003 -3530 3691 2707 -2576 -2064
390 -2064 1078 3028 5987 5099 -969 -539 5670 5573 1186 1307 1346 -1756 -881 2002 667 138 2514
407 2514 667 -2750 1581 6903 5857 3293 1840 -429 1208 6641 5478 -1096 -1288 1393 -818
422 -818 -2510 669 2436 2249 1851 -704 -2423 3090 8393 4925 708 1300 994 -865 852 2827
438 2827 1013 -1013 -2344 -4461 -2758 3085 4047 585 -161 296 -942 788 4844 4505 267 -2260
454 -2260 -3277 -2742 1089 2617 -1619 -4710 -3465 -2549 -1671 2225 3364 -654 -3474 -2463 358 3669
470 3669 4149 -704 -5265 -3558 -1140 -1411 -802 913 -1895 -7200 -8010 -2833 4666 7728 1040 -8174
486 -8174 -7114 2082 7092 4823 441 -4214 -7836 -7414 -2925 2365 4465 -415 -8816 -10162 -1528
501 -1528 6264 7094 4483 44 -6192 -8203 -2355 5798 8915 1855 -9926 -12991 -3418 6200 5613
516 5613 1037 -1426 -3921 -5847 -3142 3776 8718 6317 -2918 -9301 -4346 5265 7158 2918 -717
531 -717 -4067 -6857 -4120 2972 6446 2695 -4758 -7468 -508 8676 7670 -26 -682 3712 2649 -1939
547 -1939 -1887 1981 3642 -723 -8076 -8126 2363 10133 5431 -2280 -2620 1572 5035 7489 5939 -306
563 -306 -4996 -4997 -2103 2978 5673 1047 -4491 -2515 1455 843 1776 6878 6993 -458 -7936 -7589 2358
580 2358 12931 10427 -4244 -11462 -3803 4804 6122 4409 880 -3906 -5796 -4031 -1077 3717 6971
595 6971 2869 -3120 -3046 -646 830 6153 11446 4637 -9598 -14843 -6532 6554 11092 246 -13571
610 -13571 -10774 4402 10520 4783 1405 2752 1543 -2204 -5140 -4600 1292 5264 -1732 -10644 -8619
625 -8619 -5 5496 7635 5372 -3845 -9752 -2988 6738 7957 1035 -8146 -10857 -1910 7352 4335
640 4335 -3278 -2334 692 -2633 -4695 -552 4315 4450 -1966 -10640 -9647 3342 12285 6643 -2338 -6147
656 -6147 -6215 -841 8375 9567 -1348 -12437 -13304 -4655 6851 9295 -295 -6927 -1335 4545 2403
671 2403 1829 6560 6716 -1526 -10748 -12225 -2632 9694 8357 -5122 -11619 -4494 4582 8848 9068
686 9068 3481 -4623 -6094 -1647 2699 4414 1984 -3794 -5619 -683 2077 453 1854 4869 1881
701 1881 -3863 -4233 -107 3941 4647 7 -4600 -1619 4340 4060 833 1272 1993 -465 -1588 -1122 -1077
718 -1077 -669 36 -1205 -1334 1454 1848 847 3661 6680 2961 -2709 -2535 1163 2848 167 -4884
734 -4884 -6923 -1731 3641 1867 -1221 1057 3819 2364 466 824 2016 2754 262 -4431 -4735 -106
750 -106 2211 -23 -661 -38 -1094 -1828 723 3241 3180 172 -3492 -3619 894 3903 1515 -1042 -526
767 -526 -814 -2164 -688 2003 1708 -1500 -4350 -3926 42 2896 906 -1354 148 1896 512 -247
783 -247 1696 2392 18 -3081 -3918 -1915 215 -1450 -3390 -1377 1856 715 -1429 271 3449 3288
799 3288 332 -2402 -2112 775 1206 -1844 -3381 -1341 -637 -1449 -943 763 1031 95 -701 -471 1145
816 1145 2616 745 -1556 -729 809 74 -600 -76 -786 -1490 -912 -423 -502 268 190 -913 72 1849 1267
835 1267 127 1309 1631 -3 -775 -93 -29 -105 -478 -2383 -2398 491 1566 -491 -604 1204 1247 769 1931
854 1931 1920 949 550 -533 -1756 116 1878 -663 -2993 -1658 268 548 1152 1130 -232 175 1845
871 1845 1473 1071 2067 1107 -1508 -840 949 70 -768 -259 -1075 -1825 38 1281 97 356 1463 497
889 497 142 2079 1583 -472 393 1121 -927 -1666 87 -458 -1285 -345 -371 -1644 158 1895 403 -238
907 -238 1522 1175 -52 941 930 -977 -791 433 -1131 -2109 -248 -286 -1657 -522 719 -321 49 1621
925 1621 455 -525 1539 1734 -809 -889 219 -946 -1270 92 -1162 -2541 -928 312 -935 -352 1371
942 1371 166 -540 1479 1234 -361 664 1303 -1118 -1732 -237 -762 -1738 -320 -178 -1633 -843 656
959 656 -249 23 2325 1363 -1070 -146 1183 300 286 639 -1619 -2571 -379 -87 -1392 -297 533 -1037
977 -1037 -934 1237 1197 674 1533 1067 -1087 -193 1562 285 -877 -503 -1416 -2274 -113 806 -680 -812
995 -812 562 -87 -160 1884 2222 704 417 398 -742 12 1673 303 -2075 -1771 -649 -851 370 1113
1013 1113 -29 -257 886 303 14 2362 3229 561 -1915 -1558 -409 947 1551 -880 -2870 -1140
1029 -1140 604 -79 152 1516 1231 259 -129 -315 363 2140 2406 -157 -1780 -1226 -636 -45 1275 530
1047 530 -2183 -2547 -629 723 1329 1694 495 0 634 840 354 1324 1684 -566 -2604 -1989 -766 -200
1065 -200 112 -281 -1349 -948 48 860 2160 3002 637 -2157 -1260 1582 1981 -413 -2811 -3123 -767
1082 -767 1081 -496 -1507 469 1844 -193 -1777 -276 2402 3042 385 -3141 -3349 559 3046 1395
1098 1395 -1317 -2085 -2049 -754 1137 1025 -460 -1259 -1242 -1038 265 1603 1799 1744 1597 -568 -2762 -511
1116 -511 2694 1992 -1831 -4539 -4121 -600 2607 1572 -653 -57 1377 423 323 2514 2617 229 -1928
1133 -1928 -2578 -1908 -147 235 -1211 -941 503 -571 -1567 1668 4600 2684 -1451 -2752 -867 2370
1149 2370 2790 -1561 -4268 -725 2699 790 -1470 -266 1358 1157 -279 -2082 -1756 1323 2490 -247
1165 -247 -1890 -42 1242 1979 2926 1126 -2607 -2659 445 1235 -678 -2156 -2712 -1173 2296 1915 -1142
1182 -1142 359 4589 3457 -1374 -2331 124 2143 1215 -2628 -5353 -2389 1707 745 -1076 1002 2490
1198 2490 212 -600 1920 3048 1482 -979 -3022 -1888 1083 333 -3026 -1044 3344 1355 -3017
1213 -3017 -1855 2345 3778 1218 -2837 -4024 -156 3532 1241 -1797 -102 1360 -144 -287 1160
1228 1160 459 -1260 -1224 -1167 -1603 -907 -472 -81 2065 2307 -1318 -1770 3483 5261 1 -4077 -2737 331
1246 331 1062 -1185 -4006 -2246 2074 1763 -1904 -430 4326 3498 -802 -1807 142 1473 861 -1992
1262 -1992 -3497 -1011 1101 -1207 -1952 1613 2900 -361 -1893 197 2016 1728 -253 -2433 -1666 1436
1278 1436 1285 -1130 -457 1523 274 -1318 -493 412 -235 -560 -681 -1001 -294 687 321 1048 2633 1052
1296 1052 -1435 -83 2274 891 -2258 -2443 -914 188 -264 -1936 -1439 2150 3221 -111 -1666 1829
1312 1829 3711 1188 -1824 -1862 31 907 -680 -3206 -1712 1589 1152 -1532 -916 1851 2349 690
1328 690 -654 -481 747 1215 -353 -1638 -218 947 -605 -1018 273 652 -333 -393 -256 -298 5 311
1346 311 166 463 864 70 24 1403 1220 -794 -1228 -285 104 -723 -1575 -1111 349 973 -287 -1158 884
1365 884 2851 1327 -936 -365 1339 1184 -743 -2092 -1286 598 259 -1891 -1865 818 1773 143 -788
1382 -788 367 1432 1483 140 -1039 -203 1021 214 -1374 -994 104 -210 -349 -388 -437 -228 403 375 -171
1401 -171 372 580 290 531 770 -344 -535 447 373 -1178 -1277 -339 -289 -439 -525 -848 219 1483 778 -705
1421 -705 185 1666 740 -378 -427 -215 -88 -146 -1013 -1711 -261 737 -450 -1038 136 1112 604 511 288
1440 288 -18 732 1006 -327 -998 179 185 -957 -897 -531 -568 -2 423 -323 -616 877 1369 108 35 830
1460 830 251 46 307 -387 -1143 -105 89 -1136 -987 103 74 -159 368 258 -133 1004 1278 -142 -242
1479 -242 877 368 -674 -331 -374 -891 -141 197 -993 -896 815 648 -383 284 920 305 525 864 -163
1498 -163 -387 479 -85 -1145 -560 191 -666 -840 172 -189 -333 742 826 -212 434 1313 239 -159 366
1517 366 137 -758 -167 -224 -1044 -334 432 -653 -993 377 793 6 475 881 -64 260 1057 142 -698 165
1537 165 141 -865 -801 -143 -618 -488 394 -179 -737 456 1078 348 359 825 -64 -222 585 171 -702 -234
1557 -234 -170 -1060 -847 120 -93 -450 328 366 -251 373 991 398 218 668 20 -783 -1 324 -650 -701 -334
1578 -334 -830 -658 383 355 -45 326 522 181 385 1238 238 -470 56 -85 -482 -439 -217 -539 -369 45
1598 45 -432 -548 755 1013 107 -31 479 425 372 633 6 -656 -215 10 -535 -395 -92 -795 -811 134 391
1619 391 -11 294 583 494 421 466 -63 181 1008 243 -1325 -1212 -99 123 -177 -510 -633 -166 570 575 337
1640 337 929 999 59 -179 332 248 -449 -707 -251 -372 -542 -709 -444 812 1257 -297 -1100 246 1390
1659 1390 982 -314 -568 -69 514 203 -552 -523 455 170 -967 -800 137 45 -375 63 169 -2 -131 370
1679 370 808 1237 298 -1015 -478 1028 722 -1441 -1814 -511 132 -51 -709 -445 798 1726 659 -494
1697 -494 744 1604 365 -791 -884 -585 -733 -650 -689 -468 249 -121 -418 690 1935 677 -911 -304 843
1716 843 509 -545 -846 -451 480 409 -1007 -1016 979 1393 -371 -1171 -240 438 132 59 -225 -57 543 358
1736 358 87 831 1068 -358 -1090 105 425 -946 -1493 -685 76 333 -280 -729 857 2822 1646 -986
1754 -986 -565 1329 838 -1192 -1856 -1233 -522 -262 -957 -900 909 1990 570 -382 1131 1494 -34 -615
1772 -615 -254 -362 -607 -799 -784 98 1046 26 -1048 401 1824 650 -1125 -520 402 116 -158 -535
1790 -535 -272 947 907 -540 -492 1193 883 -972 -929 -28 -502 -1190 -687 19 643 747 -214 63 1849
1809 1849 2341 -313 -1380 165 647 -1095 -2138 -1522 -275 630 -124 -1090 489 2700 1870 -433 -50
1826 -50 1146 372 -979 -1254 -943 -586 -230 -833 -651 831 1273 -76 -228 1066 794 -453 -402 76 -190
1845 -190 -252 -434 -492 393 990 -36 -976 262 911 -456 -1044 -136 66 -478 -483 -95 507 1088 727 -274
1865 -274 296 1393 320 -1281 -672 10 -554 -1382 -1186 -417 586 836 -16 43 1643 2018 280 -631
1883 -631 49 177 -641 -1043 -1220 -850 147 180 -638 -59 1098 988 204 169 462 46 10 -92 -440 -344 58
1904 58 -285 -370 256 232 -367 -206 343 51 -423 -82 194 122 204 6 -42 598 861 -118 -528 157 406 -563
1926 -563 -970 -512 -34 97 -278 -420 308 1353 775 -168 233 1133 439 -492 -796 -489 -83 -388 -1048 -1000
1946 -1000 306 824 -11 -317 589 975 592 115 -92 -18 284 -67 -591 -647 79 -183 -410 -103 23 -46
1966 -46 24 359 190 98 267 194 229 467 -17 -335 63 224 -353 -716 -346 44 -305 -288 -355 -129 575 551 -181
1989 -181 -125 821 691 -228 -303 76 66 -146 -614 -819 -451 339 -115 -837 32 690 378 70 249 370 398
2010 398 444 -211 -457 -112 160 -528 -679 -200 -1 -238 50 66 -53 341 754 130 29 342 240 -48 32
2031 32 66 -529 -327 54 -447 -799 -49 339 -184 -113 225 -23 388 751 100 -258 445 477 -279 -498 -256
2052 -256 -201 -323 -143 -627 -637 447 635 -209 -75 527 620 250 356 86 -259 246 237 -676 -513 51 -185
2073 -185 -572 -256 24 -113 432 503 132 9 703 460 -155 210 251 -258 -322 -75 -453 -512 124 -210 -770
2094 -770 68 559 112 97 527 272 134 489 381 -425 -11 529 -405 -640 -302 -101 -338 214 -57 -513
2114 -513 137 927 283 -158 316 571 59 -34 17 -414 -195 177 -501 -886 -221 99 -186 -90 246 -150 227
2135 227 610 271 4 423 267 -358 -303 106 -328 -549 -181 -212 -519 36 395 -103 -134 419 396 47 487
2156 487 316 -138 190 268 -607 -546 122 114 -553 -450 -168 -31 431 434 -167 -200 615 603 -112 -55 218 -232 -178
2179 -178 -44 -590 -441 177 -156 -525 -96 258 -40 144 478 310 84 206 262 124 177 45 -625 -498 85
2200 85 -97 -592 -310 47 83 143 131 268 379 616 273 -133 180 191 -202 -210 -23 -300 -686 -308 114 116 74
2223 74 -56 -72 501 699 97 -367 219 507 -3 -567 -323 2 214 -72 -646 -477 305 140 -263 -59 254
2244 254 53 71 329 432 267 131 5 10 310 84 -716 -616 126 -35 -638 -501 204 663 490 -32 -51
2265 -51 651 982 144 -616 -233 151 -415 -615 -337 -133 -118 -11 -188 115 621 302 -83 236 506 -185 -417
2286 -417 29 206 -246 -446 -576 -230 401 347 -435 -432 383 445 -183 -234 266 159 111 133 90 37 555 -19 -280
2309 -280 35 177 -553 -788 -23 -120 -394 -280 84 473 911 459 -207 88 790 241 -912 -864 -180 -209 -431
2330 -431 -573 -589 231 863 193 -313 504 1040 249 -320 -141 -107 -300 -266 -373 -349 79 210 -378 115 587
2351 587 240 -402 163 610 148 -266 -132 171 351 281 -286 -213 767 673 -510 -643 108 40 -626 -568 -83
2372 -83 217 347 123 34 773 1049 77 -677 222 478 -573 -1437 -504 -14 15 -323 -427 219 1283 963
2392 963 -422 -204 857 503 -575 -600 -248 28 -267 -456 -554 64 674 4 -266 554 580 -97 -98 340 149
2413 149 -367 -430 -152 23 409 -183 -446 194 720 -293 -958 -4 473 -155 -698 -181 355 612 341 -111
2433 -111 109 866 451 -716 -690 220 -129 -943 -679 -159 272 426 71 -78 825 1260 76 -581 101 561
2453 561 -296 -914 -652 -201 144 -59 -483 -123 858 668 -51 -42 506 277 -222 -131 46 -46 -117 -147 -202 156
2475 156 193 -297 -370 428 319 -420 -229 186 236 -94 -146 -80 422 597 -2 -438 221 532 -363 -981 -261 42
2497 42 -159 -321 -325 381 750 436 -152 154 915 494 -543 -361 56 -18 -450 -678 -299 280 326 -190 -343
2518 -343 377 677 204 -273 135 204 -107 -80 -162 -227 98 -146 -375 8 233 -152 -318 198 303 39 -39 187
2540 187 457 121 -105 -245 96 369 -118 -668 -94 301 -30 -465 -183 82 294 30 -68 22 546 604 -167
2561 -167 -185 348 216 -404 -454 -296 -172 -51 -244 -507 -41 453 253 -139 155 372 183 47 14 -56 -124 62
2583 62 -332 -392 -135 -102 -256 -150 119 27 -131 333 191 -32 222 326 39 9 178 -213 -152 100 -143 -566
2605 -566 -258 175 -76 -213 133 154 143 369 111 -68 174 335 -45 -302 -47 71 -253 -320 -232 -317 64 271
2627 271 -87 -61 412 326 31 130 276 108 33 121 -308 -312 186 4 -413 -206 21 40 32 415 86 -108 231
2650 231 366 -34 -29 171 -110 -241 -36 -225 -369 -220 136 -325 -217 244 220 -36 220 253 105 202 293 -221
2672 -221 -125 148 -162 -445 -263 87 -332 -211 38 -114 -60 365 309 -120 350 420 62 50 131 -64 -190 133
2694 133 -159 -562 -142 185 -194 -243 99 25 -25 374 311 66 50 345 -90 -300 14 -50 -402 -159 -277 -319
2716 -319 -178 219 -28 -86 275 89 31 167 254 -10 -131 114 -92 -274 33 4 -441 -268 21 -11 -51 85
2738 85 34 10 430 249 -157 -93 353 170 -167 -128 -217 -186 29 36 -406 -236 68 78 -185 199 155 180 201 261 75
2763 75 2 -68 -20 -233 -165 -169 -351 -273 38 -101 -204 84 155 262 130 234 120 176 400 -51 -256 -53 -68 -330
2787 -330 -95 -74 24 -164 147 37 223 272 -1 -24 307 397 -136 -346 17 151 -4 -300 -361 -252 237 154
2809 154 -320 -227 147 167 -73 -31 254 248 85 43 -7 128 97 -240 -288 -3 -23 -276 -284 64 76 -30 7 125 429
2834 429 407 -54 -238 46 341 -225 -574 -335 87 -224 -210 -180 91 243 375 38 195 590 166 -300 -118
2855 -118 310 -277 -365 -153 -97 77 -15 -320 -90 404 290 -251 -308 330 293 -31 -200 -16 259 251 -12 -273
2877 -273 -15 237 -197 -538 -193 151 -123 -421 112 285 336 235 66 226 626 222 -402 -271 204 -106
2897 -106 -557 -501 -86 70 53 -55 -82 582 742 173 -190 220 409 -249 -567 -215 -91 -244 -245 -129 203 330
2919 330 186 -294 236 434 73 -429 -47 379 187 -213 -286 72 573 236 -524 -339 353 237 -599 -502 248
2940 248 202 -173 -148 178 545 546 -47 -272 395 581 -445 -714 -47 201 -319 -713 -301 223 543 188 -222
2961 -222 135 925 466 -482 -272 207 -1 -610 -430 -33 49 -5 -160 31 511 407 -197 -111 500 168 -594
2982 -594 -227 239 242 -185 -286 -218 408 213 -340 -625 126 547 -255 -657 107 514 215 -163 6 272 689
3003 689 102 -520 -151 436 -136 -743 -403 113 163 -176 -213 201 419 386 -77 -99 381 346 -251 -534 -72 -58
3025 -58 -305 -376 -151 -35 254 163 100 159 528 87 -216 61 351 -272 -414 17 20 -26 -288 -102 -41 286 -43
3048 -43 -467 -85 433 113 -386 -87 130 283 145 -137 -202 125 243 -370 -602 -26 50 -302 -369 61 267
3069 267 162 228 -62 336 574 292 -292 -73 203 20 -458 -243 -175 28 -100 -160 -27 250 363 -44 2
3090 2 276 177 -149 -161 -3 -245 -219 -211 -97 -54 14 -147 -116 181 264 -140 -203 269 330 -105 -64 96 219 198 -14
3115 -14 -352 8 223 -103 -409 -197 144 197 -4 -30 230 237 357 -94 -37 108 200 -273 -264 -34 -62 -145 -232 -218
3139 -218 1 248 195 -50 63 373 64 25 203 -163 -158 -13 -66 -268 -112 5 -95 -103 128 -42 -10 156 270
3162 270 -13 -9 275 114 92 -87 -94 -103 94 -40 -325 -239 126 -35 -111 -139 73 118 117 -21 -17 188 237 67 -234
3187 -234 -36 73 -68 -245 -94 -189 -121 28 -105 -169 170 334 10 2 199 181 -42 -30 -101 -215 15 199 -186
3210 -186 -269 -44 17 -3 132 96 40 173 280 103 12 130 190 -51 -84 18 -312 -228 28 -204 -231 85 -1 -58
3234 -58 37 207 51 71 196 19 31 37 44 -291 -136 -53 63 -127 -64 -171 -23 163 242 -104 106 371 151 -74
3258 -74 113 37 -87 44 -49 -338 -164 138 4 -167 -14 97 11 -19 181 -7 53 369 100 -164 20 -105
3280 -105 -251 -182 -112 -321 -230 74 18 -208 59 206 117 -3 31 79 -94 99 3 -219 -79 -39 -208 -319 -47
3303 -47 -40 -79 3 96 77 95 193 63 -8 152 199 -52 -118 -18 -47 -174 36 -142 -185 53 125 -141 -82 185 164 36
3329 36 131 125 95 85 70 -141 -137 -119 -172 -93 7 -127 -149 47 313 -10 20 196 213 102 71 62 -5 65 116 -363 -167
3356 -167 82 -61 -199 -92 151 118 150 192 133 65 166 158 -183 54 211 -100 -284 -120 7 -53 -185 -233 127
3379 127 154 156 -157 -32 273 150 -47 46 -105 -15 76 -81 -245 -119 -122 -212 -113 133 53 -156 47 253 184 116
3403 116 83 -36 141 -32 -243 -359 -29 57 -229 -255 -57 85 123 0 -70 58 191 101 -97 103 298 -121
3425 -121 -335 -86 83 -42 -212 -152 -43 72 168 -245 -93 206 120 -246 -162 296 187 7 50 -92 55 67
3447 67 -129 -267 -27 88 -252 -263 84 285 58 23 229 392 318 -6 -119 54 143 -230 -618 -189 169 -15
3469 -15 -164 -5 255 259 410 58 -44 333 236 -283 -418 7 -150 -269 -187 -8 -131 54 -16 -68 171 281
3491 281 -72 -392 164 236 -93 -224 14 186 180 104 -177 -118 152 17 -172 -201 144 -9 -261 -30 315 199
3513 199 161 239 144 215 202 -264 -396 -52 -58 -483 -409 -37 122 95 20 125 281 557 236 -295 -73 215 -217
3536 -217 -309 -211 35 -53 -186 -29 -57 224 185 1 -39 288 216 -242 -176 206 62 -199 -77 100 196 225 -132
3559 -132 -310 65 236 -74 -466 49 179 72 -181 26 284 142 185 -121 -125 215 -122 -473 -304 -72 -135
3580 -135 -321 -110 171 398 324 123 -18 268 304 -249 -402 11 -69 -259 -303 -26 28 130 162 -16 162 397
3602 397 239 -95 66 122 -100 -234 -42 16 -110 -83 -42 74 174 32 -203 -155 238 22 -283 -113 160 145
3624 145 -50 19 61 93 228 -141 -319 10 41 -325 -404 -57 98 12 -13 62 79 381 303 -137 0 124 -10
3647 -10 -370 -189 4 -34 -248 -143 -2 282 188 52 67 245 199 -210 -176 52 111 -139 -245 -64 -102 22 -53
3670 -53 -187 107 289 -125 -201 171 188 -120 -193 78 89 71 -87 -204 -20 197 35 -358 -230 181 -10 -153
3692 -153 113 269 143 185 111 -46 194 177 -289 -171 -6 -54 -176 -211 -33 -54 52 -57 19 165 189 -64 -6
3715 -6 125 172 -46 -85 -91 -152 -99 -107 -161 -124 88 -35 -132 24 252 115 -76 225 318 -50 91 73 61 -8 60 -228
3741 -228 -319 24 -24 -66 -26 129 66 140 76 98 30 310 139 -210 -84 154 -25 -65 32 -82 -193 -173 77 -52
3765 -52 26 164 -41 -33 257 175 -96 52 29 -59 -142 -101 -181 -230 -113 15 -165 -45 121 -2 -4 348 237 82
3789 82 59 203 -26 76 99 -95 -245 91 -123 -184 136 204 -55 -1 134 77 77 58 193 -2 112 51 -49 -229
3813 -229 -59 -70 -154 -146 87 -215 59 231 -9 -6 235 115 101 19 161 -120 -108 -49 -159 -135 -108 -117 -147 11 198
3838 198 12 -25 138 91 22 117 165 -115 18 81 -138 -202 23 -142 -165 116 31 -104 38 171 20 61 53 97
3862 97 39 69 113 -157 -66 182 -114 -293 -2 -45 -130 -6 21 -20 80 211 128 71 174 135 -10 5 99 -104 -108
3887 -108 41 45 -99 -86 93 -96 -79 223 29 88 181 159 196 18 178 31 -179 24 -80 -163 45 -27 -7 -50
3911 -50 -14 -42 -34 209 182 97 64 3 43 -21 -21 -174 -59 31 -121 -199 -192 123 -12 21 227 34 -43 154 135 -49 -64
3938 -64 109 87 -80 10 -177 -123 -10 -39 20 81 121 -99 62 132 125 -76 159 157 -52 -31 -71 -119 -116 -74 -190 -127 -80
3965 -80 -48 -95 66 251 42 3 -17 127 78 72 -129 -71 -2 91 -155 -253 -53 169 -45 -43 135 115 169 121 56 93
3991 93 139 37 -172 8 148 -114 -263 -77 39 -5 19 -61 30 187 131 -121 14 229 56 -24 -37 202 71
4014 71 -83 -220 -162 -118 -59 -136 -169 -65 33 -74 53 309 309 143 41 106 80 130 0 -309 -204 115 14 -295
4038 -295 16 164 17 141 116 159 216 272 -137 -246 -32 173 -219 -286 -24 -98 -105 -91 -2 36 86 -173 -115 10
4062 10 119 -34 -175 79 71 35 -97 -37 -154 147 -65 -321 -202 81 155 -146 -109 305 81 212 187 196 168 130
4086 130 -67 -168 -45 -22 -246 -351 73 189 -108 -39 220 252 215 21 6 17 125 -127 -369 -186 -10 -123
4108 -123 -427 -96 147 57 69 47 -26 286 83 -209 -148 404 50 -150 -219 198 61 4 -153 -189 78 119 -197
4131 -197 -370 88 412 -62 -234 99 294 87 97 33 85 84 -158 -292 -162 85 14 -333 -38 249 226 81
4153 81 -24 240 225 83 -187 -135 90 -21 -407 -266 44 178 -184 10 258 259 127 88 -217 201 132 -133
4175 -133 -275 57 222 -56 -154 114 251 60 -42 -67 16 232 -17 -317 -9 361 136 -156 44 216 240
4196 240 97 -94 -16 -85 4 -234 -326 -111 33 -160 -121 192 232 147 14 12 11 34 -105 -335 -75 3 -163 -280
4220 -280 29 170 160 32 68 108 251 56 -103 -37 154 36 -179 -130 62 -77 -151 -11 8 100 96 1 -108 26
4244 26 84 -120 -38 182 127 -6 -131 60 142 266 -150 -148 -130 103 -5 -113 22 248 96 42 145 55 110 194
4268 194 -8 -121 -23 -22 -69 -214 125 -43 -71 70 96 75 73 113 38 203 95 -133 3 95 -46 -60 -241 -59
4292 -59 7 -28 -37 -115 9 169 4 -87 109 264 -135 -151 86 -3 59 -45 -195 -155 -62 -114 -157 -133 113 7 -87
4317 -87 -1 34 67 65 116 -30 -16 70 -109 -46 -90 13 -194 -108 130 12 -12 57 105 -38 140 164 -17 -7 145 -131
4343 -131 -197 -57 -130 -124 -170 14 31 -94 94 4 -32 37 215 -53 63 11 -81 -82 -1 -3 -60 -53 7 -64 -26 -9 -102 -46
4371 -46 328 125 12 -110 131 -22 64 53 -95 -189 -34 18 -177 -72 18 -46 -63 68 -10 -3 0 119 -104 67
4395 67 20 -43 -11 5 19 -279 -94 42 -145 -47 -26 104 -71 170 71 -61 111 156 1 91 88 112 -150 -94 -75
4420 -75 -193 -56 94 -41 4 45 176 -80 44 143 46 10 73 42 18 -16 -50 -292 -160 84 -152 -143 68 28 58
4445 58 158 64 -49 167 135 33 -38 33 -25 -153 -36 -1 -156 -97 146 -23 -35 40 183 16 119 44 39 134 72
4470 72 140 -147 10 -28 -94 -111 -27 -72 -141 46 -63 34 -19 72 103 56 75 110 -48 3 62 -233 -57 -11 -152 -118
4496 -118 20 7 -129 93 -29 46 89 146 22 90 66 -131 -149 -92 -59 -304 -87 -79 -32 -57 33 -54 -19 95 127 4
4522 4 145 75 -117 -76 -22 25 -139 -165 -205 -108 -69 -51 -228 -104 190 104 -41 89 150 102 102 -42 -41 -43 101 -90 -219
4549 -219 14 52 -111 28 15 265 23 97 -73 139 58 -21 -168 -76 115 -181 -198 -114 106 -42 -49 -93 -13 129
4573 129 55 -145 -73 86 103 -137 -53 -4 136 -154 -134 -122 -62 -61 -93 -79 -119 -1 -102 -24 108 180 111 8 116
4598 116 35 31 -130 -71 -95 57 -139 -286 43 210 45 -71 143 351 20 52 50 -54 54 -24 -154 -231 71
4621 71 159 -202 -185 91 -49 -53 53 -21 168 163 -5 -32 204 14 -114 -118 -39 10 -143 -54 -83 -158 135 10 -132
4646 -132 -35 54 66 -20 141 197 32 111 -22 -8 31 -38 -97 -139 -1 1 -182 -89 312 97 -80 139 180 214 200 -161
4672 -161 -149 -209 30 -100 -268 31 96 24 -34 18 54 1 198 -162 -29 226 -22 -205 -9 275 -11 -40 -19
4695 -19 20 -29 -48 -208 -8 65 130 -135 -35 366 121 -15 -38 85 128 -2 -153 -66 -8 -127 -73 -117 -41 109
4719 109 -71 -73 293 291 195 -54 -14 82 51 -216 -232 -207 -42 -93 -131 -148 219 235 55 15 136 147 5 -112 -204 -4
4745 -4 131 -89 -186 269 96 -7 -62 -26 3 -22 14 -142 19 239 126 -129 -8 175 46 -35 -32 -19 51 -25 -62
4770 -62 -154 -31 82 -261 -99 56 114 -7 49 160 175 131 -138 -90 -58 -35 -152 -274 -3 188 -103 47 138
4793 138 183 101 89 139 90 198 71 -182 -60 -34 15 -70 15 -14 123 77 34 -33 -43 88 97 33 89 137 -73 -40 39
4820 39 46 2 -102 12 85 30 -139 -237 -50 24 68 78 144 110 124 72 -21 5 -24 16 -109 -44 -41 30 -149 -162 47 85
4848 85 90 86 109 197 95 -111 -137 38 37 -151 -85 8 88 -2 -56 -35 -1 114 80 -13 172 221 72 -37 -72 87 -45
4875 -45 -62 -14 -157 -10 -57 -1 -116 -129 -25 -44 -4 198 113 90 76 98 -15 45 79 -43 -105 -38 -58 -90 5 -49 -68
4902 -68 2 97 -29 112 80 108 -16 180 -44 -115 -137 58 -128 -139 2 -60 -57 74 104 36 -23 108 57 -39 58 66
4928 66 -21 83 106 -53 -107 -62 35 -90 9 20 -68 114 204 -48 75 141 56 25 97 -33 -79 -45 -68 -155 -90 22
4954 22 78 -157 188 9 -47 5 53 -13 -25 141 122 -26 34 24 -144 -134 -5 -44 -207 73 199 11 31 118 22
4979 22 45 174 -25 -125 2 207 -138 -152 52 -46 -20 14 -52 -158 147 109 -205 -51 108 -17 -27 -31 17 56
5003 56 97 -26 -133 -121 -78 -108 -262 -50 -16 -95 41 0 -41 55 49 -77 -120 -99 55 -112 -31 21 -102 -115 11 75
5029 75 -23 10 120 -25 -30 153 -103 139 123 39 -92 94 95 -44 -122 -88 51 -66 24 31 -28 58 163 20 -87
5054 -87 64 -35 -102 -137 -72 -79 -66 -73 -89 -63 -59 92 -99 57 159 7 46 75 81 36 34 62 -66 -64 66 -92 -136 -3
5082 -3 -168 -136 91 -85 60 5 81 15 -6 70 58 -36 85 165 -146 -145 -104 -77 -20 9 -97 -52 8 61 -67 70 161
5109 161 75 -69 -65 46 -30 -27 -107 -86 -9 104 -10 -92 55 92 -19 -17 179 128 80 29 -104 67 -27 -158 -88 -11
5135 -11 68 -109 -30 63 44 -79 -60 124 88 101 104 11 -51 4 -55 -133 -105 29 -175 -100 -38 -125 -10 6 -19 61 71 94
5163 94 35 -31 77 47 21 1 -217 -90 -31 -24 -149 -73 78 132 -122 126 281 91 -35 161 69 -77 -72 -181 10
5188 10 -9 40 -93 -8 95 -11 -10 40 61 0 -17 21 -38 102 92 15 -94 133 47 -125 -14 47 -86 -30 -46 -180
5214 -180 -18 130 -22 50 218 235 127 -60 -35 23 -98 -66 -42 -160 -28 67 33 -34 52 107 95 168 196 30 41
5239 41 74 -61 -120 -23 -124 -162 118 3 -77 -98 39 74 12 -55 -35 -64 106 230 -33 -118 146 73 -82 -77 56
5264 56 -94 -91 -26 31 -84 9 -77 -100 161 164 -49 -66 157 214 -20 -124 3 -144 -1 -93 -157 -140 42 -31 -96 177
5290 177 266 11 61 25 139 46 15 -182 -135 15 -138 -286 -150 113 84 -138 -70 147 166 78 21 -50 87 139
5314 139 -190 -257 33 106 -43 -168 87 47 -45 -39 30 5 34 39 -124 5 151 77 -64 8 90 -134 -97 -67 -26 -66
5340 -66 -59 -90 -115 117 43 -118 101 73 99 41 -47 -39 -56 -167 -119 -291 -71 90 -81 -99 83 48 -26 -13 151 79
5366 79 183 -1 -50 37 21 50 -202 -4 49 -3 -129 -85 -2 100 -79 -14 7 98 90 -123 -82 185 169 -113 34
5391 34 -11 16 -87 -86 -123 -28 102 21 -99 33 112 -53 10 54 18 -7 -41 -74 -139 95 -138 -75 -48 -13 -88 -93 123
5418 123 204 117 -78 -5 97 82 -23 -62 -40 33 -26 -170 -134 41 112 27 -101 45 11 187 75 -84 -65 132
5442 132 34 -133 32 -27 -83 -105 -126 -132 -81 -115 -56 -58 39 26 -3 115 46 68 -74 121 7 -73 -20 32 -125 -62 -3
5469 -3 -32 -100 63 131 -53 157 86 -57 9 -30 -34 -23 59 -119 -157 -11 -26 -96 -148 48 -83 -197 107 11 15 115
5495 115 145 6 -64 122 -34 -12 3 -6 -68 -7 -62 45 -92 70 11 -55 79 154 -88 -19 137 -26 -2 122 -101
5520 -101 -60 3 31 -86 -9 -42 19 60 229 34 54 -39 95 58 -127 -24 -140 -62 -21 29 -162 -17 -94 -167 25
5545 25 195 -34 120 30 -18 -23 1 107 -6 -142 38 124 26 98 51 -46 -105 116 69 1 177 77 -2 2 107 -14
5571 -14 -102 47 60 -132 49 1 -99 -38 69 63 55 75 102 -23 54 142 -16 -150 46 -84 12 45 -43 -120 0 -44
5597 -44 -100 -69 119 89 -83 -32 -18 62 52 82 -29 -21 166 -15 -10 1 -65 6 -51 27 -15 114 126 71 51 118 100 -133
5625 -133 122 155 74 -15 141 -49 -127 -60 -89 -137 -81 60 93 61 61 140 0 -7 5 -52 -9 -49 -62 -187 -52 -117 -103
5652 -103 64 22 -6 99 57 103 -24 0 99 -103 155 54 64 -119 52 59 9 -68 34 -49 -64 161 67 41 111
5677 111 62 -37 -51 61 129 -129 6 -17 -161 -9 -133 -92 -26 100 4 -61 156 186 20 -90 -28 -73 -18 68 -99
5702 -99 -82 23 91 -114 25 90 27 -54 102 -8 6 69 36 -45 48 94 -132 19 121 45 -36 -108 0 11 -143
5727 -143 -19 97 92 98 56 -19 139 133 10 -73 21 -50 -34 -15 -156 -38 -11 -40 155 1 119 59 -74 63 34 42
5753 42 42 -15 -53 77 -13 72 -18 217 31 -98 -4 134 40 12 39 88 -61 56 -134 -91 47 -70 -80 -58 -42 81
5779 81 -123 -89 -64 90 -30 -55 -75 99 85 50 -94 136 175 -83 -97 101 -45 2 -84 -118 -11 11 0 26 79
5804 79 141 56 -59 143 161 70 -102 -107 -207 -125 65 -146 -24 109 72 -174 -40 118 -51 -70 -135 -118 -95 -52 -54
5829 -54 -100 -32 78 80 -104 -48 -99 -8 -50 -115 90 39 70 -163 19 208 168 -89 -63 118 25 -169 -50 -108 -128 -34
5855 -34 -179 -156 134 165 -15 -55 156 98 -21 -44 -39 29 8 -24 -204 -57 11 -60 -161 143 207 21 -17 -88 57
5880 57 -12 -26 -111 -43 27 136 -97 -174 74 -52 -65 -43 -33 80 -56 72 17 60 136 76 -110 228 79 -162 -187
5905 -187 120 39 59 -65 -106 64 48 82 -153 50 90 62 -132 31 -65 63 -93 -131 -49 -84 -78 -111 44 -55 125
5930 125 18 -89 238 127 -19 -112 -21 3 35 -171 -36 101 20 271 -95 47 146 -47 7 107 45 -53 30
5953 30 8 40 56 41 -3 -19 87 4 -45 -63 44 19 -34 -61 28 -35 89 127 -22 110 98 17 -83 5 -155 -99 -58
5980 -58 -125 -4 -25 -36 -50 -48 98 39 66 37 -38 -36 -72 -33 -13 45 -23 -144 -24 -61 20 -22 -171 77 42 -22 -69 27
6008 27 168 103 13 -64 62 105 -109 -82 -92 -132 -100 -96 -64 -61 28 153 -54 91 135 80 -18 -113 -111 -4 -80 -57 -30 -30 77
6037 77 -120 -49 96 76 -173 153 116 23 55 150 76 -69 -13 7 -47 11 7 -72 -89 -8 59 21 92 28 26 -50 121 13
6065 13 -18 77 -38 -215 -48 53 -36 -15 -115 -135 -60 -39 10 -13 136 100 98 44 -11 45 -10 19 -62 -111 -73 -11 -124
6092 -124 -35 -71 80 62 133 21 44 49 82 23 -4 102 -11 -14 -23 -14 -116 -51 -18 41 -50 -9 -121 51 11 134 -53
6119 -53 -18 47 -13 37 -103 95 -112 36 21 -110 96 -3 -106 37 25 123 67 -60 109 -15 18 90 -67 -8
6143 -8 16 -30 -170 -41 171 -46 -6 95 133 -42 74 44 15 26 -90 -11 20 -60 -22 -154 -94 54 -84 -11 22
6168 22 110 -18 -38 -31 -78 107 104 -42 -79 170 -13 -94 29 75 -53 21 33 -44 -33 157 231 119 4 -30 -70 15
6194 15 -50 16 -122 -69 -76 -168 -60 53 -185 -166 -40 -23 -47 108 186 -64 -39 84 46 74 67 -19 -125 3 -88 -104
6220 -104 13 -27 -75 94 55 37 -65 51 59 -127 1 124 51 -86 133 87 -108 -94 -29 13 -50 31 89 23 114
6245 114 102 -1 3 30 53 -17 -83 100 -39 -28 -57 -39 -48 13 -48 24 180 87 48 91 120 54 33 -164 -67 -103 -61 -67 -129
6274 -129 -23 80 -43 -24 97 135 42 -71 88 -62 30 43 -79 51 56 -32 -105 -125 -12 35 22 -157 181 91
6298 91 17 -17 88 92 41 29 -46 68 74 -131 -132 23 -34 -62 -170 -68 107 70 100 -67 86 188 -74 62 -94
6323 -94 -2 8 -100 -67 -11 41 -42 -44 -26 -3 33 26 67 -15 -66 -73 -37 27 78 13 -51 3 52 18 -118 -12 10 33 -67 -20
6353 -20 -13 -130 -1 14 18 0 87 24 -37 22 21 -140 -87 -143 26 35 -54 -75 -5 179 79 -31 10 36 47 -92 -62 -64 -63
6382 -63 29 7 -79 -64 38 -101 -8 80 -13 -61 -49 -34 -48 31 72 26 -34 -19 7 -35 -20 -24 26 -127 -84 -54 49 -94
6410 -94 -35 -105 64 69 -27 21 131 103 -158 -173 -39 -50 -39 -36 -105 161 195 29 14 131 88 69 8 90 14 -47 -173
6437 -173 -59 -97 -7 -28 11 17 154 35 -142 1 46 65 -80 -3 -41 87 25 -164 -136 -18 20 -143 -113 11 28
6462 28 -106 102 -141 43 -82 -60 -60 178 151 11 -41 4 67 94 -77 2 -55 -82 21 -77 5 93 169 -50 -106 174
6488 174 2 55 -4 -124 -149 -30 -85 -242 131 92 64 -165 143 27 -101 -17 4 99 -16 -10 -38 29 64 -182 -42
6513 -42 62 55 49 -30 -9 1 93 58 -2 -51 65 105 -66 -31 93 16 -93 -164 -9 -20 -167 36 56 44 99 15 -34
6540 -34 -81 172 -100 -51 30 -109 -19 -235 -23 -98 50 -147 -30 -28 104 -28 -17 22 64 -106 -70 -13 96 -15
6564 -15 63 -22 -77 -73 53 -55 -74 -52 -1 -43 -34 -1 36 98 -61 52 -137 95 -58 -119 20 -75 -117 -118 -21 -102 31
6591 31 80 -134 119 88 13 -45 48 67 3 -91 -7 -45 -2 -48 -29 -5 60 27 -122 -70 -62 34 -69 88 55 29 -88 87
6619 87 -27 -40 7 -196 7 37 120 54 -43 -15 41 46 -81 122 -33 85 -10 67 -88 -101 -29 -56 -36 -70 70 -25
6645 -25 30 -10 -6 35 79 -79 94 94 -98 -91 10 -36 -50 -30 47 -105 176 -13 -78 56 216 68 152 81 27 7 -9
6672 -9 34 -11 -95 -44 -63 -161 34 69 -72 -105 30 84 38 61 -24 41 -74 -65 1 -111 24 -92 -139 -58 -68 -57 -126 -115
6700 -115 70 48 3 45 -47 14 -45 -60 59 -22 -31 -35 -26 47 -5 13 23 -122 -47 21 10 -63 28 -81 -72 -7 49 -57 95
6729 95 10 -122 -70 -84 -111 -66 -13 20 9 -91 114 49 2 107 -59 -120 15 14 -13 -146 -9 -5 -108 -95 129 -60
6755 -60 -7 -15 133 99 107 -20 69 96 48 -40 -26 77 -8 -66 -32 30 13 -63 42 32 -24 52 28 -6 180 -49 -60 185
6783 185 -82 -96 -187 27 -212 -96 40 -51 -49 27 95 21 39 110 100 -95 33 -28 -56 -38 62 -33 37 16 59 34
6809 34 -13 110 105 -46 60 77 55 80 37 -114 -28 82 -67 -16 -138 -38 -153 18 6 52 70 10 29 -151 -48
6834 -48 -67 -30 -57 33 71 95 -97 -36 -11 -45 53 -34 -2 1 -138 8 57 96 19 16 -23 67 45 -18 -84 32 19 16 20 34
6864 34 77 -83 107 125 42 57 62 54 -117 -8 144 -15 57 -42 -5 -72 -68 182 -10 -35 48 -140 60 6 -23 12 58
6891 58 -74 -77 18 -89 -13 -3 -4 -6 -3 9 -74 2 129 154 31 -1 66 144 131 61 -87 30 -41 152 -107 -78 -16 144
6919 144 66 68 -41 -71 39 -28 -11 -60 10 3 -60 -34 33 -94 -77 -95 -69 -67 -17 -145 88 65 78 -41 39 114 -44 -31
6947 -31 11 135 34 -63 79 -17 10 125 -31 -68 119 111 -71 -78 -30 46 -105 1 2 11 -8 54 -60 -109 163 -104
6973 -104 -157 -22 -13 -38 -91 9 -72 0 24 -46 -117 38 -21 -102 -34 43 -77 -155 -99 -2 62 -41 105 9 78 205 43
7000 43 163 103 84 -190 -155 -35 45 -10 72 5 -6 58 -70 -117 -29 102 -64 65 29 43 179 -21 -110 -87 -13 7
7026 7 -51 40 63 -64 -63 -18 -69 26 -116 42 -65 -36 12 -112 -92 56 -14 -152 -44 -59 31 -11 -35 17 79 -29 -17
7053 -17 -13 189 85 166 -97 -29 -25 -11 -29 -22 17 -28 -114 -41 56 -30 38 -21 -108 116 147 -110 30 -47 21 -105 -122 -118 29
7082 29 132 -59 -27 76 119 -43 -109 127 125 36 -70 -43 7 165 16 -37 107 -55 -6 -37 9 14 39 197 18
7107 18 113 2 126 -9 -20 100 17 -33 -168 -170 1 -58 -77 -75 16 -26 11 -11 52 68 24 -88 -104 117 18 -52 -31
7134 -31 -40 -104 -69 -80 -51 173 135 19 109 216 0 -66 3 41 41 -67 17 9 36 10 -120 -16 24 -17 11 -67 5 -62
7162 -62 75 12 32 26 72 -71 -129 -93 52 -108 -65 -20 -12 -65 49 -13 -122 69 13 -43 158 -17 -8 -102 -37 30 48
7189 48 -4 -13 74 -46 22 4 129 50 94 -110 103 8 -5 64 23 119 6 6 -164 -110 13 157 -98 -89 60 143 -21
7216 -21 108 13 -125 -44 65 -115 -6 -81 88 -37 -91 3 -111 -160 -30 16 -53 48 43 43 85 158 -22 44 -78
7241 -78 -49 -17 122 -91 23 9 -25 68 -48 53 -70 29 -5 40 -32 82 43 48 -12 -7 -6 0 -36 20 32 -54 4 -79 -2
7270 -2 -42 -8 -1 10 84 47 91 87 -53 -74 130 -76 -107 -98 -17 -1 36 149 102 43 23 126 -12 -62 138 99 -5 -55
7298 -55 1 12 -81 -112 -64 -34 102 46 -163 34 -17 152 63 72 -58 -9 22 -153 -84 17 6 -16 -29 -106 58 15 35
7325 35 -28 38 128 87 -110 -124 59 -41 -28 -44 -85 24 -12 -12 32 -150 73 -24 62 54 17 -51 112 44 -97 153 -106
7352 -106 -33 26 -37 -56 0 -1 4 -105 -123 -11 -106 -110 1 98 -80 3 -36 -57 93 11 -14 40 18 -52 -114 -65 87 191
7380 191 -127 35 -43 -20 94 71 -39 -114 78 -62 2 -47 -85 -29 57 -46 77 8 93 8 26 75 79 -17 79 -4
7406 -4 -153 72 -153 -54 -179 15 -48 -58 -4 79 -82 3 101 197 -38 55 40 89 -59 -70 -18 -53 22 -48 -93 -3 47
7433 47 -18 3 31 29 -86 91 5 -146 -80 13 -32 -47 54 -40 -70 -120 16 -150 -29 100 63 68 114 70 -71 42
7459 42 -5 -5 -66 -96 -53 -28 -89 -123 31 -77 -111 -40 -99 104 -24 -127 22 38 -70 -98 20 10 115 -10 -74 -47
7485 -47 -40 -4 60 -28 89 -3 1 -30 -17 106 30 95 -5 -29 -10 -51 35 -117 91 -40 -64 -31 -51 -51 -146 23 -76 -50
7513 -50 -4 44 5 142 -21 -62 -52 -74 -116 -41 -70 -17 104 85 -71 -101 100 42 -160 -18 118 -118 25 -7 68
7538 68 155 127 -63 -75 8 -31 -13 -3 -58 -64 -30 -63 28 135 35 49 -76 -84 67 18 -62 -41 -80 43 -7 -39 113 110
7566 110 72 -34 -99 -46 -16 -24 -23 10 17 -80 27 -23 -62 -5 28 -3 157 6 34 -51 23 119 -38 -123 14 41 -77 -16
7594 -16 -83 22 37 -63 -158 -194 8 -44 -70 69 -26 105 -20 22 -58 5 48 -87 -63 112 -16 51 -106 -36 14
7619 14 -9 49 39 64 32 108 -88 49 -26 -95 -88 -24 91 35 -22 20 36 23 -10 -19 65 118 11 -92 -119 138 -14 -34
7647 -34 -92 -51 -21 52 -65 -81 60 -42 -17 -110 -19 -23 -8 2 41 29 57 7 -23 -44 54 -25 -45 -24 181 -19 59 -28
7675 -28 -8 159 67 129 -161 120 123 -196 -57 79 7 -53 -100 14 -99 8 38 48 -4 41 16 130 43 33 -11 -129
7701 -129 -65 -21 -52 29 155 7 -10 11 -61 -91 84 -64 79 -122 32 45 8 144 -39 1 67 -64 -26 19 -11
7726 -11 -91 -9 -64 141 -11 88 -143 10 169 1 -40 11 75 71 -90 -118 -102 -12 8 -76 23 28 115 54 -19 64 -66
7753 -66 47 -5 -7 -4 -40 46 -96 -29 32 -3 120 191 109 49 91 33 95 12 66 73 -72 100 -16 -84 -22 89 -25 -9
7781 -9 38 28 -3 47 47 52 -5 78 -110 58 54 -21 -201 30 58 -39 -48 -123 11 13 -33 -9 21 -49 67 72 -179 85 -35
7810 -35 30 -124 -133 -37 37 103 -74 82 83 23 -103 69 70 19 -39 -66 49 -10 -79 -70 50 -16 46 101 -36 19 3 -72
7838 -72 -87 -16 -94 -59 -19 -62 52 124 -45 -131 -23 -43 -27 -94 29 -54 -145 14 21 -72 -54 45 3 49 163 30 -63
7865 -63 -6 -61 -66 -27 -6 -50 -18 134 -7 48 55 66 -24 16 74 2 36 9 -25 -8 -120 -218 -84 -80 -103 -63 56 50 3 105
7895 105 31 -66 -28 44 21 -67 81 -32 57 -134 19 -1 -65 -19 175 60 -85 67 60 116 47 183 15 5 -1 -113
7921 -113 -23 29 5 -72 -48 7 -79 30 -1 112 -20 0 140 87 -2 44 69 -16 -27 21 -110 -35 -26 -9 -77 -10 -7 -15 22
7950 22 130 30 -115 20 92 174 -59 41 -26 -114 -130 -24 3 79 0 23 28 38 78 13 32 -15 -34 49 -45 -47 -60 -87
7978 -87 79 8 12 34 -40 50 151 23 -10 27 25 -29 94 95 -146 -65 -45 -115 1 -4 -29 -85 89 57 -134 -4 -95 1
8006 1 79 46 161 38 -9 90 29 -67 7 -12 4 -133 -70 -58 35 155 -12 9 -146 -19 26 48 27 105 -18 -79 29
8033 29 -149 -195 -18 -16 -167 -157 37 -93 -22 -35 -56 43 -151 32 117 53 -95 -85 -22 38 5 13 -30 -21 79 23 -41
8060 -41 -20 -30 31 79 53 -58 127 -104 4 6 16 52 -94 -83 39 27 -25 40 -56 95 -45 48 -77 -7 81 -74
8086 -74 28 -35 -28 -87 -71 -6 91 -28 -16 11 98 72 42 -70 1 -91 25 -6 -14 -8 -18 -35 -32 21 66 4 -29 10 -43 -42 -42
8117 -42 64 -53 -63 -1 -47 65 -48 -18 -59 -175 -92 -98 24 -97 122 70 -8 105 72 -86 76 3 -113 -9
8141 -9 -44 17 -53 -106 67 -11 49 -9 98 -53 13 65 28 137 117 -126 -70 77 6 -9 -97 24 -68 4 180 -26
8167 -26 64 75 7 -47 70 -14 -73 -18 55 -2 -56 -74 -17 -175 -21 -116 -2 -8 34 100 -9 6 185 50 21 -28 -51
8194 -51 18 -30 -39 -63 -29 32 -75 120 79 96 15 -57 19 20 129 21 -150 45 58 70 -78 -31 -91 -77 10 -10 -46 43
8222 43 -24 -164 35 -19 -58 -70 -105 49 -45 90 10 -93 4 126 -24 -1 -29 -27 37 -70 25 36 61 -32 -1 69 87
8249 87 66 -1 -118 -102 -48 -147 -40 -17 127 30 -44 106 9 15 31 34 9 3 34 -85 6 182 -61 -39 -39 -56 -125 -16
8277 -16 80 60 136 -54 -24 95 -18 1 -55 36 2 -55 -22 67 -46 65 -28 76 46 -79 7 42 53 -33 93 68
8303 68 -10 -37 85 75 103 -99 -56 -96 -112 33 -66 -127 -84 60 93 57 -60 -61 -8 -6 90 -87 -93 -10 55 72 -14 107
8331 107 -16 54 -36 -49 55 87 -7 19 -15 165 41 32 29 35 -56 -84 -181 -59 10 63 56 1 24 96 -15 68 55 -86
8359 -86 -4 -116 -78 -16 -24 -74 -64 -114 71 -102 66 -80 -58 29 -24 134 -147 12 -62 -56 -92 -9 0 59 33 33 49 -11
8387 -11 30 -158 169 57 -4 59 -16 -5 69 5 -10 -29 -19 -69 26 -62 -47 -53 11 5 52 14 -1 18 28 145 -47 -26 7
8416 7 54 -27 -99 -147 31 -61 -137 136 -58 33 -34 104 0 93 -18 118 -54 74 48 62 52 92 -23 -92 96
8441 96 -101 4 16 -17 -115 119 118 -31 7 -8 18 -46 -58 -58 -60 -9 19 28 -58 38 -39 3 9 5 -73 -83 -24 -1 -114 -34 -35
8472 -35 -115 -64 -90 -71 -77 -33 17 -21 -23 1 146 -87 86 130 20 29 53 -69 42 -32 1 16 -77 30 -67 -23 -21 43 41
8501 41 -7 7 -101 -12 -25 74 -52 -62 43 -1 -35 49 33 -31 -109 -9 -22 -4 23 -23 99 150 -73 -123 -48 -27 33
8528 33 -17 -82 95 -12 -103 -6 -11 3 28 25 0 -96 -56 31 -5 -78 -55 105 42 -3 54 -28 -41 -47 34 -74 -55 121 82
8557 82 64 32 -10 -176 -5 59 -26 -83 -80 -41 -5 -36 -47 -189 28 70 26 27 68 115 -24 70 -62 76 8 29 -40 -109
8585 -109 113 190 -28 45 78 63 45 -50 10 -3 25 -75 16 -80 -24 -12 -13 36 61 -61 -51 -37 -50 -30 38 -68 -72 41
8613 41 125 -70 56 -98 -22 31 27 -14 -114 -132 10 -76 12 112 -125 19 -57 68 -24 33 15 -109 -24 60 44 -70
8639 -70 15 -133 -42 5 69 -154 -115 -41 -22 -57 60 104 -41 61 -68 19 -55 -55 76 -68 -28 -12 83 -1 73 43 43
8666 43 39 -11 -37 152 98 -68 -118 39 42 -101 -31 -51 64 -33 -31 28 15 37 -47 82 76 69 -55 -21 -38 -26 -17 -44 -90 -107
8696 -107 -42 16 -72 43 42 17 -87 -43 -8 -6 5 86 -45 -95 -24 50 -88 22 -57 -100 18 80 -53 -51 -30 -81 81
8723 81 138 -128 -12 119 -43 -179 -36 -32 31 85 8 -36 -71 98 94 -134 -100 15 162 70 100 -27 162 59 -65
8748 -65 -28 59 -31 -117 -52 -110 -17 -61 -77 -7 -115 42 48 -54 89 94 55 -136 65 -122 -66 -258 -144 97 -55 -104
8774 -104 31 39 -4 42 -65 -23 58 7 -75 -70 7 -64 -90 -138 -101 -26 43 -72 -32 120 -23 -39 65 -24 -38 8 -56 -32
8802 -32 2 -181 -55 -22 -72 -10 -112 -141 79 108 -67 -67 -112 121 -60 -99 136 13 -2 32 7 8 105 -58 -89 18
8828 18 110 61 97 -159 -132 42 55 93 -74 8 -25 1 -86 37 -40 36 79 5 17 -27 -79 -59 -73 -58 -129 -139 -152 85
8856 85 113 29 -94 -48 13 11 -102 -85 1 74 -77 66 113 -20 -9 -51 -28 -88 73 -78 79 -42 -28 17 -88 81
8882 81 44 -22 53 43 -31 27 -8 87 -12 61 -9 -53 -4 5 -34 21 -38 -110 11 27 -83 -11 66 -4 38 -45 -27 20 -58 -130
8912 -130 -73 -78 -46 51 -35 -15 29 31 40 -42 7 -28 93 53 126 7 45 -63 -39 39 -78 35 6 91 18 -50 -41 -19 -14 149
8942 149 -99 87 -11 -57 70 -46 -26 -76 -99 -44 -42 7 39 11 1 12 58 -1 42 -5 38 16 72 -34 15 -146 -146 29
8970 29 -47 -96 59 62 42 -15 -79 -10 16 51 -19 1 8 -5 -29 80 42 63 6 -75 61 -35 26 28 -60 -9 -19 95 36 -43
9000 -43 25 -37 -40 48 22 -12 -32 -13 -1 5 56 -89 20 -40 25 -31 90 46 -25 93 28 -137 95 2 -72 -123 -70 -9
9028 -9 13 -20 -65 -110 14 -10 -47 -70 -17 12 65 -16 17 -103 -32 -81 -160 5 70 15 42 -126 -111 -128 53 34 96 -29
9056 -29 -29 -119 -49 -42 71 -207 -20 -48 -99 -31 -25 -20 -59 28 -7 70 -103 8 -46 -80 -139 -13 2 -31 -60 -120 8 -31 30
9085 30 53 45 -22 -175 -23 -12 -42 39 25 4 -98 -74 -4 5 31 40 -56 -54 -42 36 72 -52 20 -49 -47 21 37 54 16 1 -127
9116 -127 -18 -5 -29 104 -90 -29 -23 125 -70 -26 62 -8 -93 -29 -27 -42 -75 -65 81 -22 0 -38 -57 -61 -40 81 -60
9143 -60 117 50 -97 90 -11 -29 75 86 -73 -21 -24 14 -51 -68 -83 11 47 -46 28 -136 -14 96 -61 34 101 -96
9169 -96 -152 70 32 -137 -84 70 31 -5 -36 -44 6 79 -2 -14 -30 27 -45 -156 -26 42 -100 -140 15 -43 46 -20 119
9196 119 -106 9 63 -55 -91 -20 -53 47 8 67 83 -38 -116 22 64 4 -43 -61 141 26 74 -52 33 -77 -33
9221 -33 84 87 2 -79 30 -26 -43 26 5 -71 81 -85 -20 102 -7 -34 96 -85 -49 45 0 -61 -42 54 164 -12
9247 -12 -34 35 -64 68 5 25 -76 36 -19 41 47 91 -29 -25 97 -177 12 -41 -29 -40 52 13 -86 11 15 77 -4 34
9275 34 20 68 -52 5 -97 29 -7 -134 -170 -6 33 -165 -6 105 -138 38 52 -58 84 35 -32 -56 -31 75
9299 75 39 44 -10 44 28 -89 71 -21 134 35 15 -38 -24 196 -82 -83 -44 -65 123 34 -65 -114 -32 -27 -35 -90 -72 -41 -180
9328 -180 -38 -59 31 -6 11 -64 80 27 -66 22 13 -16 -29 -55 77 97 -22 104 -23 87 26 8 -79 19 72 -69
9354 -69 -28 -60 95 -38 -45 50 -57 58 -112 -48 17 -68 -65 -99 -75 48 -42 -40 -10 65 82 -83 -69 -135 -5 -76 -30 -36
9382 -36 30 -61 -24 -54 62 -43 72 45 -131 43 5 7 -87 98 109 91 43 -41 -70 74 -16 61 95 163 34 16 -50
9409 -50 -95 -56 -33 3 -117 61 32 -26 -66 85 4 -83 -28 18 -23 8 -2 47 39 -142 61 -35 -45 18 -7 -130 73
9436 73 112 7 -41 83 59 39 24 -69 -130 13 -67 24 62 23 1 67 65 110 12 13 118 19 50 -138 -6 -16 -57 69
9464 69 -55 -1 -55 89 50 -46 -93 -15 16 28 21 -28 38 5 -46 -24 6 -87 -24 -72 -125 -55 112 -9 32 17 26 23 -155
9493 -155 22 102 39 51 -1 -1 -36 -59 0 1 219 18 48 -100 -33 24 101 35 -24 -29 97 -35 26 24 -57 -24 -106 40
9521 40 8 -49 -28 96 -103 27 -20 28 -72 -190 -71 52 -8 188 3 -41 62 33 -22 66 -67 23 75 30 53
9546 53 -38 63 -24 93 31 18 28 71 -7 -124 -8 -29 -45 -145 -1 12 -58 -37 62 -52 -51 -36 -32 -62 -22 14 -123
9573 -123 55 21 39 -126 -78 -11 -83 -30 8 75 -8 4 146 32 88 74 -21 -30 6 91 -70 55 -15 1 23 -31 12
9600 12 -85 -2 54 -49 -2 -37 20 28 -83 -82 -37 -47 -41 -38 -70 11 -162 -38 -38 -6 -22 32 -58 209 -27 -64 31 -98 -71
9629 -71 -141 -29 -51 13 -119 0 76 -2 6 105 59 -16 9 6 103 -19 -53 -44 -77 -4 -4 -35 -37 84 -73 5 160 74 -109
9658 -109 -61 35 -147 -12 52 -56 -79 16 64 -131 -58 -117 -19 -33 5 -14 -17 64 166 -2 44 -56 72 -43 -21 77
9684 77 -68 0 33 51 -103 -30 -100 -25 41 -76 -71 87 34 -155 -97 116 -77 -25 15 -46 -29 -57 38 -43 -118 22 -26
9711 -26 -5 45 -60 19 -12 -26 33 -75 64 13 -52 -69 -60 -36 -23 59 -5 17 -18 -56 73 54 54 41 69 111 -28 -10 10
9740 10 -93 -59 49 13 66 -52 -13 -101 -25 109 -125 7 18 -60 19 -54 11 77 -194 -12 124 -1 -69 99 75
9765 75 -44 87 -98 -110 -40 2 36 89 -3 11 49 -102 13 24 -48 -1 -55 9 14 -49 -48 53 13 -24 -58 -7 -35 28
9793 28 -131 63 -28 -9 -73 -141 54 -66 -35 -14 46 49 -24 47 -13 -23 -83 51 -15 -58 -54 -149 -58 26 7 14 -45 16 44
9822 44 25 -130 -41 33 96 -51 -110 -71 -22 95 17 -10 -24 -10 44 62 -71 26 37 12 -23 32 21 -84 88 -69 -1
9849 -1 38 7 -48 108 -25 -150 2 -67 -113 12 12 23 44 -116 32 -93 -26 -28 -54 -211 33 -67 66 -2 220
9874 220 -5 6 20 43 -9 -49 123 79 -36 12 98 -18 77 -55 -45 -40 45 -97 -59 6 15 -77 -20 96 -36 -38 1
9901 1 -88 -121 -5 -3 -110 -11 -43 -68 -192 -30 95 155 -5 108 -37 4 89 -19 -73 61 7 28 77 85 -47 20
9927 20 -80 62 40 27 -37 -37 58 62 48 -86 -41 74 68 -115 40 -82 -19 -25 -183 -36 46 -91 -47 -2 -68 0 132
9954 132 -30 45 -52 -77 -71 23 -25 -51 -122 -106 -86 105 67 48 129 1 40 14 104 -65 -45 -32 58 110 -38 -34 -61 12
9982 12 21 62 -36 38 -14 17 -116 -128 -75 69 51 -70 -73 16 -28 -12 -35 -53 -43 57 -5 -34 6 79 -82 104 92 -48
10010 -48 -113 -84 -48 26 -66 -48 41 18 50 53 0 37 98 -34 91 133 9 86 30 -10 -51 36 -3 22 -49 -26 21 -124
10038 -124 67 35 -17 -32 -35 -28 -6 -72 -35 -89 -12 42 -125 36 26 -99 -13 -2 -57 -39 41 54 55 59 113 79 -49 119
10066 119 56 80 -27 -21 -17 11 5 -126 58 -13 -39 -76 37 65 -48 69 25 -53 -26 29 -22 -45 -105 44 2 -131 35
10093 35 -118 -27 117 135 0 -35 13 7 47 17 -191 85 126 -21 -22 -41 42 65 5 115 -125 -62 139 93 -60 -29
10119 -29 -7 -15 75 -45 29 62 -29 -49 22 -17 113 43 1 9 -58 -5 10 -59 -92 -74 -52 -49 -63 -45 -40 -114 34 -56 -15 -163
10149 -163 -13 187 46 -11 -31 -125 7 -50 -119 57 -69 11 -87 36 -7 72 51 10 -29 17 12 81 -67 66 8
10174 8 -65 -20 15 -81 70 41 -94 -112 -2 43 -57 -59 8 26 41 -16 -114 28 32 4 -99 -87 3 -107 -41 1 -127
10201 -127 -18 -14 -38 -34 51 56 -126 163 62 47 -107 -12 5 40 15 -57 10 48 43 -41 16 94 9 67 62 30 49 102 2
10230 2 -70 -36 -68 4 -138 -78 -139 -65 -35 0 46 57 74 35 -71 -73 79 -27 42 69 -45 39 -52 56 95 -96 -7
10257 -7 -32 70 53 -37 12 48 -18 -58 -12 34 -7 76 -82 51 -25 -7 -27 -76 -187 -19 -13 132 9 53 -109 -49 -57
10284 -57 91 -6 47 -78 -39 45 -108 28 -106 32 -135 5 57 -18 89 42 43 -75 -15 30 115 13 -16 27 39
10309 39 13 46 -41 -94 28 52 -63 15 -43 50 28 25 -21 -1 143 -48 17 -15 73 14 108 9 62 93 64 64 -15 -34 -96
10338 -96 -81 -7 133 -84 68 -35 -70 3 141 42 -69 -47 -50 84 64 -7 23 65 35 87 71 88 138 197 -18 -12 -39
10365 -39 16 -3 59 -32 -120 -70 -20 24 -147 -9 70 -80 15 29 -5 -66 66 28 -136 -71 -31 -46 -90 -36 44 71 49
10392 49 63 3 0 -11 0 -53 -24 111 -24 -63 57 -38 -137 -112 104 64 -27 47 47 92 -15 45 8 -206 -71 -33 -23
10419 -23 17 -181 -13 20 4 -2 38 -45 -1 -47 -80 -1 -59 -14 -13 -81 -123 -55 -29 24 92 -71 -105 107 -53 55 -62
10446 -62 21 27 -50 37 -33 -123 26 44 -38 22 27 106 -37 -67 -90 -43 4 -128 -41 71 10 -67 -4 -57 37 43 43 -19 -97 -15
10476 -15 -42 146 131 77 -49 101 55 160 -45 45 -132 -116 28 -40 -44 54 82 -33 -71 27 3 89 42 -12 135 44
10502 44 95 -67 9 11 -6 -57 72 12 36 -96 8 -4 -14 -105 20 -127 -58 44 -63 115 5 22 -59 -55 -13 -114
10528 -114 -92 -68 -84 -74 21 34 -31 106 23 -63 -70 3 25 -82 51 -64 -9 -1 -52 -2 -5 98 92 65 -47 -86 -106 19
10556 19 30 -26 0 -37 -114 -13 -64 14 -26 -4 -11 30 53 -128 44 -108 -30 -69 -92 -114 -92 14 -77 -38 -115 52 -68
10583 -68 -67 -12 -31 -143 21 8 -13 -18 61 -15 -45 -24 16 -15 -128 -103 -194 10 -33 -82 43 -129 -46 92 -91 53
10609 53 -48 15 -170 9 59 28 -82 -108 -7 -9 74 -2 86 -125 -51 -38 -11 57 -9 82 29 126 -47 -44 -113 -38 50
10636 50 3 -15 -14 -119 -85 131 16 -32 14 62 31 -3 90 -114 23 56 9 -136 -16 80 -106 105 -62 -37 11
10661 11 21 -59 -50 73 5 -27 -25 -50 27 12 -12 -13 -46 -32 -104 -27 -151 -150 -38 32 -24 -46 -35 26 29 60 10 27 -92 -50
10691 -50 93 40 -60 149 6 38 -72 -17 44 14 41 -37 -4 104 -6 -69 -1 133 9 -148 -131 -175 102 -42
10715 -42 -128 -129 23 3 -11 29 101 -15 -11 46 63 -109 36 -6 -14 17 -13 60 -74 -152 21 55 69 71 52 -132 66 80
10743 80 -65 32 -1 44 -19 -97 23 10 -110 84 -93 74 144 -14 150 -30 -50 61 33 9 -74 168 -108 -126
10767 -126 9 -35 29 4 79 27 -71 -83 -2 -60 -24 -4 -92 -6 -56 74 19 -34 -7 -26 -102 -7 -75 -10 29 38 -48 108
10795 108 16 -38 -56 65 -114 11 -69 -61 -33 70 -100 -38 -33 7 155 0 -8 -26 -12 -19 -51 -31 -16 52 118 -171 1
10822 1 -10 11 -68 60 21 104 110 60 70 30 39 -43 55 36 -4 -64 14 -20 -68 -30 -9 28 6 -61 17 -57 42 -43 -47 76 57
10853 57 21 -98 -27 125 -28 -131 49 10 -6 28 -30 54 18 -7 -64 -49 31 -60 16 102 -14 26 74 83 -18 4 79
10880 79 -56 6 50 -8 -3 5 65 28 68 -13 -87 6 58 -36 19 83 45 -16 -42 -27 -27 -22 -30 17 -11 4 32 -70 -17 103 -69
10911 -69 -49 -61 17 -30 16 -28 -14 -65 -116 48 71 -69 -22 -11 90 70 3 -75 31 -100 35 113 -7 20 -17 95
10937 95 88 76 42 -7 -12 -7 15 76 69 52 -51 -17 42 -22 -70 -16 24 -83 -39 -1 38 -54 -13 8 39 -37 4 -100 -106 79
10967 79 54 -64 -76 2 -53 -73 -92 2 6 12 31 0 35 -44 0 7 -71 -15 9 4 -6 18 -218 123 -74 -37 72 -8 45
10996 45 -20 -11 -48 -16 33 -28 -11 82 -13 -73 -26 -95 -9 35 43 72 -31 -106 -47 39 10 -35 -17 77 61 14 -39 -61 -11 10
11026 10 29 -79 -5 33 -93 -50 36 -26 5 49 -23 -18 35 0 -93 -1 101 50 7 46 -9 86 -84 -106 -65 22 -88 77
11054 77 80 2 -56 -70 -146 7 -67 35 45 -42 -26 95 -12 -14 54 -82 48 -38 -70 53 15 8 -43 -113 -45 -53 -22 56
11082 56 -114 -39 8 30 27 -175 -59 -44 47 78 -43 -21 17 -36 -96 -117 38 41 -29 -12 -128 -57 27 26 0 -23 19 -49
11110 -49 27 17 -19 16 -99 16 15 44 86 29 69 12 130 -129 -22 14 59 -39 81 -141 -59 11 3 3 -64 -7 -62 -151
11138 -151 -12 -61 -74 14 58 28 10 28 7 -184 56 -75 -134 -86 -2 -84 -138 -37 14 12 -136 -70 17 -21 -64 118
11164 118 -60 133 105 -7 -20 10 29 -16 -20 -36 26 3 118 23 20 154 41 53 16 -10 147 69 -134 -23 103
11189 103 24 72 27 -41 7 -30 26 55 -26 -74 -85 -65 -45 23 11 -182 4 22 -117 7 32 84 -32 -17 15 -12 50
11216 50 -86 63 -10 55 55 -69 42 -25 -109 85 -79 0 -130 18 -65 -18 6 -7 -23 -145 95 -12 -86 -62 75
11241 75 -95 -11 -17 -77 -86 30 -23 84 51 -44 -164 117 -130 136 1 76 17 -37 47 -78 -106 -32 -109 23 11 -12
11267 -12 -22 131 -4 118 -31 82 29 91 30 -49 -34 32 -26 -43 -85 -56 10 -103 -70 10 -71 84 -58 -91 -28 -26
11293 -26 6 -126 1 -32 -49 -69 96 -51 -109 -57 -24 117 -73 90 -44 10 87 -77 -28 -107 -48 31 -51 -40 70
11318 70 34 50 -9 107 123 9 -29 26 -25 3 -74 -58 -19 -26 -221 3 14 -33 -60 -34 76 -26 47 114 18 -3 -30
11345 -30 -2 51 102 9 -1 112 47 -83 94 -29 -46 -44 43 -49 23 110 -72 -44 60 58 -9 111 52 -65 9 92 -31
11372 -31 7 -15 79 25 -74 3 51 -62 55 -39 50 -73 -3 -28 96 56 -58 31 -44 -134 57 69 -75 80 -87
11397 -87 -119 -31 -29 -22 99 -15 26 59 -94 12 43 -28 -8 19 -58 -84 -20 98 -19 27 9 -73 1 80 -60 -46 -140
11424 -140 -25 -70 11 40 -79 -43 -74 27 98 3 -38 34 64 -16 15 -189 -66 102 -131 -31 10 -64 -30 37 -46
11449 -46 9 129 1 -156 32 34 209 -78 39 201 35 -49 -4 -49 -19 84 -10 55 15 75 76 23 83 -91 -44
11474 -44 -83 19 -46 -126 14 -81 -90 -118 -35 -42 71 -76 45 -28 -107 -14 -18 54 -21 42 127 47 -54 -62 -22 -28 -4 -81 -10
11503 -10 -58 -8 -84 13 88 64 -93 26 58 -52 34 -87 11 -82 -14 22 -95 53 -97 47 -60 -76 110 -118
11527 -118 -16 127 -13 24 28 -66 -47 -50 -98 -71 -104 97 -59 34 1 51 91 0 7 9 -40 21 76 -20 -103 -168 -8 -37
11555 -37 -31 -15 37 -58 -31 121 80 30 78 -2 88 6 -43 -16 -9 -36 45 -116 79 22 -51 68 -38 172 -40 -23 49
11582 49 9 -7 10 122 -58 -6 95 -11 -45 -104 210 31 29 59 -11 -34 -13 -62 51 -32 89 -139 -38 23 7
11607 7 -53 67 38 -50 16 50 -20 -37 20 -109 -75 -23 55 -45 -8 -52 -32 -109 -83 0 -33 -22 -85 -16 -57 -74 -23 37 17
11636 17 49 33 12 78 40 -30 43 43 -53 -20 -35 -13 -161 -12 -188 69 39 27 -40 -18 -70 9 77 86 -100 -45 -44 17 -42
11665 -42 117 5 -40 5 -19 -76 -20 31 -2 -1 5 -92 -60 -81 -23 -49 -46 109 -41 14 -36 -11 -78 -59 111 -36 -6 -34
11693 -34 -35 138 -48 167 106 -120 -68 -19 0 29 59 7 7 84 -56 56 51 -65 65 53 -109 -40 -121 -84 -22 38 -90
11720 -90 -31 38 -25 54 14 -126 -34 59 46 -17 18 21 -157 79 -31 -63 -77 1 91 50 84 -53 44 24 85 -67 142
11747 142 -46 8 -88 48 55 -56 -101 -42 -43 -19 -62 -89 45 5 -10 -9 -43 -31 61 -11 102 -43 27 74 5 -96 -38
11774 -38 24 -38 10 86 -23 90 73 -52 101 -13 53 130 -58 136 97 57 -3 -9 -71 -2 30 124 79 -61 79 84
11800 84 13 128 -19 -49 -42 74 0 -17 -23 -89 -23 21 152 40 -38 -80 -30 -35 34 134 -27 14 -122 57 -7 68 5
11827 5 -43 -1 -145 -10 -29 -64 56 -1 14 -80 111 45 15 -29 72 25 22 -73 45 -45 11 -56 -19 94 -89 40
11853 40 -30 49 -121 80 12 -77 20 43 -60 -13 -50 -113 -122 -175 54 4 -53 1 11 37 -102 28 -45 -113 94 78 24
11880 24 -36 -54 45 5 -99 44 20 62 42 113 92 20 94 -37 31 -56 -101 32 85 -42 -67 -4 -6 49 86 26 -70 -87
11908 -87 -110 -46 29 97 22 38 -1 42 -48 5 67 102 7 41 35 -94 -118 5 -46 57 -6 -105 112 20 56 -18 14 -62
11936 -62 -11 39 14 78 141 44 -29 4 37 -22 -65 97 107 -100 -42 -104 153 49 69 82 -95 43 -113 -19 -49 -106
11962 -106 -132 -69 -22 -84 21 57 -81 -47 -29 -56 -15 56 26 -51 -80 95 13 -77 -30 -43 5 -57 -11 -36 -123 -112 -10
11989 -10 -18 66 -27 22 8 -126 -50 -37 47 68 -5 8 13 52 83 -63 -73 16 78 2 26 -98 -116 124 -25 -69 15 69
12017 69 -54 -31 -15 -47 -162 103 70 119 37 -14 -35 -33 20 78 -8 35 -1 -20 45 74 40 9 128 46 28 -41 8 -62
12045 -62 50 7 -129 -45 -63 45 7 32 -73 17 30 66 22 22 -38 -75 85 43 -12 -17 60 31 15 54 -27 -173 37
12072 37 -64 -9 -82 -2 37 18 18 8 -66 -57 107 -13 -16 79 -53 19 75 -77 86 7 -61 -32 57 -153 -119 23 -28
12099 -28 -7 61 17 33 -42 -39 -99 38 5 69 -51 26 -41 50 34 -92 31 24 45 -3 12 43 9 14 90 23 -39 -11 78
12128 78 38 -103 97 -32 13 145 45 -41 45 -86 -41 -23 79 87 -40 -78 72 -17 24 28 102 -82 -9 -51 -7 -117
12154 -117 38 -28 -92 1 -60 73 38 7 8 -14 -104 107 6 0 50 -60 64 138 38 148 20 53 -59 33 -126
12179 -126 21 30 92 -103 -95 15 -98 131 101 -21 9 94 55 -11 1 112 -108 -14 -62 -9 -84 -9 -14 -11 -22 63 18
12206 18 -20 -42 147 -24 123 52 -80 -97 78 -39 20 -55 -20 92 -30 -43 21 79 59 -26 -21 36 8 126 139 101
12232 101 42 -17 -49 -104 -121 99 158 112 2 105 0 33 -57 64 -39 -49 140 35 -38 -61 -14 -20 -44 40 46 -28
12258 -28 23 55 27 107 -54 -14 -8 102 -57 -69 -32 -31 69 32 89 -18 19 5 -123 -78 24 -38 -45 37 -45 72 22
12285 22 -9 -79 -135 29 -66 37 28 17 124 -59 92 2 -26 55 6 5 -22 10 12 -64 -36 -53 -107 -20 55 30 -17 41 42
12314 42 44 -24 -87 -70 64 -63 43 -35 -15 -46 70 -39 122 -80 -2 -116 87 122 39 81 26 -130 -40 42 39 23
12340 23 -79 -31 62 90 -86 -8 32 -163 -109 79 98 52 -114 0 0 -50 -17 34 2 91 37 -101 57 -4 -64 21
12366 21 -14 15 -54 45 -46 -20 114 57 -23 -87 -163 -26 -17 27 31 17 -9 -24 -90 -18 4 -27 -33 48 85 -173 96 30 14
12395 14 54 -58 71 -47 -25 42 52 -9 -2 15 91 53 40 -82 44 -59 68 132 -11 87 -20 78 4 21 -46 -17
12421 -17 45 -37 68 92 -109 16 10 -56 -12 1 19 -18 54 -83 -83 -116 85 -25 44 60 -21 -37 -39 -95 -39 -13 75 114
12449 114 47 18 73 -126 -5 -137 -3 61 51 -3 90 -14 27 -24 16 16 -39 44 -113 76 13 -43 -142 -55 -167 47
12475 47 -52 48 -55 -157 32 36 -60 23 91 -86 -119 -76 -18 -51 -95 -27 -34 -74 27 93 -45 40 104 5 31 11 -32
12502 -32 4 41 -15 258 -98 5 72 -106 12 -83 37 49 38 22 66 137 -9 18 -7 -71 39 16 -45 -111 -30 -100
12528 -100 -27 -39 10 -33 -2 -97 -1 -65 14 27 -34 -77 19 -24 -127 -38 -50 -65 -60 -45 -54 9 -22 -69 4 112 30 4 37
12557 37 -14 67 -23 -93 -34 34 94 68 11 -7 78 -22 68 -11 7 -1 3 114 152 -77 -73 -124 -101 -62 -58 -47 3 38 2 40
12587 40 -97 -203 -15 -54 -2 -79 35 2 47 22 66 -28 52 39 43 34 -11 17 33 8 10 71 -101 111 89 14 -90 -118
12615 -118 -11 -51 3 -38 -3 -45 -94 -44 44 5 8 -80 -32 69 81 14 -69 29 -5 39 13 -134 -10 10 -46 -13 112
12642 112 -17 -26 -91 13 102 140 2 -119 -83 -47 -30 19 34 9 -23 -132 11 31 -46 31 23 55 -99 119 125 47 46
12669 46 -29 -38 11 33 -22 -63 -1 -54 -77 -24 25 -103 45 23 -213 -83 72 -15 24 -17 -1 -41 -116 -47 -40 82 -48
12696 -48 -36 -91 88 40 61 -64 13 -10 -4 18 11 90 13 -4 -10 45 -94 -46 19 18 -75 4 35 -69 -40 -58 -114 -117 -84 -49
12726 -49 -28 -19 -10 37 54 -35 3 -86 41 -103 -83 -42 7 -8 61 -15 17 49 121 125 24 12 -87 21 47 -33 97 62 -59
12755 -59 -47 -37 132 28 98 4 113 -119 4 -47 4 83 -70 3 -26 24 -90 21 121 25 22 -7 22 50 -26 -124
12781 -124 103 17 -89 -29 -67 54 68 56 62 -15 113 19 -12 5 117 -104 59 68 -92 -137 57 66 -3 -28 20 -21
12807 -21 -83 -17 -65 102 34 43 94 47 -68 23 47 51 2 154 -42 55 27 67 -155 -47 127 32 -7 31 -37 -92 -65
12834 -65 -33 -60 34 -83 -11 -48 27 45 -123 -2 36 -66 39 2 3 10 -15 -21 -12 -42 -25 -12 21 5 -38 -80 -14 -2 -15
12863 -15 108 -57 -13 24 -62 138 21 -4 -25 -62 -26 8 -7 11 -116 -59 -80 24 -63 6 69 24 111 95 72 -4 56
12890 56 -18 11 3 -3 -13 106 -124 29 49 13 30 -56 7 26 5 45 -98 -44 52 15 58 -43 -29 -40 30 -32 -50 -97
12918 -97 -51 -26 -93 -71 56 34 -28 -122 -3 -12 -9 -3 75 -74 -53 -70 27 87 28 -58 7 27 -23 -37 -34 48 -23 114 34 -35
12948 -35 58 13 142 -60 -27 27 -12 -7 80 118 -115 8 -78 -8 25 24 7 53 -84 -74 66 -46 -17 -141 33 -42
12974 -42 40 -30 108 81 10 39 -84 -13 15 101 21 -41 9 54 -62 87 28 31 40 4 65 34 -31 60 -10 36 28 29 25 13
13004 13 -128 -19 54 -8 -31 -35 -3 -37 -79 9 53 -140 112 99 -70 30 81 -69 66 97 -17 0 20 126 9
13029 9 107 -90 58 7 -24 32 -23 73 -48 18 -46 37 28 46 41 35 -108 63 70 -2 -1 79 55 -22 -19 102 -40 28 -16 5
13059 5 98 32 -39 -13 -18 18 111 -160 49 71 -9 -43 -12 -78 61 28 -82 -6 119 9 24 -74 68 -27 65 21 36
13086 36 13 -16 66 97 31 33 66 -158 -10 69 85 -20 -24 -25 -79 -18 21 85 84 85 8 -53 -126 -12 -41 -124 -101 5 -4 13
13116 13 -31 -31 26 -80 -9 -91 63 -75 -112 24 89 194 44 97 -91 86 -11 44 81 7 -87 0 54 18 113 78
13142 78 -63 -54 32 43 101 39 58 -27 35 -7 -1 17 -7 18 -16 -95 -47 53 -68 46 26 28 -95 23 12 34 -77 -63
13170 -63 2 67 19 70 -19 -11 -134 57 29 211 62 -3 -12 106 26 -32 46 115 81 -18 -27 -85 11 35 96 42 -33 4 58
13199 58 -67 85 -26 -6 22 11 42 -31 -155 3 31 -93 27 31 89 19 -83 6 59 81 9 13 -56 -28 14 6 60
13226 60 82 15 46 31 31 105 4 -9 -51 83 63 -66 79 -6 12 -8 -112 -60 -67 -72 0 23 101 -7 39 -69 107
13253 107 63 88 -15 -22 15 -22 -28 42 -151 -25 -5 -114 47 -37 153 62 47 -1 -26 48 97 82 -76 141 47 -65
13279 -65 33 14 -22 -86 5 -25 -52 91 -8 -69 74 16 -54 -180 75 11 -28 -142 -6 144 -42 -36 -37 45 18 -38 102
13306 102 63 10 27 17 -42 -98 -124 -20 -45 -76 37 60 -121 -88 129 15 1 -1 29 -4 68 201 -90 -25 -16 -2 8
13333 8 -102 112 35 27 -76 53 21 100 -200 53 -5 -1 12 35 -17 59 99 -139 0 -57 10 -40 -62 -96 -48 57 -37
13360 -37 100 -41 -57 -8 63 0 -90 -39 47 -50 -2 43 -72 -8 77 23 57 -33 137 -6 24 -37 -94 -86 61 52 -16 31
13388 31 -38 135 31 106 -97 -116 -56 5 -6 10 -76 -43 -9 25 -57 -10 8 104 58 25 -51 -128 -80 -3 55 123 111 -7
13416 -7 73 141 -138 -17 35 61 3 -1 -112 -38 96 25 32 -77 -27 -85 -48 28 0 55 26 -20 35 -26 31 13 81 -118
13444 -118 -30 -8 1 -36 -131 173 -58 52 -123 -34 109 28 58 32 -23 -78 99 38 -12 -69 126 -9 29 15 112 -27
13470 -27 -84 6 24 12 73 -24 -71 13 -51 92 73 -69 72 42 -9 -29 -30 -30 64 -22 -13 57 -148 32 66 -61 -46 -24
13498 -24 -5 -38 2 18 107 47 -72 52 -59 59 38 -24 116 26 -3 -41 17 88 63 73 33 65 -56 14 27 96 30
13525 30 -49 30 58 85 -103 -78 -82 -68 69 -68 72 9 -60 -61 -15 -42 -22 49 -50 6 -55 -42 80 26 -101 28 65
13552 65 14 25 84 -96 7 32 -37 8 72 -86 32 -91 -53 86 -53 81 -66 7 7 -71 -116 -92 25 -63 3
13577 3 39 41 -22 -15 13 50 95 22 34 -15 -189 -77 -123 -103 109 12 -14 -76 -24 26 15 -91 12 117 -59 17 -44 38
13605 38 24 -14 32 2 -14 56 -35 119 -50 28 -129 -22 35 42 69 -113 -41 -11 18 -12 -22 -13 88 14 -103 63 -34
13632 -34 54 103 -1 -47 -44 99 -110 -70 -12 -13 99 65 -76 -80 -1 -125 -89 8 18 -93 20 -47 -60 32 35 -4 3 18
13660 18 17 -40 -8 35 146 -61 66 -53 -3 -15 -24 -65 -48 -44 119 25 -23 3 14 -93 74 -42 -31 19 27 -48 -7 -60
13688 -60 52 90 2 -171 -11 73 18 -58 68 71 84 -89 -48 -45 71 14 -36 7 32 -38 69 -69 34 131 -151 47
13714 47 -13 55 93 40 -54 60 52 83 -24 -81 -133 -13 -35 37 86 44 10 -5 -74 -7 26 -90 113 -49 -94 -27 19
13741 19 79 56 -29 -19 -29 -9 -8 -72 85 -24 1 -4 119 46 -7 4 -32 -48 -19 76 99 140 -69 -48 109 -40 -64 -159
13769 -159 -138 49 9 42 15 -89 -19 34 43 -45 -20 -57 -110 -3 74 29 -2 -56 93 -110 -30 74 -73 -7 14 40
13795 40 21 -63 -20 -1 30 181 26 -22 -32 47 43 15 4 46 0 70 102 77 -136 -39 -2 -17 31 10 -66 75 115 -33
13823 -33 -160 18 74 -88 76 68 -18 2 50 22 -5 23 -52 -153 67 -82 54 29 126 -64 78 59 26 130 62
13848 62 -82 32 66 -12 98 4 100 -78 2 61 -3 74 -9 6 8 93 -8 -25 129 -54 2 -66 15 -23 48 -175
13874 -175 -65 53 -96 53 -11 22 33 52 -48 -11 -90 -64 -82 4 -69 54 -29 56 19 86 -24 -94 50 83 24
13899 24 -19 -18 -23 -85 33 114 4 72 -50 -18 -1 6 -14 109 -39 10 44 74 -22 1 -75 -52 -54 -63 -16 126 18 62 -63
13928 -63 -72 34 62 -69 -48 -58 51 3 43 -74 -26 47 23 -69 -24 13 -75 21 63 -13 -37 11 -30 -50 -47 44 -29 -7 0
13957 0 -75 -88 15 -14 -46 34 63 70 -17 -60 -28 -19 -49 41 -4 -62 -93 -37 -33 -47 34 59 40 17 -50 -47 58 -56 -17 -60 68
13988 68 32 -24 -73 -124 18 -44 -38 -51 -14 -51 55 -40 22 49 18 40 -6 25 -11 -8 -7 73 -4 3 -105 -5 -72 -157 -60 -35
14018 -35 41 -131 -39 -59 1 33 93 -2 58 23 39 -29 -98 -98 26 73 11 18 44 -69 61 40 -44 57 -22 -75 9 -34
14046 -34 35 -31 -59 -7 32 -43 -65 32 -114 -18 10 66 159 11 -16 -152 38 -48 81 -77 -35 -7 1 -34 -78 17 -66
14073 -66 72 -68 -83 3 -176 -10 -28 22 -101 16 103 -8 -44 11 -74 -42 -101 25 -118 -105 -51 28 39 -80 45
14098 45 22 26 9 44 110 34 -60 -11 24 68 -63 -73 -99 74 -45 9 -92 -77 4 -74 76 3 -41 -49 10 56 51 9 -49
14127 -49 -24 32 59 -4 2 -30 -71 21 13 95 36 -20 -10 14 39 37 22 -38 10 19 -24 -45 -12 0 36 -87 67 52 -63 -126
14157 -126 -20 -70 38 33 -46 -82 -41 -82 -8 -81 2 -25 -17 -107 -123 -8 -38 -36 142 -52 24 14 -1 -101 13 80 -37
14184 -37 -50 27 -13 -15 -18 109 20 24 17 -4 55 -6 -48 -43 43 49 11 120 -32 14 1 28 75 -39 92 -112 -31 -227 87
14213 87 76 -64 -47 9 1 -113 -148 -8 -2 -62 82 65 18 17 -109 -6 -109 25 -4 -48 -63 20 38 97 81 39 30 -78
14241 -78 7 94 95 53 166 -22 -30 -103 -57 -45 5 -16 124 -40 -40 17 50 -29 -17 48 33 -107 -146 14 30 -39 -14 2
14269 2 -44 -104 -11 24 52 7 39 -58 30 163 70 78 -49 -64 30 -29 -47 34 -41 -36 33 -36 -55 51 -69 -114 89 125 -76
14298 -76 -7 -32 41 -129 -48 -78 74 -30 -49 -15 -33 -101 2 67 -69 -28 -30 -66 46 -11 -28 -76 -9 34 65 -12 24
14325 24 -12 -79 98 107 38 4 67 -47 125 -18 15 -3 119 -2 110 111 -11 -20 29 -11 90 -17 20 -106 -133 -63
14351 -63 3 -55 -37 -26 24 -25 4 -8 23 -38 29 -54 -68 104 -38 -48 -9 31 21 17 16 42 74 35 -6 74 143 -57 -159
14380 -159 -36 -32 30 -11 -41 -51 24 119 -111 -29 80 53 -113 -41 -39 -30 -40 -10 -66 -40 7 -109 -58 -47 30 -214 -47
14407 -47 3 14 -22 -20 -83 -65 23 10 -97 -49 74 -51 26 -38 40 63 -20 23 76 0 20 -129 25 -61 -58 -41 86 19
14435 19 -7 82 18 66 -34 -99 -54 121 48 -68 -4 -15 7 -25 -50 -55 19 36 -21 -83 -107 -10 -16 -26 11 4 13 121 -62
14464 -62 -92 55 39 -15 -56 87 113 118 -93 -34 21 10 26 -76 9 -10 -4 -50 29 -3 -45 42 -54 -15 -4 -44 74 -62
14492 -62 -30 -45 -75 -91 -24 31 58 -20 51 80 -3 -8 135 -35 8 19 -97 -41 -66 -62 57 18 13 102 71 14 -8 -82 56
14521 56 84 160 -28 -55 0 61 -90 32 -49 -5 -51 -86 -22 8 101 -66 -127 -78 -18 -5 12 -48 -10 91 -9 22 -104
14548 -104 -20 -32 -45 -77 -65 18 50 15 49 27 -72 9 -108 12 -91 10 35 -20 27 35 12 -5 58 -26 55 40 -3 55
14576 55 -97 -10 -30 -17 21 -140 33 94 103 24 -30 -18 -111 -8 59 -25 -8 30 -23 -46 5 -28 -93 50 46 -14 3 43
14604 43 -8 -22 22 -34 -44 103 -53 -30 79 100 11 11 2 -15 69 32 -9 72 -20 -29 -72 79 -3 -57 -63 198 19 -36 26
14633 26 -25 13 -37 42 75 22 -51 39 -24 -62 -109 109 59 -4 -29 -101 -5 45 16 34 -105 28 -52 42 89 -65 -9 -24
14661 -24 74 -47 -63 -51 -19 92 -36 57 -4 -54 106 21 -51 -98 -28 117 -71 -82 1 82 82 -56 -6 -79 10 -33 28
14688 28 92 38 73 135 50 -9 -61 67 36 118 -13 -57 -73 -42 43 -74 -83 -105 -51 81 153 90 -1 -79 -111 -29 22 45
14716 45 -45 114 131 0 50 -86 -61 63 -24 -28 -41 89 -32 -93 29 -46 -19 28 -62 -4 -64 116 8 -76 22 131
14742 131 -10 -46 -78 -60 0 22 -27 7 -42 -79 -16 -17 26 102 -80 -22 43 29 -103 -24 -2 28 102 83 25 3 39 -67
14770 -67 -44 -33 -17 5 -18 -21 64 36 65 3 -49 14 -7 -9 -142 6 22 -49 66 -84 113 42 -94 18 14 171 117
14797 117 32 14 51 -6 -2 -37 54 -138 -29 15 53 124 105 109 94 -45 -1 23 -64 82 -36 -44 -72 -186 1 86 -26
14824 -26 -102 -13 -131 -41 -108 -25 29 -18 -99 -118 67 -97 -33 43 -17 -18 -65 79 33 39 -59 67 14 14 40 24 83 0 140
14853 140 53 -6 23 -29 16 95 20 -47 -17 -52 4 24 -20 30 9 -19 4 -1 61 -13 -4 34 -14 20 72 6 -10 26 6 54
14883 54 -50 14 -39 20 82 28 42 -125 -122 20 -70 -1 -13 88 101 6 -29 98 94 -26 -56 84 -8 -53 -3 -23 18
14910 18 37 26 -119 -21 -30 -68 -43 -1 -9 -20 -49 -8 -69 -7 32 -35 -17 34 -9 62 -38 -49 43 -5 -28 35 116 -22 -4
14939 -4 -17 62 0 -2 102 -78 -20 72 30 19 64 -52 -124 -49 58 -5 118 -2 -95 33 30 69 -8 85 138 72 -38
14966 -38 6 58 -58 45 -7 73 5 46 158 47 -15 -34 40 35 6 -2 -22 -125 -34 71 -1 -12 98 -170 -20 -1
14992 -1 -77 -116 7 78 94 -50 -10 -11 4 -86 -32 82 65 -49 7 -14 -85 39 -101 -50 -51 67 -121 -17 29 -2 -67
15019 -67 -19 5 -11 -18 -15 -72 -3 -43 -85 -121 -38 60 128 -61 0 -92 71 108 170 -78 -25 -60 8 -42 -4 8 61 -145 57
15048 57 79 -24 108 -63 -40 -2 72 -16 83 -16 80 -16 30 36 -47 52 -55 113 -64 1 126 96 -48 6 -7 -34
15074 -34 -41 71 -25 50 -89 23 -29 -52 7 -143 18 88 91 -9 20 90 -23 114 44 -1 -107 72 18 7 13 -100
15100 -100 11 -7 -41 30 -70 -96 -16 104 -12 21 -36 -138 -10 -43 22 23 -86 30 6 -9 -88 -72 -33 16 82 -57
15126 -57 -23 -78 93 11 37 -115 19 33 53 2 118 -38 -7 -36 31 -5 -3 30 -10 -4 53 73 -70 53 71 81 -60
15153 -60 84 26 -45 -10 3 -7 16 -92 -88 -89 28 -18 10 -30 -59 -49 40 -104 -74 81 -62 2 -60 -195 -73 -64 -38
15180 -38 0 17 63 -36 -80 49 7 -62 46 6 -70 19 38 18 -87 -8 60 58 -28 31 -3 -83 -103 0 -97 15 -126
15207 -126 -155 -29 -47 27 55 -54 39 -20 60 -9 -46 -131 -44 19 -1 -136 9 -32 -125 -13 56 -66 -15 -3 31 81
15233 81 -31 -14 -70 -107 3 84 20 115 -3 82 20 37 101 50 -116 110 94 41 120 9 -13 -75 25 48 -100 -18
15259 -18 -83 16 -30 45 -65 -7 66 -17 34 24 -37 12 -104 -28 93 58 -85 -3 -35 0 26 176 55 -27 -10 38 -103
15286 -103 34 -119 -3 154 -3 113 69 -139 -42 24 -67 -41 58 -17 95 25 68 -44 18 -19 107 -2 35 -19
15310 -19 -51 -49 106 -81 41 18 -137 25 47 -57 2 102 42 52 64 -81 -61 -149 -50 -18 -45 -17 75 33 -10 94
15336 94 -79 -85 145 77 -72 -9 -18 48 -49 -121 -16 -35 -32 -60 -31 0 -38 65 63 -81 -19 0 -49 -11 -4 -52 45 -90 -8
15365 -8 48 81 -100 -84 7 81 -20 27 80 53 107 -49 -5 51 59 20 -31 -72 -14 74 10 55 -52 -54 -27 81 -58 -59 -72
15394 -72 42 55 78 17 -84 121 -14 139 81 50 66 -44 -120 -72 14 -32 74 12 -89 -33 131 44 18 50 1
15419 1 5 -112 -169 74 75 -15 -80 138 74 85 -10 -9 -13 -6 -9 101 -30 -32 6 10 35 -2 47 -21 85 54 50 37 3 -13 -103 90
15451 90 67 66 -42 -41 93 56 -118 -139 -23 19 1 -41 -23 -81 -37 -77 11 -5 33 -36 -147 -62 72 49 -60 -35 15
15478 15 -45 34 -67 2 -9 91 -10 -13 94 -61 -60 52 122 64 -81 -26 86 -8 -32 -14 -41 -5 -16 -18 -150 85
15504 85 -8 -93 111 8 23 87 95 -25 5 65 39 -27 23 22 -15 21 88 98 -17 -15 115 38 19 56 -62 -52 -41 136
15532 136 101 -7 76 -68 -70 -25 70 73 -52 41 -18 -7 -40 24 -44 -137 17 -11 31 47 -72 7 -5 8 -30 84 48
15559 48 -67 94 -54 29 -41 2 -79 -36 11 29 46 16 24 -32 -71 -23 -7 50 70 16 151 -47 7 -50 27 105 12 -54
15587 -54 -95 12 14 -1 -43 -36 11 24 7 90 -10 84 25 -14 -1 -5 19 -20 68 -75 -12 -34 -86 41 -57 21 70 86 63
15616 63 29 77 94 111 -62 -34 -31 6 -41 -69 1 36 -17 24 -13 -146 -18 -76 209 -54 -29 75 -53 56 143 95
15642 95 2 20 -59 7 0 -117 11 44 -41 58 95 46 48 43 -26 -43 2 158 -88 7 -13 2 127 -37 124 46 -8 -13
15670 -13 -5 -11 51 61 -10 75 6 23 19 31 64 72 -19 -100 -69 -10 -102 -227 -78 28 61 -25 85 46 -67 -93 -35 -18 31
15699 31 -65 7 -89 14 20 42 4 10 -30 -30 68 48 -203 29 -2 -23 21 141 -86 36 -28 -68 -43 -120 -60 -145 -25 28
15727 28 107 -47 -96 -85 -3 -34 -15 57 -82 31 -93 -12 38 176 -42 -30 -27 -112 -106 9 55 -92 -44 -27 -2 85 -62
15754 -62 -62 -30 -16 25 -66 45 -44 -98 59 60 25 -109 20 154 38 -2 17 -23 -44 8 -33 173 -76 -39 -42 -121 -66
15781 -66 1 2 31 24 14 10 18 -106 143 -119 -79 10 -55 19 -63 -58 -16 102 22 10 71 -46 -6 -44 65 -19 -81 5 128
15810 128 37 -30 7 72 32 -17 175 33 80 107 37 -88 74 -56 21 -26 -4 -47 35 37 -58 51 20 205 -133 76
15836 76 41 57 -17 28 126 58 -126 -40 64 -116 70 -70 115 0 25 37 92 57 -8 -80 13 40 13 36 84 138
15862 138 -25 128 -15 38 -1 0 52 71 50 59 9 -4 13 -2 -117 86 -17 24 33 4 -25 71 9 10 -151 -136 -136 62
15890 62 32 -128 -12 29 60 20 146 -101 19 13 -68 48 -136 17 70 57 100 -31 8 114 72 88 -44 83
15914 83 0 -81 17 89 0 -8 -97 -43 -121 31 41 -2 3 -70 -57 21 -46 -51 48 -5 -123 25 -81 66 22 18 -35 -10 -34
15943 -34 -73 -35 -15 2 32 -5 19 75 35 2 25 43 -42 -25 35 -73 -67 -72 22 3 -38 -108 28 31 4 192 -33 -36 103
15972 103 41 -16 62 96 -9 67 95 77 16 64 -15 64 -34 -16 15 34 -31 -48 30 41 -47 -25 70 -39 -45 -131 46 8
16000 8 88 -59 2 1 21 -54 -23 -9 49 -4 32 -1 67 94 -34 56 6 4 0 28 88 -22 -53 -61 -55 17 20 -31 85 128 -51
16031 -51 36 -34 -26 -31 -32 15 95 -10 -23 -16 -63 -88 7 46 -18 -60 53 35 6 34 -12 -115 56 32 -73 23 74 -86 12
16060 12 21 24 -45 -43 -54 6 86 -24 -69 -30 29 14 -95 -57 -58 -2 -30 53 72 -83 4 21 -80 -7 23 115 -10 -126 -98
16089 -98 54 132 87 17 -126 130 124 -19 106 -48 86 -95 132 -50 76 57 -45 76 -46 18 -7 -17 47
16112 47 26 6 -26 -14 -49 63 1 -108 51 -38 -27 45 25 -7 7 -25 -48 -163 70 -54 65 20 8 105 -32 62
16138 62 -72 86 -33 -2 21 -32 -17 -8 -117 -155 -70 -4 -1 -65 22 88 -3 -54 19 63 9 -63 107 83 -16 6 9 -114
16166 -114 -116 38 -7 -136 -30 58 -34 -108 -32 -32 -22 39 -23 21 -88 -104 -138 36 22 -24 48 -46 -26 59 -2 3 91 -12
16194 -12 -60 -72 -6 -139 -1 -99 91 -53 -148 -43 -72 38 -18 23 -6 0 50 -85 -12 -67 24 81 29 65 -102 27
16220 27 -32 -2 89 7 8 19 92 -9 -138 95 -48 3 110 -18 81 38 -19 -7 -3 7 -41 22 -96 18 64 113 -35
16247 -35 -56 -21 88 34 -20 -77 -59 36 -126 -20 44 -74 23 17 -13 13 37 3 -48 34 58 -24 -57 -17 -15 43 5 12 -47
16276 -47 38 -7 -90 -79 17 -42 22 -45 68 -17 -1 18 49 91 -73 59 71 80 69 65 106 5 -13 -29 -41 -52 15 -32 -17
16305 -17 -101 -50 -45 -57 -73 -33 16 4 -50 34 75 -21 -15 -35 -20 -28 -2 -31 43 -29 -20 69 55 10 43 -84 3 42 -29 -15 39
16336 39 35 -40 91 -107 -42 -17 -21 -2 -45 10 -50 -120 -98 140 -2 40 -113 23 23 8 -111 23 0 -99 18 -15 64
16363 64 -78 -66 -98 13 45 -13 6 -44 -123 -55 -49 107 22 145 27 132 7 27 63 19
16383A9
$$ Imaginary data points
##PAGE= N=2
##DATA TABLE= (X++(I..I)), XYDATA
0 0 0 0 0 0 0 0 0 0 0 0 0 0 0 0 0 0 -4 32 -32 32 -32 32 -64 64 -64 65 -96 96 -128 129 -160 192 -213 225 -257
35 -257 290 -341 384 -417 480 -520 577 -641 713 -799 873 -962 1064 -1175 1294 -1423 1570
52 1570 -1730 1908 -2109 2337 -2595 2891 -3235 3638 -4127 4726 -5481 6472 -7823 9804
66 9804 -12981 18917 -33905 156921 191216 -168689 -205175 -39932 156522 120472 2476
77 2476 -75675 -34250 -10662 -17409 2541 90988 107572 17550 -88336 -78356 18672 109030 86627
90 86627 -18546 -91959 -52929 23725 58205 40102 7457 -19688 -19709 -7113 1818 16270 39068
103 39068 20770 -38877 -62239 -8729 52667 49851 -9322 -49387 -18842 39739 35041 -23303
115 -23303 -36950 9007 21285 -29536 -61620 -18400 47786 47944 -26504 -75125 -16322 75010
127 75010 63675 -34146 -78710 -21407 40293 19305 -50865 -67513 379 57093 15243 -62727
139 -62727 -56276 24395 67142 24731 -42121 -58817 -16638 24573 15139 -18258 -22885 -8088 -11424
152 -11424 -22655 -11811 14635 25184 3872 -33649 -43845 -6336 33000 22773 -17751 -34205
164 -34205 -14375 11243 13008 -7231 -15727 5036 18234 -8536 -38356 -22252 18969 28573 -3010
177 -3010 -31007 -17826 17474 24765 -1836 -12115 13733 25939 -5718 -36856 -19828 23649
189 23649 34842 -3615 -42224 -26782 23350 40464 9306 -15740 -2370 19551 16046 -4679
201 -4679 -10352 8533 22389 4472 -23466 -18963 13286 30494 14040 -11996 -17073 4233 26400
214 26400 22192 487 -8450 1006 9311 8466 6306 7548 8488 1897 -10777 -9906 13037 29971 12668
229 12668 -19963 -25892 3045 34197 31859 -1744 -24464 -8488 19663 22535 6307 -2670 -1424
242 -1424 -2908 -7518 -5544 7733 18494 6761 -18197 -19865 8682 28878 16928 -7034 -14930
255 -14930 -2612 12302 10648 -4677 -9785 -564 1459 -7701 -9144 736 7881 4600 -5839 -12739
269 -12739 -3528 13859 13435 -4925 -14276 -5837 3933 5069 -1801 -10336 -9482 -935 -1224 -9297 -6327
284 -6327 4376 2968 -7275 -10034 -3296 5886 8993 -1766 -14536 -9177 5338 4492 -7859 -11698
298 -11698 -6636 -2048 -764 -5903 -10891 -3492 7523 2715 -8877 -6731 2845 4805 612 -4394
312 -4394 -7663 -3445 1616 -4010 -10562 -2978 4340 -2799 -10179 -5784 2263 7281 5624 -4436 -9878
327 -9878 735 10837 4426 -5216 -5108 -2966 -1616 1054 -514 -4397 -1381 2346 -2820 -4187 4864
342 4864 9041 3061 -1353 -1482 647 7155 8811 -1593 -8199 -365 5284 504 -2335 137 696
357 696 1676 3330 694 976 8155 8316 -518 -1849 5201 6411 3265 1343 -2250 -3154 3184 5404
373 5404 -1266 -3085 2570 3957 1930 3706 4124 2885 4956 5087 -2 433 6370 3981 -3225 -3163
389 -3163 1103 1706 1966 804 -3507 -1934 5422 6104 808 990 3146 1346 1497 4026 1887 -1113
405 -1113 -80 -1564 -4884 -1361 3444 765 -3127 -2727 -1902 687 5598 4375 -1953 -1975 2213 735
421 735 -2002 226 1052 -1747 -3693 -5017 -5454 -622 3721 -440 -5077 -2602 291 -405 1268 3186
437 3186 645 -2280 -2858 -3410 -2309 1539 589 -4829 -6233 -3946 -3407 -1840 1906 1222 -2826 -3387 -1404
454 -1404 694 3434 3504 -1708 -4986 -3123 -1628 -1718 -508 -910 -5143 -6828 -3044 964 2977 2398 -1573
471 -1573 -4012 -452 3586 2532 989 820 -2342 -6635 -5288 554 5096 3531 -4194 -10250 -5161
486 -5161 5826 9060 3476 -1929 -3785 -3456 126 4826 7067 4769 -2109 -8638 -6847 2899 8264
501 8264 4194 -1827 -5298 -6515 -3660 4412 10842 9357 395 -7872 -5932 5579 12408 6441 -2619
516 -2619 -5352 -4940 -4313 -348 5465 6780 1982 -5315 -6728 2020 11502 10338 2319 -1984 -2749 -2785
532 -2785 646 5573 5220 -1482 -7632 -6713 1755 9080 5709 -2809 -2737 3458 3786 -479 21 3970 3955
549 3955 -1108 -6140 -3785 5454 9501 1056 -8015 -5762 966 3611 3336 691 -4179 -5642 -1240
564 -1240 3874 6834 6342 414 -5046 -2529 2068 441 -1176 1040 -661 -7340 -10354 -4443 6195
579 6195 12426 5981 -7848 -10415 1558 10148 6751 55 -4495 -7602 -7275 -3191 257 2431 2814
594 2814 -2036 -6649 -3776 2131 4099 5922 6798 -1236 -12421 -11376 1185 10980 8293 -5152 -15317
609 -15317 -8139 7869 10700 142 -5493 -2575 -1821 -3763 -3531 -297 4750 6233 -1063 -8024 -3325
624 -3325 6164 7785 3513 -2301 -9472 -11195 -1849 7507 5006 -3650 -8471 -5287 5431 12531 6627
639 6627 -3230 -2601 1772 -932 -3571 -172 2963 -217 -6003 -9784 -4696 8510 13619 3853 -6017
654 -6017 -5544 -179 5461 10038 6506 -6036 -13352 -7833 3567 10646 7570 -3801 -9069 -1183 6280
669 6280 3433 651 3764 2943 -4491 -8835 -4252 6516 13806 7394 -7216 -11004 108 8689 7309
684 7309 1955 -4513 -9302 -6618 1541 6087 5222 1923 -2130 -2029 3904 6302 2443 712 1808 -1796
700 -1796 -7127 -5557 138 3048 1825 -2259 -4319 287 6674 5651 823 693 1652 -497 -2023 -1099
716 -1099 -981 -1370 -1006 -1867 -1948 447 1224 26 1580 3792 49 -4341 -2193 2696 3363 -317 -4039
733 -4039 -4189 1334 5144 1298 -3567 -1792 822 -879 -2998 -1869 262 750 -837 -3196 -1594 3867
749 3867 5264 1278 -1059 -625 -1346 -2404 -783 609 -1229 -3986 -5344 -3035 2159 4791 1596 -1117
765 -1117 164 1264 261 1103 2378 677 -3315 -5154 -3377 375 2057 -691 -3217 -909 1745
780 1745 752 96 2016 2590 -39 -2205 -1553 761 2039 25 -2507 -1007 1376 -194 -2640 -845
796 -845 1999 1378 -1460 -2423 -353 2673 3115 291 -982 1219 2081 169 -328 638 -116 -1817 -2109
813 -2109 -1440 194 1319 4 -1289 449 2781 2310 1257 1652 1024 -83 96 309 -671 -707 -1033 -1945
831 -1945 -1090 917 759 -326 898 2145 688 434 1743 1784 975 475 -1150 -1300 906 1251 -1481
848 -1481 -2245 -151 54 -545 372 951 238 236 553 430 1829 3067 459 -2327 -759 1292 176 -649
866 -649 -972 -2213 -1869 198 419 -228 920 958 -618 230 2626 1732 -241 144 -441 -1524 -368 308
884 308 -1422 -1971 -611 -965 -1345 674 974 -613 218 1892 360 -480 1214 900 -754 -569 -590 -2055
902 -2055 -1257 298 -1205 -2344 -212 390 -787 262 1472 -86 87 1826 477 -963 515 635
918 635 -1638 -1203 -138 -1254 -1806 -69 -622 -1543 726 1532 -509 -405 1773 1181 213 1368 357
935 357 -1539 -407 693 -1260 -1574 -144 -938 -1938 30 1000 -360 540 1898 453 -375 1712 1551
952 1551 -266 247 512 -1485 -1404 160 -860 -1156 516 196 -1881 -423 2088 1356 861 1520 185
969 185 -555 1464 1565 -564 -632 154 -1467 -1912 230 416 -700 19 482 -746 432 2781 1735 108
987 108 661 511 -451 943 1314 -1047 -1903 -511 -610 -1019 456 981 -570 -472 607 556 1219 2676 1226
1006 1226 -1256 -627 819 315 83 105 -1437 -1961 -662 -543 -749 1054 2018 -518 -1834 39 2041
1023 2041 2752 2097 -361 -2355 -720 1174 -102 -1346 -390 -789 -1972 -1600 -427 505 2027 2027 -274
1040 -274 -1240 395 1394 1289 1362 -8 -2743 -2779 -516 502 129 -479 -1280 -1460 -67 1114 656 1217
1058 1217 1592 -219 -1785 -374 1248 1073 233 -844 -1925 -1514 -383 184 365 380 -1353 -2848 -516
1075 -516 2839 2632 -140 -1603 -810 1599 2597 221 -1812 -436 442 -1523 -3107 -1133 1517 1422 -1033
1092 -1033 -2997 -1196 3395 5062 1967 -1290 -1344 -416 528 1284 140 -2190 -2826 -1838 -720 604 1726
1109 1726 1344 742 806 -247 -1069 1275 3806 1849 -2405 -3945 -1794 1615 3130 565 -2295 -1557
1125 -1557 268 -43 -186 1436 1653 -695 -1823 -770 946 2456 2154 -3 -477 441 -365 -1739 486
1142 486 2387 -687 -4367 -3537 302 3296 2709 -875 -2223 1803 4973 1952 -1410 -467 855 -416
1158 -416 -2317 -3252 -2155 811 1797 -920 -1939 1105 2988 2650 2275 585 -2281 -1816 1499 1578 -1144
1175 -1144 -2695 -2305 -347 1981 1088 -1862 -663 3093 1713 -2919 -2426 1520 2757 889 -2093 -3257
1191 -3257 112 3722 1830 -1703 -588 959 -1475 -2463 207 1351 -624 -2339 -2133 234 3175
1206 3175 2439 -629 522 3576 1205 -3657 -2523 1680 1439 -2267 -4942 -3977 880 4326 1604 -1575
1222 -1575 478 2944 1298 208 1182 200 -1982 -1853 -1210 -1577 -947 -18 -20 905 1073 -1321 -1365 3406
1240 3406 4332 -1258 -4475 -1128 2457 2117 -864 -2947 -1022 2560 1624 -2450 -1496 2658 1529 -2983
1256 -2983 -2901 543 2005 1070 -1013 -1381 1446 3275 663 -1128 1389 1904 -1993 -3623 -949 807
1272 807 -189 -1718 -2333 -344 2952 2939 195 561 2386 1137 -1157 -547 149 -1009 -1606 -1441 -1360 -603
1290 -603 707 598 727 1988 772 -1027 445 2734 1075 -1999 -1641 511 926 -115 -1692 -1228
1306 -1228 1596 1874 -1637 -2656 1098 2848 0 -2371 -931 1515 2068 311 -1485 -219 2467
1321 2467 1419 -2081 -1627 926 743 -1615 -2295 -1097 555 1099 169 -473 1186 2253 774 -329
1337 -329 667 680 -820 -1310 -1105 -1040 -789 -465 -540 -125 577 260 313 1569 1531 -186 -758 665 843 -451
1357 -451 -1244 -691 206 313 -916 -1647 170 1711 222 -1756 -464 1659 1334 -168 -857 232 1738
1374 1738 892 -1379 -1522 724 1122 -1202 -2080 -616 553 195 -702 -1028 343 1861 1011 -336 128
1391 128 1259 734 -153 -383 -657 -759 -476 -651 -1053 -514 12 -91 313 843 342 223 1239 1212 -334
1410 -334 -363 423 391 -501 -855 -979 -445 386 -134 -1289 -474 1334 716 -475 131 901 788 584 -78 -509
1430 -509 284 840 -698 -1631 -417 428 -544 -687 -316 -77 396 1013 185 -305 1056 1326 -147 -384 286
1449 286 -60 -272 -142 -906 -1360 -82 586 -606 -628 647 563 261 861 474 -65 710 925 -611 -966
1468 -966 344 39 -904 -543 -497 -819 180 689 -438 -497 1145 1059 82 311 764 -26 271 389 -735 -1166
1488 -1166 328 108 -1232 -776 169 -196 -218 529 173 -94 1068 878 -245 140 790 -171 -809 -30 -278
1507 -278 -959 -223 -72 -872 -277 736 191 -267 817 801 -18 498 720 -143 -85 565 -490 -1383 -227
1526 -227 105 -838 -623 35 -361 -188 1012 509 -269 749 1009 -138 -7 593 -60 -424 3 -537 -1385
1545 -1385 -373 489 -380 -541 324 210 -70 982 788 10 219 658 -259 -482 322 -155 -896 -467 -288
1564 -288 -740 -451 385 -47 -196 647 391 -70 735 1193 206 -282 143 -315 -592 69 -94 -983 -715 -147
1584 -147 -354 -76 669 361 -260 456 899 394 328 621 32 -249 36 -339 -917 -125 87 -784 -917 144
1604 144 309 367 745 376 -54 417 1034 274 135 25 -533 -937 -270 -63 -709 -609 -24 -191 -139 249 234
1625 234 543 1213 536 -671 -531 959 647 -250 -710 -625 -380 270 -84 -562 -118 212 -402 -379 563 806
1645 806 54 219 549 468 181 -164 12 399 298 -1116 -1906 -429 938 120 -1087 -572 511 1141 909
1664 909 233 108 869 428 -732 -898 83 -215 -965 -762 -357 -380 -154 339 831 881 229 -558 192 1571
1684 1571 844 -1336 -1477 36 555 -161 -983 -683 555 770 -392 -1088 127 1279 83 -902 -303
1701 -303 510 585 525 328 254 360 -134 -640 -7 608 -766 -2056 -969 660 460 -319 -216 837 1541
1720 1541 1232 -102 -278 1187 913 -1269 -2193 -825 6 -401 -478 -434 -36 754 1049 733 1056 1342 -90
1739 -90 -863 227 572 -1019 -1507 -375 325 109 -576 -447 700 1979 657 -1625 -831 1424 1020 -990
1757 -990 -1261 23 902 683 -25 -401 721 1245 -492 -1688 -253 385 -972 -1274 -113 478 401 578
1775 578 657 1135 1563 344 -1230 -255 961 -856 -2453 -1410 -63 -19 -332 182 605 1596 1417 47
1793 47 -105 1178 748 -1316 -1394 -223 -662 -1318 -721 111 534 446 -152 -61 1541 1652 -614 -1628 402
1812 402 1150 -763 -1580 -431 783 775 -101 -950 173 1787 481 -1951 -1268 646 266 -865 -604 462
1830 462 808 964 377 268 1009 882 -825 -1460 -374 -214 -1574 -1120 89 258 250 471 807 1276 1549
1849 1549 474 -632 157 590 -939 -1734 -658 -197 -688 -619 120 564 1027 654 -100 476 1390 427 -1102
1868 -1102 -483 573 -151 -992 -704 189 686 440 -307 -469 881 1104 -519 -1319 108 520 -31 -365
1886 -365 -14 603 981 621 -474 -408 501 128 -997 -1091 -403 -359 -182 131 302 645 968 798 359 639
1906 639 525 -525 -728 -312 -567 -1059 -759 -208 -8 -21 210 481 874 1043 266 -148 474 633 -468 -744
1926 -744 -312 13 -249 -409 -610 137 766 224 -564 -53 931 429 -499 -222 334 501 139 -581 -311 299
1946 299 635 -494 -1043 -175 348 -219 -621 -345 44 508 370 102 281 867 532 -172 -125 -78 -426 -452 -440
1967 -440 -504 -555 -194 20 204 518 457 221 451 904 213 -313 67 259 -387 -603 -675 -220 -112 -179 -513 -317
1989 -317 723 614 -137 -93 544 497 90 -59 -227 101 410 -218 -965 -424 295 -161 -588 -203 172 108 365
2010 365 197 -68 416 744 15 -242 186 197 -259 -391 -340 -544 -379 119 -365 -425 312 465 66 523 573
2031 573 300 306 534 38 -539 51 151 -491 -514 -284 -453 -120 244 -57 -464 532 832 49 -44 537 397
2052 397 10 109 -239 -537 -2 131 -832 -781 110 193 -187 74 102 130 534 871 -39 -67 665 381 -528 -318
2074 -318 -116 -433 -378 60 -504 -315 327 302 -240 300 748 196 174 534 230 -62 270 111 -762 -355 235
2095 235 -285 -628 -133 83 -140 215 295 -117 299 804 153 -382 98 232 -165 -203 -218 -737 -212 305 -130
2116 -130 -748 161 539 136 97 382 142 208 604 65 -471 -90 274 -439 -566 -163 -329 -386 91 122 -384
2137 -384 148 553 201 151 607 478 -45 69 -27 -353 -142 97 -494 -635 126 125 -272 122 156 98 254 523
2159 523 33 -21 779 537 -297 -352 -99 -103 -15 -212 -614 -492 235 410 -220 8 584 448 343 265 10 29
2181 29 341 124 -559 -299 -39 -490 -390 -111 -79 -235 -155 331 308 338 309 43 109 455 119 -517 -244 77
2203 77 -153 -335 -183 -229 -211 242 -54 -265 330 451 89 162 623 37 -154 48 388 -46 -386 -585 -521 10
2225 10 175 -331 -725 198 539 118 -170 308 683 518 -18 -408 -168 115 16 -609 -694 -254 -162 -172 112 361
2247 361 274 109 174 424 632 378 -428 -316 332 85 -672 -545 119 268 -109 -580 -324 311 726 -90 -554
2268 -554 129 607 220 -97 99 217 146 -40 -226 -205 28 -100 -688 -256 275 -210 -346 271 748 279 109
2289 109 145 464 569 307 -547 -554 -117 -84 -724 -728 112 206 179 321 313 386 806 339 -146 33 225 -544 -686 -133
2313 -133 -37 -523 -307 112 349 431 103 -393 -34 643 305 -656 -362 579 341 -117 -326 -70 278 470 -200
2334 -200 -925 -134 504 -179 -699 -59 287 269 248 230 396 416 409 -182 -199 238 -233 -974 -654 168 -335 -569
2356 -569 177 496 600 547 87 142 799 754 -655 -825 73 2 -982 -853 78 270 179 153 39 565 873 1
2378 1 -673 139 631 -338 -877 58 612 191 -169 -433 171 788 236 -977 -765 563 343 -743 -561 480
2398 480 522 404 44 72 429 646 -277 -805 -331 121 -719 -762 69 229 -187 60 630 662 697 347 -41 274
2420 274 624 -480 -1218 -429 291 -380 -708 -187 552 529 319 -44 103 742 503 -656 -552 384 96 -699
2440 -699 -457 227 394 159 -351 -371 416 608 -346 -810 101 715 70 -551 43 523 496 169 -347 -96 321
2461 321 148 -760 -736 173 -115 -598 -198 268 377 376 252 296 557 371 -258 -390 128 -108 -888 -755 31
2482 31 123 -209 -90 141 750 593 231 -192 389 642 -345 -715 -187 306 -117 -536 -367 273 422 110 -365
2503 -365 54 661 306 -518 -231 545 386 -43 -278 45 451 251 -356 -618 84 35 -341 -618 -44 308
2523 308 54 57 119 258 425 239 -110 283 148 -122 -582 -39 -40 -417 -478 35 237 86 249 105 380 544
2545 544 138 -180 -10 440 -104 -602 -353 -68 -26 -266 -360 -136 539 219 -223 -104 334 404 -166 -185 124
2566 124 210 110 -283 -385 -159 344 -281 -550 -160 130 34 -157 18 265 256 293 224 -226 130 206 -207 -126 -57
2589 -57 -239 -375 -93 11 -186 -99 257 86 -17 334 249 5 308 157 -433 -102 270 13 -410 -203 -158
2610 -158 -244 -68 39 -126 230 476 58 -196 342 389 122 -55 -58 -112 -73 44 -340 -457 178 66 -344 -121
2632 -121 304 77 111 367 173 -44 335 354 -244 -207 57 -21 -149 -91 -107 -419 -58 308 -165 -60 343 254
2654 254 26 253 116 -184 54 13 -409 -407 -36 -185 -479 -50 -14 -185 87 237 -5 94 395 187 -18 74
2676 74 390 -77 -229 -96 -215 -162 128 -127 -432 -74 298 -7 -77 225 378 89 321 221 -262 -167 318
2697 318 -134 -386 -49 -74 -229 -52 -48 -254 73 327 67 -52 304 148 -63 45 202 -131 -127 93 -150 -385
2719 -385 -240 -47 -292 -59 282 74 18 371 209 18 290 474 -196 -263 78 -72 -242 -162 -164 -312 151 36
2741 36 -119 41 421 392 -71 86 80 85 212 -7 -291 -288 46 -70 -413 -150 -131 -163 -38 198 83 -56 439
2764 439 322 109 123 218 94 -33 224 -296 -347 -142 31 -151 -109 -117 -59 195 195 162 4 172 270 82 -140 83
2788 83 -21 -260 -117 -135 -207 -43 -184 -177 107 215 -78 -84 251 410 287 -14 73 -48 76 -54 -544 -445 55
2811 55 44 -347 -149 74 141 38 303 -4 205 302 -38 -131 -27 -9 -445 -302 87 29 -294 -260 129 180 221
2834 221 -26 -233 270 522 53 -383 61 333 13 -223 -13 88 51 8 -242 -256 166 -35 -309 7 486
2855 486 172 -22 120 488 475 14 -227 -294 78 35 -593 -583 169 140 -145 -131 240 412 446 99 -91 50
2877 50 267 -189 -548 -230 52 -245 -465 -130 215 111 -6 91 175 541 175 -310 -184 447 234 -432 -187
2898 -187 227 225 -6 -220 -241 104 277 -262 -465 -98 260 -69 -175 276 472 155 72 128 244 208 -56 -551
2920 -551 -336 65 -285 -645 -70 462 208 44 24 527 608 308 -370 -361 302 120 -784 -663 98 195 -370 -156
2942 -156 83 512 467 -96 -182 422 514 -221 -667 190 442 -179 -611 -38 279 249 -14 -456 -64 492 186
2963 186 -759 -246 432 283 -287 -33 460 399 144 -14 -213 167 140 -564 -447 193 109 -588 -189 600 625
2984 625 90 45 210 558 249 -338 -668 35 252 -472 -852 -8 540 35 -164 112 457 527 194 -320 -189
3005 -189 356 81 -721 -390 508 3 -419 -314 101 319 120 -287 -200 340 398 -306 -313 342 471 -3 -213
3026 -213 47 216 63 -34 -319 -202 34 -211 -421 -41 284 9 -57 355 491 253 107 -4 54 69 -294
3047 -294 -580 -279 206 -125 -573 -141 230 441 155 62 81 357 299 -274 -409 79 226 -258 -391 -91 201
3068 201 -28 -247 -131 64 231 64 -232 -41 385 202 -312 -95 213 143 42 -198 -141 117 100 -220 -224 66
3090 66 102 -174 -8 208 118 172 198 284 98 -40 -87 -172 41 38 -355 -332 64 95 -76 43 223 364 336 67
3114 67 -131 73 300 -76 -425 -250 69 -65 -109 -165 16 102 131 -132 -103 262 373 128 -164 57 118 -69
3136 -69 -77 -206 -143 -32 -13 -312 -204 95 -31 -137 17 139 -21 266 138 -64 96 119 12 -69 0 -153 -288
3159 -288 38 76 -216 -308 166 238 110 51 237 131 216 273 -296 -111 250 -4 -266 -297 -11 -47 -210 -69 -8
3182 -8 42 404 78 -185 138 306 84 -121 -53 -69 -78 98 -67 -255 -18 107 -65 -257 191 155 38 116 79
3205 79 -83 212 162 -146 -277 -5 16 -138 -67 -88 -269 54 153 53 -86 221 260 55 53 230 33 -32 235
3228 235 -94 -368 25 142 -223 -257 -59 -3 -145 104 37 114 254 348 66 20 241 20 -347 -75 -75 -178 76
3251 76 -88 -199 -47 234 -32 -131 6 222 59 86 172 -100 -63 31 20 -322 -215 -78 -90 -131 78 -116 -51
3274 -51 338 163 -98 229 247 76 40 192 -82 -158 150 -90 -260 -186 -82 -123 -76 34 89 -8 187 212 -77
3297 -77 122 330 14 -110 19 90 -6 -127 5 -253 -10 45 -89 -126 255 225 -38 71 257 36 -20 66 -116
3320 -116 -110 -32 64 -206 -199 56 -63 -100 39 120 63 206 149 130 49 189 68 -155 -2 -63 -202 -85 -5 -173 -173
3345 -173 -45 52 -57 -19 44 68 147 233 -106 32 285 106 -97 -42 -119 -164 -147 -70 -110 2 116 -17 -40 249
3369 249 438 72 -82 153 14 135 27 -67 -69 25 -87 -313 -180 166 49 -53 -64 247 23 83 54 -103
3391 -103 -7 -2 -193 -167 -23 -30 -269 -58 123 108 -164 -91 107 184 171 -51 -106 195 300 -38 -159 112 230 -21
3415 -21 -226 -108 -64 -6 -126 -196 34 346 193 -158 174 449 203 -43 98 68 -13 -149 -413 -227 57 128
3437 128 -198 -105 296 313 112 128 133 185 118 -126 -258 -29 54 -209 -200 72 187 -193 -72 239 199 175 78 -96
3461 -96 76 187 -48 -208 -27 295 94 -133 -3 148 -48 -117 -282 -252 62 65 -120 -113 379 383 72 50 211
3484 211 172 8 -113 -312 -106 -28 -252 -494 -28 283 38 -116 260 435 398 259 43 26 10 -2 -510 -303
3506 -303 111 49 -323 -87 269 236 127 160 90 277 196 -155 -255 53 175 -237 -329 188 181 107 -90 -117 -30 215
3530 215 -29 -441 -140 307 -10 -212 119 349 184 112 172 10 -28 -82 -290 -306 -56 -132 -268 -115 479 280
3552 280 102 144 344 226 196 -94 -316 -38 130 -447 -710 -71 236 -93 -135 86 272 297 136 57 63 104 55
3575 55 -374 -232 158 -100 -289 61 124 110 -15 -98 29 118 67 -227 -319 51 305 18 35 243 183 64 3
3598 3 -100 -200 41 -151 -431 -99 226 21 -38 256 426 160 156 34 141 41 -86 -229 -341 96 -151 -509
3620 -509 -205 198 190 55 80 205 364 243 -136 -155 26 129 -191 -479 -96 76 -63 -135 114 99 90 108 -88
3643 -88 17 169 93 -332 2 249 34 -57 -52 -32 38 40 -139 -251 81 125 -204 -192 201 255 15 90 257 228 107
3668 107 62 -190 61 163 -313 -302 23 168 -244 -213 236 381 222 -31 28 146 308 -26 -446 -231 139
3689 139 -86 -225 -200 114 -22 -53 -78 -112 222 252 -87 -88 293 236 -46 -72 32 -70 -77 -118 -17 -71 30 -18 -248
3714 -248 111 255 -4 1 212 241 125 34 165 40 -51 -76 -214 -213 -43 -136 -198 -20 109 67 -64 11 208 -3
3738 -3 192 -24 -88 94 59 -286 -133 40 -64 -120 -144 29 60 184 76 -47 140 299 139 -49 93 55 -228
3761 -228 -113 -18 -172 -143 34 -167 -169 107 113 25 165 225 155 1 78 113 -145 -68 21 -105 89 0 -203 -179 55
3786 55 59 -183 99 169 93 -12 105 122 89 92 105 -109 -72 -2 -108 -221 64 76 -171 41 82 32 141 272 40
3811 40 16 174 246 -25 -105 -19 -211 -185 11 -131 -151 -4 92 -68 -78 132 91 -2 115 -5 -13 37 42 -238 -51
3836 -51 135 -158 -145 30 -43 -172 60 199 -68 29 297 64 43 105 107 -149 57 5 -104 -201 29 -75 -147 33
3860 33 123 -27 88 143 97 65 117 211 -107 57 70 -64 -92 -22 -119 -146 -43 -166 -62 75 215 0 56 162
3884 162 162 -36 117 -89 -81 -9 -22 -176 -212 28 -131 -48 151 50 -126 132 272 185 -30 144 192 -68 89
3907 89 -23 -47 -183 -92 -216 -137 23 42 -124 31 111 183 216 304 126 -23 140 76 -143 -185 59 -198 -67 -12
3931 -12 -141 30 -13 184 -123 55 321 187 -11 216 128 -149 14 -27 -68 -85 -142 -158 -139 18 65 -126 70
3954 70 152 32 22 226 157 -4 -20 -171 34 47 -50 -124 -83 186 -62 -11 -151 176 95 52 68 -35 78 269
3978 269 39 -171 62 108 -115 -105 -21 -43 12 -26 -90 80 182 76 -119 72 313 62 3 90 134 -29 -166
4001 -166 -69 -90 62 -27 -207 -224 69 212 101 108 149 124 86 -10 -38 -53 -8 -104 -242 59 -6 -195 -51 103 101 -133
4027 -133 -41 -9 97 274 -78 -110 44 142 115 -121 -56 194 16 -229 -138 -101 -44 122 -96 -9 174 324 33
4050 33 -29 211 89 -100 59 -35 -98 -84 -334 -333 -116 78 -124 -257 215 366 156 48 125 93 129 6 -213
4073 -213 -156 177 142 -262 -147 228 119 -7 2 112 129 -4 -17 -92 88 121 -91 -147 166 264 -208 -259 -59 179
4097 179 -169 -68 -208 5 259 88 -250 72 296 20 -168 -68 277 6 -159 -249 -263 27 -47 -346 -115
4118 -115 289 328 -72 14 452 227 -36 -171 -16 33 70 -279 -469 9 136 -121 -312 284 318 64 -63 147
4140 147 250 152 -95 -165 -11 143 -132 -290 -96 246 131 -204 -50 99 113 -76 -261 25 165 257 -133
4161 -133 -92 288 229 -15 -238 81 145 -21 -198 -95 -155 63 -65 -137 254 310 140 -9 283 200 152 -27 -104
4184 -104 -169 73 -142 -322 26 209 57 -209 95 353 257 -84 -6 -65 81 45 -197 -240 79 0 -246 -173 220
4207 220 63 -130 24 74 7 61 50 -175 68 256 44 -243 115 125 -51 -143 -41 -89 -66 -93 36 -136 124
4230 124 104 65 2 307 197 84 51 -21 -19 -40 -103 -266 55 -53 -173 -195 159 326 96 -42 140 256 103
4253 103 -34 -146 -70 89 -15 -272 -75 70 72 -78 70 90 111 165 63 89 93 5 -89 1 134 -54 -73 -78 -47
4278 -47 37 -88 -132 -124 16 68 -153 -79 249 68 -27 -40 175 103 1 -174 -137 -155 -157 -99 -70 92 37 -42 84 154
4304 154 162 113 -9 46 4 -36 33 -198 -150 76 -109 -202 -78 16 21 72 80 30 85 122 82 -48 -38 156 -93 11 -2
4331 -2 51 -81 -108 29 -102 41 61 51 13 93 101 -46 107 163 -199 51 -14 -46 -134 -77 -106 -111 -75 -17 -170 -38 157
4358 157 89 31 111 192 -33 110 32 -64 -74 -46 53 -29 72 -36 21 -169 70 141 95 151 114 -17 24 130 -36
4383 -36 -78 26 -43 -135 7 -153 -111 84 152 -197 -5 43 40 37 68 193 70 16 80 -89 -213 63 -98 -169 13
4408 13 -48 -98 37 150 25 -93 130 178 37 67 58 0 0 81 -68 -42 -14 -26 -145 -130 108 -26 43 228 158 71
4434 71 76 61 14 1 144 -69 -153 -4 -114 -153 -46 15 -45 -29 63 3 -93 308 168 -12 24 42 -8 61 7 -58 -209
4461 -209 -102 21 -38 -67 116 -19 114 169 -25 -3 72 219 12 21 -1 -99 -58 -78 -92 -165 4 54 -85 -89 92
4486 92 77 -26 -4 98 34 87 145 -51 -144 -18 128 -277 -9 41 94 -111 5 0 108 133 97 -65 150 122 -61
4511 -61 2 70 -86 -86 -30 -8 1 -76 34 -80 -106 105 129 37 158 71 75 -3 -22 -51 -66 -86 -59 -125 67 -85 -199 11
4539 11 73 150 1 -50 22 -29 124 -9 -66 47 25 -117 -110 -59 -26 -135 -58 -145 59 -30 104 -79 42 356 36
4564 36 -30 121 94 35 -8 -91 -47 -112 -35 -167 -2 97 103 -28 102 250 167 68 34 106 -111 -69 12 -191 -67 -83
4590 -83 -58 -173 172 189 -94 -45 217 204 54 84 -149 55 80 -97 -172 62 278 -16 -53 -15 -42 -64 -146 -54 -131
4615 -131 44 115 38 131 361 218 -78 12 90 19 -85 -160 -161 88 -17 -8 -122 133 223 24 30 140 72 13 -25 -18
4641 -18 -2 -140 -146 -205 -3 115 8 -165 -11 255 55 85 154 129 128 0 -233 -122 114 45 -63 -60 221 83
4665 83 -182 -65 -13 79 181 27 -109 149 196 1 -63 100 145 77 -87 -11 -16 -92 -94 -126 -157 191 47 -240 79
4690 79 358 217 -159 -29 209 -48 -105 -67 -97 -73 97 -153 -222 252 214 10 46 84 165 27 -40 91 10 49
4714 49 -22 -180 135 119 -138 -254 49 141 -22 68 52 70 57 -55 -42 7 282 134 -160 -30 224 33 -189
4737 -189 -162 -168 -12 -63 -48 -27 223 248 53 64 224 154 18 -129 16 42 -156 -124 -150 -5 62 -42 -81 66 253
4762 253 70 107 94 205 55 3 -110 -71 -50 -17 -136 -84 -1 -28 -5 28 157 39 -86 -7 23 7 10 -88 -84 -94 -44
4789 -44 35 -195 -18 126 -141 12 -32 30 114 114 -24 19 154 68 -18 16 79 105 46 -88 -57 -19 -40 -76 61 128
4815 128 188 9 -2 230 11 41 38 -5 -40 -112 -58 -108 -160 117 -60 -163 -53 18 61 -43 29 -1 135 75 -94
4840 -94 -93 77 5 56 -77 96 -62 -124 -121 -83 -93 72 -32 -63 261 104 34 -50 95 111 48 -77 -14 28 -59 -79
4866 -79 -185 -43 145 -13 -40 -41 287 125 44 24 206 -52 2 -55 -114 -128 -82 -90 -186 9 -25 -61 26 12 -28 -32 8
4893 8 -18 155 207 -53 -153 132 46 -117 -125 20 -51 -18 118 -32 69 10 92 164 17 176 29 -17 28 179 -72
4918 -72 -144 -9 -93 -45 -5 -63 -81 96 197 -59 33 79 20 49 11 109 -107 54 -25 -198 -23 -43 -33 -21 36 18
4944 18 19 59 44 145 124 189 -103 -75 -110 21 -128 -105 -88 -36 46 61 52 -6 149 40 42 42 231 62 -55 134 100
4971 100 -138 -124 -45 -215 -126 -83 -172 -19 78 -21 62 185 164 113 -39 193 124 34 51 -1 -148 12 237 -212 24
4996 24 63 -90 35 84 -19 178 -12 41 25 43 154 49 -126 -53 -132 -198 -22 97 -109 -148 20 55 48 -1 59
5021 59 -11 108 48 -49 -69 65 11 -141 -183 -52 -121 11 98 -73 23 43 149 42 -23 133 52 40 -87 80 -62
5046 -62 -40 -81 -153 -68 87 -103 -81 19 -98 56 5 75 -47 -130 34 -101 -98 67 76 -188 -93 62 33 -33 -17 5
5072 5 5 125 -6 -39 20 201 -18 55 123 -47 -133 38 40 -20 -117 70 5 -3 116 173 -57 99 109 84 -63 -14 33
5099 33 -159 -61 14 -30 -64 14 -70 0 180 -17 -20 27 145 57 -42 40 185 -4 12 -8 -33 16 5 66 71 2 167 -119
5127 -119 57 65 -26 200 115 49 187 118 106 -119 -36 -2 -140 -52 -48 97 86 51 -6 67 251 35 -109 -1 227
5152 227 24 -38 81 127 62 -43 76 -107 134 91 8 -137 52 125 -9 64 68 -5 19 2 -47 134 9 -20 -189
5177 -189 -15 132 -163 -202 -3 134 105 93 94 114 154 98 38 37 160 -17 -120 -94 -33 -86 -143 19 109 82 130 0
$$ [...]
16383B9
##END NTUPLES=NMR FID
##END=
