##TITLE=abcd
##JCAMPDX= 6.0         $$ Bruker NMR JCAMP-DX V2.0
##DATA TYPE= NMR FID
##DATA CLASS= NTUPLES
##ORIGIN= UXNMR, Bruker Analytische Messtechnik GmbH
##OWNER= root
$$ XWIN-NMR		Version 3.5
$$ Sat Jun 28 15:40:37 2025 Russian Standard Time (UT+4h)  servis@DPX200
##.OBSERVE FREQUENCY= 200.131235884673
##.OBSERVE NUCLEUS= ^1H
##.DELAY= (6, 6)
##.ACQUISITION MODE= SIMULTANEOUS
##.ACQUISITION SCHEME= undefined
##.AVERAGES= 32
##.DIGITISER RES= 18
##SPECTROMETER/DATA SYSTEM= spect
##.PULSE SEQUENCE= zg
##.SOLVENT NAME= CDCl3
##.SHIFT REFERENCE= (INTERNAL, CDCl3, 0, 16.5164)
##AUDIT TRAIL= $$ (NUMBER, WHEN, WHO, WHERE, WHAT)
$$ ##TITLE= Audit trail, XWIN-NMR		Version 3.5
$$ ##JCAMPDX= 5.01
$$ ##ORIGIN= Bruker BioSpin GmbH
$$ ##OWNER= servis
$$ F:\spectra/data/av/nmr/H1/1/audita.txt
$$ ##AUDIT TRAIL=  $$ (NUMBER, WHEN, WHO, WHERE, WHAT)
(   1,<2025-06-28 15:39:09.95 +0400>,<servis>,<DPX200>,
      <created by zg, POWCHK disabled, PULCHK disabled
       configuration hash MD5:
       00 E9 B6 7A A2 85 ED C7 34 08 36 98 17 FE 4E 26
       data hash MD5: 32K
       FE 14 9B CA 8B 3C 11 8A 6E 86 5F A9 D3 37 B1 C7>)
$$ ##END=
$$ 
$$ hash MD5
$$ F9 89 0C 39 3E A2 70 CE 48 77 02 4D BB 5C B7 0E
##$RELAX= 
##$RELAX= 
##$RELAX= 
##$RELAX= 
##$RELAX= 
##$RELAX= 
##$RELAX= 
##$RELAX= 
$$ Bruker specific parameters
$$ --------------------------
##$DU= <F:\spectra>
##$EXPNO= 1
##$NAME= <H1>
##$PROCNO= 1
##$TYPE= <nmr>
##$USER= <av>
##$AMP= (0..31)
100 100 100 100 100 100 100 100 100 100 100 100 100 100 100 100 100 100 
100 100 100 100 100 100 100 100 100 100 100 100 100 100 
##$AQSEQ= 0
##$AQ_mod= 1
##$AUNM= <au_zg>
##$AUTOPOS= <>
##$BF1= 200.13
##$BF2= 200.13
##$BF3= 200.13
##$BF4= 200.13
##$BF5= 500.13
##$BF6= 500.13
##$BF7= 500.13
##$BF8= 500.13
##$BYTORDA= 1
##$CFDGTYP= 0
##$CFRGTYP= 5
##$CHEMSTR= <none>
##$CNST= (0..31)
1 1 145 1 1 1 1 1 1 1 1 1 1 1 1 1 1 1 1 1 1 1 1 1 1 1 1 1 1 1 1 1 
##$CPDPRG= <>
##$CPDPRG1= <>
##$CPDPRG2= <>
##$CPDPRG3= <>
##$CPDPRG4= <mlev>
##$CPDPRG5= <mlev>
##$CPDPRG6= <mlev>
##$CPDPRG7= <mlev>
##$CPDPRG8= <mlev>
##$CPDPRGB= <>
##$CPDPRGT= <>
##$D= (0..31)
0 2 0 0 0 0 0 0 0 0.06 0 0 0 0 0 0 0.0002 0 0 0 0 0 0 0 0 0 0 0 0 0 0 
0 
##$DATE= 1751110749
##$DBL= (0..7)
120 120 120 120 120 120 120 120 
##$DBP= (0..7)
150 150 150 150 150 150 150 150 
##$DBP07= 0
##$DBPNAM0= <>
##$DBPNAM1= <>
##$DBPNAM2= <>
##$DBPNAM3= <>
##$DBPNAM4= <>
##$DBPNAM5= <>
##$DBPNAM6= <>
##$DBPNAM7= <>
##$DBPOAL= (0..7)
0.5 0.5 0.5 0.5 0.5 0.5 0.5 0.5 
##$DBPOFFS= (0..7)
0 0 0 0 0 0 0 0 
##$DE= 6
##$DECBNUC= <off>
##$DECIM= 32
##$DECNUC= <off>
##$DECSTAT= 4
##$DIGMOD= 1
##$DIGTYP= 9
##$DL= (0..7)
0 120 120 120 120 120 120 120 
##$DP= (0..7)
150 150 150 150 150 150 150 150 
##$DP07= 0
##$DPNAME0= <>
##$DPNAME1= <>
##$DPNAME2= <>
##$DPNAME3= <>
##$DPNAME4= <>
##$DPNAME5= <>
##$DPNAME6= <>
##$DPNAME7= <>
##$DPOAL= (0..7)
0.5 0.5 0.5 0.5 0.5 0.5 0.5 0.5 
##$DPOFFS= (0..7)
0 0 0 0 0 0 0 0 
##$DQDMODE= 0
##$DR= 18
##$DS= 0
##$DSLIST= <SSSSSSSSSSSSSSS>
##$DSPFIRM= 0
$$ [...]
##$SUBNAM0= <"">
##$SUBNAM1= <"">
##$SUBNAM2= <"">
##$SUBNAM3= <"">
##$SUBNAM4= <"">
##$SUBNAM5= <"">
##$SUBNAM6= <"">
##$SUBNAM7= <"">
##$SUBNAM8= <"">
##$SUBNAM9= <"">
##$SW= 20.6817932712277
##$SWIBOX= (0..15)
0 0 3 0 0 0 0 0 0 0 0 0 0 0 0 0 
##$SW_h= 4139.07284768212
##$TD= 32768
##$TD0= 1
##$TE= 0
##$TE2= 300
##$TE3= 300
##$TEG= 300
##$TL= (0..7)
0 120 120 120 120 120 120 120 
##$TP= (0..7)
150 150 150 150 150 150 150 150 
##$TP07= 0
##$TPNAME0= <>
##$TPNAME1= <>
##$TPNAME2= <>
##$TPNAME3= <>
##$TPNAME4= <>
##$TPNAME5= <>
##$TPNAME6= <>
##$TPNAME7= <>
##$TPOAL= (0..7)
0.5 0.5 0.5 0.5 0.5 0.5 0.5 0.5 
##$TPOFFS= (0..7)
0 0 0 0 0 0 0 0 
##$TUNHIN= 0
##$TUNHOUT= 0
##$TUNXOUT= 0
##$USERA1= <user>
##$USERA2= <user>
##$USERA3= <user>
##$USERA4= <user>
##$USERA5= <user>
##$V9= 5
##$VALIST= <valist>
##$VCLIST= <CCCCCCCCCCCCCCC>
##$VD= 0
##$VDLIST= <DDDDDDDDDDDDDDD>
##$VPLIST= <PPPPPPPPPPPPPPP>
##$VTLIST= <TTTTTTTTTTTTTTT>
##$WBST= 1024
##$WBSW= 30
##$XGAIN= (0..3)
0 0 0 0 
##$XL= 0
##$YL= 0
##$YMAX_a= 592656
##$YMIN_a= -443278
##$ZGOPTNS= <>
##$ZL1= 120
##$ZL2= 120
##$ZL3= 120
##$ZL4= 120
##$ABSF1= 10
##$ABSF2= 0
##$ABSG= 5
##$ABSL= 3
##$ALPHA= 0
##$AQORDER= 0
##$ASSFAC= 0
##$ASSFACI= 0
##$ASSFACX= 0
##$ASSWID= 0
##$AUNMP= <proc_1d>
##$AZFE= 0.1
##$AZFW= 0.1
##$BCFW= 1
##$BC_mod= 2
##$BYTORDP= 0
##$COROFFS= 0
##$CY= 19
##$DATMOD= 1
##$DC= 2
##$DFILT= <>
##$DTYPP= 0
##$F1P= 11.0000007629395
##$F2P= -0.999999237060547
##$FCOR= 0.5
##$FTSIZE= 0
##$FT_mod= 4
##$GAMMA= 1
##$GB= 1
##$INTBC= 1
##$INTSCL= 1
##$ISEN= 128
##$LB= 0.05
##$LEV0= 0
##$LPBIN= 0
##$MAXI= 10000
##$MC2= 0
##$MEAN= 0
##$ME_mod= 0
##$MI= 0
##$NCOEF= 0
##$NC_proc= 0
##$NLEV= 6
##$NOISF1= 0
##$NOISF2= 0
##$NSP= 1
##$NTH_PI= 0
##$NZP= 0
##$OFFSET= 16.51637
##$PC= 1
##$PHC0= -273.2733
##$PHC1= 1.101538
##$PH_mod= 0
##$PKNL= yes
##$PPARMOD= 0
##$PSCAL= 4
##$PSIGN= 0
##$REVERSE= no
##$SF= 200.13
##$SI= 16384
##$SIGF1= 0
##$SIGF2= 0
##$SINO= 400
##$SIOLD= 16384
##$SREGLST= <1H.CDCl3>
##$SSB= 0
##$STSI= 0
##$STSR= 0
##$SW_p= 4139.07284768211
##$SYMM= 0
##$S_DEV= 0
##$TDeff= 0
##$TDoff= 0
##$TI= <>
##$TILT= no
##$TM1= 0
##$TM2= 0
##$TOPLEV= 0
##$USERP1= <user>
##$USERP2= <user>
##$USERP3= <user>
##$USERP4= <user>
##$USERP5= <user>
##$WDW= 1
##$XDIM= 8192
##$YMAX_p= 0
##$YMIN_p= 0
$$ End of Bruker specific parameters
$$ ---------------------------------
##NTUPLES= NMR FID
##VAR_NAME=  TIME,          FID/REAL,        FID/IMAG
##SYMBOL=    X,             R,               I
##VAR_TYPE=  INDEPENDENT,   DEPENDENT,       DEPENDENT
##VAR_FORM=  AFFN,          ASDF,            ASDF
##VAR_DIM=   16384,         16384,           16384
##UNITS=     SECONDS,       ARBITRARY UNITS, ARBITRARY UNITS
##FACTOR=    0.0002416,     1,               1
##FIRST=     0,             0,               0
##LAST=      3.9581328,     0,               0
##MIN=       0,             -443278,         0
##MAX=       3.9581328,     592656,          0
$$ Real data points
##PAGE= N=1
##DATA TABLE= (X++(R..R)), XYDATA
0@%%%%%%%%%%%%%%%%%%%%%%%%%%%%%%%JlMnRj3J5j9K4k8L2l5L7l8L9m1M6n1N6
50C0o2O6p5Q6r8J12j32J58j92K37k98L89n19P17j041J618k748N380j3878Q9461
70G9211N13445j04589o05183k75064K50507L34398L5298j70751j19238r836k7600
81i9402m4212Q0674J94658Q5801j36455k12985o9579J50172K25623M4585k02753
92A6127k13084K022J55128J22972J6776o1818p5011j6907L8920L8631L9058N0359
104A13173k3002j41293j19189N9067J68669O2191j19311j28041M9133J48067K2969
115I2433r8592j0462R7291k185j44599p8753J00480J34767m195j27163q0772P8426
127d3324J40031J4524j16309o5472P2637Q1311n2444j32234k2903J46201J23204
$$ plain form
0 0 0 0 0 0 0 0 0 0 0 0 0 0 0 0 0 0 0 0 0 0 0 0 0 0 0 0 0 0 0 0 0 1 -2 2 -3 6 -7 8 -11 13 -15 17 -18 19 -19 20 -21 25 -26 30
50 30 -32 34 -41 45 -53 59 -73 85 -107 130 -168 221 -298 419 -622 996 -1752 3628 -10250 79211
70 79211 592656 488067 -117116 -392180 -141673 192725 228023 57272 -61966 -71802 -99402
81 -99402 -143614 -62940 131718 217519 81064 -131921 -201500 -51328 174295 218880 16127
92 16127 -196957 -194935 -39807 83165 99941 38123 -36888 -53795 -14875 23756 62814 113173
104 113173 90171 -51122 -170311 -111244 57425 119616 305 -127736 -78603 69464 92433
115 92433 -6159 -16621 80670 78485 -66114 -144867 -44387 90380 86185 -40978 -121750 -43324
127 -43324 96707 111231 -5078 -70550 2087 83398 30954 -101280 -124183 22018 145222
138A45222r0964j89467j3849J84728J37726o1077j54470o8491O7188J01458P184
149F5188q1504m9358L1780L3030j4463m169M9567M9424k5709q2460l6574O1490
161c758P2117k6332r0207l5416M5358N4104J2888j8711j6479J4858K5453j4054
173A9821m0412N622M8666J640o7425m1699M7451P0343n986o7261j9342O6359N1427
186F9204m4936o8690J3334O4198J0460n6793m4421K0194N2930J7314l4469k2695
198b4370L5066L7946k9621n6384O679O2690K2041o1686p4593Q814R0602O6205
210H3389l3835q2057k7630M8711O1589J0840m5987n2878o940K9600J6506q26J1848
223A2330J0500k7476l9087J3318O3121L9318l4776p2261k6979M7026N5016o610
$$ plain form
138 145222 54258 -135209 -149058 35670 173396 112319 -42151 -110642 -43454 58004 65188
149 65188 -16316 -65674 -33894 -864 -15327 -19496 30071 79495 53786 -28674 -65248 -3758
161 -3758 68359 42027 -48180 -83596 -38238 15866 28754 10043 -6436 8422 33875 19821
173 19821 -20591 -14969 33697 35337 -32088 -73787 -26336 44007 38021 -29240 -48582 17777 69204
186 69204 24268 -44422 -31088 33110 43570 -13223 -57644 -37450 15480 32794 -1675 -24370
198 -24370 10696 48642 19021 -37363 -30684 32006 54047 -7639 -82232 -73418 17184 83389
210 83389 49554 -32503 -60133 -11422 50167 61007 15020 -37858 -44798 -15198 1308 482 12330
223 12330 22830 -4646 -43733 -30415 32706 72024 37248 -35013 -61992 -14966 40050 33440
235C3440m6074k0905J4754J6928M887M791J2353P954j9835l9786o675M7919L8802
248D8553k8395n6923j2353L8902M1203N389k7605k5043M112J5261k3n636N965
261C407L303j3294j4752K621K3903K6697m893l9787k1066L1397L5509j1721l5233
274a3909j0754J7071J7432l736j9274l155K3548J3258j8501j6298J2995J8618
286A7295j147j5741j4599J01J5628O355j3907o544J4744Q318j0042o052O776Q032
300I217K345r829j8646l74K5684J3707k0526k0670P296K0243Q650j0762j8245
313a1910K97J8847L040j9191l630J9009N315j5820q327Q557J3092N941r405j7068
327a1253J045J7981L186j4072o386L532J707K719L061k216K363Q997l695j4110
$$ plain form
235 33440 -12634 -33539 -18785 -1857 3030 7821 20174 28128 8293 -31493 -38168 9751 48553
248 48553 20158 -36765 -49118 -10216 30987 36376 8771 -16272 -12160 3101 3078 -2558 3407
261 3407 6710 -6584 -21336 -18715 5188 31885 26992 -12795 -33861 -2464 33045 21324 -13909
274 -13909 -24663 -7592 9840 6104 -13170 -16325 7223 20481 1980 -14318 -1323 17295
286 17295 16148 407 -14192 -14091 1537 7892 -6015 -12559 2185 10503 461 -5591 1185 9217
300 9217 11562 1733 -16913 -17287 8397 22104 1578 -19092 -11796 8447 17097 6335 -11910
313 -11910 -11613 7234 10274 -8917 -12547 6462 11777 -4043 -12370 -3813 9279 15220 5815 -11253
327 -11253 -10208 7773 10959 -3113 -9499 -5967 -4260 -1541 1520 -696 1667 10664 6969 -7141
341g141J983J4847K262j2218j2242l693J1759J8358l507k1542k699J8661O935
354A1763r234l706K668L58j765l791j867Q723O745j1609j2357R164J3926j403
368G615p070l193k799L227Q795k033j0686J76P889M42k405Q70J89J965L134o009
384A07r113O094J0715o236j1943K474Q828L516j51l435l267M840N550o264o091
399d376N993K587q310m092N270L461P68J54m007k694P384O340l671n006q30j671
415b700J286N197j985p449J941O226l126m176N693N626l517o049k251L032P749
430E497J182r369m603P562M194m973j74M903j697n667o17K169K084K067j675n206
446d323k21M556J394J181L665j592p450j875N174L330q35k878n563k730M984N652
$$ plain form
341 -7141 -5158 9689 11951 -267 -12509 -16202 -4443 13915 10408 -11134 -13833 4828 11763
354 11763 2529 -1177 1491 1849 84 -3707 -5574 3149 9894 -1715 -14072 -4908 9018 7615
368 7615 545 -2648 -5447 -2220 6575 4542 -6144 -5968 1921 2363 -42 828 1017 2982 6116 107
384 107 -9006 -2912 7803 1567 -10376 -7902 926 4442 4291 856 -2411 2429 7979 1715 -4376
399 -4376 1617 4204 -4106 -8198 -2928 533 1301 1455 -2552 -5246 2138 8478 4807 -199 -1029 -2700
415 -2700 -1414 3783 1798 -5651 -3710 2516 -610 -4786 907 6533 3016 -3033 -5284 -2252 5497
430 5497 6679 -2690 -7293 269 4463 -510 -684 4219 2522 -3145 -3762 -1593 491 2558 883 -4323
446 -4323 -4544 12 1406 2587 6252 4660 -2790 -4665 509 3839 3004 126 -5437 -8167 -3183 2469
462B469Rm39K96l931k895N801O386k960n499j379k99o32P73K086L402J222p082
479b672q944N030J5978N217j1271j1762o15P716Q496J445q229o969J576L433R20
494f51L692M477m007r214l483N007P671M608k877q264m792J979O247R157M324
509A3874j1450j7465J192J8880R602r761j2353k517N425O364K124j874j53Q91
523B779l652l334M574N865o92l946m309o096p10R316Q453j979q283o961J117J3123
539E265J1612q893j8616p68J5681O128j0344r628L599J1757L180j2567j0495R632
553d457J6217L1j1782p986n24O927J1153J147j3164r125N283Q406L278Q9l448
568B045m470J278J451m608j194Q414N630o646j1714l888J2032K0603L267k3660
$$ plain form
462 2469 2478 2039 2335 -1596 -4491 1310 7696 4736 -763 -2142 -2441 -3073 -2300 -214 3188 4410 -2672
479 -2672 -11616 -6586 9392 14609 3338 -8424 -9039 -1323 7173 8618 389 -6580 -5004 -1571 -651
494 -651 3041 7518 3511 -5703 -9186 -4179 3492 8100 5223 -3041 -7833 -5854 393 9550 13874
509 13874 2424 -15041 -13849 5031 14633 4872 -7481 -9998 -4573 1791 3915 2041 1888 2779
523 2779 -873 -4207 367 6232 5540 1594 -2715 -8811 -9521 -205 8248 6269 -2014 -8975 -7858 5265
539 5265 16877 7984 -10632 -11400 4281 10409 65 -9563 -5964 5793 8973 -3594 -14089 -4457
553 -4457 11760 11791 9 -7977 -8501 -1574 9579 10726 -2438 -11563 -6280 2126 5404 5493 2045
568 2045 -2425 -1147 304 -4304 -5498 2916 8546 1900 -9814 -13702 -1670 18933 22200 -1460
582a460k0092R561K0182N049p953j0317p983J599J2260R141j625o887o086q44
596e455O339M947k882o81M150n891j3970j199J5704J3424k807j7140j5802Q869
610a2394K8992J1441k2625k3256L417J6699P700o148r901j410Q365M068n306j996
624b354N045K377j664l005q210n120J1777J5540m704j6911n041R639J1287L430
638A2086p858j1558J83Q871J157o509m07N010K462l170p154k134J2033J3739m891
653A1860j6684n155N822N549M988J475j0967j3493K662J6358J1396k665j1772
666f26p592N499Q688j785n558K920K097q221p827M433J2910J0415l852j9093j2518
681b0110J3974K2339J107j7434j2842N53R232J0654K723p487q151j363M965P433
$$ plain form
582 -1460 -21552 -11991 8191 13240 5287 -5030 -13013 -11414 846 9987 8362 1475 -4611 -5455
596 -5455 884 5831 2949 2268 6418 527 -13443 -14642 1062 14486 11679 -5461 -21263 -12394
610 -12394 16598 28039 5414 -17842 -14425 2274 9974 3826 -6075 -7485 880 4948 -358 -2354
624 -2354 2691 5068 3404 399 -7811 -12931 -1154 14386 9682 -7229 -12270 -2631 8656 12086
638 12086 4228 -7330 -7147 1724 2881 -3628 -4035 975 3437 267 -6887 -9021 3012 16751 11860
653 11860 -4824 -9979 -4157 1392 6380 7855 -3112 -16605 -13943 2415 13811 11146 -626
666 -626 -8218 -2719 5969 4184 -1374 1546 3643 -4578 -12405 -7972 4938 15353 11501 -7592 -20110
681 -20110 -6136 16203 17310 -124 -12966 -12413 -3181 7473 10196 2709 -5442 -6805 -1840 5593
695E593K369o285n263K612no901N99J1621M922q500p919K352Q414O741j632r380
711f62o637K550M118J10o58O4n62K04J246O43J920K816j565m154J07J042l838
728c256p49O732K732p582o473L842P811L354k915m521j028K564O36k291P84K879
744B519j625m563j517K936N899M976k886j0035m057O159O118l29l099l747l558
759f809J825Q600N987l750p734l136L654M504n39l663p41J265k713k487N226O402
775E891k040o044j228L482K907J050j444k946j137K39j270j50L505J611l597k734
791c905K647M189J181j969l288n43K188l29k775J909L941j823m869J832M489q63
807B012k977o78O39M96L21r21m2K707J372k537j678J891N56r52O74j64k297l47
$$ plain form
695 5593 7962 1677 -3586 -974 -979 -7880 -7281 4340 9262 762 -7157 -4805 3609 10350 8718 -662
711 -662 -7299 -4749 -631 -521 -1179 -1115 -1677 -1473 -227 416 2336 5152 3587 -567 -460 582 -3256
728 -3256 -4005 2727 5459 -2123 -8596 -4754 3057 6411 3496 -1025 -2053 511 1147 -1144 -360 2519
744 2519 894 -3669 -5186 -2250 3649 8625 5739 -4296 -8353 -2194 3924 3595 496 -3251 -6809
759 -6809 -4984 3616 9603 5853 -1881 -5017 -1363 3141 2602 -1061 -1802 -537 -3250 -5737 -511 5891
775 5891 3851 -2193 -3421 61 2968 4018 2574 -372 -1509 -1270 -2540 -2690 815 2426 -1171 -3905
791 -3905 -1258 2931 4112 2143 -1145 -1688 500 171 -2604 -695 3246 1423 -3446 -1614 2875 2012
807 2012 -965 -1643 -1004 -508 -187 -1108 -1150 1557 2929 392 -1286 605 1161 209 883 719 -1578 -1925
825a925J388k16K26J876j502l742K640N157l44l441j49P37l95J31k93j507J75
842a184M3j441J255M342o45m414O70L638p19k152P80j01j186J105Q51j225P78
859C95J036k509j420L017J172k705n36J650k96qJ554q14q84J785o23k625J837
876B6L413k672l430J584J252j549O22J497j697o93J941Q53L30J399j611l079J473
893c41K431k234j985J888k73k112J881K652j680q54J188m72n06J923j1k509N82
910d32J571j528o90K097o13k257J199J470j702J27J800q02r51J567l83j776J910
927F07K016k893j781K775P17j955K38M29j551o0J533l37r8J507q02j892K324K022
945B799k140j234J693j157k048J917J823j935j209R21k71J6J806k45j450Q68N08
$$ plain form
825 -1925 -537 -753 -527 1349 -153 -3895 -1255 3902 3558 117 -32 705 310 441 148 -1359 -1184
842 -1184 -1141 -2582 -1327 3015 2370 -2044 -1374 2264 1545 -607 173 72 -1114 -9 842 -383 395
859 395 1431 -1078 -2498 519 1691 -1014 -1550 100 -196 -204 1350 536 -348 1437 814 -1811 26
876 26 3439 767 -2663 -1079 173 -1376 -754 743 -954 -1647 294 1147 1477 2876 1265 -1814 -341
893 -341 2090 -144 -2129 -241 -514 -2626 -745 1907 227 -627 561 89 -417 1506 1495 -1014 -432
910 -432 1139 -389 -1079 1018 405 -1852 -653 817 -885 -758 1042 240 -711 856 473 -1303 607
927 607 2623 -270 -2051 724 1441 -514 -276 153 -1398 -1458 75 -262 -360 1147 345 -1547 777 2799
945 2799 659 -575 1118 -39 -2087 -170 1653 -282 -1491 -570 -841 -825 981 736 -714 154 662
962F62j566N29L146o15k989n05N56J51J316P42k900j038K371M55j184J668J715
979B514k272j677J370J008K67O45j019k739l19J357Q85N84L77k212j437K704K024
996B060j333l27J594j376k926Q10K645N12q27j491j882O94K795R66j515o42K8
1013b15j043KJ639J084O26n74k945k358L424M704j061m666j530J206J211J448
1029I52K08j565r78P90rr3J645K079m41k302k433m47L010L340j827m973j211K355
1047a900K094J265J059j801k492N97K489L76o56P3n58k153r55J297K027J297r55
1064A104k749p95J720J194Q77J525r21m462j779M036L838n66k712k731q18K706
1080e33L610j149l444L29J958j020k468J46L975L583k296o971j851P637O457l444
$$ plain form
962 662 -904 -375 2771 2156 -833 -1338 -782 -631 685 1427 -1473 -2511 -140 315 -869 799 2514
979 2514 242 -1435 -65 943 1210 1855 836 -1903 -2222 -865 20 604 981 -1231 -2668 36 2060
996 2060 727 400 1994 618 -2308 -1498 1147 1659 832 -659 -2541 -1847 948 1914 399 -243 -215
1013 -215 -1258 -1256 383 1467 2093 1519 -1426 -3784 -360 4344 3283 -1383 -2913 -1707 -496 952
1029 952 1160 -405 -1383 -593 -602 -695 950 3029 2588 286 -2147 -2594 416 3756 1929 -3044 -4255 -1900
1047 -1900 194 1459 2518 717 -1775 -1178 1311 1687 1031 1104 546 -1607 -2562 -1265 762 2059 1104
1064 1104 -1645 -2440 -720 474 1351 2876 1955 -2507 -4286 -250 3588 3022 310 -2421 -3239 -533
1080 -533 3077 1928 -1516 -1187 771 -249 -2717 -2571 1404 4987 2691 -4280 -6131 1506 7963 4519
1096D519o925k588J866L532K721j758m316M1L277N78j189J156J877k43k089k865
1112b406j208L544M370j518n567k435J796M554M349j570o830j986N444L006k521
1127A022j172R41j277j834R48J975Q05k52j416p70J000j55j573K069L433k365
1143A379o217p4N698M078n01m326m491J805P320O94p258l466M350L425k390l903
1159c877L51N095M408l176o705K23O407K591k536l854l660j07N775L625m278m413
1175d131K042L665O49j103j220k9K409mm620k556M581M493j718m550k544K320
1191b316O010J949n608m220L220K316k558j81L710m76m587m02M050K946q58m129
1207a134j708L676K196m710l234M863L954l565m847R85N122M277j749o463k050
$$ plain form
1096 4519 -2406 -4994 -3128 404 3125 1367 -2949 -2908 369 947 -242 914 2791 2548 459 -2406
1112 -2406 -3614 -70 4300 2782 -2785 -5220 -3424 1130 5479 3909 -2921 -4907 537 3543 1022
1127 1022 -150 791 -486 -2320 -1372 603 1408 1156 -260 -1030 -30 -185 -1758 311 3744 1379
1143 1379 -4838 -4912 786 4864 4363 37 -4454 -2649 4671 5365 -1893 -5359 -1009 2416 26 -3877
1159 -3877 -3526 1569 5977 2801 -3904 -3681 2726 5317 2781 -1073 -4733 -4840 935 4560 282 -4131
1175 -4131 -2089 1576 2225 1122 -98 -127 2282 2278 -2342 -4898 -317 4176 2458 -2092 -4636 -2316
1191 -2316 3694 5643 35 -4185 -965 1351 -1207 -1388 2322 1846 -2741 -3143 907 3853 2995 -1134
1207 -1134 -2842 834 3030 -1680 -4914 -51 3903 338 -4509 -3524 1598 5875 4126 -2337 -4387
1222d387N501L842m109m249J126J869q3K64m8n20R24J683P7j328j558n02K785
1239A287K830l810o405K301Q001M14o649k473M284L753j710m145n90M738K289
1254D115m929m205L942N419j611m592m49K813J958j297k842L51K736n45m378K62
1270c252N605J157m158k120K770K853l34k188j638P96J160j457j447J477J446
1285F70j077n11J164K60k68J307N46j791j941M89J908J051j316l110j68L540K240
1302B993l004l099K369L837r75l708j193L230K843k192m686P14N431J607m920
1317g53k617L106L280j606l358p15K688J987j976k737J160L721M62k714j114J518
1333C32R71m72j273q35K80R57l12r87L18J457K98l54L77k93l31J130L86j787j658
$$ plain form
1222 -4387 1114 4956 847 -3402 -2276 -407 -490 -226 -274 -794 130 1813 1890 562 -996 -1498 1287
1239 1287 4117 307 -6098 -3797 4204 4618 -2031 -4504 -220 3533 1823 -2322 -2912 1826 4115
1254 4115 -814 -5019 -1077 4342 2731 -1861 -2310 503 2461 1164 -1678 -1327 1409 864 -3514 -3252
1270 -3252 2353 3510 -648 -2768 2 2855 2521 333 -1305 -509 651 -806 -2253 -776 670
1285 670 -407 -918 246 506 238 1545 2091 300 -1641 -1152 756 1807 491 -2619 -2787 753 2993
1302 2993 -11 -3110 -741 3096 2121 -1587 -2780 450 3293 1101 -3585 -2871 2560 4167 -753
1317 -753 -3370 -264 3016 1410 -1948 -2663 25 2012 36 -2701 -1541 2180 2642 -72 -1186 332
1333 332 1303 831 -442 -1277 -997 -40 -352 -1339 -1021 436 734 380 757 464 133 1263 1649 -138 -1796
1352a796R05J317k35j187l37Q59J840p9k360j36L025O66l182j802K187K358p20
1369A323k445j174K129K631j151l550L69L473K37l036r03J783J756J0k119j268
1385a935J903K657j173k925K77K185o7j311n78j32P14R88n19j325Q60J673j48
1402A144p64k47m23K41J384n97k483M7K539qj744j34R81P30R9j026j202J520K086
1421B143j350k371R82K069n15j206o62RP97R72j568j389K039J956j600j507J097
1438a04J040J7j88r42r26J297J157j601j576J112J090k12n84p6p6J291J049j893
1456a25j325J858J338j794j047Q39L45L42O1j116m89J807O82j901r65J371M65
1473C46q1J43r06k57J515R73j835r56J473L08j185k21J43j09R18J74j383k80J923
$$ plain form
1352 -1796 -891 426 191 -996 -1333 -474 1366 1287 -1073 -1209 1816 2482 -700 -2502 -315 2043 1323
1369 1323 -1122 -2296 -167 2464 1313 -2237 -1868 1605 1842 -1194 -2097 -314 1442 1452 -667 -1935
1385 -1935 -32 2625 1452 -1473 -1196 989 922 -389 -967 -1099 -385 603 84 -1241 -381 1292 1144
1402 1144 380 133 -290 -49 1335 738 -1745 -1698 841 833 -911 -1045 -64 666 765 -261 -1463 57 2143
1421 2143 793 -1578 -596 1473 958 -248 -910 -901 -104 868 -700 -2089 -50 1906 306 -1201 -104
1438 -104 936 953 765 -177 -1103 194 1351 -250 -1826 -714 376 164 -420 -496 -572 719 1768 -125
1456 -125 -1450 408 1746 -48 -1095 -256 89 431 492 -624 -1113 694 1376 -525 -1490 -119 346
1473 346 265 408 -498 -755 760 1733 -102 -1058 415 723 -462 -683 -540 -649 269 443 -940 -1220 703
1492G03P91j388m53Q18J97J0j76j083k64J039k35j444N74J628m07p28N88L55l76
1511A49M60J50j211k19J126j79r02L95L49k66j2P9p90N62J154m92j188O07J235
1530A007l68m24L9n41J6O96k24j204M10J318n92p09Q7L37K19N10l55p25L96R97
1550H90k67n92Q4q0m52L42L08o93j17Q22j46p44N95P97n35m37K52Q1o1K84J9j12
1572B38J68j44q49J26O62k43q30K24M09p8N49P07k71p89L43M18k61k47N3m77k13
1593e05L24o3k78N8N59N8o9k94J99O47O76n90j339RJ144m6q96k5P1m4M5P21K08
1616E70m05l28J00M7M6Jj37K97M35m65p32L60O66J91n22o96p14P80J539k87j685
1637i39P4J431J42q98K23O60k14m65R8P6N2j62p03J70N22p36q97J424J870p24
$$ plain form
1492 703 1494 106 -347 471 668 678 502 -581 -845 194 -41 -1485 -911 717 310 -418 170 525 149
1511 149 609 759 -452 -671 455 276 -626 -231 118 -148 -160 -81 -871 -309 845 353 -835 -228 1007
1530 1007 639 215 254 -287 -271 425 201 -1003 -593 725 133 -576 -489 -152 67 577 222 -503 -107 890
1550 890 623 31 115 35 -417 -75 233 -460 -577 245 99 -645 -50 747 212 -225 27 108 47 331 350 238
1572 238 406 262 -587 -461 201 -42 -872 -648 -239 -317 232 939 668 -121 222 640 379 132 185 -292 -505
1593 -505 -181 -244 -522 -464 95 153 84 -210 -11 636 1312 722 -617 -608 536 490 -406 -431 -360 -404 -359 362 570
1616 570 165 -163 -63 -16 30 31 -106 191 626 161 -571 -211 455 646 124 -572 -1286 -506 1033 746 -939
1637 -939 -865 566 708 -190 33 693 479 14 112 188 240 78 -625 -455 67 -669 -1566 -142 1728 1004
1657A004j670P3J281P04k13j587j131P19J459l31j559N25J163R6o98j09K39M97
1675D62L84p43n03L56n0m73J112O02j886j407K012K314j282k114J29J471P14q55
1693B43j521J69K027M99j812n79J410J076m61r05q96k91R65M05j060j39Q93l95
1711c72n52J838J297j626j441R11J071l98j476q96J079J353q60k071P74K907K05
1728A743j857l74Q41K21L03k1j401o01N92M44k54O51K72j039O5J710j52j542m96
1747h95R72O89o23j533n16K526K226k284k769J635K961p91k533o11J106O37o21
1764d24r23K57J494O03j051K2J281N1r63n0k7q53n52l5K69N69O39p78o85J935
1784G79J604j202j490L95Q18o41j177k64P20M19l42o53R22J364m75j051P57O45
$$ plain form
1657 1004 -666 -593 688 1392 1179 -408 -1539 -820 639 308 -1251 -726 437 533 -165 -274 -35 462
1675 462 846 103 -400 -44 -94 -567 545 1147 -739 -2146 -134 2180 898 -1216 -1087 384 1098 243
1693 243 -1278 -1109 918 1417 -395 -974 436 1512 1051 146 -750 -1041 -76 329 -731 -870 23 -372
1711 -372 -924 914 2211 585 -856 55 1126 728 -748 -1644 -565 788 -72 -2143 -1369 1538 1743
1728 1743 -114 -488 353 574 877 856 -545 -1146 -554 -110 -364 287 559 -480 -415 1295 1143 -399 -895
1747 -895 77 766 143 -1390 -1906 620 2846 562 -2207 -572 2389 1598 -935 -1546 -440 197 -424
1764 -424 -1347 -1090 404 1007 -44 -22 1259 1310 347 297 270 -583 -1135 -1170 -901 -332 307 -471 -1156 779
1784 779 2383 1181 -309 86 904 263 -914 -1178 -458 -39 -381 -1034 -112 1252 777 -274 483 1128
1802A128j522q40J196P48q06j021j5J216J320k24j727n6J716L02j846j285R67
1819g49J110j66j338n04J767K137r86j864N65J702m12k064k40N67j16k82k08O34
1837d47O77M04j74J09M68j18q11K3K06p83o40K53O08p2K12j06N3P22L81p59m85
1858b79Q04J48j014p34P09P31m35p23L69J158L88r28q56P83R16j204j460P23J352
1877D48N7j005j22R24O72N4p64o71M49N45n36j140p9R54K96l93j51K68Q36O18
1897A260o09p01L09K25m73m59k60k3J68M17J25k97L16P16j49k96k55J3N1M2k34
1918a14m53J59N77k2l95K56nJ67O1k76l41L28N61l77r40L49J274k81q99P0P12
1939D11L44k42r31l99Q45M30r53p90Q47R19j00l86Q8K49M78K21j155n35O74N72
$$ plain form
1802 1128 -394 -1234 -38 710 -96 -1117 -1132 84 1404 1180 -547 -603 1113 1415 -431 -1716 -749
1819 -749 361 195 -1143 -1647 120 2257 1271 -593 -28 1674 1262 -802 -1042 -475 -591 -873 -1081 -447
1837 -447 230 634 460 569 1037 919 108 131 337 -446 -1086 -833 -225 -297 -85 -191 -138 584 965 206 -279
1858 -279 525 673 -341 -1075 -366 365 -70 -793 -424 734 1122 194 -662 121 1037 -167 -1627 -904 448
1877 448 505 -500 -622 302 974 1028 264 -407 42 587 51 -1089 -1168 -214 82 -311 -462 -194 642 1260
1897 1260 651 -50 259 484 11 -448 -708 -731 -563 -146 -21 -318 -2 714 565 269 14 27 78 120 -114
1918 -114 -567 -408 169 147 -248 8 3 170 231 -45 -386 -58 503 126 -814 -465 809 528 -371 -301 411
1939 411 755 513 -418 -817 28 458 -495 -1285 -438 481 381 -5 83 332 810 1031 -124 -659 15 587
1959E87j022o36P24L98j43K68j90j82N23J50m61p7L73j31k61J46l3n56L62N04
1979C43n39m56N72M12l16m4K2j52M70K55o68m91P23N80o29l99K64J71P5k02p76
2000g85J3J184J32j074q6J123L60p11k25P1P1K41j23q38J94Q60l07o13J95M30
2020A12j87Q7K01k97l2Q11j99n03J05L13l78l39J97r7j14M56J30o56N5Q09j23
2041C51m96j34J78J69L94k96p91O04P48n75q37K61M87j17j24p6j27M10Q40m23
2061D46q94L04O55k74l33Jn9J56M10m48o23M11O61m52m66M32K65L0J26j09m26
2082a87L11M66n87l70K98L07m44p3K98j74K64K7m53j41O30M13n74k46L52K64k18
2103A63j3l20l76O27N6n52k72M39O23m4l44k94R0P19J4q20j28P24K06n29k20R8
$$ plain form
1959 587 -435 -1071 -347 51 -92 176 -14 -196 327 477 16 -61 312 181 -80 66 33 -523 -161 343
1979 343 -196 -652 -80 332 16 -28 -6 -158 312 567 -101 -592 131 711 82 -317 -53 118 193 -9 -785
2000 -785 -772 412 544 -530 -616 507 867 156 -69 2 73 314 191 -647 -453 407 100 -513 -318 112
2020 112 -75 12 213 -84 -116 695 496 -7 98 411 33 -306 -109 -206 -320 136 266 -390 -335 474 351
2041 351 -145 -279 -101 68 462 166 -625 -21 727 152 -685 -424 63 -54 -178 -254 -381 29 869 446
2061 446 -448 -144 511 237 -96 -95 -154 2 412 -36 -659 -248 413 -39 -505 -73 192 222 348 239 -187
2082 -187 124 590 3 -367 -69 238 -206 -279 19 -155 109 136 -317 -458 172 585 11 -235 117 381 163
2103 163 150 -170 -546 81 137 -415 -687 -248 375 331 -13 -307 -217 502 516 -304 -432 292 498 -31 -251 -153
2125a53K12K0k00l33K7N53K36k32l21L88J37k94J40l45M4K31k8l52N8K70Ll21
2147b60j27K36k4K02R5k11n6M32J96m67r9K32k8k59j69r3K33L43Ro92K18O17J66
2170D94l97l04J45L82K9j51m12lM35j49m89j73M10L84o5j25j08J09L53k7m23j13
2192a98J27P2j30K93K80o21j17L30M4l39l8R8K15n9N4k04L96L79k96k89o2P5j93
2215a83J15K41l54j41J38K11o6K49j47m91L08O38j6o52qN17K9n26j82R0J89M83
2237D42m62m99L45N91j56m07J32J1l16M65J67k87NM3m6K3M9m00m04M91M18k58
2259e3k58K69L90j8q4m01k23P58L01p81n30N17M40m46r9N8R4k0J75j17M9J84N6
2282B61k23L7nl24j13O60n1m83o8L25N1R1K23o50j47P46K2o96j2N59k8j10J72
$$ plain form
2125 -153 59 79 -121 -454 -427 126 362 130 -191 197 334 40 180 -165 -121 110 82 -270 -212 58 61 -260
2147 -260 -387 -151 -175 27 122 -89 -145 287 483 16 -83 149 121 -138 -307 -400 -167 176 185 -507 -289 328 494
2170 494 97 -207 -62 320 349 198 -214 -217 218 69 -420 -593 -183 201 136 11 -97 12 365 338 -85 -198
2192 -198 -71 1 -129 164 444 -177 -294 36 80 -259 -297 -199 16 -43 11 -193 203 582 286 -3 -65 10 -183
2215 -183 -68 173 -181 -322 -184 27 -39 210 63 -428 -120 518 502 -150 -158 359 388 -138 -320 -230 -41 442
2237 442 -20 -519 -174 417 261 -146 -14 -3 -319 146 313 26 31 74 28 51 100 -300 -704 -213 205 -53
2259 -53 -311 -42 348 330 246 -155 -378 380 681 -100 -630 -113 327 -119 -218 -160 -66 -86 89 -28 21 205 261
2282 261 38 75 70 -254 -367 293 242 -241 -309 16 67 158 381 -269 -416 330 352 -344 -356 203 175 65 237
2305B37j72l5J96k02l57J03L27l24n8M04M1m67J44N57J27m50P3j86O0L82j90o69
2327d59p1M63J61l73j68L29L81M16m50n66J96Q90m40q26O3M90m4j31Q1q0P3L75
2349C10j96k49L31k8m23J07L89k49k93K42L24k53k6j58J32J63L55m55n55N87L56
2370D11n53m70N96L69k88r1J53L50J05m66n75L96L56p01m70N25P02k71m12K69
2390f5N88K26m44n86J4O76L1r30j52N32L12j44l87L3M00K88j84m12K05L61j86
2411A76m77K54K05j76l31K10M54k28k75J31K98Pk47l37K39M07k33m80K75N75P6
2432E23n24j6K64J80k14n22j56K79L62n03k30O42N91m67n10M22M89j50n51l74
2452d65M80M78n45p69L26P17P9n82L9N36K91k25n51J36L00j57j68j58L9L12j48
$$ plain form
2305 237 65 30 226 24 -333 -230 97 -227 -285 119 160 -307 -163 394 521 71 144 -42 18 400 210 -459
2327 -459 -530 -67 94 -279 -447 -118 263 679 229 -337 -141 749 309 -517 -454 36 -8 -139 -58 -138 -65 310
2349 310 114 -135 196 168 -255 -148 241 -8 -301 -59 265 12 -14 -172 -40 123 478 23 -532 55 411
2370 411 -142 -612 -16 353 65 -26 127 477 582 116 -459 -63 293 -408 -878 -353 349 78 -334 -65
2390 -65 523 749 305 -281 -267 409 440 -490 -642 -110 202 58 -329 -296 104 392 208 -204 1 362 176
2411 176 -301 -47 158 -18 -349 -139 315 87 -188 -57 241 248 1 -336 -97 310 77 -403 -128 447 523
2432 523 -1 -17 247 427 213 -309 -465 -186 176 -327 -557 85 676 209 -301 121 610 460 -91 -465
2452 -465 15 493 -52 -821 -495 222 301 -281 -242 294 585 360 -191 -55 245 88 -80 -238 -199 113 -35
2473c5p4L08L3k04j51L13k1j48m02J16L97J80m97j11M38M57l44o03K93L56k05
2494I6m66j18L37K91j42k67K13M85J08o27%M73L2m95m75L21J97J48m03j09L05
2515i6N68j49o43L82L62j21m38J3Q7J74j33l00Q0K36J68k60j8L28j76k93K65K20
2537B56l36k28K37J59O7j48r8N5J61Q7m40k3L77J4l92p5K68K23pk05p5K86L04
2560D67l69m78K82N48m94m27K33L46rj94l7m4M32J15l87p0L52J7m32K9O5p2O7
2583f0Q5o3k28K87qj32N9K34k63J67J19j53j51J87J72o2k49P6j16J91P3l11R8
2606d8K5K10k43n6L01K0n0k27J29r2J29K0k94J4K56k2l19OP0K64j29J02k72R7
2630a09N13j08l96oK35j71n1rL8p6K64j44k2j26K38N0r0L6j02j2P0O0nJ1M4m4
$$ plain form
2473 -35 -109 199 232 28 -123 190 169 21 -381 -265 132 312 -185 -296 142 599 255 -348 -55 301 96
2494 96 -370 -488 -151 140 -2 -269 -56 429 537 -90 -90 383 415 -80 -555 -234 -37 111 -292 -401 -96
2515 -96 472 323 -320 62 424 303 -135 -122 -35 139 6 -294 -214 22 190 -70 -88 240 64 -229 36 256
2537 256 -80 -308 -71 88 155 7 -91 -36 125 212 -228 -251 126 140 -252 -327 -59 164 157 -48 -123 163 467
2560 467 98 -380 -98 450 -44 -471 -238 108 99 -95 -132 -176 256 371 -16 -86 266 283 -149 -120 -55 -127 -60
2583 -60 25 -38 -266 21 13 -119 -60 174 -89 78 197 44 -107 80 252 190 -59 17 -99 92 165 -146 -48
2606 -48 -23 187 -56 -112 189 209 159 -68 61 -31 98 118 -176 -162 94 72 -247 -241 -171 93 -36 66 -206 -109
2630 -109 404 296 -100 -106 129 -42 -93 -102 -64 -140 124 -20 -42 -168 70 120 30 66 -36 -48 22 82 77 88 132 88
2656H8k75J53J8qr8K11n6LN1o8o9O8N1M5k57J83j4mL1m4k72P6J75j22k9J59J29
2683A25kj34J18j54J19qj19j03J69L9k2j10n2J63j7R4p0j64J85J80j37J21j90
2706C1J30p9j86J34j06N5J25n1q5J8pm5Q7L6j33Q6L4k9J16j26J7j19q6J99L7k57
2732b04J86o6JJ72k5q5l2J78k0K2k17K1R5K15j78j56J5K15jk83j6J8J45N6n8O3
2758F1j16J04R6m9r4k1L0j7m2m2K7l0O6R1m2j57j5K34K10p9o2j70K07k1l39p1
2784b41K06pO5qn8N2PK07k46K2Q9O1j03j04J53j38Q3oJ13j61O5k59O3K41O4l67
2810b07M5J94J66j94j34L04r5j8j63N9P4J1q0j87J1L19k66J0K85m7j57J14J4J03
2834A61J27k47j44k6K69j36k95J54K54M6l95J27J34J55J3j85p2J69N4k86m5K51
$$ plain form
2656 88 -187 -34 -16 -24 -122 89 33 36 87 19 -50 18 69 114 -143 40 26 22 53 9 -263 -187 -12 -134 -163 -4 125
2683 125 123 -11 107 -47 72 64 -55 -158 11 50 28 -82 -134 29 12 106 36 -128 57 237 100 221 31
2706 31 161 82 -104 30 -76 -21 104 53 -32 -14 -21 -66 21 57 -76 10 44 15 131 5 22 -97 -183 16 53 -204
2732 -204 -18 -84 -83 89 64 -21 -53 125 105 127 -90 -69 26 241 63 -93 -78 137 136 -147 -163 -145 0 56 -2 61
2758 61 -55 49 145 96 2 -19 11 -6 -48 -90 -63 -93 -27 64 22 -135 -150 84 294 215 153 -17 190 169 -170 -241
2784 -241 -35 -42 23 15 -43 9 16 223 -23 -1 88 149 46 -58 95 -43 40 34 147 -14 51 -208 -145 96 160 -207
2810 -207 -162 32 198 4 -130 174 79 61 -102 -43 31 42 -38 -225 -214 105 -161 -151 134 87 -70 44 58 161
2834 161 288 41 -103 -129 140 4 -291 -137 117 163 -232 -105 29 184 197 12 -60 109 163 -123 -168 83
2856H3o1k91J80J68j40J8nj6J51rk24J03O0K19l36j48K64K05j43j70q2J42J84
2879A52n1k95q5N24j94j93J20L07pj92j01J38O7k04k09J04M29l4n10q7M32K25
2901C36k95k62K25J98R4j33l71R9K47o7n29K59K49M5k59R9J96L7j91j97J49K12
2923A41j42k23J52M00l2m11p6L53J74l85k13J43J38J04k36j87M43K18l96k34M53
2944A84K34k19l35O8J63O2j75l58K88K76r1m37J69O51j97l52n5K63L04k55m36
2965b48J47K24n4k30j12K99J36j00j63O5K00r4j83R1J44J8k46J06K86l0k35l28
2987c07L51P5r2k51J16K50P4m07j70M17L08j82m15K25K62n9k79k30K16L35l50
3008a13n9K5M69j29k40R7P7K20k50k46Q9L04k11k23j16J93J34j23mO4K39p5k46
$$ plain form
2856 83 22 -269 -89 79 -61 -43 -48 -64 87 78 -146 -43 17 236 -100 -248 16 221 78 -92 -174 -32 152
2879 152 101 -194 -279 245 51 -142 -22 285 278 86 -15 123 190 -14 -223 -119 310 276 -234 -321 111 336
2901 336 41 -221 4 202 296 163 -208 -109 138 71 -458 -199 50 95 -164 -65 131 168 -23 -220 -71 141
2923 141 -1 -224 -72 328 296 -115 -191 162 336 -49 -262 -119 19 123 -113 -300 143 361 -35 -269 184
2944 184 418 199 -136 -68 95 157 -18 -376 -88 188 97 -340 -171 480 283 -69 -124 139 443 188 -248
2965 -248 -101 123 69 -161 -273 26 162 62 -101 -36 164 70 -113 -22 122 140 -106 0 286 256 21 -307
2987 -307 44 119 27 -224 -108 142 216 -191 -361 56 364 182 -233 -8 254 195 -84 -314 -98 237 -113
3008 -113 -172 -147 322 193 -47 50 127 347 97 -149 -60 244 33 -190 -306 -113 21 -102 -106 -42 197 122 -124
3031a24Q3J61J16k46l2R4j45J2K4P0N6k6k29Q6K17j39r8rJ39L4N2j69J05J11K4
3056A67l05O1M5K39j04m50K12K19l4j88J50O6n4K1Q1q8J13j7k12J0k2J84j40j48
3080a94J5J22l7J40j12Q2J50p3p9o6J49K7j67O0p0L1O3Pj66j2J25Q5N1k44P2l2
3106g3J22J63j71j08R9P9j88J03M6j49R4J18k33j10J66J80q2j08J63m9P2k5o8
3129D1j31K06r2r7j43K72M5j86L4K0Q6R8m9n8N5N5Nj45l7J21l5K0l3l1j07J61
3155G5j26l2l3J83j03M3Q5j87R5K2M5j5j12M4j11M1K9r5N8J27N3k25J82qQ7j33
3181a1P9PL5p9J0j71J21R8j52k31M73m5j09n5P2O1j18K79k37j02K8K30j92j37
3205a46K0J42m0o5j03QK33j7j02k7J19P6r8PpL2J97r6j41j05R7NL9j06l0J00J39
$$ plain form
3031 -124 -41 120 236 -10 -42 52 -93 -81 -57 13 69 43 -186 -100 117 -22 -120 -129 10 44 96 -73 32 143 167
3056 167 -138 -77 -32 207 103 -347 -135 84 50 -138 12 78 24 45 126 38 151 134 -78 -68 -90 94 -46 -194
3080 -194 -179 -57 -94 46 -66 16 166 93 14 -52 97 124 -43 17 -53 -22 41 48 -118 -130 -5 80 131 -113 -41 -73
3106 -73 49 212 41 -67 32 111 -77 26 72 -77 17 135 -98 -208 -42 138 56 -52 111 62 134 109 41
3129 41 -90 116 24 -73 -216 56 101 -85 -51 -31 55 153 104 46 101 156 161 16 -21 100 65 85 52 21 -86 75
3155 75 -51 -83 -116 67 -36 7 92 -95 0 22 67 52 -60 -16 -127 -86 -57 -152 -94 33 86 -139 43 35 122 -11
3181 -11 68 75 110 31 41 -130 -9 89 -63 -294 179 134 25 -30 42 103 -15 264 27 -75 -47 183 -9 -146
3205 -146 -126 16 -24 -89 -192 -184 49 32 -70 -97 22 98 0 7 0 32 229 133 -8 -113 -16 -11 28 -78 -108 -8 131
3232A31L4k12M2J08Q1k27M7J17q5p0P9j60NJ05l5p9M9J4J61o3j21Q8P2j00L4k4
3258iO6n2m0l1q7K48Pj55k6l5K6J20J7j06N7J25lj4j81j40J97J25j58L7l9R3L3
3285G5j2j19Kj04J92J73j84P3r4k1j1M1m3o2J43j28r7J62%l4J27j32K08j31q4
3310f0K29r2mp6j22O5P6k0K6j57L0J49N7l1o9J14p3Lj44J45M6M6j43o0M5NO3p5
3338b7P6j43L7J45K2m5r9L1J37j73J46k07N0J25J20l06J1O7N7l0j25O2J14j17
3362g2MQ5j93L56j77j55J48O3m6k21J38J40j18l2K4m2J61R0o5n1NR4k40LO8o1
3388i4O4O5o4p0K52r4j55M2l6J71j00J18L2j7j62J03q1L1m8O1p8J35p3r8K3K48
3414A75j52k22J67M4M5j8k1j54K90j49Ln6J28j25Kj9N0K9r1J0J19n3J57j47o1
$$ plain form
3232 131 165 -47 -5 103 184 -43 4 121 36 -34 45 -115 -110 -5 -40 -119 -70 -56 105 42 -79 9 81 -19 15 -9
3258 -9 57 5 -35 -66 -153 95 102 -53 -79 -114 -88 32 49 -57 0 125 122 108 -73 -213 -16 109 -49 -12 -51 42 75
3285 75 63 -56 -54 -158 34 207 23 96 2 -19 -30 11 -32 -94 49 -79 -176 -14 -14 -48 79 -53 155 24 -60
3310 -60 169 77 73 -3 -125 -60 16 -4 22 -135 -105 44 101 70 1 115 42 45 -99 46 92 138 -5 -65 -20 -15 48 -27
3338 -27 49 -94 -57 88 110 65 -34 -3 134 -39 107 -100 -50 75 195 -111 -100 -33 24 -6 -131 -69 45 -72
3362 -72 -68 17 -176 180 3 -152 -4 59 13 -208 -70 70 -48 -80 -56 -98 63 153 88 37 42 136 -104 -101 -33 -94
3388 -94 -30 35 -29 -99 153 59 -96 -54 -90 81 -19 99 131 114 -48 55 -26 5 -43 18 -60 75 2 -96 -73 175
3414 175 23 -199 -32 12 57 39 18 -136 154 5 8 -48 80 -45 -43 -62 -12 17 -74 -64 55 2 159 12 -49
3439d9K61K8j94j57K0mN8j13M1J12j3mJ1RJ38j78L8K5J24j43j17P2Q0J6n1j66
3465a56J51J37n7j07p3K32j46R9k48R2R9N0k02K7J35M7J01l05J43pr0K2J36m5
3489C5J7p5k1K54l7p0l5j8J46l7k65j5J08j2j3N4j80K45nJ3mN1k7m8j9j64L7J03
3517A8j32m3K12j35J85j64k3K71m7k24J04n1J32k34J08L3N7N8j24q6K90j41q8
3540b4q6K4N4N2j21K0J59q8k4Q7M1m7l0j03J6jJ00k23R7J01K7o5J3J2J44P3j31
3567G7j6N0N3k09j65J24L6Q7j25R5n1J33o1Q1MP9k16m7N1P1o8r1N9N3J72k35N4
3594ek5M7M4j64nL5J21j68j4rJ54L4l9K4o6j5J3l6k7J16k6l8l8J56L7k03K1J90
3622A14Qj13N8o1J07j38q8n0J34J12n0p7J14K9Pm9j93R7Q8m9l3L2P3j09j30R0
$$ plain form
3439 -49 212 240 46 -111 -91 -95 -37 -150 -109 3 -10 -14 -3 6 144 -34 4 29 153 10 -107 -35 45 61 10 -156
3465 -156 -5 132 75 -32 -105 127 -19 80 -168 -76 23 73 -129 -102 33 80 181 -124 19 12 -78 -56 80 35
3489 35 52 -23 -44 210 173 103 68 50 196 159 -106 -121 -13 -25 -38 16 -164 81 76 89 85 136 109 61 42 -122 -85 18
3517 18 -114 -157 55 -80 105 -59 -82 189 142 -82 22 -29 103 -131 -23 10 67 125 1 -85 205 64 -24
3540 -24 -110 -86 -32 20 -101 -81 78 -10 -34 53 94 47 17 -86 -70 -71 29 -194 -97 4 31 -34 -21 -9 135 208 77
3567 77 61 111 164 -45 -210 -86 -50 37 -88 7 -44 89 28 109 113 192 -24 -71 -20 51 -17 -108 -49 4 176 -59 -5
3594 -5 -30 17 61 -103 -108 -73 48 -120 -134 -143 11 45 6 30 -36 -51 -38 -74 -101 15 -11 -49 -87 69 106 -97 -76 114
3622 114 122 9 67 6 113 -25 -113 -163 -29 83 33 -44 70 99 106 57 -136 -39 49 0 -33 -1 72 -37 -167 -77
3648g7K18l1j22M8j30J48J07k66K8N4J34k40j6L7K0J90n2q3J44j20o3m8R6N3j45
3673a16J90j57K47j55K5J70j92o6k5Q1O3j39pn2pK79j01j3r4K4J94p9l7j17M8
3698c6J17k90J13K9J06p1n6Q1N7Rq1J11j6J14j30p3J32J0l2q1k6k8K6k9K0KK2
3725@j8n8p3L89k11k8m9M2j6%lNLq4J5M8mN7r8Q9J42J3k38N8K0JP7r2O9o1J0J4
3757A9k1j19K12j62P3j8J54j32Q3L1j9J3j51Q2k7N2k02Q6J25j44Q7j14J71j37
3781e8P5J7q8RN5N8q1M7L6o0q0l6%J51j26l9J14q6K12k8q9j8N9N5j29QmM2L2q8
3811d0L5N6p1l5MJ37j20O9N8M2m7j14j1MJ51o2J09j74J8l4j8Q1j55P8M4L9j24
3838h0M0j7J4J35q1l9M9P6j47mJ35j65J13r1j8PJ07K6K1l4N6l8k0J22j72k3J22
$$ plain form
3648 -77 141 110 -12 36 -94 54 161 -105 -77 -23 111 -129 -145 -108 -88 102 50 -33 111 -9 -72 -120 -24 29 -116
3673 -116 74 -83 164 9 34 204 12 -54 -79 2 65 -74 -81 -133 -140 139 38 25 -69 -45 149 70 33 -84 -36
3698 -36 81 -209 -96 -67 39 -32 -88 -7 50 59 -22 89 73 187 57 -16 116 126 94 13 -13 -41 -15 -44 -24 -22 0
3725 0 -18 -76 -149 240 29 1 -48 -6 -22 -22 -25 -20 -17 -101 -86 -38 -42 15 -83 6 148 161 -77 -19 1 2 79 -13 56 -5 5 19
3757 19 -2 -121 91 -71 2 -16 138 6 89 120 101 114 -37 45 18 70 -132 -46 79 -65 22 -92 79 -58
3781 -58 17 34 -54 -45 10 68 -13 34 70 10 -70 -106 -106 45 -81 -120 -6 -92 120 92 3 -15 44 99 -30 -22 -26 16 48 -40
3811 -40 -5 51 -20 -55 -51 86 -34 35 93 135 88 -26 -37 -33 118 56 165 -9 9 -25 -43 38 -117 -39 5 44 -80
3838 -80 -40 -57 -43 92 11 -28 21 97 -50 -54 81 -84 29 -62 -80 -73 34 60 81 47 103 65 45 167 -5 -28 94
3865I4j26N7j8j8k5PK7P6j22R6l3j4R4j0olj39m9J17n1j6R6L4rM3j06q8K14j8
3894A04j11k8j01K17p3m1R5qr0J54j13o8O3j1j23R5J6r9J78l7P5p9l8R3k0k4j16
3921i0j7N1O0J0j37J72m4r0Q1L2r0O1k1q0J30o1l4O3k3oJ4m0J52l0nj27J41j17
3949d5J17p2m6R0o7J29j6j77J20K0j45K35r7j2MPj95J42l2j5l3J64o4n9P2j32
3975a07M1Q1K2q6L2Kj9q3J36J45j20j13M0j3K8KR2L9j68J26n6o8j2k7N7rJ1j17
4003a44J23J24n1q8J0J97o2j70K21j28mj33l0J76j6l8J9J03n1k6o9K6J15j00l7
4028c3m1J34M0j77p5R0J08p0nk6N7O2q2j32J73L3rknk0k4J03j11j06J42k1r9o0
4056a56K45p9q2J15P1j7o1RL2p1p1N6%L0Lm0PmP9n6j91K29j06KoJ7K9l1q6J69
$$ plain form
3865 94 -32 25 7 -11 -36 -29 -2 74 -48 48 15 1 95 85 79 76 -63 -112 5 -46 -62 34 68 59 102 -4 -92 122 104
3894 104 -7 -35 -136 81 8 -33 62 54 -36 118 5 -63 0 -11 -134 -39 -23 -122 56 19 94 15 -23 70 50 26 -90
3921 -90 -107 -56 4 14 -123 49 5 -85 -4 28 -62 -1 -22 -102 28 -33 -67 -4 -27 -33 -19 -59 93 63 58 -69 72 -45
3949 -45 72 0 -46 44 -23 106 90 -87 33 53 -92 143 46 34 38 45 -150 -8 -40 -55 -88 76 12 -47 25 -107
3975 -107 -66 15 37 -49 -17 -15 -34 -117 19 164 44 -69 -29 -42 -14 -12 80 119 -49 77 21 -47 -59 -86 -29 -38 -27 -144
4003 -144 -21 103 52 -36 -26 171 109 -61 160 32 28 -105 -135 41 25 -13 6 109 58 32 -37 -11 104 4 -33
4028 -33 -74 60 100 -77 -152 -62 46 -24 -29 -55 2 64 -18 -150 23 56 47 45 40 20 -4 99 -12 -118 24 3 -96 -156
4056 -156 89 10 -72 43 114 97 36 45 77 6 -65 -9 -9 21 24 -16 -9 -13 66 10 -181 48 -58 -56 -62 -45 -16 -47 -133 36
4086C6j51J46r4l6L4K19J7j67j27N5J41j30L0j3R9J30k60n7K76n2j69k4J59j7
4110D5J8m8n6O7N4j53J27o6N1l9M7j11J13j21O8j85J00J08p5K1J2J4R1j48RM5
4136a2r4J34r3M5R1j38M7k7J19p5P1m2p9J1O0l5L9j4J7l1N1r3J46l5j14N3M4j20
4164g4NJ5K6J0J44j86J65j56J47q6l1Q4Kj54j33J33Q6Qk3r9J30M9j9n2O8M9j98
4191i0M2J09l3j16N6J27o2L3j08LmK2L4o8L4j2J57j03j00J43JP8j62J3k2N4n7
4218c1n2P1j1O5M0l2l2J31j87O7J3l0n1J8jj4k9m8K51j14m3N4j42N4Q5l8k4L2
4246BP4j32J37j75P2L0K1p9K8K8Jlj0N5P1r2l6M8r1j5o4J81r7P5k1j10J75l8J0
4275D5r4L5k7qJ13n7k0l7l9M2Q0k4Mk4J06%j9N9n1l6p5R8J3m1j39J13P5o7QN5
$$ plain form
4086 36 -115 31 -63 -99 -65 154 171 4 -123 -68 73 -57 -27 -40 59 189 -71 -128 148 96 -73 -97 62 45
4110 45 63 15 -41 26 80 -73 54 -12 39 0 47 -64 49 -72 -4 -189 -89 19 -56 -35 -23 -9 82 -66 -57 -12
4136 -12 -106 28 -65 -20 71 -67 -20 -47 72 -3 68 26 -53 -42 18 -17 22 8 25 -6 45 -48 98 63 -51 2 46 -74
4164 -74 -69 -54 -28 -18 126 -60 105 -51 96 10 -21 63 65 -89 -222 -89 -3 5 -18 -117 13 62 43 -9 59 108 -90
4191 -90 -48 61 28 -88 -32 95 33 66 -42 -39 -43 -21 13 -55 -21 -33 124 21 -79 64 65 143 -19 -6 -28 26 -31
4218 -31 -83 -12 -23 42 82 50 18 149 -38 29 42 12 -39 -21 -22 -36 -65 -113 138 24 -19 35 -107 -53 32 -6 -30 2
4246 2 76 -56 81 -94 -22 8 29 -50 -22 6 7 4 -6 49 120 28 -8 40 -51 -66 -130 51 -46 29 8 -102 73 35 45
4275 45 -49 -14 -41 -49 64 7 -13 -50 -89 -47 33 9 13 -11 95 95 76 135 84 48 -27 71 84 43 -96 17 92 25 33 88
4305H8j54N9M1J7k1r1O4L5m8J47k06O9J02j35n8Q8J44k25Nq3J72m5K5k7O4K4l7
4332A4q3O3M9n6k1JP1j13L3N5N6j17J83j0j67P2n1J68k01J79j0nl4J1r0k0O9r9
4360e3k7J21m7r5J40mo8P7K5k8N9j2j85J12j6K4p8J4k3nR1q2M0l3J14p8Q7o2R6
4389A04k2l2j5M7n5j05K11q7r2o1N4j24K44j10J22P2j56J50j92L6J00j04l7Q3
4413C1Pp7Q8J8r1L6k4R3j34j8Q1R0j12P3j38K96k26K1R7k03J53n0L6J04k19K4
4439d4n8K37n7j3K8M1j45R6j18K03l1k03J37q0K4j8j29J5Q7O7m8Jpl5K7l8N8N1
4467D8j49K31j51J3J33j67N3j28K15o7j2k7OJqk4K3K8J6J6j19J9k1P3M1k8o1L
4495d3J89m9j84L5Q8o0o3R2M0q4r2R5M2n2Ln3R6q0O9j3J0N5m8J1j01Q2N7P5j40
$$ plain form
4305 88 -66 -7 34 51 30 -61 3 38 -10 137 -69 0 102 -33 -91 -3 141 -84 -79 -162 10 -35 -10 -37 27 51 14
4332 14 -69 -6 43 -13 -34 -33 38 -75 -42 13 69 -48 135 125 -42 30 -21 147 -54 125 115 110 76 87 -3 -23 46 -53
4360 -53 -80 41 -6 -101 39 35 -33 44 69 41 100 88 -97 15 -1 23 -55 -41 -64 -69 22 -60 -20 -53 61 -17 70 8 104
4389 104 82 50 35 82 27 -78 133 46 -46 -107 -53 -177 67 -43 79 151 -5 145 -47 -11 89 -15 -52 31
4413 31 38 -39 49 67 -24 12 -12 81 -53 -71 10 100 -12 61 -77 219 -7 14 111 -92 61 11 47 151 -68 -44
4439 -44 -102 135 78 65 93 134 -11 85 -33 170 139 -64 73 -7 17 -1 -130 -115 -28 39 -9 -8 -15 -50 -23 -61 -3 48
4467 48 -101 130 -21 -8 125 -42 11 -117 98 31 19 -8 -2 -1 -9 -33 -10 18 34 50 -69 -50 -71 2 43 15 -46 -43
4495 -43 146 97 -87 -52 36 -24 -87 5 45 -39 -131 -36 6 -46 -43 -96 0 -80 -11 -24 -14 41 -7 4 -97 -15 42 117 -23
4524b3J8m1P1j19N7RK11j34l5j75J38R4o1j20PP7j0m5N2J51j15p3J16J05k29O6
4550hJ02l7m5Nk8k6Q5P0n5j33n7K24j1q2n4o4N9J06j50N2Q1j3L2m7k2Q1p4k5k
4579c6L6O6j62L6P4m8J68L1r2n1P2n3j65J32l0J61k56J01J02j28J4j4P6n9p9L1
4605g3N4J02j09K2o6M5L8n4m9J23j3Kr6L3L3Q9k1q6K1R8rj67R6K2j0Ol3P1o4o0
4635e5lM2K2nm3M0J01ml7r2J19r7K3m0P6j9l9j5J7J12k06J43j15L5N1P3k12M5
4663h3R1N2j36J72j20N%n5oN0J23j9j05O3l6l1l9R1K7j9R4k26J72N0k97L06j32
4690hk3LN7o4P3p4J2j6k5l3K25j56M0J3p4J55k41J40rp9K0M5K7j0k8JP0r3Q2K5
4720E5n8o3J29P1q5j35J15k8K3k6m9J63m0r0r1K70k90J44N2n9j4l2n5O7O0J1m8
$$ plain form
4524 -23 -5 -46 25 -94 -37 -28 183 49 14 -161 -23 71 10 -110 -103 -26 -36 -81 -29 122 7 -66 50 155 -74 -8
4550 -8 94 57 12 17 -11 -37 48 118 63 -70 -127 97 86 4 -50 -114 -55 51 -99 -47 34 21 53 6 -16 65 -9 -34 -36
4579 -36 0 66 -96 -60 14 -34 134 165 73 22 94 41 -124 8 -22 139 -117 -16 86 -42 -28 -42 34 -25 -104 -73
4605 -73 -19 83 -26 -4 -70 -25 13 -41 -90 33 20 22 -74 -41 -8 81 60 -26 -5 93 84 -83 13 35 25 31 -2 69 5 -55
4635 -55 -58 -16 6 1 -42 -2 99 95 58 -34 85 -12 11 -29 47 28 -11 -26 -9 103 -103 40 -75 -40 11 84 -128 -83
4663 -83 8 60 -76 96 -24 -19 -19 -74 -80 -30 93 74 -31 32 -4 -35 -74 17 44 25 119 -107 65 115 -182 124 -8
4690 -8 -31 -28 29 -35 38 -36 -24 -40 -65 -98 127 -29 11 24 -50 105 -136 4 -5 -84 -64 -19 8 -2 -30 -29 41 -52 30 55
4720 55 -3 -66 63 134 49 -86 29 1 24 -2 -51 112 72 -18 -109 161 -129 15 67 8 -6 -38 -93 -26 34 45 -3
4747c%M4J1q1o0J28n7m5lj9L8lk8O8l2l7p1K08L7j25J26rm7M8j13q8Q1J8J21j6
4777I1ql5l4j4k4N0j1Oj36O6Q1j17J03Q1l5j00j14J14K7P4j78P9Q1j28N9l1Q6
4804C3m1Q8j00%l7J9J23j16P4K8Nr0P2k06J00J5n8M9n0J34m0k4J38m3j04J14j10
4831b7O4Qm6N2j04R5J0m0M0p7K1%Lo2P2n6N8J7o3j2OJ09m9M0K7p6o8Q7J18j81
4861c4M3L8j12N7n4R9P1nk0o8j7K0Q9k5j0o0J45j51J77j00k2o9l6P7j2j10J14
4888B5j45K32l2lk3o6L3j0m0Kk1J10k8j3j3J9j41L4Q2Qn7J82j96O2J2j9J08l5
4916F7m1K4j5L1N9j43m4J13m0N9j12R8J1n9m5n4J61jp8O6l1L3r8q7Q0M5L6l4Q
4945Iq3J26n1Q0j85K0k1J14j81J38J03o6j2n7J15Mj17K0J78k35J63j06J64r8%
$$ plain form
4747 -3 -3 41 52 -29 -89 39 -18 -63 -66 -85 -47 -50 -78 -10 -42 -79 -150 58 95 -30 96 87 40 88 -25 -113 -32 -14 107 91
4777 91 83 48 14 0 -24 26 15 21 -115 -49 32 -85 18 99 64 -36 -150 -36 -9 65 -113 -34 47 -81 -22 -53 33
4804 33 -8 80 -20 -20 -57 -38 85 -31 43 71 76 -14 58 -148 -48 -33 -91 -42 -92 42 2 -22 116 73 -31 83 -27
4831 -27 37 45 -1 51 -53 42 52 12 52 -25 -4 -4 -1 -63 9 -47 11 28 -35 -47 -41 68 19 59 86 10 -58 29 147 -34
4861 -34 9 47 -65 -8 -62 37 108 103 83 15 -2 18 107 82 72 12 157 6 183 83 61 -8 -44 33 21 -89 25
4888 25 -120 112 80 77 54 -12 21 11 -29 -27 -48 62 34 21 8 27 -114 -80 2 10 -47 135 -61 1 13 -6 102 67
4916 67 26 50 35 66 125 -18 -62 51 11 70 -42 56 67 8 -37 -91 70 69 -9 57 26 59 -39 -126 -46 -1 35 1 9
4945 9 -74 52 1 81 -104 -84 -105 9 -172 -34 69 3 -9 -66 49 53 -64 -44 134 -101 62 -44 120 22 22
4970B2L1k1k3n1l4K30j47m4j57K11l2J11%j01M2m7O2l7j9N9j25J4M4l7J7j34K33
4997F7n7Qo0m6Q9J3On7J4l1l8J16j21J34l5O4q1N2Lm7M6N7j33ML6pM9m2L6q3L8
5028fj0NP1n1K7p4P1n3Q8o0M0p2Q8k15J29m2J4k2N0PJ3Q4p6N6n9J11m1r4j15J15
5058b1J03M4k14K3Q1J4r4k8J18N3o1j1m4M8p8J41q7J44j09j19L8L6M6m1l1J0J5
5085b4J07O2j09j18L3J04r8R5p8N7r1QR5J8r6m8J36K6l8j61K3J14j3j20J02M5
5111C1O4q5J2j26P4O1M9j47J00j09j3Q8k7P0p5jJ11m0J8l2K3j4j0N6m4n7l3J36
5139H0j52P1n9N2r0O3k5QP8k6q1J15j44K15j27j6K9Q5m2L9l7j69J89%k3j9o3p
5167e6J35o7m4J39j01J0N0p1K1j5j7k7mqQ6k2l4kJ4J23l0q8r9k6J79k02Q3j1p2
$$ plain form
4970 22 53 32 9 -42 -76 154 7 -37 -194 17 -15 96 96 -5 37 -10 52 15 -4 55 -70 -56 -12 -49 -32 -166 67
4997 67 10 18 -42 -88 1 14 20 -37 -23 -54 -92 24 -97 37 2 66 -15 37 40 -7 39 96 -37 -33 3 -4 45 3 39 -44 -6
5028 -6 -16 -11 60 9 36 -38 33 -20 68 8 48 -24 64 -151 -22 -64 -50 -72 -22 -15 -2 82 6 62 3 114 73 -21 -136 -21
5058 -21 82 126 -88 -65 16 30 -64 -92 26 79 18 7 -37 11 -67 74 -13 131 22 -97 -59 -23 23 -18 -49 -39 -24
5085 -24 83 145 36 -82 -49 55 -43 52 -26 31 -60 -52 43 61 -35 -83 53 79 41 -120 -97 17 4 -116 -14 31
5111 31 95 10 22 -104 -30 31 80 -67 33 -76 -89 -1 -28 42 -33 -34 77 37 55 23 46 32 22 78 34 -23 -56 80
5139 80 -72 -1 -60 -8 -98 -35 -60 -52 26 0 -81 34 -110 105 -22 -38 -9 76 34 73 36 -133 56 56 33 14 -49 -56
5167 -56 79 12 -32 107 6 16 66 -5 16 1 -16 -43 -47 -55 31 9 -25 -27 -13 110 80 -8 -107 -133 46 -156 -73 -84 -156
5196a56K12L4M7j29j10J10Lj5q2J48j15j9N6QQ6o8L6p5O3O7j02mJ52k43K21j86
5222f1Q6K03l54L4O8NJ16k20J11J34j24m7m3J65j00L8l2J48j52J4R0r6oR8j44
5247f9J5J2M0J74j71k8M5J6j1j34J34q1n4J83r0j05J91n0M3o5K12k41J9J18p9
5272B4j35J70j51P1L3PL1RR2k18k4J93q4jl1MoQ8r3j13P9k6J39j22J09j05J57
5299I7p9Q4l00K63J5k09J75j24K1O7j1O1R1j49M6j88K09j8oj10R9j4k6n2n5K10
5325I7p6oN1m2m4P5n9j3L0M8o5J7K2m8k9k6l4N5j0MPQ3q5jj05J68J05p9j60J45
5355B5r9J00k2Op4R8j07m8O7Q2n0Q8m4k1n3R0q4N0M2k1J8k9J00p0q6J56j10O4
5383F8m4j40NJ58K9k2l1O0oJq7l2J13r8Q6o5j16J33j4k4L5J7J4k7nJ20j23K6J6
$$ plain form
5196 -156 56 90 137 8 -102 8 11 -4 -86 62 -53 -72 -16 -8 78 10 46 -29 34 101 -1 -5 147 -96 125 -61
5222 -61 25 228 -126 -92 -24 -19 97 -123 -12 122 -2 -49 -92 73 -27 11 -21 127 -25 -11 79 -17 -23 75 -69
5247 -69 -54 -42 -2 172 1 -27 18 34 23 -111 23 -58 -112 71 -19 -124 67 17 60 -5 207 -34 -15 103 24
5272 24 -111 59 -92 -21 12 19 50 59 151 -67 -91 102 18 17 -14 -10 -16 72 -21 -134 -55 -81 58 -64 45 -60 97
5299 97 18 102 -198 65 80 -129 46 -78 -57 10 -1 60 151 2 48 -140 69 51 45 -65 34 20 -6 -58 -113 97
5325 97 21 15 66 24 -20 55 -4 -17 13 61 -4 13 35 -13 -42 -68 -102 -47 -57 -53 -46 37 -48 -49 -154 14 119 40 -120 25
5355 25 -74 26 4 10 -64 34 -73 -121 -54 28 -22 66 22 1 -52 38 -46 4 46 25 43 14 114 44 -42 114 4 68
5383 68 24 -116 -111 47 76 54 23 83 77 78 -9 -41 72 -26 60 -5 -121 12 -2 -26 9 26 40 13 8 128 5 31 47
5412D7l1K7l4k0M3l8M1j04L2K9n8k6M9M3q7R7N6j35J86j72K8L7JN1j17K0N1J4
5440C0n0n8K9J41j03j03J00RM9j96J79j50P4J07j83K35k18J72j36N6k7J47r5R3
5464A02l8l5mRm4ok5lN8K9N0j39Q3k0L0k6m1L8J10q4j5lj9N6M0M6j57o3J40r3
5494b4p2K57j67Q0qq0K4m2KJ4kR0l5k3L1no6L2rl4KJ29j06k0K0MOq1N4M7pq2L7
5527c4r7J67k4j07M3P2j8j9J01j48m9J05mj8o9P5J7p8J34Jl5J9q8n9J74j61J18
5554A8K1K2m8P1n9n9J23j17j1P8n7J24r0K5m0K4o8o6P8L5n8J7L0j21J16n4oM7
5582b5Q1PKp9j07J15RJ11j41K26j94p3lR9M8l0k6p7J42j00N2J01j22o4K3o4R3
5609Dl9M7J48q2q0oL5P0k4pk4O6o7k0j9P1j8Kj5po3J12k1K5m6j4j13O5k5Q6N2
$$ plain form
5412 47 16 43 9 -11 32 -6 35 -69 -37 -8 -66 -92 -43 0 -87 10 66 -69 117 -55 -27 10 11 62 -55 -35 16 30
5440 30 -20 -78 -49 92 -11 -114 -14 -5 44 -152 27 -123 -49 58 -125 110 -108 64 -72 -16 -43 104 9 102
5464 102 64 29 25 34 -10 -16 -41 -44 14 43 93 -46 37 17 47 21 -20 18 128 44 29 26 7 63 103 149 -8 -71 69 -24
5494 -24 -96 161 -6 74 66 -14 10 -32 -30 -16 -18 72 37 14 45 40 -26 6 -3 -37 -35 94 -12 -32 -12 -8 -2 -83 -29 18 11 -71 -34
5527 -34 -131 36 12 -95 -52 20 2 -17 84 -64 -113 -8 -12 -30 -99 -24 -7 -85 49 50 15 34 -54 -113 61 -100 18
5554 18 39 61 13 84 25 -34 89 -28 -39 39 -18 106 16 41 1 25 -43 -109 -31 4 -54 -37 -7 -128 -12 -66 -72 -25
5582 -25 56 63 65 -14 -121 -6 3 114 -27 199 5 -68 -71 28 76 46 20 -57 85 -15 37 138 16 -48 -25 -89 4
5609 4 -35 12 160 78 -2 -8 27 97 73 66 42 108 41 21 2 73 55 57 42 35 -28 84 63 88 42 28 -85 -20 -45 41 93
5640I3j45L7m2J1M9r5J71j29RK09q9l9n0q2%J8J10M6k4l9p7N0n9PJ17p0J0K9j27
5669a01MR2nJ1m2L3k9M5j2j6P7J2J5o5j06Q3P4Mn5K6k1n2R8K9j30Q6L7J5j32M5
5699B0k5J32j53Q8LMJ10j01j8P1r1nM2k44J78M0n0l3j5Q3o0J11p3j19Q1L9M0o1
5727fJ8n4P1j14O8O4q6P0j09J3P6m7lM1j9Q5j20J7J26q1m5M4P0j56k3J02J61p5
5755H8j36m3J26m0L6j12O5n0O4K8n4K9l3J44j31K1N6j18K7Kk5J30k19J93q1N9
5781B6q5N9N7o5M9n1r9R6L4J07j41J05p7J39j91O1J09j77N3j00M7K3J7J27j54
5806c1N8L0j11j9K7J55l3q5o4M6M3Jq8M3J12k38J49n6J07oq2o6J90r3P0j26J51
5833H4J2j23R8kMj13J07j29P8K1j0q1J56JM3k43J46P7j34J76k74J7K6O7j29J17
$$ plain form
5640 93 -52 -15 -57 -46 3 -92 79 -50 -41 168 79 40 -10 -92 -92 -74 36 82 58 19 -58 -8 -67 -60 57 -13 -3 26 -101
5669 -101 -97 -5 -10 1 -41 -8 -37 8 -4 -20 57 69 84 19 -87 -4 70 74 19 45 24 -28 70 99 -31 55 92 107 -25 20
5699 20 -5 127 -26 62 65 69 179 78 60 131 40 35 77 -167 11 51 1 -32 -47 36 -24 87 14 -105 -24 15 55 -6
5727 -6 12 -42 29 -85 -17 47 -39 31 -78 -65 11 -36 -39 2 -17 68 -52 -35 91 10 -35 9 79 -77 -100 2 163 88
5755 88 -48 -91 35 -5 31 -81 -16 -66 -2 26 -28 1 -32 112 -19 2 58 -60 -33 -31 -56 74 -145 48 -33 26
5781 26 -59 0 57 -8 41 -10 -109 -13 21 128 -13 92 15 154 -37 24 133 -44 9 -91 -44 -21 -4 123 -31
5806 -31 27 57 -54 -73 -46 109 76 -9 -73 -27 16 17 -71 -28 84 -154 -5 -61 46 40 -42 -108 82 -11 59 -67 84
5833 84 96 -27 71 69 73 -40 67 -62 16 37 27 -54 102 103 146 -97 49 126 -8 168 -106 -89 -63 4 -125 -8
5859hn7L8Q7r2N4J9O8j83l8k7J08l9p4K4J44J64k05R0K5kj94m3R9K9K8oM9j60
5887a02R4O2k07J59M8J9j65O5J04n1K5j21KNR7J05l0l5n8L0o2o4M0k7LpP3j28
5915a26O3L4pO0j15L5nL8R3j55J70O7j10p7P1l7N0j13J56j16p2J6J87m8p0OQ0
5942G5j36J02km2oP2Lk5o7M7o7j13K12j54O6L2l4L8m6R0k2r4L1K5j01J28M6p4
5970a6p1K4JK2M9J83j02j15p7J34k62K14PP5q8n4Q7l7J34j5j60J5M9m3J59o7j11
5997f5j0Q5j9NM5o5j8j1O9K9r3K6n8L6J55j38l3K7K8L6j02q6J55jRO9o5j4N8j19
6027f5J43Qj11J6j11J47N5J4j28J56k5j13kN9Ro4K2K9P6j05O2n8l8k4m1O0O3n
6055B9r5k5J27O7q0L6M2m5j04O5l3o7Q0mM1l0r5J09k1O6J9j06L8N6l3J1n0Q6q8
$$ plain form
5859 -8 -65 -27 60 -32 22 41 109 -74 -112 -139 -31 -70 -144 -120 24 188 -17 73 98 96 -98 -141 -42 -13 15 9 58 -102
5887 -102 -8 54 -153 6 54 73 -92 -27 77 26 51 -70 -68 -63 34 139 109 74 16 46 -16 -80 -40 -67 -64 -71 2 -126
5915 -126 -63 -29 -36 24 -91 -56 -61 -23 70 -85 85 152 42 -35 36 -1 49 -64 92 -24 -96 -80 107 59 -11 -5 75
5942 75 -61 41 39 -3 -9 63 66 41 -26 21 -46 -159 53 -101 -35 -3 -37 1 -45 45 23 -71 -40 -15 -116 12 58 -16
5970 -16 -87 -63 -62 -40 9 192 90 -25 -102 32 -230 -16 -9 66 -22 -76 11 -26 108 93 -67 -52 -3 -46 113 46 -65
5997 -65 -75 10 -9 -4 41 -24 -42 -53 16 45 -48 -22 -80 -44 111 -27 -60 -33 -5 31 -71 -157 -2 -3 6 75 10 -4 54 -65
6027 -65 78 86 -25 -9 -120 27 82 96 -32 124 99 -14 -16 43 52 -12 10 39 115 10 72 14 -24 -48 -89 -29 34 29
6055 29 -66 -91 36 103 23 59 101 56 -48 17 -16 -83 -3 -7 34 4 -91 18 -3 63 82 -24 14 70 37 48 -2 84 -4
6084dJ23l4o0o0Q2q6J70j65M1P2l3J5j29Qj9J05m9lL8l1Q2L4k25O5K08k46O8Q3
6112E0q7L3m2k4K9J0L1%k3K9mP2j10Pj9J24j32O9k3L8qj33J48M1qk5M7j20M9m6
6142b7K6J40j32lk7K7k1j7K8lr4M9k6J13n0O9m6N8j47J20K8p9N1k4Q6j19L1l2
6170b1M9k7M0R2k07Q8m7r9J94J39j01k0j26JJ41m6k11K34k3K7np7k3R3op0%M4
6198C3J8j20NJ03r9M0M9n1m3N7m6oN6o4M1rl2L0K6M0m7OQ0l5j24K79j44j30J51
6227F4j21Q4j5m4Km6P5n1L5J07o0p7M3O3j49R5L3K7j37L6M0J55j70J43q1o1P3
6254F3Kj10K0k9J1k5J3M3M0Rq4MJ11nJ8r8M0j3N5j5o7N4o8J21k5j42Q5K0n5Q3
6284E6j02OQJ7n0R6N7p3L3r2J25kr5lL3r1lJ02l8Qm6P8Q7k46K32j02j9M8Nm0k9
$$ plain form
6084 -4 119 85 25 -35 47 -39 131 -34 7 79 46 61 -68 -60 -79 26 -23 -26 12 -19 63 97 -128 -63 145 -101 -33 50
6112 50 -37 -4 -46 -70 -41 -31 0 0 -23 6 2 74 -36 -29 -48 76 -56 13 -10 28 20 -113 35 76 68 43 90 -30 19 -27
6142 -27 -1 139 7 4 -23 4 -17 -34 -6 -9 -103 -54 -80 33 -17 52 6 64 -83 37 65 -14 37 13 99 -20 11 -21
6170 -21 28 1 41 133 -74 14 -33 -132 62 201 100 80 -46 -45 96 50 -161 73 50 77 72 -5 -28 65 59 -11 -11 33
6198 33 51 -69 -64 39 -60 -20 29 -22 -65 -8 -54 -60 -4 -68 -27 -36 -68 -38 -12 28 -19 -13 67 32 -92 187 43 -87 64
6227 64 -57 27 12 -32 -30 -76 -1 -52 -17 90 30 -47 -4 59 -90 5 38 65 -72 -36 4 159 -11 132 51 -10 63
6254 63 65 -45 -25 -54 -43 -68 -55 -12 28 37 -47 -43 68 63 81 -17 23 10 65 50 -17 37 -31 90 65 -77 8 28 -27 56
6284 56 -46 -40 -32 -15 -65 31 88 15 48 -44 81 79 -16 -19 14 -77 -80 22 -16 -8 -54 24 111 -135 97 -5 -24 24 29 -11 -40
6315d0O8n5j0N4J70j62j31P4L5K4K0O6k01Q0J25Jr4m2J9J5L1K2p4mN9j21J4Q1
6343B4J8m2K1Q7j10K7m6q6J14K0j4j9J21j48l2M6O6m2n4J37r3jr7l4J22l1J25
6370G9m5J1k3J4J6K0r9k2J10r8M8J07m1q7qk3kn1K7ljK09k93J36n1P1L5N5j48
6399e7P8J4P6p0j11K9J24j25J38o5K9r6mJ46m3j61RM4J5OP8j25J54l7j04l2J01
6426A1j7P9o8Q3p7R4j4j86J05k0J14k13J27q4N1L9jn3R2j1j19RJ8m0J51j29j9
6453g8Q3q9K2K8R5K4pmr6J63M8j78NJK3K2o6o5K01J0j97R9m0p2P6k9J55k18J53
6482F9j08L3O1m9n0N5m9J29j18m3J08K3n8L4j04k3J8J35o2j05N4k3J53Qj10k1
6508d3J45Km5j0o4p%J8O3n7m1M9l1m0J7m4K68k04r8J37j22P8L5J25r0qq9Qq5M5
$$ plain form
6315 -40 28 -27 -37 17 187 25 -106 -32 3 27 47 113 -88 -8 117 118 24 -18 1 16 47 69 -5 -9 50 -71 -57 24
6343 24 42 0 21 108 -2 25 -21 -107 7 27 13 -6 115 -33 -65 -19 47 5 -49 88 -5 -6 -103 -137 -15 -46 79
6370 79 34 45 22 36 52 72 -27 -49 61 -37 11 118 77 -10 -18 -41 -43 -94 -67 -70 -71 138 -155 -19 -70 1 36 91 -57
6399 -57 21 35 111 41 -70 -41 83 -42 96 31 60 -36 -40 106 63 -98 -89 -45 -30 -24 54 -71 83 46 -58 -90 11
6426 11 -6 73 5 88 11 105 91 -95 10 -10 104 -109 18 -66 -15 24 23 -30 62 51 -68 -59 -41 -81 70 -59 -78
6453 -78 5 -84 -62 -34 61 85 78 74 -22 141 189 11 16 17 40 62 -4 -69 132 142 -55 44 4 -68 8 -21 134 -84 69
6482 69 -39 -6 55 6 -44 11 -38 91 -27 -70 38 61 3 37 -67 -90 -72 63 1 -104 -50 -73 80 88 -22 -43
6508 -43 102 104 59 49 -15 -22 -22 -4 59 2 -39 10 -21 -61 -44 -88 180 -24 -122 15 -107 -29 6 131 41 33 -56 -48 -133 -88
6538h8J30p2j33J54l7P5j02J17n9j21L5O3Q2J12j99j2R6J05n6j73J28k3j03J44
6562F3r7R9J0k32J35j7J25j48J08l8n0J38Pj57J32o3jN3j24M8P7p0q1N0l1M5j05
6589a24M2P4l6R7o3L9opj04J1j9O3P3j63K30j28R2k15J00Q2o0o0j9J22j54J15
6615a8J02j35Q2n9J24r0P2n8J9n2q1P1J13r7q6R8M6p9n4K5P7oJ2qJ60k72L14l00
6643h0R9pJ8N6o8j56J03k9K8K48j91Q4p0k0Q1j35J45p7j20J95j15r9J13j21J45
6668B7Ln9j9K1J19j17N4j81K30j46J08nr1O4%o9R9l1q9J67n0l0J5j38J62j10J2
6695e4J19kq5j8L5m2ml6R0P8n6p1R5l0Q8j06J4ro4J63j82J34K0j3j45O8K4M3j
6724E3o9p3P8m2L3P9m9l1m8N9l6k6pM8%Q2q5J21j66j19K09%l5J5N6Ql9K4Mj1m9
$$ plain form
6538 -88 42 -30 -163 -9 -46 29 -73 44 -15 -136 -101 -38 44 156 -43 -55 41 146 90 -83 45 22 -81 63
6562 63 -34 65 75 -157 -22 -39 86 -62 46 8 -42 96 103 -54 78 15 14 67 -57 -9 68 -2 -83 -33 -64 -19 -124
6589 -124 -82 -8 -44 53 -10 29 23 16 -88 -77 -96 -33 40 -123 107 -21 71 -144 -44 38 -22 -82 -101 21 -133 -18
6615 -18 84 -51 31 -28 96 6 78 20 39 -13 -94 -23 90 -7 -93 5 51 -28 -82 -57 20 14 26 18 178 -94 220 -80
6643 -80 19 12 30 86 18 -138 -35 -64 -36 212 21 105 35 15 96 -39 106 29 -91 104 -11 -110 3 -118 27
6668 27 30 -29 -48 -27 92 -25 29 -152 78 -68 40 35 -56 8 8 -61 38 7 -82 85 35 5 20 -118 44 -66 -54
6695 -54 65 63 -22 -40 -5 -47 -51 -87 3 81 25 -46 49 19 107 1 15 6 -58 105 -77 57 77 64 -81 -13 11 54 53
6724 53 -16 -89 -11 -53 -20 59 10 -21 -69 -10 -46 -72 -79 -31 -31 51 -34 87 -79 -198 11 11 -24 -9 47 55 16 40 44 33 -16
6755a6N3j8m3P0j4RK2j14J25J8j21j37K14O0q3m1M4n0k4m2N6n6K7P2N9j01Q6j12
6783e7J23K5J1j22n9J81n1K5j6lj7LL3j6M9j45N2k9N2K0N5p3p8P6m5j7k7O5O5
6812H0l9j44K27r6k3Nj1R1j10L0K6%N5r0p6J05n4P2j09J2O3o0J01l3O1j38o7J17
6840eq0j1MJ12KJ31j22j41qK77j19P5m8l6l4o2M3Q7r6Q2j3r3M1J2O8M0p5j31Q3
6869a7jQ2Q5j49p4R1r5J01k0O2M3j26K7oM8p9J3K5J0j0O0j0j32L3J29q2M4k2L9
6898F9j36J53k00Q5RJ8j61K18j18K8P0J6Jl0M8K0n1j39Q9%J15j61N1J23j30o0
6924g3N5N2j5R1j62N8j9R6m2n1m9p6K63j03k5M0nj5Q4j27N2L0j17Q8k3j9R4p8
6952DJ5l6P4j1j30J62k07M2P8J9L9J5J4j57K23q4j89J23M8j8J5r2j7J47j17q0
$$ plain form
6755 -16 37 19 -24 46 32 41 63 -51 74 92 -29 -166 48 108 25 -16 28 -22 -46 -88 -32 -88 -61 11 70 -31 55 -57
6783 -57 66 91 102 -20 -79 102 51 76 60 57 40 43 76 60 109 -36 16 -13 39 59 114 41 -37 39 -6 -23 -50 15 80
6812 80 41 -103 124 28 5 10 -1 90 -20 10 36 36 91 1 -75 30 -24 48 -61 -49 14 -46 55 22 83 -55 -122 -5
6840 -5 -85 -96 -92 20 22 153 31 -110 -118 159 40 115 67 31 -3 -65 -22 65 -31 51 38 -55 -14 -2 66 106 31 -100 -17
6869 -17 -18 64 149 0 -74 17 -78 23 3 65 108 -18 9 3 51 -28 -15 10 20 10 70 60 -72 -39 90 8 52 30 69
6898 69 -67 86 -114 -29 -20 -2 -163 55 -63 -35 35 51 52 22 70 90 39 -100 -11 -11 104 -57 -6 117 -13 -73
6924 -73 -18 34 19 110 -52 6 -13 83 41 -10 -59 -135 128 25 0 40 35 20 104 -23 29 59 -58 30 7 -12 82 4
6952 4 19 -17 57 46 -84 78 -129 -87 -9 10 49 64 78 -79 144 60 -129 -6 42 24 39 -53 -70 77 -40 -120
6978a20J22n5R7j3l0J14j03q3R3n5Q2o1j02K41j88K15k7m7q8n7N8M5Mj17R6j31
7004a10Q4N5J5m2j7P6j40J75j48Q1j76J67N4r7O3K8p9O9P9k0k20M8q1L6J85Jj52
7031f6Q0j00L2O0Q2J0r3O3j29m0J45rN0m6o4K07o8j35lL1K9o5M9L0K3N0k11K9
7059e9o6K41r5p9J32o1J16j0j36j4K1L2J5l9J29j26o7P6kJ5r3R4o7q2M5J05q8
7086f3J49O6q7LJ8q0%oR9k3k0jq3L8l1L3l7O1j08n4J37olL3r1N0L8K5j27O7K1
7117A8n0K9k3l2L1K6M7J9r3n9N8N1k5N5lq6J14KN5k9l5j33M9Q1Rj84J67l2qj03
7147h4J66j11q3J11om7O3k7O9k6j58J73L2j3O3Lp0j04L6p0J37kj09MJ11p8o6J39
7175E3%j2L4qq5Q5p4l3R2Q7j37J8Ro9J43n6J19k39K3N6n3J30q9N8k2r1N7J34n4
$$ plain form
6978 -120 2 -53 44 31 1 115 12 -71 22 -33 49 -12 -114 127 -61 154 127 80 -8 -65 -7 38 42 -75 21 -110
7004 -110 -26 29 44 2 -15 61 -79 96 -52 29 -147 20 74 -23 40 68 -11 58 137 117 -103 -55 -136 -100 85 86 -66
7031 -66 14 -86 -54 6 88 98 5 68 -61 -101 44 35 85 39 -25 182 114 -21 -24 7 36 -29 20 50 73 123 -88 -59
7059 -59 -125 116 21 -58 74 13 129 119 -17 -31 -10 22 37 -2 127 1 -66 10 8 23 -70 24 -43 -125 -80 25 -63
7086 -63 86 152 65 68 86 6 6 0 99 76 56 55 -28 10 -21 12 -25 36 -72 -126 11 5 2 35 -56 -6 32 57 -70 -3 18
7117 18 -32 -3 -26 -58 -27 -1 46 65 -28 -87 -29 22 -3 52 49 -37 77 79 134 105 70 -63 -14 67 76 -108 59 27 19 -84
7147 -84 82 -29 -112 -1 -7 -54 9 -18 51 25 -133 40 72 59 122 125 55 -49 -13 -83 54 52 -57 -53 58 -20 -86 53
7175 53 53 41 75 67 -18 67 -7 -40 52 139 2 20 29 -40 103 47 166 -73 -50 6 -47 83 -6 52 30 -61 -4 130 76
7204G6p6J36j55OM7j95J97j09J03l6Q5o3n5M2k9O9o2Q8J03j65J5l1J1j9r7M2J04
7231C2Lo7J13p6M2Jk1L2n3O0o3K5O3n1j26RJ21Q5j74Q5J2J0r3K6j3K1qj16K44
7260A23j33qoN5m0q8K14o3J9j30Q8m5kJ34k2K3p5Kj88J96o7l1jK0k22K53o5l5
7288i4J79q0J38j69J9M0j08j2Q6M4j23M2Q3M3j04J9n0NJ21r6R7j45J7j6L7J04
7314G7j97Q3mL1K2J4j43J18Qo8j3Q0njj10J09K6N2j02P6j3q5J63r4r6J50m8Mj4
7343B0m7LK9p5J24l5L0j6n6m9j8J36n2Po5mJ1Q8m6J09j10j8O3n5k7J18L2J9j52
7372c6J37k11N5rQr4M8J80j62J75j56J12m6N4m7m5K4J05j70R6K0P6o8N5q8p4m2
7399a03P9L0m3K9O5L3Ol3q4N4j17R6k34J28Q9J0k3k%n5J13l1N1r3K02j82r3J99
$$ plain form
7204 76 0 136 -19 -13 34 -161 36 -73 30 -6 79 16 -39 3 -26 43 -19 69 172 7 22 -9 2 -17 -114 -72 32
7231 32 35 -32 81 5 47 48 27 59 6 66 3 28 91 40 -86 -77 44 129 -45 40 52 62 -31 -5 -18 3 -5 -121 123
7260 123 -10 -18 -24 31 -9 -97 117 54 73 -57 31 -14 -16 118 96 119 44 46 -142 54 -13 -44 -45 -25 -247 6 -59 -94
7288 -94 85 5 143 -26 -7 33 -75 -87 -1 43 -80 -38 45 88 -16 3 -47 -42 79 -17 80 -65 -48 -64 -27 77
7314 77 -120 -37 -41 -10 12 26 -117 1 9 -59 -72 8 3 2 -108 1 27 79 -23 53 40 -45 118 24 -72 78 30 34 20
7343 20 -27 -24 5 -70 54 19 49 33 -23 -72 -90 46 -6 1 -64 -68 -57 31 -15 94 -16 -34 29 -26 -53 65 97 116 -36
7372 -36 101 -110 -55 -64 -56 -150 -102 78 -84 91 -65 47 1 55 8 -37 -13 92 -78 18 38 114 46 101 13 -61 -103
7399 -103 -24 6 -37 -8 57 90 96 63 -21 33 -84 12 -222 -94 -5 5 -18 -20 -20 -75 38 7 58 -35 167 -15 -108 91
7427I1J7j24m8J30J1L4m9l0R3qk1j08J06k7k22J44M4K0O2o1j32K4Q8k0l0j4p2
7454a02J42j71J67p9qJ3o0M3K0Q6p8N9k2O4j00nK4oK9r4O7K0oJ13j26P4n8j04
7482i8M7J02m3M0k11K11o3R9p3pj2O2J7p0j53J60pJ1j13J03KL8j63O9j33K68j28
7509d5N5PKJ5L5o8m5O9p2MoR1p6J31j6j17P1ml2J46p8n1Q4J5o2Q2m0k04O8L4R3
7540H6j30P1O5r7L8P4j70M2N9j05J10k5n9n2MJ43j33j4J79m6o6O1j56J89P9j21
7566B6J0Kj52J25J27j02J8r6K1j4N5J2q2P1n9N6q1K0J88j35J01j84N5kRK3l9k0
7594d7J33k44J48Jj10K30r5o2p7N5J29j68P6k4L8jJ00o6j05J14pN0q7%l1J11j
7621F0r6R8K3k1m3L8O7j93P0k5n4N9nr4Q6p4J05m4Q0p3P7N8j15rN6j40J24J40
$$ plain form
7427 91 108 -16 -64 66 77 111 62 32 125 117 96 -12 94 67 -155 -11 33 53 115 54 -78 -54 34 14 -16 -30 -102
7454 -102 40 -131 36 -43 -51 -38 -98 -55 -35 51 -27 32 10 74 -26 -31 -7 -13 16 -78 -11 9 3 116 -10 64 6 -98
7482 -98 -51 51 8 48 -163 48 -15 84 11 4 -8 54 71 1 -152 8 1 12 -101 2 4 42 -121 -52 -185 83 -45
7509 -45 10 17 19 34 69 1 -44 25 -47 -43 -49 42 -34 97 81 -36 35 31 -1 145 67 16 100 115 53 135 95 -109 -41 -7 86
7540 86 -44 27 92 -5 33 107 -63 -21 38 -67 43 18 -41 -93 -89 54 -79 -93 86 40 -26 35 -121 68 147 26
7566 26 36 38 -114 11 138 36 54 -42 -21 -35 20 32 -50 21 -38 18 -63 -43 145 10 111 -73 -18 -20 -11 12 -27 -47
7594 -47 86 -158 -10 -9 -119 111 16 -46 -123 -68 61 -107 -31 -55 -17 -18 82 16 -89 25 18 68 -19 -19 -50 61 60
7621 60 -36 62 85 64 21 59 126 -67 3 -22 -76 -17 -22 -116 -30 -104 1 -43 37 -36 41 99 -16 -25 31 -109 15 155
7649A55k00P1r2R8J9l8J7lm7o6J0O8K4Qo8Q7j6n9o0J97r5M7R3j80M8p1p0J63O4
7678A04n5qN4j85P2Q4o4l3Q4j43J39L4j74J01J9q3J07Or6L0J42j01Pk4r1Lm4J52
7706C7p7m5R9p6R2j19J30j5j07J12%l5M1j29J40m2J6o9J16M9r9j2j1n1N3oK7K7
7734D6k0j10M6Q0m3M2p7l0P5R2j34J27j00J9r3J35j26J15pl1RL5L0j53J6mM2J1
7762hj7P1R1q5l1L0K4q0r0J24p6J50q6n5j3K9P4j32P9O8M7j96KO7l9j3R8m4M5
7791C4j10N0l7J49n8l7m3J6O0k9N1k1j7o0l5J54r3k3J36l1j01K3N4j24N9P4q6
7818d5O9R6q2r1J44j55M3O6K0J8J2j13p6QK04p3r5Q6m9K0Q2k19L3R4p6Q9L8n2
7846doK5P0Q9k20L5O7o3rj3Q5q4M3kN0j17J11q3o1J02J9K4o0k2O9LJ7l7n7P1o2
$$ plain form
7649 155 -45 26 -66 32 51 13 30 27 -20 -86 -76 -8 16 24 -44 43 27 -32 -92 105 10 57 150 -30 18 -53 -123 40 104
7678 104 49 41 95 -90 -18 66 2 -31 53 -90 49 83 -91 10 29 -54 53 59 -37 -7 135 34 41 17 -74 -71 -115 37
7706 37 -40 -85 14 -62 30 -89 41 26 -81 31 31 -4 37 -92 48 6 22 -47 69 118 19 7 -4 -55 -2 -8 19 46
7734 46 26 -84 -38 42 -1 41 -36 -66 9 101 -33 94 -6 13 -80 55 -71 44 37 6 15 50 80 -73 -57 -61 -19 -8
7762 -8 -25 46 137 52 21 51 75 -5 -95 29 -47 103 17 -38 -51 -22 52 -80 -1 67 114 -82 -80 -13 -52 -65 33 -11 34
7791 34 -76 -26 -63 86 28 -9 -52 -36 24 -5 46 25 8 -52 -87 67 -26 -49 87 56 -45 -22 32 -92 -33 41 -45
7818 -45 24 120 38 -53 91 -64 -21 45 65 83 95 -18 -94 -86 118 45 -50 36 -13 7 89 -130 -97 -3 -79 10 48 -4
7846 -4 -10 15 85 174 -46 -11 56 -7 -16 -29 56 -28 15 13 63 -54 57 -26 -87 15 34 58 -2 -24 45 48 65 28 -29 42 -20
7877b0n8L3Q1kk7o1O0J45j63R2j52n7J43l7O9j07M2J2m9NJ02m5R2r1o0R1j0j2
7905A6l0K02j45J4L3o3l0j55K79j28p5K10j83P0O0J7j98J31j01Rk6J33J10k10
7929f0J3J1R7q4L9p8m3J15k6l0Q5j18Q5l2J03j02N2r7P3l9k5L9L8J0j09O1o1Q3
7957@j0L2L1Nj10K8N0Jl7j63J08Q7P5m3K7q0j2m2Q0M1M7m8OJ2j37n9J58K4j38
7986f7Q5j0j18K0J04l2O4Rp3j3J1M0l8K9Pj15J09l5N7j73O7l7J28j9%l1K0R0m7
8015C2J33r5K6lj01R5lj31P4k6pqK7j23Q4N1p8L2L1N8j37Q7o7MRJ15r5RK9J1m9
8046a6Q6q0K0M7m4L9M9n9L0q4R3k3K4p1J11p4j52J20on9J03j0NQJ40k12NJ8P8
8075H6j09M4J2j7l4K1L1n2J34j38pm0Q6r0P6j08O7N2m1M8o7N9qK0j06NJ06oJ13
$$ plain form
7877 -20 -78 -45 36 34 7 -54 6 151 -12 80 -72 -129 14 -23 46 -61 -19 -7 -56 -51 51 6 98 7 -53 38 28 16
7905 16 -14 188 43 57 90 27 -3 -158 121 -7 -82 128 -55 15 75 92 -106 25 -76 -67 -93 40 150 -60
7929 -60 -47 -36 61 -23 16 -62 -105 10 -16 -46 39 -79 6 -26 77 -25 27 -70 3 -36 -61 -22 16 26 -83 -22 -83 0
7957 0 -10 22 53 58 -52 -24 26 27 -10 -173 -65 22 97 54 81 1 -11 -53 27 68 115 67 73 85 -52 -111 47 71 -67
7986 -67 18 8 -110 -90 14 -18 46 55 -18 -31 -20 20 -18 11 18 -97 12 -23 34 -139 -72 -109 19 0 0 -31 -11 79 32
8015 32 165 70 96 93 -8 87 84 -47 27 1 -6 -14 13 -110 -26 25 -53 -21 10 68 -69 18 -49 -45 -36 79 -16 -7 22 33 -16
8046 -16 70 -10 10 57 13 52 101 42 72 -12 81 58 82 11 122 48 -104 16 10 -49 54 44 49 57 197 -15 -10 8 86
8075 86 -23 21 33 16 -18 3 34 -18 116 -22 -29 -69 17 -73 3 -105 -38 14 -27 21 -46 13 5 25 -81 -76 30 24 137
8104A37r9l6L6j64J12K26j57q1N6p3J62j91l6J03j6k8QN4m2J07p4L3j59J39k7
8129a0J5j21J32r1p7K37n1j09N7QR0K0j30P2q6M2Kj58Q3k2J84j05J32j36p9J69
8155F8j11k1J40K9m1j12N3J7J8j51P7P3o2J67k28K6Q4p7J13k78J46j2j2No6J50
8181eJ7k7j3J5m9l7R7j20O3Q3m3k7J38q1J6r2P8m7m5J20M4n8J8L5m0k8K6j27J22
8210C3K9k2o7j14J34p7J80j53Q3M4q4J68l07J90Lm4M3j33J01M0k1p8K7Q5l3j32
8236a05Q9N7j6j01Q2j06J57pk5J9J14j83j10J29l6M6n7J36o7LL8P6j58J95k09
8261c9M5K6Ro5R0p9QM6p1J0j31J55Pmk6L9M6m9o0k1L2NJ7q0J25J2k5k2KkJ3N8
8293G1m3k6J5j48J25P2oK9m1J11l3j22nl0j3J22n6j1K22k30O5j45OM9J22r5k5
$$ plain form
8104 137 38 2 38 -126 -14 212 55 -26 30 -43 119 -72 -108 -5 -21 -49 -41 13 -29 78 4 37 -122 17 -10
8129 -10 5 -116 16 -75 -152 85 34 -75 -18 -10 80 100 -30 42 -44 -2 0 -158 -75 -97 87 -18 114 -22 -101 68
8155 68 -43 -64 76 105 64 -48 5 22 40 -111 -34 39 -23 144 -84 -58 26 -51 62 -216 -70 -82 -94 -89 -155 -5
8181 -5 12 -15 -28 -13 -62 -99 -2 -122 -59 24 -19 -46 92 11 27 -65 13 -34 -79 41 85 27 45 80 40 12 38 -89 33
8210 33 62 40 -27 -141 -7 -84 96 -57 26 70 -14 154 -153 37 40 -4 39 -94 7 47 26 -52 -25 60 27 -105
8236 -105 -16 41 25 -76 6 -100 57 50 25 44 158 -25 -135 -6 -42 4 -53 83 16 19 57 133 -25 170 -39
8261 -39 6 32 41 -24 66 -13 -5 41 -30 -20 -151 4 11 7 -19 20 66 17 -43 -64 -32 -27 -10 -90 35 47 22 0 2 0 13 71
8293 71 28 2 17 -131 -6 66 60 89 48 159 126 4 -1 -31 -44 78 22 11 233 3 68 -77 -71 -22 100 5 -20
8320b0P9l8j65J52K8m1N2r4L3kL9O7q2Q1j00RJ54j84M3nJ03n3l3M6J9j13pK0m
8349a6q7J53m0J5Pp8N9nN2n9oQ6j17K05r2j34P6Ol9R7j21o4Q8M3j61J06P2p3J37
8378A10p1p0O7o7nO5Q4j80k6J34r0J25j14J8Q9q1Q0k1l7j2J10j95J77nj6M8o1
8405E6j23J34q0j10J54m4j0j9PK5R7j9p0P2j29j6M1J33j72K8J05n9J4l2N8j20
8431g9J15k8J0m9J56j67R5O7j02rLJ03r2J08k60J87p1oqn0J02j14Q7O8j03J13
8457G6r7O7q5Q6o8k9J98j51J53j66K4j8J6m3M7o5m3J57p8p8L8L2R6j4Rj62lP6
8485b5N1l7oj26Q7K30q8j64J24J8%k4k7KQ5j95J58N3q6P6j03q2J41kJ2Jl3q6P0
8514B4R8j43rM1L4o0k5J23l5j4p5o2J41K1p3q4N4J84k04J30j88J30L6J6M8j00
$$ plain form
8320 -20 59 21 -144 8 36 -5 47 -47 -14 -16 23 90 8 89 -11 -2 152 -32 11 6 109 56 23 69 88 -25 -32 -12 -16
8349 -16 -103 50 10 25 32 -46 13 8 60 1 -5 81 -36 169 77 -57 19 25 -14 83 -38 -102 -14 29 -132 -26 46 -27 110
8378 110 39 -31 36 -31 -36 29 113 -67 -93 41 -49 76 -38 -20 69 -12 68 47 10 -2 108 -87 90 85 69 117 56
8405 56 -67 67 -13 -123 31 -13 -23 -42 -35 -10 87 68 -2 70 -59 -75 -34 99 -73 -45 60 1 15 -17 41 -79
8431 -79 36 8 18 -31 125 -42 53 120 18 9 12 115 23 131 -129 58 -13 -19 -27 -77 25 -89 -2 66 -37 76
8457 76 -21 46 -39 47 -21 -50 148 -3 150 -16 8 -10 6 -37 10 -55 -98 59 -19 -97 -59 -27 69 55 64 -98 -101 -25
8485 -25 26 -11 -17 -143 -56 174 86 -78 46 64 64 40 13 15 100 -95 63 116 30 106 3 -79 62 60 72 73 40 -46 24
8514 24 122 -21 -30 11 45 -15 -40 83 48 34 -41 -103 38 59 -14 -98 -44 140 -64 66 -122 8 44 60 108 8
8540HJ4K5L9o8r6K12j16K6K6j76O6O0L1j69O3L4J69j25L7n5k4j54J67M8rmo9p8
8568a18Q4j4N4j9N2j2j37J48o0L9l1J9J5k3l8jJ18k3L4m5J8j7j07J05J6kr1J48
8596A12j36R8j38J30p4n8N5OpRJ31j26j0j0j3r1J03k5M9om6P5K4Pp2n1Q1N2r1
8625b2J10j68N8l7R6M5p2p7J78j14J6o6J16K6j08J9L5J4O4j55P7j00J02j51J45
8650C1Qj19J2j7J97j81J16J0O8M8k01J39j47P5J1l0o2L1N4M3p0k4J9j27J13J8
8676A5%L8j79K35j44J23p4Q7j31k8O1R4q9o7K45k73M8M2P1j57P5K8P0j59O3L1
8702B5m5K1l0j3K7K5M3q5J68j56J03j43J90o0k5j07mL8O8jp8J4L8K5K5Ko0k1J45
8731A29j14M2L1L4o1q7n7J58J7j33K5R9o2j5J7J03j03LRN7P2k07l3J37k8nM9j73
$$ plain form
8540 8 22 47 86 18 -78 134 18 44 70 -106 -40 20 51 -118 -55 -21 148 23 60 5 -19 -173 -6 42 33 29 -40 -118
8568 -118 -34 -48 6 -13 39 27 -110 38 -22 17 -14 5 20 -3 -41 -42 76 53 87 42 60 43 -64 41 57 55 -36 112
8596 112 -24 74 -64 66 -8 -66 -11 -5 -12 -3 128 2 -8 -18 -31 -122 -19 -44 5 -1 -47 28 52 59 -13 -64 17 69 -22
8625 -22 88 -80 -22 -59 37 82 10 -67 111 -3 13 -53 63 89 -19 0 35 49 113 -42 35 -65 37 -114 31
8650 31 39 -80 -68 -85 112 -69 47 57 125 173 -28 111 -36 39 50 20 -42 -11 43 86 16 -8 11 -116 -3 15
8676 15 15 53 -126 109 -35 88 14 101 -30 -58 3 97 8 -59 186 -87 -39 3 74 -83 -8 20 90 -69 -6 25
8702 25 -20 1 -29 -42 -15 10 53 -32 136 -20 83 -60 130 70 45 -62 -66 -28 40 39 -39 -25 13 38 63 65 5 -16 129
8731 129 15 57 88 122 61 -26 -83 75 92 -41 -16 83 21 6 23 126 23 26 35 92 164 -43 -76 61 33 28 77 -96
8759i6L2Q3M7m5N5q8L9o0L5l1Qk5MN6j01J63M8q6j33N5J3l2K06j05P1j5j93N7
8787c8J47j24j0KJ73j03j1r2P4PO2j11OJ03l6n3J0pn9J06j2p5m3J97M4k28J48
8814G7j10M4k3J03q0Q3r0o7N7N1j20KN4K2j1p6L2J27j31P9m1L3j2Q6j38L0L0j21
8842a10J51m1j0Q1j51R7J8J6j7j2n0J38n7J8m5o6J22p5lj9O5lj22R0Ll3J52k08
8870g1N4k3O2q5K3N0N3o9M2Oko6k2R5j43N2JJ17p1J42j71M1J07K5r3j6k1K07j23
8899A01r1l1L7k0K7j96K10L9O4j59RLO4O1j11L8k1L9o0J50k01R5M5j28Q5%J8o0
8927GL6l1O9p1L3K2jl3n8j1J3NJ34p7j41K10k7j49J01o0l1J00l7m4mlJ79l3j22
8956b4O6m4o4N8M1nl8K2J01j00k1Pj1J44j68J07j67J13j0pr6J29K2p3M9J05m4
$$ plain form
8759 -96 -64 19 66 21 76 -12 27 -33 2 -29 -21 -46 -42 14 -87 76 124 38 -95 -40 -27 -59 147 42 113 98 -95 -38
8787 -38 109 -15 -25 -23 150 47 36 -56 18 25 87 -24 -18 85 49 -4 6 -1 -60 46 34 -41 -84 113 157 -71 77
8814 77 -33 11 -12 91 11 94 4 -63 -6 45 -75 -73 -19 3 -8 -84 -52 75 -56 23 -18 15 3 89 -49 -19 11 -110
8842 -110 41 0 -10 71 -80 17 35 51 34 22 -28 110 53 71 26 -40 82 7 4 -15 50 47 -75 15 18 -15 137 -71
8870 -71 -17 -40 22 -63 -40 10 63 -6 36 42 40 -26 -48 47 -96 -44 -43 74 3 145 -26 15 122 147 54 38 17 224 101
8899 101 10 -21 16 -4 23 -173 37 76 140 -19 -10 -7 57 118 7 45 24 63 3 153 -48 47 92 -36 49 49 67 7
8927 7 43 12 81 10 43 65 64 31 -27 -38 -25 -20 114 37 -104 106 79 -70 31 -29 -60 40 3 -41 -45 -48 131 98 -24
8956 -24 42 -2 -66 -8 33 28 -10 12 113 13 -8 -1 -12 132 -36 71 -96 17 7 0 -96 33 55 -18 31 136 92
8983I2j69J07n0J85n1j22r2J11M7j6l4k8l5R0K2m7R2j16J40rj63J01j08R8j7m8
9009b0L3J2j3J21j68Q8O2q6n5J28r8j6P5p1J9R3r5Q8j01K8J7j58J27j31M7J17
9035D3q7J44k54J74K8j05R5m4l2J0p2K27j54L0k4l5O2k6K2Q1K5j25K04j53P0r6
9061HJ3J4K8r2J02m6k5L5m2K3o5M8L6r2J03q1J27j23ON3m8P1p2p5O9O7L8j06L0
9090DJ0k6K0k1K4P7j73r4J73L3k8o1N7K3m4J8N6K8n3p4RJ07M4k9p8J7p6J72N0
9119A65k41M3R6n5N9k5ML9j33O0Qj05P6M8o6J97j79QK1N0q5L6Rj10P2n1nJ13P2
9148A21j33pP1j00K7j3M9n6J2k4P5p9P3jlN4j3n9J06r9R9l7j0MJ7J49k51l2K00
9177A40j54l2R0n4M0M3q3o8J33j01k9M6J9k6M9N4j19J14r5R3r6L9R2j51J05j17
$$ plain form
8983 92 -77 30 -20 165 114 -8 -100 11 58 42 8 -20 -55 35 57 10 102 -14 126 117 -46 55 -53 45 28 -20
9009 -20 13 25 12 133 -35 53 115 29 -26 102 4 -12 63 -8 11 104 9 97 -4 24 41 -117 10 -121 -74 43
9035 43 -44 100 -154 20 48 -57 38 -6 -38 -28 -100 127 -27 3 -21 -56 6 -20 2 83 108 -17 187 34 104 8
9061 8 21 35 63 -29 73 27 2 37 -5 18 -47 1 37 -55 48 -33 94 -29 -23 30 -18 53 -19 -94 -25 42 80 -26 4
9090 4 14 -12 8 -13 11 88 -85 -179 -6 27 -1 -62 -5 18 -26 -8 48 76 23 -51 -42 65 109 80 2 19 -57 115 165
9119 165 -76 -33 63 8 67 42 46 85 -48 12 20 -85 -9 39 -27 170 -9 -1 20 70 -15 21 30 -80 -8 -59 -64 49 121
9148 121 -12 -19 52 -48 -21 -34 15 -41 -29 -53 22 -57 16 15 12 66 53 -6 100 1 100 63 53 57 74 223 -28 -60 140
9177 140 -14 -46 44 -10 30 73 -10 -78 55 -46 -75 -29 -10 -36 13 67 -52 62 -33 60 -36 3 95 -56 49 -68
9203f8R4j83R8j7R7m5m8k5K07k11K23r8N1j0n2N5j65Q1j2np5J31O4k3L3j67k6
9230i6J27p6pK9K03j45p5L4o0P0J9r7j7J42K9q5J7J16j07m6Q5k2M4j29O7k1M1
9257D0N4j21J9N6j27O6r0K75k18P7q6MJ33m7k5o6QJ43k02J57l9O0j54J96j8j17
9283b2j7J29j25j3Q3j03l6O4K2l6J0J24j05NJ52p7j0m1K9O6n5l0KJ07p5Q0r1j12
9311g5K12r9M9p2l3P8k02R0N2o9K11j80M1LL9q1M9n4J35j04nOMKnr3P3O8p6J54
9341A18p7n6rJ7qmL0mQ6q1jj4j6N0Nj42J45q8N2lj2nP9o1P6j26lM0ln2J0J46j82
9374i3oJ25JO7j97J10R6m0j11J31j99qJ16Op0J23j23M4J8k4J20r3Kn6J27n6o2
9401e2J3P9K7m8oJ2K5N4j11j60K20l0p1L7L7K1M2j28N1l3J20n2P5j44N2q6K7n7
$$ plain form
9203 -68 26 -157 -59 -76 21 -24 -72 -97 110 -101 122 24 75 65 13 68 -97 -16 -28 -33 -108 23 87 64 97 -70 -96
9230 -96 31 -45 -52 -23 180 35 -40 -6 -66 4 23 -74 -91 51 80 -5 12 128 21 -25 60 38 82 -47 20 -1 40
9257 40 94 -27 -8 48 -79 -13 -103 172 -46 31 -55 -51 82 35 10 -56 -48 95 -107 50 11 71 -83 113 95 -22
9283 -22 -39 90 -35 -48 35 -68 -104 -40 -18 -54 -44 80 -25 -20 132 55 45 4 33 99 44 14 16 123 48 128 37 -75
9311 -75 137 38 87 15 -18 60 -142 -52 0 -69 142 -38 3 6 45 -36 13 -41 94 -10 -15 -9 -5 -3 -8 -101 -28 40 -36 118
9341 118 41 -15 -24 -7 -15 -19 11 7 93 12 11 -3 -19 31 36 -106 39 -49 3 0 -12 -17 62 1 77 -49 -52 -12 -15 -67 -57 89 -93
9374 -93 -99 26 27 94 -103 7 103 63 -48 83 -116 -124 -8 -2 -72 51 -72 -28 -10 -34 86 -7 -5 -61 66 10 -52
9401 -52 -39 40 67 19 13 25 50 104 -7 -167 53 23 -48 -11 26 47 89 -39 12 -21 99 47 122 -22 30 -56 -29 -86
9429h6Q2K1j8n1l7J46JQm1L9Jj31J10N6q2P6m5L0L9j84JO5j6m4J21J09j65m6J53
9458A12m8K1oJ0j81L4J4L6O6m4K7j2J44j42m0n4j2Q6qJ47j37om3N9L1j7j3PMo
9488B9K8QOm3j29J28Qn5nl1L6p0J39N6j33J63p1o6o7Q8Q9q9j2ML4O4k75J41%N
9518b0L1j08J24l7P3M0m4j54M7o6R4j5J13l8R9j18q2P2M0j15L5r2J51m6PJ4pO6
9546F4m6k3P9j21n9l0K41J0k29J09O1j60K31q8n1K3nkm2m7R5j15K08q8O3n5j7
9573FLN6Mj16K1J1r2K33n7KJ7o7L5r2j0O9K2N7j35p5L4J25l5O5j79J45N7o7L0
9602F7k4j65J36O7o2L7o3K6M5J16r8j35JL5J07l3k0m0R2n5k1j3j4N5l4L9j36J54
9630F4j1n2j7k5k9J12m4J7N0j20J11m4L9k9O9m7lJ5p5J7m6n1R2K9j15J23m8o5
$$ plain form
9429 -86 -4 17 -1 -52 -89 57 58 66 25 64 65 -66 44 100 18 94 49 79 118 -66 -65 0 -16 -60 61 170 5 -41 112
9458 112 64 85 79 89 -92 -58 -44 -8 58 14 41 29 173 31 -9 -63 -75 11 3 150 13 7 -36 23 54 37 24 31 35 29
9488 29 57 65 71 28 -101 27 35 -20 -25 -56 -20 -90 49 105 -28 135 64 -2 -69 19 108 19 7 11 45 109 -166 -25 -25 -20
9518 -20 11 -97 27 -10 63 103 59 -95 -48 -114 -20 -35 78 40 139 21 -61 11 51 -64 -29 -121 30 -16 -9 5 -2 64
9546 64 18 -5 74 -47 -106 -136 105 115 -114 -5 56 -104 127 39 -12 11 6 4 -38 -85 10 -105 103 15 78 23 6
9573 6 9 65 69 -47 -26 -15 -107 126 69 71 88 21 56 -36 -46 23 45 102 -33 -108 -74 51 16 81 -98 47 104 37 67
9602 67 43 -122 14 81 19 56 -7 19 64 180 82 -53 -52 -17 90 57 37 -3 89 34 13 0 -14 41 7 46 -90 64
9630 64 53 1 -16 -41 -70 42 -2 15 65 -55 56 12 51 22 91 44 41 56 -19 -2 -48 -99 -7 22 -93 30 -18 -83
9658h3P2l5O8m0r3J18M7k1j11J2Q7mj15P2K3n8o0K45j39j2L1J18%r5j9M5l7l7
9686b1J7j8O2j27P7k5O2L1K6n1n1J1K9j03J33p0M4q3J44o0J3j1n2n3J62j44M4
9713a4n4J7l6J2K3p1J39J7L4lo5m1J6O0P7k32M7k3K54k14Q8m7J39m0m6J07j97
9740e3m6R3JQP1j09L3P3o2r4N2k5O1Q7o9n6N4l5k7jl4J75j9o3n7P3k4K4j00J31
9770F2o4M9q4O7k7q4j2j1K32j70q0J08L3n4N3qP0j18L5N3nl0p3R6n9O9k2O8q8
9799Fk8J4m0O0m8l2J54p8j15J10J2k3P3j29Q4r2J05J4l5k4N7j9j06n2J33p3K20
9826A48k55R7J01q6L1n3R3J9q2j2M0J9n0M9JJ6r4o1J96p2KL1j22Q4L3j54J38l
9854E4j64O6J60j71r8J73p7l0K2O4J5j22J48q3qLJ12o9rQ4j86J10m9l3J46p2k2
$$ plain form
9658 -83 -11 -46 22 -18 -111 7 54 33 -78 -66 21 17 -98 -26 -3 -61 -121 124 -15 -27 4 122 122 27 8 53 16 -21
9686 -21 -4 -22 40 -87 -10 -35 27 58 84 33 -18 -7 22 -81 52 -18 26 -57 87 27 40 29 -23 -76 86 -58 -14
9713 -14 -68 -51 -87 -75 -52 -123 16 33 67 64 -1 -42 -26 34 111 -121 -74 -97 157 -57 31 -16 123 83 37 144 -53
9740 -53 -99 -6 -5 3 74 -35 -2 71 9 -85 -33 -58 3 90 21 -35 19 -16 -43 -44 -78 97 78 15 -42 31 7 31 -69 62
9770 62 -2 47 -37 30 3 -81 -93 -104 128 -42 -122 -14 19 -35 18 10 80 -38 -3 50 45 15 -58 38 -21 48 26 94 6
9799 6 -22 -8 -48 12 -36 -68 86 8 -107 3 15 -8 65 -64 20 -72 33 47 12 -12 45 26 -80 -132 1 -72 148
9826 148 -107 -10 91 5 36 -17 76 95 13 1 41 60 10 59 60 76 -18 -79 117 45 47 78 -44 40 73 -81 57 54
9854 54 -110 -44 116 -55 -153 20 -57 -87 -65 -1 14 -108 40 -43 -51 -48 64 -5 -14 70 -116 -6 -55 -88 58 -14 -36
9881c6M1J2p4J54m6r7K8R9j42J00N6q3R1j00L0K1j2M1j40J6N7J0q0n4K28j91j1
9908h2J5L2N2p1J47k26J18N9Oj05P5L7j04J14m0kj16Q0M8N3j10l3Q5j20O7l1m
9935e6O3k6J8p1K08j05o6J09j11RN6r3R0N5j86K96l28J67m7J3Q0m4K8r2j06R4
9961d5m4R1P7j49J48j18M7p5K8nO9M7j55M7Q2j17J24m1j21J16J9l7Ro7R0q0QP1
9989A9j3p3J04N8q6K0k3l7N2j8N7j27R6l7n2P9N5q2r9Q8M9j03ll0L3J08n1N3q9
10018e2J55j79L0LM6p4N4J8Q0Om6j08J17j06L8J9o6M2m6qJ34j14pK04p1J1q1N9
10046E8r8Q1J5q4M9m1k6M5L5j06N7Q1j86R8m7R2j7N4M9j74NJ08j33P2N3o9Q3J8
10074G2k02J74n4P4M6k18K16p9q8P2R2r3k8m4L8m3M1l2R4Nmopj8K2M1p8k6K3J10
$$ plain form
9881 -36 5 17 -57 97 51 -46 -18 81 -61 39 95 12 103 3 33 54 42 83 -57 -41 16 26 -54 -108 120 -71 -82
9908 -82 -67 -35 17 -54 93 -133 -15 44 50 -55 20 57 -47 67 27 25 -91 -11 37 90 -20 -53 32 -88 -21 -52 -56
9935 -56 7 -19 -1 -72 136 31 -35 74 -37 -28 28 -65 25 80 -106 190 -138 29 -18 -5 75 31 59 -33 -139 -45
9961 -45 -89 2 79 -70 78 -40 7 -68 -40 -45 24 71 -84 -37 45 -72 52 11 -110 6 25 -12 -3 -70 20 -60 -52 19
9989 19 6 -67 37 95 9 29 6 -31 21 3 60 -67 29 -8 -60 19 74 -8 -107 -19 30 -73 -76 -106 -73 35 -16 37 -52
10018 -52 103 -76 -46 -43 3 -71 -17 1 81 87 41 -67 50 -56 -18 1 -65 -23 -69 -77 57 -57 -64 140 69 80 -1 58
10046 58 -40 41 56 -28 21 -20 -46 -1 34 -72 -15 66 -120 -22 -69 23 6 60 109 -65 -60 48 -85 -13 40 -29 54 72
10074 72 -130 44 -10 64 110 -108 108 29 -59 13 105 12 -16 -60 -22 -65 -24 -56 38 43 39 33 26 8 30 71 -7 -33 -10 100
10104A00l5j30K3N7m9n2O9L1n7K3O1j42Q9Q2n7J0L6o0Q7j8j01N6p4J7J17m7Nn1
10132a0MJ23j38P3p5K9k6J25j9k2q5J6P3q6m9L9j8N5Q8P0k14Q5kj15MJ3J18j29
10160g3J25OJ5r4J1M7n6R3j0j68K10r3l5j9K8P4j34J11n2M3j8j07J22j25Q8j01
10186a12J60j8j9k9R5r6PJ30j17P8r3P2j39M0O0l5j5N3m2R9j02L0K7j09Q2Qm2
10213b7J18r4m4j3J18l5O0n8n2M4Qq5KK9L1ok7k1J72j31M7j19K13j05k9o6K93
10240B23j75N4j45M9J8l0K8l2Q8n9j02l2J83K8j81Q1M2j9j0n6L0O7M2n9j0q1j
10267e9RN7m0K7n1J88k7k37K15j12O1n7Q3k7K7m3l5J29k07Q4K7j9k3M6kK5j24
10294h5J09l0m6K6j4M1p7O5J14m5p8L4n3J46j76l8J37K6n6r9J51lJ9N7r4l1j4
$$ plain form
10104 100 65 -65 -42 15 -34 -86 -17 14 -43 -20 41 -101 -12 70 13 23 59 -1 86 68 -33 23 -51 -34 83 36 41 -10
10132 -10 -6 117 -21 52 -23 6 -20 105 86 64 -21 -5 68 -18 -67 -28 -46 9 97 167 -47 38 36 -79 -75 -62 56 -73
10160 -73 52 58 73 -21 -10 37 -19 74 64 -104 106 13 -22 -41 -13 61 -73 38 -14 29 11 -96 26 -99 -11 -112
10186 -112 48 30 11 -18 77 -19 -12 118 1 79 -14 58 -81 -41 19 -16 -31 22 -20 79 -23 7 34 -75 7 15 -27
10213 -27 91 -3 -47 -60 58 23 83 25 -27 17 25 -60 -58 -29 2 -4 -31 -52 120 -11 36 -83 130 25 -4 -70 223
10240 223 48 102 -43 6 24 -6 22 -10 78 19 -83 -115 68 96 -85 -4 38 19 9 -47 -17 50 92 33 23 -58 -59
10267 -59 -50 7 -33 -6 -57 131 104 -133 82 -30 31 -26 57 30 57 14 -21 108 -99 -15 12 -7 -30 16 14 39 -85
10294 -85 24 -6 -52 -26 -40 1 -76 -11 103 58 -20 14 -39 107 -69 -107 30 56 0 -99 52 49 68 125 31 0 -14
10321a4M7m3O4q0m4J46m2J6J7o1o5N5L1R9o3j33J76j66J26j35Q4O0n7J0p6j7O6
10348AJ17j78J1J67j33p2R2o1O2m9J37j28n6J20o9l1J23j19J88l2j32Ln2N3J32
10373I4n6n9q3J44p6R6N4j83Q4q4J16J24j46q6Rj13J10J3P5j32J30K0k9rL5q2
10399c4L0J88j71n1j3R7p1J41q6j00Q6M0J6j25j4N8J1j5j5J2J7J0l2j1j2N7r1
10426g8K1J52nO8j03j29P1j4P9J9j07Q8L6j99O7K3K6J52j52l2k2J53j29Or6R9
10452fL6q8N9k6K7Nn7kM2RN2j16J32p2M9Q7j64p%L5m4J04l3r6K5K8kj72K40r9
10482e4J31L8j99L4oJ47j40R2L9q7K8m3R6p7l7J54j66j5K8L2O9n6j6l7Q6m5m2
10509d6J09j8k1o1L9J7o0O0J5m5k5n3P5L0N7r3rj4n7K53j05M3j29J6K2j0k5J01
$$ plain form
10321 -14 33 -10 54 -26 -70 76 34 50 67 6 -59 -4 27 126 63 -70 106 -60 66 -69 15 75 18 28 -48 -65 1
10348 1 118 -60 -49 118 -15 -87 5 -56 6 -43 94 -34 -90 30 -39 -70 53 -66 122 90 -42 -39 -91 -38 94
10373 94 38 -21 -104 40 -36 60 114 -69 15 -69 47 171 25 -61 -52 -165 -55 -42 33 -99 31 51 22 13 48 -34
10399 -34 -4 184 13 -38 -51 46 -25 116 30 -70 16 56 72 -53 -67 -9 2 -13 -28 -16 1 11 -21 -32 -44 13 -78
10426 -78 -57 95 90 158 55 -74 -3 -17 62 81 -26 62 98 -101 -34 -11 15 167 15 -17 -39 114 -15 -9 -105 -6
10452 -6 30 -58 1 -25 2 7 -50 -52 -10 -1 51 -65 67 -5 44 131 -33 -40 -40 -5 -49 55 22 -74 -49 -21 -23 -195 45 -54
10482 -54 77 115 -84 -50 -56 91 -49 43 82 -5 23 -20 76 -1 -38 116 -50 -65 -37 -5 64 8 -8 -45 41 -4 -46
10509 -46 63 45 24 -37 2 19 -41 19 34 -11 -36 -89 -14 16 73 -20 -29 -43 -100 153 48 91 -38 -22 0 -10 -35 66
10537F6q1J14p9m8Q5l3o2Q5l4K2N0j10M4L8r8QLj8J6R1o4M4m1k9K1PQ2k5m4m0
10567c0K3l3L6r3K17J0n0j35N2OR1q6n9J12j21P5j2j9J23k20K04o3N0k01J10M
10593ij08J46Q5j05r8J41k5J0m9R0pj8qo4O5m8ql3M7r0N8l4J10j15M6J6j1m1J09
10622E2o3RNmkK8l9P9L4o4r4J49n8N5L6j30l3P7j2j6J3Q3j72L5N5N2O4j92R4L5
10652G6l2j49Q6mJ61j54J27j64qR3k0J0l8L0j56J88j00J35j30L9L5n7jQ4m3%p5
10679f7J19k8M3J3p9n0P3M7j20M5O7m2q2k6M9K8R1j2k3j38O2n2L3J33j25M7j3
10706gR0p6J53j49n6l7J31j18Q1L3j4o5R7o5Q5L1p5O9l3np9M5k6O2j26K18j94
10733c0l9k3J6Q7p9Q9l2q9J14j4l3J72r8O8o5j22J37q0P6j5n0N9J6j00J25o6m4
$$ plain form
10537 66 -15 99 20 -28 57 24 -38 47 13 35 85 -25 19 57 -41 -33 -30 -48 -32 59 -5 39 -2 -31 -10 -3 79 54 10 -30
10567 -30 -7 -40 -4 -97 120 130 80 -55 -3 3 94 8 -51 61 -60 15 3 -16 107 -113 91 28 78 -123 -13 -9
10593 -9 -117 29 114 9 -89 52 27 37 -12 78 71 53 45 -19 46 -2 -10 -43 4 -86 -28 -62 48 -67 -21 -5 -16 -57 52
10622 52 -11 -2 3 -1 -3 25 -14 65 99 35 -59 90 32 87 123 -7 -40 37 25 9 22 105 -67 -32 23 75 139 -53 41 76
10652 76 44 -105 -19 -23 138 -16 111 -53 -61 32 12 22 -16 14 -142 46 -54 81 -49 -10 25 -32 -33 51 8 8 -67
10679 -67 52 24 67 80 1 -49 24 71 -49 -4 63 21 -61 -87 -38 -10 81 69 46 -92 -30 -82 -49 84 -41 6 -7
10706 -7 83 7 160 11 -45 -82 49 -69 12 45 31 -34 63 -2 83 114 39 108 75 70 -9 36 10 72 -54 164 -30
10733 -30 -69 -92 -76 11 -68 21 -11 -100 14 0 -33 139 41 109 44 -78 59 -21 55 40 -10 49 65 -35 90 24 -20
10760b0R9N8q6q3P0j3K2J8j10Q4kKRj2j31J68Kl5L9p8M8l1O7r3R2j16N8o6J20
10789H0l3rq5L4l5R6j4K8k70K69j21m9R1k2r8J57rmM2j96K50j58J32m4j04J04
10815C2n1k7L7L0J69j20k2p7P3q6j4O6O7p5L6O1r2q6J29k6N0j37mJ16j9o6k8K6
10843c8O6Np3J2k7l4J04l9j1J32q3J11k49J71r4J30P5k03J32m9L7l0Ml3l2LQ9
10870G6j17P6j30J42k4M8o7J3J2kl3j1Q4j88K73j76J05j22L5j8O5p4k3R6m1Kk6
10897b5l5RJ01Q4n4p5J4j45m3J96N6o1j13Q6M9p6R9p4N2p4nKR4qk1J6N9%n8j16
10927f6l4K15q2o9O2n7J04j86k9K36m9p7J6R2M5k18J22p6J42Q8l9l4j61J30j14
10952c9o0l1J58L4o2K1j4N1k5j50K64j40L9j66J51q8J9K5n0K09j11Nl8J16k5j75
$$ plain form
10760 -20 79 137 51 -32 38 25 47 65 -45 39 37 39 48 36 -95 73 75 40 79 1 49 18 85 -8 84 -32 26 -40 80
10789 80 47 38 -47 -13 -48 48 34 62 -208 61 -60 -109 -18 -40 -138 19 10 6 48 -148 102 -56 76 32 -72 32
10815 32 -19 -46 -9 21 190 70 48 -29 44 -42 -56 10 77 2 38 99 7 -79 50 24 74 -63 -67 49 30 -36 -64 -38
10843 -38 28 33 -40 -28 -55 -89 15 -24 -35 97 14 125 -124 47 -47 83 158 -45 87 38 75 45 49 16 -16 -13 76
10870 76 -41 35 -95 47 23 71 4 17 29 27 -6 -17 67 -121 152 -24 81 -41 -6 -24 41 -33 -56 40 -1 1 -25
10897 -25 -60 -51 50 134 80 5 19 -126 -169 27 83 22 -91 -5 44 -32 67 -7 45 -29 -34 -32 62 54 33 49 108 108 50 -66
10927 -66 -100 115 33 -36 26 -31 73 -113 -142 94 45 -32 -16 76 121 -97 25 -51 91 179 140 106 -55 75 -39
10952 -39 -99 -130 28 62 0 21 7 58 33 -117 147 7 46 -120 31 -57 -38 -13 -63 146 35 40 2 118 93 -82
10978h2J75j01j18R1K8N0R1k8j06Q7o9r5J29j29M9m1O1R9n1j7JN1j33J01m2M2
11004D3r5J18Kj57J08Nj15P0r0J96n3q0K2mrj0J32r8K7ql8L1J68j19j52J07m7
11031d6J13j4m1J4l0o4J8m6J84j12J25q8R9j87J12L7j03j2Q1J28k56N5M9K6N4
11056I6l3L4p5j4p8N3o2J56j02L1K4p4l4J56J0j40N3K9rK6r6j1O3o3J77j95M4
11083c4P4p1R8j05N3K7n9QJ29j73k3L3K4l0Q4P8r9K8L3r4J12r1Q9r3M4%q0N9k7
11112fL6O4K5j07L0j8o8J5J12j34J29p8Q2L4j27J2Q6o8pK7m1m7R6j7l5M5j21k5
11140a06Q9J46k05j5Q0L8n6ol6J09l8J02m8P4j62Q2m4J1j1r7J16k6L5r9M7q2L3
11167f9J45j03O1l9o1O6O5o4j8QL9l8q2K00m6n8m4o2J30N4j52P7Rm5jL3m8n8J94
$$ plain form
10978 -82 93 -8 -126 -35 -7 43 134 106 0 87 18 -77 52 -77 -28 -69 -8 91 40 23 24 75 -58 43 1 43
11004 43 -52 66 68 -89 19 24 -91 -21 -111 85 32 -48 -26 -30 -39 -49 83 -15 12 4 -34 -3 165 46 -106 1 -46
11031 -46 67 53 12 26 -4 -68 -50 -96 88 -24 101 13 112 -75 37 74 -29 -41 40 168 -88 -33 16 42 96
11056 96 63 97 22 8 -70 -17 -79 77 -25 6 30 -44 -78 78 88 -52 1 30 21 47 -49 -60 3 -60 117 -78 -34
11083 -34 40 -31 67 -38 15 42 -17 -9 120 -53 -76 -43 -19 -49 35 113 14 42 75 -19 93 2 91 -2 42 42 -38 21 -6
11112 -6 30 94 119 12 42 24 -44 -29 83 -51 78 0 82 116 -11 1 87 19 12 39 -2 -49 47 30 -5 40 -81 -106
11140 -106 -17 129 -76 -91 -11 27 -29 -35 -71 38 0 102 54 128 -34 48 4 15 4 -93 23 -3 32 -67 -20 -102 -69
11167 -69 76 -27 34 -5 -66 0 65 1 -17 -9 30 -8 -90 110 64 6 -38 -100 30 84 -68 9 18 -27 -28 5 -43 -101 93
11196I3r2k9J08N5j54p8J41K4p4m1J00j11N0j20K14l3l9m1L6mO5q9m2N9j26K10
11222H2m8J59j93l4j5Q6J2r7k5P6L9o6l6L0J65k7n4n8K2O1j65M4OO9j18J68j87
11249a04J66p2J04r5N9p1R0j31NL8N0K8P1j2p6M5r9J8J8L6k8r0R4L4j87R2%j42
11277a59J77Kj14J02Q9p1j7P6j13J09N5j73O5Lm3j07J91j10J12j28Q7j05NJ59
11301I2k18J35j7J5Q3N1j8j6q8mPL0PJ3q6Jm0j4J24J61j37q1J33k39J27Q3k28
11328a24K42K6j06K5JK1j06p7J30j21J86k5Rk1KN8p6LoM7K6k4M4j30j8J23n3o0
11356dn5O8l9J4M7r4N1R1n3K5N8j78j8J14r3j1m4J86m4K9l1J06j22N5j00Q9j6
11383C1l3J15j30P3r7k1m4J10o9Q0J13j32l9NR9l2J7J08r6j69N7O9j24R4m1J25
$$ plain form
11196 93 1 -28 80 135 -19 -97 44 68 -6 -47 53 -58 -8 -128 86 53 14 -27 9 5 70 -19 -61 -2 -128 82
11222 82 34 193 0 -34 -49 37 49 -48 -73 3 42 -24 -60 -30 135 108 54 -4 18 79 -86 -42 -36 33 -85 83 -104
11249 -104 62 -10 94 -1 58 -13 77 -54 -49 -11 39 67 138 126 50 95 -4 14 32 68 40 -50 44 78 -109 -17 -17 -159
11277 -159 18 20 -94 8 97 26 9 85 -28 81 136 -37 28 31 -12 -119 72 -38 74 -54 33 -72 -67 92
11301 92 -126 9 -8 7 90 141 123 107 19 15 22 52 59 72 -14 -13 -53 -67 57 218 81 0 133 -106 21 104 -124
11328 -124 118 144 38 63 64 85 -21 -98 32 -89 97 72 81 60 62 120 44 47 41 88 114 90 134 4 -14 109 56 -4
11356 -4 -59 9 -30 -16 31 -63 -12 79 26 51 109 -69 -87 27 -66 -77 -121 65 21 50 19 125 3 58 -42 47 31
11383 31 -2 113 -17 56 -41 -62 -106 4 -65 15 128 -4 -43 -38 61 29 46 154 58 -111 -54 15 -109 -15 -56 69
11409F9m5l0J07j58k0PJ43q9J36p0kj4M0K1l9n2J0j6j05J19K5o9O0q7K3J9P8j38
11437g7%m3P0L7j11J32j4L2J1L8j08l2P2K8j63J55l8l2O4k2L9M8j63Q3K5n2r9
11464a20NK42j53J42k22N3nO6N4m0n9J61q7P7q6k8O2j16J19N3l8j03l1O8k9J03
11490H8j3p7J3m5l1J96m2r1Kp3J13m4o9J5p1K09Nj61L0N8j09J23J5r6J2P1j83
11517a55N1J87j10J53p7r4Q6o9N9M2lr6N1j09J89n0n8J3o8p7K31j19q8K02%p6
11543A5k6K8K8j18O4k1J0m8J50j03O6M1j07J5J15r4o9K9m0L0N7q3J10l7l2n1J08
11570C7JOo4O5l6l8P7o0jN9J4n6m4Q5N6m2q1J19j24P2m9q6O1O4PN9j07K4j31L0
11600h3J6J6J84j17M0o3R2j26K6nJ0m8L2J20r5LP0l6n1L1j5k9PP7l0n0J26r3M
$$ plain form
11409 69 24 -6 101 -57 -77 -70 73 -16 120 50 48 34 74 95 56 4 14 -2 -107 12 37 -32 28 -59 -36 -17 61 -77
11437 -77 -77 -120 -50 -13 -124 8 -6 26 37 75 -33 -65 7 35 -128 27 -11 -43 21 -1 38 86 -77 6 31 -21 -120
11464 -120 -115 127 -26 116 -106 -53 -58 8 62 22 -37 124 37 114 28 0 62 -54 65 118 80 -23 -54 14 -15 88
11490 88 75 -2 11 -34 -65 131 89 -2 0 -73 40 -4 -73 -58 -129 80 85 -76 -46 12 -97 26 41 -55 -43 28 -155
11517 -155 -104 83 -27 126 49 -45 41 -28 31 73 70 -26 25 -84 105 55 -3 10 -58 -135 96 -23 -111 91 91 15
11543 15 -11 17 45 -73 -9 -30 -20 -68 82 -21 45 86 -21 -6 109 15 -54 -25 -65 -35 22 -61 49 12 -20 -71 37
11570 37 38 44 -20 45 9 -29 48 -12 -13 46 60 4 -40 45 101 59 -22 97 -27 45 -4 -90 -29 35 42 101 -6 18 -113 -83
11600 -83 -67 -51 133 16 56 -7 85 -41 -15 -20 -10 -58 -26 94 -1 2 72 36 -15 16 1 -28 -21 56 26 -24 102 9 13
11629A3M3o7Q2r3j6L8Q7k8j28J24n6kK5j8K2p1o7P5J41K7m1j24M6k6j41N6Q2J30
11657A13o3l6n1M8P7j09M8ML3n1K6j26J26j00Q0pL5J9lj16J06j32J79Nr7o3J09
11684E4K3n1N7j83J45l8J2n1o1R8k5J31j39Q6j4j7O9r8O7J6J2p3M7o2k9k9J12
11711E9Ll8j31J49j7l1K2M6J8j19M6n9k4J30M6j34J6n8J54q0O0om0r8J64j00N9
11738C7j35j8J69o0O3p9J06o6o1J11M7j27K5j9KJL8L0K2J7j64O5L1o3N3m4Q3j20
11766e6L1N3o0L2p3K8M8Nj3l8R0n9RJ1O6j16M1N5J5p5n5J60k5o6L4m7L7J02j54
11795b0j30R2Q8mo4j0l2J11j20J22M3m0j40NJ21M4o8J7L1k6k4rK8q5p8J84j08
11822g2l8J92Q3j32o2M5P1m2j58J02N4j59j9P0N5J43k15k4J09LO0J6k47J31J6
$$ plain form
11629 13 56 -11 71 -22 -38 0 87 59 -69 55 -1 -3 22 4 26 -45 -112 -37 104 131 90 -34 12 -14 -155 -99 -17 113
11657 113 50 14 -37 11 88 -21 27 31 64 13 39 -87 39 -61 19 12 47 66 63 -53 53 -79 100 105 8 -55 54
11684 54 77 26 83 -100 45 7 19 -32 -93 5 -20 111 -28 58 44 27 96 -2 65 81 93 20 67 5 -24 -53 59
11711 59 62 24 -107 42 25 -6 16 62 80 -39 7 -52 -76 54 100 -34 -18 -76 78 -2 58 52 12 -86 78 -22 37
11738 37 -98 -116 53 -7 56 -23 83 17 -44 67 114 -13 12 -7 -5 -4 34 64 86 103 -61 4 35 -28 25 -19 64 -56
11766 -56 -25 28 -32 0 -73 -45 3 8 -5 -43 47 -12 -3 8 74 -42 -1 54 69 -6 -61 99 74 8 42 -5 32 134 -20
11795 -20 -150 -58 30 26 -38 -48 -80 31 -89 33 76 36 -104 -99 22 66 -2 15 46 20 -4 -13 15 -70 -148 36 -72
11822 -72 -110 82 165 33 -29 16 87 45 -113 -11 43 -116 -135 -65 -10 133 -82 -106 3 6 66 82 -165 -34 -18
11847a8OJ21p2jq2P8j25J88j06L5K2j03J5J16j00L1j2j11N1N1M9k3R2j26O8L0
11873G4o4m3P6j8o1P8m4P5o6M8m9j1L3l3J07j54J32j11p3J48p7M3q4M6J8j4Q0
11900E6KL0j84J09o7k0N6l7O1L0rkm9Q9j35J31K7J4j40pJ60j33o2J08j3k9J26
11927A12K1j61n1J06M4j4m3M5L8q8N6K6j14R9o3k6o8k6n5R6%K6O5o0%M6N2K3j56
11956g0P2O2qqJ18j37k1Q0rr6K0j43Q8M1k8k4kQ6j30J08Q6l3m1j6l8N4o6K1M4
11985A0j1K0M4p3NJ6k2k1j10P9R4q2N8k8q6J11j37L8J10o3J01J9j05J5N7r8J84
12012A25j7Qj00j08J00J30k46M7J6N4kr2N9O4pp3j1J10j20L2O4r0J34k13J31r6
12038a01P4O4o9R4j14J33m7j03Q3m6J4p3M7L4Q7r5J6R1j37jl2P5RPj27K52o5P
$$ plain form
11847 -18 -12 109 37 36 -46 32 -93 95 -11 24 46 -57 -42 74 -26 5 -7 -118 -67 -16 33 10 102 -24 44 74
11873 74 10 -33 43 25 -36 42 -2 73 7 55 6 -5 28 -5 102 -52 80 -31 -104 44 -33 10 -74 -28 -10 -24 56
11900 56 58 88 -96 13 -54 -74 -18 -55 6 36 27 25 -24 65 -70 61 88 102 -38 -45 115 -18 -80 28 15 -14 112
11927 112 133 -28 -79 27 71 57 14 59 97 9 65 91 -23 76 13 -13 -81 -107 -162 -66 -66 -40 25 -35 -35 11 63 86 -70
11956 -70 2 64 56 48 166 29 8 88 79 -17 3 -140 -52 -11 -39 -63 -65 21 -109 -1 85 52 11 -5 -43 11 -55 -34 10
11985 10 -1 19 63 -10 -5 11 -11 -32 -142 -63 31 -51 7 -21 -107 4 -133 -95 15 -48 53 72 -33 -18 39 -59 125
12012 125 108 116 16 -92 8 138 -108 -61 -45 9 7 -85 -26 38 31 -42 -53 57 -63 -31 33 -57 77 -136 -5 -101
12038 -101 -27 37 -32 62 -52 81 34 -69 14 -32 -18 -91 -44 -10 77 -18 -2 89 -48 -49 -81 -6 3 10 -117 135 70 77
12066G7J0k20J29J55k57P9K1m2l0J01j19R7m5J24p1qn2P0%j6O0j56J18l8K4Lk4
12093a0L1l9mN1j80J14J4K3k0M2J1o2J14j40M2O6l2j16J21P5k44nJ04J32J5m5
12119E8kq7J44q3M6j10P5j72M0J31j72R2L4M0J15l3o7J2O9o5n8%K1k9J07j87j8
12146i9K27j94J09o8Q0p9K7rl9%K7Q0o2L6j04J90j04q4O3O7k9lnK5o1l1l0K15
12174A45j55k0M7n9J21q4q0N0M5O1j54M4j43P8J44j1j9O6j39L6J03m4o0L6o5P
12200e0l7M7P7k3M7q2L2M4Rj69Q7R8Pj05k4J33%j88R4N6M9j75J02NLk0j21J66
12228F2j0qL1k00P8Q3r0R9n6K7Jm4K4l0o2J58nm7Q3n1m9Q2N5j98M8m2J68j16m4
12257e3Q1L8j17O2Q3j6j39L2N8J3j27J10o4Q6k0r0K74j60P5k31M2Q5L0j60J32
$$ plain form
12066 77 87 -133 -4 151 -106 -27 -6 -48 -78 23 -96 1 -44 80 9 1 -51 19 19 3 63 -93 25 -13 11 14 -10
12093 -10 21 -18 -22 29 -151 -37 -23 0 -20 22 33 -29 85 -55 -13 53 21 -95 26 101 -143 -148 -44 88 103 58
12119 58 56 -31 113 30 76 -34 41 -131 -91 40 -132 -40 -6 34 149 116 49 61 130 65 7 7 28 -1 106 -81 -99
12146 -99 128 -66 43 -25 55 -24 3 -6 -45 -45 -18 62 0 36 -68 122 18 -66 -3 64 35 32 27 52 -9 -40 -70 145
12174 145 -10 -30 17 -42 79 -5 -85 -35 10 71 -83 -39 -182 -104 40 29 10 76 -63 -27 76 32 -28 8 -57 -50
12200 -50 -87 -40 37 14 61 -21 11 55 64 -105 -18 80 87 -18 -42 91 91 -97 -3 53 102 -73 29 34 37 17 -104 62
12228 62 52 44 75 -125 -47 36 -54 45 -11 16 17 -27 -3 -33 -95 63 58 11 94 43 -6 76 131 -67 -19 -61 107 -9 -53
12257 -53 28 66 -51 11 94 78 -61 -29 29 42 -85 25 -39 47 27 -63 211 51 126 -105 -63 22 52 -108 24
12282B4n9K9mj02J00L1j2p9J55q6N2m6r2O8p2O4J5l1O1j03J34j2OJ78k31K2R1
12309A01j76J44o3Q1j43Q0K4Rj37R8r2L7R3m8o5O6P1Q0n0j07q8J59j84N9K3qR3
12336E7kjn7m9J1J9k5O6o6O8l7lp6R4p0J65p3m7J5RjL2j3J62j50n8M8K1o4l9N3
12367a1K6kr2PJ73j59O9K9l2l1M2l2M1m9K5q9mj3N0J31K4o3J01j84J22q4l4O9
12395C0l0K9p9M4J10k07J82jj05J27q6K7M6j49Q6J6NR0k64J78l4m0%J04k16K19
12421H2k5j08J42p8Ml3L9l3k8pJ16q2j01K06j29l8N7J18q8J03p6j0j80P5J6J17
12447E9p2m5J02J3q1J35r8qk3q2R4J04j40N3j4m0L7n8J55n5Lq6J7l9J07oq3j1
12475f2P6j20M3M0n9L9R8J6p4LN4j8o7O7l1K9m1l8N5L1n0L1r5P0N2j89J59J39
$$ plain form
12282 24 -35 -6 -10 -112 -12 19 7 -72 83 -3 49 3 -89 -21 -93 -29 -14 -45 16 -87 47 35 41 219 -12 10 101
12309 101 -75 69 6 87 -56 24 48 57 -80 18 -74 -37 56 8 -57 9 80 160 110 3 -85 74 -110 -51 -28 -36 57
12336 57 55 54 -3 -52 -41 -22 -47 19 -47 21 -16 -19 -95 -1 -71 94 21 -26 -11 -2 -3 29 16 178 28 -30 18 39 -25 -64 -11
12367 -11 15 13 -79 -72 101 -58 11 40 8 -23 19 -13 28 -21 4 -85 -89 -102 -52 79 103 40 141 -43 79 -5 -39 30
12395 30 0 29 -50 -6 104 -103 79 78 -27 100 14 41 87 -62 24 40 45 135 -129 49 15 -25 -25 79 -137 82
12421 82 57 -51 91 13 17 -16 23 -10 -38 -45 71 -11 -112 94 -35 -73 -16 102 14 117 41 31 -149 -74 -58 59
12447 59 -13 -58 44 57 -24 111 13 5 -18 -100 -6 98 -42 11 -3 -43 -6 -64 91 36 39 -47 -30 -69 38 32 -51 -62
12475 -62 14 -106 -63 -23 -82 -43 55 71 -3 0 54 36 -31 36 5 34 -7 -45 10 41 -9 22 -73 -3 49 -140 19 158
12503A58j97J26o3j22M0K0R6p3j7M9q8R1k4L1j1l5l0J37j69M9Q0Mj52J38j29N3
12529c8K4J08q1j08P0P8L1j02l0J13j01j17J60MJ01p0J12r6p4N8R2j08r3K21k02
12554d8O2j21K01k7p7j2J16n7j06N8m5J5q0J00J0J3j16J75m1J5j05J1Q0j4j2k5
12580c0L7m0N4j%Q8m5j55J07l0M9j6j27J42j8J5J11j66J46m9n6J0M2O5j02j23
12606i2K05m3j81J26ql3L2j16R8j2J26p8p%o0k2RO3J5m1r3K6P2O2m1m0L9JM2m8
12636Aq6P5Q7k2j31J38J1R4k73J44R5r0m5rj97K16l6J12n2N2k03J62j01k2k0N3
12662d7K2L3J37j22m3M0q7M8L9lJ4p3K5j2P9j79P6P1Q6q6P0o1p3j5O1j07J27J5
12690C5J2o4K9P8q9j14J23K3L1k7j53R9K3L3K0L4nq4n4K5K7r7K6J18m4j08q3K75
$$ plain form
12503 158 -39 87 24 -98 -58 -38 58 -15 -32 17 -71 20 -4 27 16 -19 -49 88 -81 -32 48 52 -100 38 -91 -38
12529 -38 -14 94 13 -95 -25 53 84 -18 -48 65 -36 -153 7 11 112 42 154 58 -16 42 134 26 -67 154 -48
12554 -48 14 -107 94 67 -10 -22 94 37 -69 -11 -56 -41 -121 -21 -11 2 -114 61 20 35 -70 -59 21 7 -5 -30
12580 -30 7 -33 21 20 20 108 63 -92 15 -15 34 18 -109 33 15 30 141 -25 121 72 16 26 68 133 31 -92
12606 -92 113 70 -111 15 7 -26 6 -110 -12 -24 102 24 17 17 -43 -65 -56 7 22 -19 -112 -86 -14 48 7 -33 6 7 49 1
12636 1 -85 -10 77 55 -76 62 73 167 -106 38 133 43 -2 -11 -208 8 -28 84 32 84 -119 43 -58 -80 -100 -47
12662 -47 -25 8 145 23 -20 20 -67 -19 20 17 31 -42 -17 -29 50 -129 -53 18 104 18 88 27 -46 -61 0 -107 20 35
12690 35 47 -17 12 90 1 -113 10 33 64 37 -116 -17 6 39 59 93 88 4 -50 -25 2 -95 -69 49 5 -103 -186 89
12718H9j80P0L8KQ5j47L6J12p6j16N1p6J93j41ppJ43k3O5r8m0N0K4Kr3MN7J62
12746A79j84Q2L6k40J16OR6k74J29J00p5m9J38m2L6j01j23K44j85N1R3N7p0q5
12770f5J8L5N5p6OpL0pM5N8q1o4J35K7j22N8j19m3J66Qmj60N0oN9M4o2j13K19
12799H4n6J5q1j0j6O1O6j16L5K1J5m2J2j18J83p7q8R0M3j37m5K10j8o4P0J2r5
12826d6k3J1J46j43P1Q7o1OL0P6j63K5j5K0N0o5J4l6O7j9j10J54j47J78j61j4
12852f8N5n9O7J1L5j11J04nO9j41J77k65J30NN8j26k6J26J3m0j2M8R9p6n4J17
12878A31j14j3k4O6j5L8j03RJ21r7k2l3J21M1j53KL1N8l8JPM2Pm3j34J25p6O2
12906cO5o7N2q1J31k8m3k0J52j48r0Q5r6J11q2K1j7O7O0o0N7Kn3p0N7m7L3L5q
$$ plain form
12718 89 -91 -21 17 19 104 -43 -7 105 29 -87 -36 -112 81 -60 -67 -74 69 46 111 13 -27 23 47 49 -44 -40 17 179
12746 179 -5 77 113 -127 -11 -5 91 -183 -54 46 -29 -78 60 18 54 -47 -170 74 -111 -60 33 90 20 -65
12770 -65 -47 -12 43 -33 -27 -34 -4 -11 34 92 11 -53 82 109 -13 45 -74 -117 49 57 53 -107 -57 -63 -4 40 -22 -135 84
12799 84 28 43 -38 -48 -64 -3 63 -53 -18 3 18 -24 -12 -130 53 -24 -112 -22 21 -116 -161 49 31 -33 37 49 -46
12826 -46 -69 -58 88 -55 16 103 42 48 78 154 -9 16 1 21 71 6 20 -16 51 32 -78 76 -71 107 -54 -68
12852 -68 -13 -72 -5 6 41 -70 34 29 98 -43 134 -131 -1 4 62 -64 -90 36 49 9 -3 45 144 68 14 131
12878 131 17 4 -20 46 31 69 -34 -25 96 -1 -23 -56 65 106 -47 -45 -14 44 6 7 14 56 63 20 -114 11 -65 -3
12906 -3 62 -5 47 -34 97 69 26 6 158 10 -80 5 -91 20 -62 -41 -58 9 69 9 66 68 15 -55 2 -45 -12 23 15
12935A5M7lKo3l3J02k1j23J54k8j13J63j67rM7J10mj52J2k5J48m6k1M4n3P5p7
12962a9J23r7K3l0J3l1P6o3R0j1n9J10j32M9j14J28j39n0J30j64J46o7O0J18K0
12987A10p0k3O4j10R6n2L2r7J25m3j02M8KJ8p4J71K5k10R9P4j04p1J53n5o0jL2
13014b3l1o9N5RM3j5j8P4j42J23m5J10l5O9j55R2l3QJ17p8q0N4q6RMJ34r9j9j5
13043d2K4J43j27o4jJ26l1k2j22J7J0J09o3M2r6J54N1n5r0P9n3k5mN3N3j36J29
13070E9JQj0j05R4n8j7K2J44j09o9J61p3j4k9N9p4Q6P3j18j26K15j47j2J3N5N
13097C4n7q6N9J3J6n2P8J1Mj30J29Ll8N4o7No4R3M1o7r1J00j10J97L6j24m2P2
13125A7j0J06j07j00K27k19O1PJ8J19j60j6K7l6J7LJ66m9j22L3Q0r4O6L0Pr0%
$$ plain form
12935 15 62 59 61 -2 -35 67 46 -77 77 49 -64 99 -68 -77 -30 80 76 -76 -64 -89 59 13 -8 36 -17 58 -19
12962 -19 104 7 30 0 13 -18 58 -5 85 74 15 125 -7 42 -72 56 -83 -133 -3 -167 -21 -88 -28 90 110
12987 110 40 17 81 -29 67 15 47 -50 75 32 -70 -22 -20 -2 -76 95 120 -90 9 83 -21 -92 61 6 -54 -55 -23
13014 -23 -54 -123 -68 -59 -16 -31 -49 25 -117 6 -39 71 36 105 -50 42 9 17 134 56 -24 30 -56 -47 -43 91 -8 -27 -42
13043 -42 -18 125 -2 -66 -67 59 28 6 -116 -99 -89 20 -43 -1 -97 57 108 53 -37 42 -11 -36 -40 13 66 -70 59
13070 59 60 68 58 -47 47 -11 -28 -6 138 29 -40 121 48 34 5 64 -10 76 149 31 -95 120 -27 -39 -26 29 34
13097 34 -23 -109 -50 -37 -21 -73 5 16 20 -110 19 22 -16 38 -29 -24 -88 5 46 -21 -112 -12 -122 75 111 -13 -55 17
13125 17 7 113 6 -94 133 -86 -25 -18 0 119 -41 -57 -30 -66 -49 -46 120 71 -51 -18 62 -32 34 64 71 -19 -19
13152a9oL4l6m5J47j44L4P0N0j26L2J12r9J30j28p0RL1j5J04j12J05N0j09J29
13177A28j20Jo6K1nR7Mj06r0K08j04lM0O0j50P0j28J56jj13J78r5L7qLR3j30J17
13205I4n8j11P3L4OJ8j14J3l0M5qJ53j60qJ35O8j86J31n3M9K7j61J19Kj05J04
13231G7j1l9m5J7l8j1J36o4P8p3K0l5j3K1n1m2J55j46N9j4J06m2OJ4p7M7O0m1
13259E4l5p1LL5M8k2njM1R4k28J67P5j80R8m5l6LJ37j44ljj8J00j00M6n3Mk9L8
13289b8MQ7m3o2O1j58P7J17l5q1PO1j45J22rRMR7q0P5o2k0O0q9J36j10j5J00m0
13318D0kq6Nm2J53j48M2J09k1m0m1K9j1o4O9J7m5j69J88K8mPJ7q6k4q3K76j49
13346c5O6N5j30L1l2j5Q1o2P8n0JKk0m0K5L3j09J97N6q9L8j22K6K7Qm4J08m7p2
$$ plain form
13152 -19 -25 9 -27 -72 75 -69 -35 35 85 -41 -9 103 4 134 6 -64 -55 -24 -39 65 -47 58 108 -1 128
13177 128 8 9 -57 -36 -41 56 60 -46 -136 72 -32 -35 5 65 -85 -15 -143 13 12 -101 77 -18 19 11 14 107 -23 94
13205 94 36 -75 -2 32 38 56 -58 -45 -75 -30 -38 115 -45 -53 82 150 -36 95 42 91 118 -43 76 78 -27 77
13231 77 66 27 -18 -1 -39 -50 86 22 100 27 47 12 -1 20 -31 -73 82 -64 -5 -19 87 45 51 65 -12 35 95 54
13259 54 19 -52 -49 -14 34 12 7 6 47 141 -87 80 155 -25 73 28 -8 -5 132 -12 -15 -16 -34 66 -34 12 -41 -37 -66 -28
13289 -28 -24 63 20 -42 19 -139 -62 55 20 -61 -54 7 -138 -16 -25 -16 -12 85 5 80 18 -2 58 -31 105 -5 -20 80 40
13318 40 38 -48 -43 -85 68 -80 -38 71 50 10 -31 -2 -13 -77 -8 9 -36 -205 -17 11 7 14 31 -55 -79 -162 114 -35
13346 -35 31 86 -44 -13 -45 -60 21 -41 37 -13 -12 -10 -30 -70 -45 -12 -121 76 132 43 81 -41 -15 12 20 -24 84 37 -35
13375c5P5k3o2Rn2Q1O1j02J00m1r9J16n1k7J25j61L5J12j17N4q3J45r3O9K5q5
13401b4k6J59j36l0M3J16j72Q6l0j8J15l2l0n7L1j6L2N9k3j18L9N0Lj42J20M4
13427D3K2q5M4P8p1k4j1O4K3k6j7N2q1Q6j43Llp0K27r3j2N4n3o3L0K7o0j05Q4
13456h0Q8p6O5m6O8%J8j14J56j16Ql7J23Jr8q0J01O3m2J02k7j27J25o6rQ0r9L3
13484A4K8o7O1p6J15j92J23k4P7p7J7O2l7k4k1j17L38k08p2J32q9N5l9R4Oj7N8
13511A20j31J51j21P9j45L5L9q4Q9K6n3q0j8O8j21Q2J4q6K02q4m0Q8J1p0O5m0
13537dk29J82J23r6K00k32Rl1P2q2J12PK2o3q0Q5m8J06l4Q1j18J02j73r0J74O7
13563F2j64J07m5L1P7q7L7j57J52j37J12L5l0j6J01O6q8n6K1J03r1k3j1P4l0P4
$$ plain form
13375 -35 40 17 -45 -36 -88 -7 54 -48 52 11 -88 28 -23 -50 75 -86 -51 61 -56 -2 -85 60 -33 36 61 -24
13401 -24 -50 109 -27 -57 -14 102 -70 16 -14 -32 83 51 21 -36 -5 -21 11 70 47 -71 -32 18 21 -121 -1 43
13427 43 65 -20 24 102 31 7 -4 60 83 57 40 92 11 97 -46 -43 -46 -116 111 18 6 60 7 -56 -26 1 -59 -164 -80
13456 -80 8 -68 -3 -49 19 19 37 -77 79 -37 -29 -66 57 58 -40 -120 -19 44 2 104 77 -50 75 9 0 80 -19 14
13484 14 42 -25 36 -40 75 -117 6 -18 59 -18 -1 61 24 0 -21 -138 200 -8 -80 52 -37 18 -21 73 79 62 120
13511 120 -11 140 19 98 -47 -12 27 -57 32 58 5 -75 -93 -25 -146 -64 -50 -136 66 -18 -58 30 41 -29 36 -4
13537 -4 -233 -51 72 -24 176 -56 -47 -78 -6 -88 24 31 53 -10 -90 -5 -53 53 19 100 -18 84 -89 -179 -5 62
13563 62 -102 5 -40 -9 68 -19 18 -139 13 -124 -12 23 -7 -23 78 144 56 0 21 124 33 10 -1 73 43 117
13589A17l8L2j41P0m2N1L4j29M2O2o2J6lr8KJ25r9J49m5P0p3M2k3l7q4R1q1K3
13617b9pp2J64p9O6l0K3q7N1R5o9j0j63J10L1L3k4k3jO9j79J30l6Q4j16M3O9m5
$$ plain form
13589 117 79 111 -30 40 -2 49 83 -46 -4 58 -4 12 9 -89 -87 38 -61 88 43 113 40 82 59 22 -62 29 -52 -29
13617 -29 -36 -108 56 -23 43 13 36 -51 0 95 26 16 -147 -37 -6 27 3 -20 -21 48 -131 -1 -37 47 -69 -26 43 -2
$$ [...]
16383a6
##END NTUPLES=NMR FID
##END=
