##TITLE=abcd
##JCAMPDX= 6.0         $$ Bruker NMR JCAMP-DX V2.0
##DATA TYPE= NMR FID
##DATA CLASS= NTUPLES
##ORIGIN= UXNMR, Bruker Analytische Messtechnik GmbH
##OWNER= root
$$ XWIN-NMR		Version 3.5
$$ Sat Jun 28 17:58:44 2025 Russian Standard Time (UT+4h)  servis@DPX200
##.OBSERVE FREQUENCY= 200.131235884673
##.OBSERVE NUCLEUS= ^1H
##.DELAY= (6, 6)
##.ACQUISITION MODE= SIMULTANEOUS
##.ACQUISITION SCHEME= undefined
##.AVERAGES= 32
##.DIGITISER RES= 18
##SPECTROMETER/DATA SYSTEM= spect
##.PULSE SEQUENCE= zg
##.SOLVENT NAME= CDCl3
##.SHIFT REFERENCE= (INTERNAL, CDCl3, 0, 16.5164)
##AUDIT TRAIL= $$ (NUMBER, WHEN, WHO, WHERE, WHAT)
$$ ##TITLE= Audit trail, XWIN-NMR		Version 3.5
$$ ##JCAMPDX= 5.01
$$ ##ORIGIN= Bruker BioSpin GmbH
$$ ##OWNER= servis
$$ F:\spectra/data/av/nmr/H1/1/audita.txt
$$ ##AUDIT TRAIL=  $$ (NUMBER, WHEN, WHO, WHERE, WHAT)
(   1,<2025-06-28 17:57:56.92 +0400>,<servis>,<DPX200>,
      <created by zg, POWCHK disabled, PULCHK disabled
       configuration hash MD5:
       00 E9 B6 7A A2 85 ED C7 34 08 36 98 17 FE 4E 26
       data hash MD5: 32K
       66 6C DB FB 52 08 0E 17 D0 89 FF 7D 71 91 27 6B>)
$$ ##END=
$$ 
$$ hash MD5
$$ 6F 94 A4 6B F2 D0 68 60 75 CF 97 E4 A6 46 D0 00
##$RELAX= 
##$RELAX= 
##$RELAX= 
##$RELAX= 
##$RELAX= 
##$RELAX= 
##$RELAX= 
##$RELAX= 
$$ Bruker specific parameters
$$ --------------------------
##$DU= <F:\spectra>
##$EXPNO= 1
##$NAME= <H1>
##$PROCNO= 1
##$TYPE= <nmr>
##$USER= <av>
##$AMP= (0..31)
100 100 100 100 100 100 100 100 100 100 100 100 100 100 100 100 100 100 
100 100 100 100 100 100 100 100 100 100 100 100 100 100 
##$AQSEQ= 0
##$AQ_mod= 1
##$AUNM= <au_zg>
##$AUTOPOS= <>
##$BF1= 200.13
##$BF2= 200.13
##$BF3= 200.13
##$BF4= 200.13
##$BF5= 500.13
##$BF6= 500.13
##$BF7= 500.13
##$BF8= 500.13
##$BYTORDA= 1
##$CFDGTYP= 0
##$CFRGTYP= 5
##$CHEMSTR= <none>
##$CNST= (0..31)
1 1 145 1 1 1 1 1 1 1 1 1 1 1 1 1 1 1 1 1 1 1 1 1 1 1 1 1 1 1 1 1 
##$CPDPRG= <>
##$CPDPRG1= <>
##$CPDPRG2= <>
##$CPDPRG3= <>
##$CPDPRG4= <mlev>
##$CPDPRG5= <mlev>
##$CPDPRG6= <mlev>
##$CPDPRG7= <mlev>
##$CPDPRG8= <mlev>
##$CPDPRGB= <>
##$CPDPRGT= <>
##$D= (0..31)
0 2 0 0 0 0 0 0 0 0.06 0 0 0 0 0 0 0.0002 0 0 0 0 0 0 0 0 0 0 0 0 0 0 
0 
##$DATE= 1751119076
##$DBL= (0..7)
120 120 120 120 120 120 120 120 
##$DBP= (0..7)
150 150 150 150 150 150 150 150 
##$DBP07= 0
##$DBPNAM0= <>
##$DBPNAM1= <>
##$DBPNAM2= <>
##$DBPNAM3= <>
##$DBPNAM4= <>
##$DBPNAM5= <>
##$DBPNAM6= <>
##$DBPNAM7= <>
##$DBPOAL= (0..7)
0.5 0.5 0.5 0.5 0.5 0.5 0.5 0.5 
##$DBPOFFS= (0..7)
0 0 0 0 0 0 0 0 
##$DE= 6
##$DECBNUC= <off>
##$DECIM= 32
##$DECNUC= <off>
##$DECSTAT= 4
##$DIGMOD= 1
##$DIGTYP= 9
##$DL= (0..7)
0 120 120 120 120 120 120 120 
##$DP= (0..7)
150 150 150 150 150 150 150 150 
##$DP07= 0
##$DPNAME0= <>
##$DPNAME1= <>
##$DPNAME2= <>
##$DPNAME3= <>
##$DPNAME4= <>
##$DPNAME5= <>
##$DPNAME6= <>
##$DPNAME7= <>
##$DPOAL= (0..7)
0.5 0.5 0.5 0.5 0.5 0.5 0.5 0.5 
##$DPOFFS= (0..7)
0 0 0 0 0 0 0 0 
##$DQDMODE= 0
##$DR= 18
##$DS= 0
##$DSLIST= <SSSSSSSSSSSSSSS>
##$DSPFIRM= 0
$$ [...]
##$SUBNAM0= <"">
##$SUBNAM1= <"">
##$SUBNAM2= <"">
##$SUBNAM3= <"">
##$SUBNAM4= <"">
##$SUBNAM5= <"">
##$SUBNAM6= <"">
##$SUBNAM7= <"">
##$SUBNAM8= <"">
##$SUBNAM9= <"">
##$SW= 20.6817932712277
##$SWIBOX= (0..15)
0 0 3 0 0 0 0 0 0 0 0 0 0 0 0 0 
##$SW_h= 4139.07284768212
##$TD= 32768
##$TD0= 1
##$TE= 0
##$TE2= 300
##$TE3= 300
##$TEG= 300
##$TL= (0..7)
0 120 120 120 120 120 120 120 
##$TP= (0..7)
150 150 150 150 150 150 150 150 
##$TP07= 0
##$TPNAME0= <>
##$TPNAME1= <>
##$TPNAME2= <>
##$TPNAME3= <>
##$TPNAME4= <>
##$TPNAME5= <>
##$TPNAME6= <>
##$TPNAME7= <>
##$TPOAL= (0..7)
0.5 0.5 0.5 0.5 0.5 0.5 0.5 0.5 
##$TPOFFS= (0..7)
0 0 0 0 0 0 0 0 
##$TUNHIN= 0
##$TUNHOUT= 0
##$TUNXOUT= 0
##$USERA1= <user>
##$USERA2= <user>
##$USERA3= <user>
##$USERA4= <user>
##$USERA5= <user>
##$V9= 5
##$VALIST= <valist>
##$VCLIST= <CCCCCCCCCCCCCCC>
##$VD= 0
##$VDLIST= <DDDDDDDDDDDDDDD>
##$VPLIST= <PPPPPPPPPPPPPPP>
##$VTLIST= <TTTTTTTTTTTTTTT>
##$WBST= 1024
##$WBSW= 30
##$XGAIN= (0..3)
0 0 0 0 
##$XL= 0
##$YL= 0
##$YMAX_a= 1015652
##$YMIN_a= -835887
##$ZGOPTNS= <>
##$ZL1= 120
##$ZL2= 120
##$ZL3= 120
##$ZL4= 120
##$ABSF1= 10
##$ABSF2= 0
##$ABSG= 5
##$ABSL= 3
##$ALPHA= 0
##$AQORDER= 0
##$ASSFAC= 0
##$ASSFACI= 0
##$ASSFACX= 0
##$ASSWID= 0
##$AUNMP= <proc_1d>
##$AZFE= 0.1
##$AZFW= 0.1
##$BCFW= 1
##$BC_mod= 2
##$BYTORDP= 0
##$COROFFS= 0
##$CY= 19
##$DATMOD= 1
##$DC= 2
##$DFILT= <>
##$DTYPP= 0
##$F1P= 11.0000007629395
##$F2P= -0.999999237060547
##$FCOR= 0.5
##$FTSIZE= 0
##$FT_mod= 4
##$GAMMA= 1
##$GB= 1
##$INTBC= 1
##$INTSCL= 1
##$ISEN= 128
##$LB= 0.05
##$LEV0= 0
##$LPBIN= 0
##$MAXI= 10000
##$MC2= 0
##$MEAN= 0
##$ME_mod= 0
##$MI= 0
##$NCOEF= 0
##$NC_proc= 0
##$NLEV= 6
##$NOISF1= 0
##$NOISF2= 0
##$NSP= 1
##$NTH_PI= 0
##$NZP= 0
##$OFFSET= 16.51637
##$PC= 1
##$PHC0= -273.2733
##$PHC1= 1.101538
##$PH_mod= 0
##$PKNL= yes
##$PPARMOD= 0
##$PSCAL= 4
##$PSIGN= 0
##$REVERSE= no
##$SF= 200.13
##$SI= 16384
##$SIGF1= 0
##$SIGF2= 0
##$SINO= 400
##$SIOLD= 16384
##$SREGLST= <1H.CDCl3>
##$SSB= 0
##$STSI= 0
##$STSR= 0
##$SW_p= 4139.07284768211
##$SYMM= 0
##$S_DEV= 0
##$TDeff= 0
##$TDoff= 0
##$TI= <>
##$TILT= no
##$TM1= 0
##$TM2= 0
##$TOPLEV= 0
##$USERP1= <user>
##$USERP2= <user>
##$USERP3= <user>
##$USERP4= <user>
##$USERP5= <user>
##$WDW= 1
##$XDIM= 8192
##$YMAX_p= 0
##$YMIN_p= 0
$$ End of Bruker specific parameters
$$ ---------------------------------
##NTUPLES= NMR FID
##VAR_NAME=  TIME,          FID/REAL,        FID/IMAG
##SYMBOL=    X,             R,               I
##VAR_TYPE=  INDEPENDENT,   DEPENDENT,       DEPENDENT
##VAR_FORM=  AFFN,          ASDF,            ASDF
##VAR_DIM=   16384,         16384,           16384
##UNITS=     SECONDS,       ARBITRARY UNITS, ARBITRARY UNITS
##FACTOR=    0.0002416,     1,               1
##FIRST=     0,             0,               0
##LAST=      3.9581328,     0,               0
##MIN=       0,             -835887,         0
##MAX=       3.9581328,     1015652,         0
$$ Real data points
##PAGE= N=1
##DATA TABLE= (X++(R..R)), XYDATA
$$ [...]
4837 78 72 227 86 -71 -256 -714 -834 -758 -193 160 186 262 123 20 269 549 446 523 389 -75 -362 -318 -379
4860 -379 -206 -142 -411 -575 -616 -317 76 540 677 602 444 406 293 334 195 -51 -628 -744 -796 -722 -198 221
4882 221 289 272 310 218 206 526 770 625 197 -209 -620 -560 -229 -35 40 -306 -508 -674 -387 149 607 784
4904 784 654 401 -96 3 391 545 270 -212 -759 -1176 -910 -307 73 384 413 -40 50 153 624 1026 1070
4925 1070 516 -264 -839 -710 -593 -79 77 -412 -600 -422 -186 184 566 873 660 339 167 11 52 223
4945 223 185 -336 -564 -684 -779 -549 -60 -17 143 105 294 244 518 785 620 490 231 -343 -534 -552 -365 -449
4967 -449 -460 -352 -447 -263 202 644 656 704 508 128 -15 212 129 67 -354 -519 -824 -669 -271 -19 150 243
4989 243 15 -47 180 562 643 802 465 -199 -763 -687 -324 -30 -48 -203 -625 -733 -203 8 617 930 802
5010 802 300 -32 -79 117 341 246 -134 -657 -762 -697 -464 92 429 370 206 67 -139 66 652 868 509
5031 509 -12 -484 -717 -568 -170 7 -184 -227 -368 -506 -100 400 744 764 535 253 -140 -1 167 57 -159
5052 -159 -359 -778 -705 -449 -149 150 212 283 267 159 296 383 388 362 12 -497 -460 -230 -284 -206 -102 -233 -257 -83
5076 -83 220 272 488 638 307 122 5 55 5 146 -150 -556 -757 -641 -535 -47 383 337 133 169 197 157 432
5099 432 635 382 -335 -609 -772 -644 -54 151 32 -253 -340 -369 73 523 910 649 332 -168 -321 4 172
5120 172 348 -25 -483 -701 -799 -392 -95 383 533 480 210 -11 215 567 545 431 -79 -453 -822 -680 -545
5141 -545 -139 204 109 12 -90 228 324 606 699 307 -264 -275 -316 -112 91 163 -169 -415 -492 -367 -110 365 396
5164 396 349 274 170 217 436 575 285 -148 -406 -694 -746 -448 -375 -108 -252 35 184 454 695 843 598 286
5186 286 -251 -460 -357 -140 -50 -338 -448 -490 -478 -208 84 308 465 217 -6 -90 173 460 418 479 59 -304
5208 -304 -675 -456 -447 -218 -90 -74 -270 -128 210 520 1022 990 654 3 -391 -516 -306 -170 -112 -514 -726 -616
5230 -616 -234 259 694 817 610 234 -59 -143 86 314 349 -83 -215 -486 -560 -398 -190 13 -81 23 -224
5251 -224 -55 367 734 634 657 266 11 -295 -393 -295 -489 -565 -428 -547 -524 197 362 625 828 584 43 57
5273 57 87 157 65 -201 -393 -490 -499 -358 -285 -14 152 -10 -160 123 363 528 629 461 56 -203 -108 -40 -126 -167
5297 -167 -452 -829 -947 -450 -98 459 816 674 317 275 391 375 387 247 -317 -731 -685 -790 -418 -154 231
5318 231 81 72 85 85 367 525 737 281 -92 -176 -381 -218 28 -33 -324 -312 -566 -706 -309 220 492 762 472
5341 472 37 37 271 440 279 119 -336 -795 -879 -740 -365 -62 358 217 81 206 399 522 559 468 -5 -426
5363 -426 -379 -371 -290 -178 -104 -273 -351 -255 -77 99 518 589 196 160 195 189 67 102 -15 -321 -445 -545 -507 -366 -152
5388 -152 28 4 91 281 420 590 510 402 101 -220 -281 -267 -216 -92 -221 -386 -512 -329 2 514 641 487
5410 487 328 -131 -33 70 325 219 -166 -330 -600 -644 -364 105 93 187 -61 -169 -35 261 615 582 384 138
5432 138 -317 -338 -162 -192 -266 -129 -274 -365 -270 -77 190 455 753 445 223 50 57 -86 -81 39 -277 -385 -551
5455 -551 -533 -297 210 412 371 173 47 141 190 476 417 -55 -121 -434 -643 -301 -143 -127 -75 -229 -184 -31 348
5478 348 692 630 361 112 22 45 219 -14 -179 -301 -527 -617 -458 -93 278 288 222 179 237 472 609 433 178
5501 178 -106 -407 -404 -346 -281 -124 -333 -289 -222 -214 182 300 459 605 303 -97 -28 -5 -56 -16 -54 -374 -559 -574 -381
5526 -381 -152 283 395 370 294 56 276 287 535 394 154 -268 -524 -649 -312 -102 103 -37 -148 -186 -8
5547 -8 316 542 581 400 281 -66 -176 -93 -67 -87 -257 -326 -660 -560 -242 85 324 353 354 154 174 325 218 321
5571 321 112 -370 -491 -599 -411 -358 25 -46 -149 -15 122 313 461 613 500 145 -21 -7 -118 -97 -84 -363
5593 -363 -436 -573 -318 -133 160 251 294 111 285 379 543 513 319 -32 -431 -580 -575 -565 -234 -91 -278 -282 -75
5616 -75 284 544 775 584 345 159 -100 -188 -90 -32 -176 -331 -218 -352 -440 36 182 166 219 270 118 193 336
5639 336 403 388 258 28 -456 -710 -640 -469 -60 65 -141 -112 -72 355 514 663 754 299 -92 -341 -470 -425
5661 -425 -253 -116 -378 -530 -383 -77 282 352 377 215 53 -8 170 301 346 111 -171 -338 -443 -575 -204
5682 -204 -86 -100 -379 -158 3 172 525 558 506 452 243 10 -218 -257 -385 -380 -555 -513 -410 19 306 288 379
5705 379 415 167 178 147 122 69 -177 -296 -571 -409 -226 -95 -11 56 -234 -313 -167 84 365 478 554 268 -96
5728 -96 -34 -59 55 -13 -94 -586 -721 -607 -102 186 369 461 472 299 277 365 190 294 -56 -302 -551 -550 -340 -264
5752 -264 179 335 157 128 -28 -125 174 409 305 135 76 -180 -464 -196 -45 -90 -128 -329 -623 -252 -37 404
5774 404 361 424 373 200 147 213 162 148 -154 -384 -545 -560 -128 56 67 260 10 171 334 322 366 207 155 -156
5798 -156 -331 -170 -185 -70 -139 -288 -445 -115 155 107 190 297 154 51 290 142 326 106 5 -184 -556
5819 -556 -445 -379 -220 -41 106 -38 107 262 340 346 392 446 138 -79 -426 -402 -159 -76 -49 -219 -280 -331 -181 214
5843 214 499 455 417 201 -54 54 9 110 76 4 -432 -681 -540 -117 66 170 171 121 75 188 266 326 395 251
5867 251 -63 -388 -354 -461 -222 -93 -8 -328 -187 11 165 153 400 498 243 76 20 -36 -51 -11 -326 -496 -382
5890 -382 -423 -243 -54 122 193 169 196 251 262 375 346 41 -227 -353 -529 -359 -178 -209 -220 -323 -178 155 41
5913 41 379 429 221 115 -1 18 -13 151 -127 -281 -396 -603 -373 -52 -162 16 227 269 313 152 602 578
5935 578 365 14 -115 -501 -443 -492 -319 -190 -65 -248 -187 50 220 302 626 547 135 -77 -111 -77 26 70 3
5958 3 -284 -516 -478 -270 30 154 285 162 153 208 339 438 443 300 48 -285 -424 -360 -253 -160 -230 -226 -82 7 312
5983 312 464 637 462 260 69 5 -55 -104 -105 -455 -394 -287 -362 -114 -26 47 69 239 39 251 234 226 248 17 -6
6008 -6 -198 -290 -291 -271 -296 -286 -261 -70 -88 168 409 480 455 330 71 36 -19 -110 -7 -116 -400 -588 -437 -148 100
6033 100 198 217 269 75 192 242 321 463 37 -124 -404 -423 -421 -144 17 -67 -170 -264 -116 29 362 537 528 241
6057 241 81 -148 -157 20 25 -237 -216 -317 -330 -230 -31 175 122 365 280 167 218 362 210 109 -66 -235 -338
6080 -338 -397 -344 -175 -138 0 -41 82 178 255 313 365 163 25 -60 -99 -174 -72 -100 -240 -271 -224 -146 -137 287 251 53
6106 53 27 217 152 264 236 212 -187 -243 -268 -191 -222 -191 -196 -72 -149 41 88 321 478 326 235 64 -173 -175 -35 -180
6132 -180 -223 -443 -201 -286 -61 211 303 401 317 174 145 -48 128 187 135 -124 -390 -463 -311 -175 51 59 40 36 -99
6157 -99 -35 260 459 444 344 -49 -162 -130 -47 2 7 -211 -250 -348 -159 23 264 441 414 229 250 146 106 -23
6181 -23 -183 -334 -358 -428 -321 -289 -18 -17 56 95 164 227 85 276 221 193 -47 16 -200 -174 -90 -188 -213 -278 -237 -313 -15
6208 -15 232 271 313 424 367 111 135 152 -147 -189 -384 -343 -248 -300 59 15 189 107 10 196 374 328 215 102 -50
6233 -50 -143 -269 -108 -87 -198 -193 -299 -257 -131 26 218 400 292 216 281 49 258 186 -2 63 -332 -552 -435
6256 -435 -374 -62 214 244 150 61 125 328 413 417 238 2 -192 -350 -370 -155 -29 -155 -246 -149 -103 -26 225 306 303
6281 303 288 205 -2 48 13 -37 -149 -285 -473 -483 -284 -145 -57 153 175 20 233 259 317 293 110 -95 -161 -273
6305 -273 -52 -177 -356 -211 -166 -102 -74 -65 182 324 416 253 289 219 211 20 29 -2 -291 -421 -323 -245 -118 52 244
6330 244 -28 210 308 238 496 237 161 -103 -191 -222 -378 -161 -165 -251 -215 -94 -144 66 344 395 217 192 44 -16
6354 -16 164 100 14 -100 -258 -310 -416 -364 -90 -45 -34 184 177 194 364 531 432 275 109 -260 -412 -379 -431 -278
6378 -278 -142 -50 -149 -101 108 224 264 306 190 67 49 -37 -44 -53 122 -7 -236 -160 -209 -317 -7 90 20 65 185
6403 185 187 314 351 282 176 5 -94 -273 -406 -381 -374 -235 -93 -23 285 248 391 335 213 63 -5 -130 -74 -122 -278
6428 -278 -245 -185 -234 -79 41 39 77 19 -33 100 108 152 194 113 90 -119 -117 -168 -165 4 -220 -180 -280 -269 57 372 381 350
6456 350 267 133 -35 2 -56 -117 -97 -284 -468 -275 -76 116 282 292 169 -9 103 65 51 192 41 -58 -263
6479 -263 -208 -237 -80 43 -130 -50 -14 -100 -38 203 227 313 235 199 177 -59 -76 -120 -171 -104 -211 -373 -170 6 89
6504 89 264 329 352 180 196 182 79 -17 53 -16 -232 -215 -257 -220 26 3 38 -80 124 209 190 154 134 77 49 118 -97
6531 -97 -3 -217 -227 -270 -342 -292 -189 20 177 180 70 188 75 268 216 77 -256 -222 -341 -222 -234 -44 -90 13
6555 13 20 -19 132 338 390 261 239 14 -14 -173 -185 -68 -128 -279 -337 -272 -133 27 152 208 92 142 110 92 156
6580 156 129 154 19 -149 -249 -265 -225 -71 -125 -69 -98 61 69 392 272 262 309 261 58 -104 -154 -210 -128 19 -165
6605 -165 -334 -122 13 150 279 292 302 196 198 75 -22 42 -144 -189 -219 -233 -203 -200 -154 16 8 -34 89 152 333 180
6631 180 249 196 -30 -159 -107 -201 -34 -200 -247 -294 -211 46 289 314 306 307 278 243 239 239 132 -47 -228 -253 -398 -131
6657 -131 -2 -4 -115 102 -29 37 408 295 266 221 54 -33 -38 -41 -247 -145 -174 -389 -179 -237 -68 139 208 288 250
6682 250 192 270 179 126 63 -21 -240 -281 -151 -288 -174 -64 68 -8 303 250 140 257 338 217 155 -41 -8 -150
6706 -150 -243 -120 -163 -229 -119 -155 -139 65 142 164 313 184 137 70 185 26 -117 -203 -289 -253 -266 -179 -34 -218 -167
6731 -167 20 205 261 233 238 232 136 -45 -46 -146 -80 -119 -138 -150 -139 -235 3 236 227 266 252 131 126 94 220 108 -63
6758 -63 -89 -351 -406 -267 -242 -22 10 57 68 167 267 365 249 306 -8 -153 -88 -314 -145 -209 -72 -162 -128 -56 -123
6783 -123 189 261 239 207 236 88 100 66 -23 99 10 -158 -365 -332 -194 -257 -77 127 186 208 218 81 180 292 62
6808 62 -28 -166 -319 -299 -285 -218 -32 79 -112 75 145 214 165 199 120 97 96 -98 -117 -4 -127 -194 -59 -117 -92 -83
6834 -83 -88 -109 -101 91 230 278 360 368 281 -140 -200 -231 -94 -160 -292 -229 -272 124 138 301 420 285 195 103 -34 -138
6860 -138 -46 -31 -108 -330 -341 -92 -92 -24 132 133 85 -41 -16 70 237 272 221 102 113 -152 -216 4 -66 -256 -158 -221
6886 -221 -83 -77 285 270 382 327 356 59 -40 -63 -141 -281 -386 -341 -205 -9 34 92 238 261 218 155 44 76 73 66
6912 66 13 -75 -114 -116 -156 -173 -89 -194 -105 -103 -111 -38 303 208 296 347 193 23 51 -44 -99 -427 -336 -364 -274 -23 108 101 316
6941 316 301 344 280 295 102 26 -21 -200 -364 -270 -250 -30 -67 -80 -19 -50 76 -21 211 204 192 142 -60 -44 -93 -71 -105
6968 -105 -306 -187 -376 -238 -26 -5 184 278 260 356 344 153 273 125 -33 -165 -208 -365 -279 -270 -69 18 44 189
6992 189 143 271 210 273 270 117 60 75 -161 -100 -111 -295 -158 -314 -298 -153 51 63 140 230 156 214 135 388 184
7017 184 -33 -161 -183 -225 -213 -106 -216 -140 -7 27 155 299 323 275 332 55 -51 -80 92 -155 -323 -385 -328 -275
7041 -275 -174 -50 112 78 220 181 56 228 201 243 42 79 -260 -306 -252 -209 -239 -29 17 -14 -51 36 149 150 363
7066 363 256 196 21 -86 -147 -185 -143 -183 -244 -218 -149 -157 110 135 267 246 203 163 70 198 153 -14 -145 -136 -456 -266
7092 -266 -291 -189 -178 83 31 -23 109 161 157 227 200 -56 -60 -111 -77 -125 35 -70 -164 -86 -164 -219 169 164 142 152 30
7119 30 240 262 174 46 -106 -235 -178 -266 -271 -146 -75 38 98 147 147 198 323 306 131 -63 83 -76 -34 -112 -117 -163
7145 -163 -164 -29 -61 6 129 160 90 107 150 119 235 164 -123 -86 -114 -224 -229 -71 -208 -114 -22 183 86 160 262 212
7171 212 219 139 76 -166 -88 -192 -149 -112 -43 -115 -6 15 36 146 328 207 129 110 -10 36 52 -93 -76 -139 -270 -304
7197 -304 -159 -130 21 52 55 64 162 151 153 289 52 5 -160 -172 -116 -201 -83 -111 -84 -46 51 -55 202 204 270 292 168
7224 168 -22 39 43 -7 -118 -102 -6 -182 -160 -140 -12 130 89 45 190 254 249 93 77 -91 -159 -236 -181 -206 -299 -110
7250 -110 -77 -87 23 52 241 308 139 232 121 -29 185 21 -114 -150 -226 -183 -89 46 -29 63 96 86 162 246 351
7275 351 303 280 140 -41 -206 -146 -234 -192 -220 -192 -192 -23 102 128 225 428 331 199 86 5 -99 -281 -105 -160 -139
7300 -139 -135 -227 -131 101 83 101 142 81 81 145 224 167 212 98 -78 -140 -248 -199 -148 -213 -177 -139 1 123 189 333 307
7327 307 324 78 102 -14 -103 -179 -335 -275 -366 -289 -88 -53 194 145 174 118 237 152 46 -29 -187 31 40 -29 -161
7352 -161 -183 -128 -117 -178 -45 -23 3 252 206 279 219 249 236 71 -51 -163 -246 -304 -314 -289 -175 35 179 257 197 306
7378 306 176 136 227 121 -30 -135 -219 -264 -108 -17 -138 -43 -115 -16 -149 48 140 241 237 97 172 186 -7 -56 -7
7403 -7 -87 -137 -300 -315 -198 -133 3 68 219 298 250 213 294 129 103 3 -98 -182 -128 -223 -121 -16 -11 126 48 -49
7429 -49 95 140 239 93 90 105 -113 -184 -26 -142 -196 -224 -283 -146 -82 116 20 119 162 224 200 220 161 151 -70 -107 -195
7456 -195 -174 -114 -167 -71 -176 -116 69 317 151 236 89 96 140 33 -11 -92 -195 -65 -104 -212 -51 -39 -108 24 74
7481 74 97 61 61 162 130 -42 -29 45 -102 -193 -142 -278 -80 -18 -91 -42 94 181 207 290 305 144 107 86 -64 -160 -4
7508 -4 -209 -117 -137 -58 -41 59 107 159 194 135 91 33 121 45 84 -33 -153 -104 -62 -277 -138 18 -144 47 179 133
7534 133 127 237 111 65 51 -94 -39 -133 -201 -91 -23 -56 -173 60 24 -55 -46 154 162 176 255 168 154 20 20 -140 -130
7561 -130 -214 -171 -73 35 -11 59 64 197 298 95 185 -3 -11 -63 -67 -114 -121 -206 -169 -228 -120 109 -27 178 160 155 -7
7588 -7 40 165 197 105 -199 -63 -122 -246 -306 -83 -112 9 -125 -34 78 52 125 322 247 275 173 5 -180 -101 -169
7613 -169 -121 -283 -145 -51 -41 41 173 213 267 137 -10 106 -53 -129 -53 80 -87 -213 -209 -181 -159 81 76 75 124 248
7639 248 207 207 102 135 87 -8 25 -110 -154 -94 -205 -179 -224 16 42 72 267 199 160 135 230 75 38 68 -77 -219
7665 -219 -146 -105 -184 39 -15 -63 82 122 191 177 94 125 6 100 -82 -254 -142 -168 -146 -87 -76 -60 -163 47 154
7690 154 181 309 249 142 146 26 -1 -26 -107 -160 -340 -212 -121 -82 63 13 -23 210 241 317 105 177 259 111 -62
7715 -62 -113 -143 -283 -154 -176 -57 -129 -83 26 249 171 169 157 213 149 13 -47 -46 -102 -41 -209 -191 -80 -26 94 -15
7741 -15 16 231 220 98 257 312 50 150 -41 -140 -148 -145 -91 -150 -79 -27 -24 9 190 47 192 325 245 48 71 -80
7767 -80 -31 -80 -193 -228 -108 -213 -168 -4 93 130 160 82 80 109 97 121 20 -49 -147 -142 -69 -35 -178 -177 25 -124 -102 -45
7795 -45 151 275 236 243 182 48 -53 20 -64 -58 -204 -244 -185 -147 -8 283 128 41 213 149 267 156 99 -93 -25
7820 -25 -174 -274 -29 -13 -86 44 -1 -88 79 -35 195 177 240 82 127 -41 75 -48 -99 -188 -216 -194 -73 -112
7844 -112 -57 119 121 308 318 382 84 119 42 -129 -103 -139 -244 -193 -133 -2 -61 -137 97 202 132 77 82 71 44 -112
7870 -112 -91 58 -73 -141 -131 -129 -160 -197 -35 37 106 151 91 205 125 172 127 65 -90 -131 -180 -161 -82 -92 -28 -32 -42 167
7898 167 127 156 289 54 197 -15 -71 -190 -112 -160 -173 -106 -196 -156 -104 -4 109 9 180 79 73 198 14 138
7922 138 -24 79 -36 -232 -108 -272 -162 12 78 -37 60 66 154 172 243 207 -16 72 4 -210 -90 -223 -128 -148
7946 -148 -125 57 8 154 13 128 172 146 205 117 40 59 40 -181 -101 -192 -143 -145 -123 -131 46 76 16 39 144 160 8
7973 8 117 79 -84 -237 -155 -150 -144 -152 -41 -36 62 -121 129 111 145 158 31 217 53 170 71 -70 -148 -86 -195 -127 -107
8000 -107 25 73 85 98 187 101 116 199 51 -3 -51 -201 -165 -64 -151 -209 -118 -102 16 38 146 48 252 117 57 16
8026 16 51 46 -89 -11 -147 -79 -216 14 -147 -48 -14 174 223 200 383 276 263 149 9 -79 -105 -127 -280 -248 -143
8051 -143 -86 -79 121 94 211 133 170 250 90 52 16 -55 -88 -62 -134 -116 -17 -138 -105 -79 38 74 53 72 100 242 180
8078 180 81 -68 -47 -39 -84 -109 -26 -169 -123 -18 61 22 188 167 285 232 155 52 12 -13 -152 -179 -249 -132 -232 -64
8104 -64 1 -131 29 83 106 64 105 170 180 -38 5 -65 -104 -159 -123 -146 -70 -76 -168 -80 57 158 190 212 125 205 206 91
8132 91 3 -120 -133 -215 -178 -155 -134 -37 124 134 79 112 114 63 8 130 182 54 56 -172 -106 -211 -186 -155 -115 11 57 40
8160 40 49 59 194 120 122 37 -134 -83 -20 -125 -145 -72 -81 -99 -38 -102 -10 158 223 55 121 104 127 49 32 -124 -5 -37
8188 -37 -100 -123 -134 -83 -22 -67 155 270 95 169 69 -56 4 43 7 -53 -187 -135 -238 -182 -183 -11 21 136 81 82 172
8215 172 57 24 104 100 -73 -27 -102 -154 -187 -43 -81 -122 -15 -95 96 154 266 300 114 116 195 116 82 -49 -115 -185 -148
8242 -148 -219 9 -5 92 126 109 245 -6 125 85 -122 -66 17 -66 -158 -260 -227 -11 -39 21 92 -132 126 177 329
8267 329 122 36 118 64 93 11 -47 -147 -29 -222 -224 -158 -19 -38 107 137 235 147 278 21 140 94 -143 -317 -236
8292 -236 -179 -115 -112 -154 -131 51 -125 74 128 155 83 -18 71 105 -55 -101 -9 -152 -166 -137 -140 -91 -28 -68 17 130 134 221
8320 221 177 222 93 -88 -16 -61 -207 -87 -177 23 -81 87 97 133 89 186 115 58 30 188 -99 -127 -9 -218
8344 -218 -219 -89 -136 -167 -154 3 -47 108 145 181 63 34 76 145 172 -41 -47 -197 -149 -192 -84 -107 -67 -111 17 224
8370 224 208 345 182 200 37 -17 -56 -137 -262 -179 -220 -178 -135 -27 6 187 48 144 151 261 238 60 134 -31 -23 -305
8396 -305 -143 -221 -155 -141 -114 -90 126 80 57 181 150 201 161 68 -17 -193 -201 -133 -80 -254 -159 -141 -75 -30 31 262 240
8423 240 76 111 128 63 112 74 -105 -123 -75 -247 -209 -90 -118 56 -56 169 94 58 172 -11 88 -48 -70 -23 -225
8448 -225 -344 -104 -128 -15 -76 -67 0 40 28 173 242 204 61 -13 -13 0 51 -78 -159 -94 -118 -73 -77 -21 68 144 118 201
8476 201 198 207 175 72 -64 -58 -68 -218 -111 -182 -77 -205 -149 67 131 220 189 33 176 -70 144 81 -227 -129 -174
8501 -174 -157 -93 -18 -70 -100 1 46 71 142 197 217 194 147 21 38 96 -69 -50 -120 -179 -205 -319 -22 6 119 184 126
8528 126 71 135 120 50 46 -5 22 -47 -139 -163 -180 -83 -35 -42 68 16 8 36 129 132 81 20 65 -104 -149 -133 -129 -136 -47 -131 29
8559 29 38 42 195 285 141 103 12 52 102 30 -84 -120 -124 -88 -102 55 -39 13 40 125 59 158 89 42 75 76 -8 -150 -142 -150 -163
8590 -163 -71 -126 -181 -53 -32 18 150 149 56 104 61 -87 -9 -48 -88 -245 -168 -99 -245 24 138 132 83 -28 190 312
8616 312 207 76 113 -2 -130 -146 -232 -20 5 -126 4 -94 23 -56 156 129 268 89 86 -7 2 29 -173 -162 -78
8641 -78 -264 -180 -135 -15 -162 105 145 118 188 157 174 282 -2 -59 -86 -144 -140 -177 -88 -40 -144 -130 114 86 80 147 285
8668 285 62 169 53 -20 23 -118 -160 -227 -195 -253 -55 -28 66 125 240 198 149 240 134 204 -48 -126 -189 -175 -214 -164
8694 -164 -65 -132 -1 -33 42 155 253 81 119 118 -58 164 43 45 -11 -58 -92 -125 -131 55 53 39 169 235 188 165 274
8721 274 99 117 -8 13 -121 -230 -281 -268 -252 -50 -95 -72 72 119 203 210 215 119 -102 49 -6 -112 -198 -122 -60 -237
8747 -237 -166 -108 -109 18 136 145 142 233 247 200 157 53 28 2 -200 -177 -251 -221 -74 -3 42 37 160 165 288 245 34 -37
8775 -37 86 31 -110 -194 -110 -130 -94 -129 -161 -131 74 98 47 216 100 95 141 78 82 -6 -65 -77 -144 -45 -117 -151 -104 -138 123
8804 123 204 127 173 285 183 -94 42 -78 -117 -189 -70 -64 -182 -135 -174 -98 1 127 53 119 158 139 30 87 87 -45
8830 -45 -8 -21 -115 -273 -214 -179 -47 -176 42 93 176 216 233 167 107 89 -113 -17 -198 -65 -178 -170 -33 -56 -17 125
8856 125 151 101 225 111 117 106 212 32 -148 -137 -181 -182 -104 -107 -95 -3 34 -2 144 26 77 78 145 33 155 -106 -131
8883 -131 -156 -135 -131 -141 -41 -3 50 123 241 115 89 101 168 157 36 76 31 -41 -67 -98 -111 -5 39 -90 -88 135 118
8910 118 107 229 204 51 109 2 -42 -164 -78 -129 -186 -158 -110 -123 -25 158 85 131 35 94 63 200 40 -158 -123 8
8936 8 -80 -75 -90 -62 -81 35 5 36 -6 62 66 166 44 74 -73 -61 -204 -58 -119 -94 -217 -62 62 51 -53 109
8962 109 115 228 169 124 -64 18 -84 -13 -179 -189 -157 -173 -87 -3 102 103 15 61 36 163 127 44 -76 -13 47 -187 -216
8989 -216 -173 -214 -177 -52 22 40 150 162 223 101 87 152 -7 -96 -26 -54 -209 -174 -106 -80 10 26 183 -18 109 71
9015 71 96 68 17 21 -52 -99 -178 -154 -172 -100 -63 -192 -127 -71 141 96 158 250 132 70 114 74 58 27 -70 -28 -151 -176 -117
9044 -117 -140 10 79 88 228 150 134 178 -9 -14 49 -10 -168 -124 -97 -171 -83 -79 36 -61 8 229 228 171 208 129 83 51 -28
9073 -28 94 -89 -98 -90 -117 -68 -200 -191 49 150 187 90 135 143 182 89 60 -66 -102 0 -114 -154 -89 -76 -42 74 134 198
9101 198 150 142 -2 -5 62 -86 0 -221 -76 -187 -193 -248 -194 -125 -48 30 -27 112 167 230 43 66 58 -39 -85 -204 -131 -67
9129 -67 -139 -98 -148 -82 -18 178 41 185 161 64 53 201 -81 27 -69 -81 -168 -181 -64 -126 -42 -73 181 160 57 144
9155 144 162 -98 166 91 67 -16 -243 -272 -185 -127 -176 -57 -52 -152 -60 107 106 228 191 98 -4 -41 35 -129 -151 -100
9181 -100 -155 -81 -69 -61 -58 22 113 193 218 95 125 179 32 26 -129 -90 -8 -147 -173 -180 25 -31 -59 95 198 170 105 115
9209 115 176 42 -7 -48 -103 -76 -90 -53 -139 -67 -50 6 -27 69 42 125 18 31 89 197 142 -32 -103 44 -99 -137 -139
9236 -139 -51 12 -112 88 62 55 208 302 42 -12 -113 4 -98 -103 -63 -75 -170 -30 40 19 68 194 -16 66 106 -47
9262 -47 92 -62 49 -30 -230 -94 -57 -26 -78 13 65 11 33 -7 232 127 220 127 35 -113 -151 -110 -34 -86 21 -84
9288 -84 -29 34 32 141 157 259 283 171 202 -10 -64 -67 -104 -108 -206 -157 -104 -80 -129 24 40 88 191 120 51 174 51 -23
9316 -23 28 -86 -91 -206 -129 -174 -44 -34 50 13 97 101 95 180 72 135 81 -31 -128 -70 -219 -211 -282 -70 -115 43 101 64
9344 64 85 69 62 237 25 -69 19 -12 -165 -258 -190 -269 -161 -150 -87 -66 96 217 258 183 123 83 -29 24 14 -172 -167
9371 -167 -143 -170 -83 -129 -43 152 134 23 35 194 169 214 93 101 -36 -58 -114 -34 -81 -125 -188 51 -32 -6 81 120 255
9398 255 222 149 106 155 41 54 -140 -105 -260 -167 -37 -85 -53 -29 2 -25 17 87 167 127 61 75 -76 -5 -56 -56 -45 -134
9426 -134 -83 -82 -38 -34 138 78 220 20 127 119 54 -31 4 -75 -31 -174 -232 -72 -167 -34 41 16 64 126 233 206 67
9453 67 156 -3 -132 -127 -40 -156 -76 20 -82 -12 -114 -114 71 7 134 186 128 222 82 31 116 42 -96 -79 -82 -155 -151 -4
9481 -4 75 38 229 195 200 196 76 204 -33 -53 -9 -119 -248 -183 -140 -51 -41 -78 45 -50 130 162 47 50 82 38 -32 -76
9509 -76 -71 -111 -83 -156 -130 -116 -67 23 -15 186 30 192 136 192 109 118 55 -152 -156 -237 -134 -135 -117 -22 33 53 229 345 186
9538 186 212 140 71 59 13 -5 0 -133 -189 -115 -145 -10 16 16 62 32 57 -9 87 17 73 -145 -106 -28 -109 -60 -110 -127 -88
9567 -88 -39 -28 -15 45 56 141 152 102 78 133 13 -61 -1 -71 -28 -55 -111 -82 125 66 72 21 21 247 55 188 96 55 95
9596 95 -118 -256 -251 12 -107 -61 -105 -29 -15 196 24 104 164 110 62 32 -13 -170 23 -230 -72 -160 0 69 -16
9621 -16 -11 2 126 201 102 207 -85 34 -40 -82 15 72 -120 -173 -14 -77 -31 7 103 -6 89 38 144 170 91 -51
9647 -51 -22 -173 -77 -136 -72 -122 -19 42 -4 74 58 165 141 105 50 102 136 -41 -63 -43 -95 -118 -116 -117 15 -24 19 29 146
9676 146 159 77 185 2 12 -39 -77 -92 -207 -193 -86 -271 -148 -37 95 30 136 112 93 68 129 -34 -108 -76 -53
9701 -53 -176 -105 -123 -219 -68 -139 50 -101 208 108 196 52 4 89 54 1 -67 27 -104 -246 -215 -104 -177 -110 74
9726 74 51 81 101 84 110 111 209 167 -22 -95 -62 -319 -200 -71 -80 -94 -33 13 106 83 116 111 30 95 -79 -56 -31 -12 -148
9755 -148 -71 -158 -137 -16 -9 32 128 233 186 143 188 25 115 119 105 -116 -47 -173 -37 -109 -26 28 136 73 79 50 119 247
9783 247 257 5 41 -56 -149 -49 -132 -184 -137 -261 84 40 35 149 161 214 176 175 138 25 8 -134 -52 -172 -187 -90 -124
9810 -124 78 -93 -13 136 56 143 182 52 154 91 -10 -43 -132 -162 -134 -228 -225 -131 -85 -89 92 66 115 205 107 108 219
9837 219 -76 -114 44 -66 -214 -209 -183 -272 -126 76 11 51 81 141 67 131 194 159 -8 68 11 -73 -10 0 -73 -151 -85
9864 -85 25 -50 102 220 110 270 135 35 64 -88 33 -138 -1 -71 -264 -67 -75 -6 55 245 61 23 139
9887 139 135 33 63 24 -94 -47 -132 -214 -207 -117 -162 -62 -16 49 72 213 184 184 107 145 92 71 79 -64 -73 -77 -89 -90 -90 -20 13
9918 13 21 220 71 186 121 48 134 48 -24 -59 -136 -20 -103 -103 -120 27 89 28 191 159 67 99 120 24 14 121 -31
9945 -31 -13 -74 -95 -98 -75 -7 -38 -63 76 65 147 114 29 213 39 117 3 -94 -215 -99 1 -124 21 -147 140
9970 140 25 180 33 241 194 55 -6 -10 15 -175 22 -162 -210 -133 -130 -55 -24 -35 70 12 68 23 43 104 45 14
9996 14 -145 -176 -149 -179 -123 -77 -31 142 107 168 43 290 59 144 174 23 -63 -69 -5 -71 -96 -61 -127 -60 35 3 40 40
10024 40 63 -5 -42 35 113 -17 35 -223 -210 -82 -176 -128 -209 -3 -86 -47 160 -6 111 170 59 174 -20 -3 -19
10049 -19 -56 -89 -99 -99 5 42 -69 85 125 108 124 18 -42 131 101 120 122 -158 -16 -179 -152 -92 -91 -142 -127 47 4
10076 4 6 163 68 101 123 46 -85 -54 -93 -183 -170 -126 -65 -20 70 26 129 212 271 123 -35 -30 117 -2 33 11 -36 -192
10104 -192 -109 -72 -14 -6 31 13 93 120 237 72 -31 175 -37 26 -68 -161 -216 -130 -167 -117 17 29 21 36 74 113 35
10131 35 176 -80 2 -72 -106 -180 19 -118 -152 -78 86 -60 -68 53 12 189 59 195 -27 84 -45 -64 18 -115
10155 -115 -105 -198 -127 -173 -96 93 -10 -41 158 178 48 44 43 52 -81 -309 -147 -204 -92 -186 -66 -21 -7 -161 82
10180 82 132 150 64 93 180 74 -51 -1 -59 -137 -144 -77 -84 -70 -19 -13 2 -3 263 52 146 32 2 150 -53 29 -92 -138
10208 -138 -219 -98 -111 -84 83 41 83 139 18 84 183 42 84 -92 -10 -90 -56 -15 -148 -163 -53 73 -4 10 92
10233 92 170 151 83 -93 -1 107 14 -90 -86 -137 -77 -75 -86 -97 -83 114 -50 57 36 77 176 56 61 -74 -28 -83 -57
10260 -57 -170 -222 -59 -191 47 -44 34 60 76 144 -19 33 97 -38 -139 7 -215 -162 87 -69 -166 -39 4 76
10284 76 40 168 54 1 16 -50 73 -35 -35 -150 -183 -16 -53 -81 -112 -36 -62 -15 90 84 58 216 45 -40 -8 -39
10310 -39 4 -39 -261 -145 -147 -111 90 -6 25 117 32 31 85 -24 141 -30 -164 -67 -6 -122 -122 -125 -101 -26 -74 29 78
10337 78 114 111 48 133 24 37 -18 -75 -150 33 -135 -56 -239 15 7 -68 62 46 105 104 99 89 -63 37 -233 -28 -139
10364 -139 -116 -212 -15 -56 -9 167 -12 117 133 -71 86 62 12 -33 -88 30 -65 -90 -77 -204 -155 -82 -12 94 63
10389 63 214 87 139 39 61 35 65 -113 -54 -187 -184 -64 -109 16 84 -10 30 113 98 24 108 -73 80 -64 44
10414 44 -5 -61 -117 -155 -104 -4 7 -1 74 80 104 90 116 118 112 138 -106 -49 -94 -177 -104 -83 -81 38 -41 61 190 97 176 222
10444 222 147 -51 5 -67 -156 -116 11 -120 -172 -36 -57 -70 31 67 -22 -33 -28 -24 203 1 1 -78 -87 -230 -154 -97 -133
10471 -133 -141 20 -32 -74 -23 145 119 165 38 -19 -61 -82 -42 -122 -126 -8 -163 -34 -97 -22 -16 136 171 86 6 115 69
10498 69 47 84 -87 -79 -21 -71 -99 -38 -68 38 32 -14 54 -42 133 164 21 -93 41 -29 36 -96 -64 -180 -160 -29
10524 -29 -102 -81 -9 152 194 95 43 106 42 102 97 70 -144 44 -139 23 -126 -55 -73 -15 133 19 89 59 23 111
10550 111 104 49 53 -37 -149 -222 -133 -92 -137 -117 -121 114 48 178 74 -12 -17 -70 17 54 -16 39 -90 -96 -142 24 0 21 -31
10579 -31 34 -77 32 -31 140 -62 50 64 -60 40 -77 79 -15 -83 -173 -146 -53 63 47 142 45 21 118 35 27
10604 27 38 -44 -224 -2 -124 14 -126 -23 69 73 149 118 177 122 228 -16 106 67 -107 -90 -43 -231 -155 -57 30
10629 30 -57 34 119 209 160 201 142 87 151 16 -63 -17 34 -160 -31 -46 -128 -6 -20 -58 8 60 9 69 10 99 -68
10656 -68 100 -21 -181 -120 -49 -132 -76 -89 -68 -72 27 -23 96 183 22 199 13 33 -63 167 -104 -119 -114 -59 -115 3
10682 3 29 11 197 100 -26 66 96 103 164 4 -46 -75 -34 -56 -47 -72 -29 -18 -48 31 85 163 35 119 21 8 48 -102 -24
10711 -24 -86 -66 -183 -35 5 -80 88 0 85 -87 22 194 87 39 96 -28 45 -110 -31 -99 -43 -76 -134 -50 25
10736 25 -48 64 123 94 36 109 69 37 23 -96 -37 -130 -33 -117 -103 -46 84 -61 102 101 178 105 115 31 -11 2 -10 -42
10764 -42 -159 -44 64 -54 -33 -68 76 130 111 185 196 111 81 85 -99 -19 -29 -35 -106 -26 -59 -43 63 102 167 149 35
10791 35 83 81 53 147 -21 -18 -181 -198 -99 -79 -89 -65 -29 23 -4 146 35 90 162 206 68 -97 -38 33 -83 -66 -16
10818 -16 -168 -195 -28 -95 67 96 155 216 89 140 48 36 22 -2 46 -97 -54 -80 -86 -1 51 95 71 79 114 -11 32 9
10846 9 17 42 -23 -50 -67 -1 -98 -29 -146 -101 -32 37 108 121 142 90 104 100 70 9 -72 -193 -175 -6 -66 -99 13 0 26
10875 26 44 75 -20 9 192 113 18 -63 -167 -38 -53 -5 -162 -76 -50 23 68 76 137 82 19 43 73 13 44 -4 10 -50
10903 -50 -9 -97 -14 -85 -77 -17 15 -13 -10 31 95 136 113 10 67 -7 49 -64 -62 -59 -82 -77 -155 15 96 98 160 233 127 110 -43
10934 -43 47 64 -15 -53 -83 -29 -50 -111 -82 -52 -55 -16 -19 166 77 187 159 -117 90 1 -77 -117 -32 -42 -64 5 -22 -18 38
10963 38 144 122 18 97 142 72 68 -4 -36 -101 -100 -100 -29 -132 18 5 2 47 17 -38 100 24 32 -19 -42 -52 -100 -139 -138 8
10993 8 -30 -90 -24 -25 25 35 143 22 -59 93 53 18 -41 -31 -104 -85 27 -85 -16 178 37 95 67 -10 91 79 118
11020 118 -9 47 -120 -96 118 -90 7 -71 11 -129 68 -30 87 63 88 78 -68 18 59 20 -73 -57 95 -58
11044 -58 -125 -93 -111 80 18 111 -1 21 101 106 213 75 74 -118 -1 16 -88 28 -116 -64 -84 -44 -78 -26 40 121
11070 121 104 14 -46 -7 -20 62 -62 -66 -187 -107 -52 2 90 82 -53 -78 76 85 101 39 107 -138 -59 -100 -66 -169 -75 -164
11098 -164 -111 59 -89 50 31 112 72 146 34 -8 95 -42 -111 2 -11 -46 -13 -67 14 -44 42 26 180 118 91
11123 91 11 124 32 -27 -94 -130 -42 -20 -143 -40 -102 -15 -22 12 17 69 109 40 106 -20 62 -51 -28 -79 -80 -14 -155 -13
11151 -13 38 -21 190 46 61 9 119 33 30 55 91 -146 -86 -160 -228 -125 -63 -59 -36 94 -15 99 210 76 -7 83
11177 83 -24 -31 -15 -73 28 -200 -130 -113 -37 1 27 87 -42 71 -15 107 -42 90 83 92 -100 -98 0 -99 -103 -63 -11 38
11205 38 -21 -1 111 169 111 36 25 -37 22 -106 25 -15 2 -28 -85 -139 -141 24 -53 111 -4 49 61 10 0 91 -21
11232 -21 57 2 -114 -107 -3 -7 15 -67 -112 -37 67 77 84 168 -42 62 -35 43 43 -77 -101 -34 -35 -13 -19 62 46 97 81 41
11262 41 1 105 75 47 39 -98 -98 -18 -113 -93 -97 -130 -20 -7 4 106 -36 61 126 -2 64 53 7 -167 -56 -72 -48
11289 -48 -138 19 -1 -45 54 -76 -28 66 20 87 115 29 32 82 7 -165 -110 29 -61 -71 28 22 -54 152 -8 122 63
11316 63 71 -40 -42 35 -135 0 -31 -104 12 3 52 -82 29 183 62 -2 40 -3 77 -69 -64 19 -4 -143 -130 -11
11342 -11 -103 34 147 79 63 90 41 62 176 102 88 39 -121 -6 -22 -48 -110 -66 -3 7 24 -3 70 3 45 6 53
11369 53 17 17 -164 -28 65 -110 28 -48 -46 35 -13 -53 -89 102 77 20 -61 -2 8 -70 -80 -111 33 -101 -17 -105 -86
11396 -86 -84 137 -153 82 88 2 4 22 15 39 -9 -101 -88 -12 -37 -66 -53 -50 -19 4 57 4 63 63 145 34 64 -131 -19 -174
11426 -174 -48 -113 -35 -77 -34 -11 36 -40 72 27 36 -31 6 18 2 117 23 -133 -163 -130 -22 87 -85 -8 111 -9
11452 -9 154 135 82 81 -40 -94 -57 -28 -119 -56 -87 -95 -110 -77 34 -20 171 38 -2 -10 -18 -19 70 -10 -125 -2 -145 -42
11480 -42 -108 -84 -68 -85 77 95 1 -19 44 135 -57 74 49 -104 21 -188 -16 -88 8 -167 -110 27 89 142 73
11505 73 149 84 -43 -10 -17 -1 51 -31 -230 -27 -121 -1 -84 102 50 19 97 75 32 91 62 -19 -69 83 -70 -93 -30
11532 -30 100 -73 -29 29 -9 108 100 143 19 112 171 221 -45 36 16 132 -49 -153 -115 26 61 64 48 123 83 71
11558 71 105 -15 190 16 -37 -75 -71 -87 -126 -44 -195 64 -134 -96 -12 70 101 52 45 51 78 61 2 -34 -137 -83 -32 -105
11586 -105 2 2 41 69 -23 78 79 61 162 104 42 -10 41 -113 -87 11 22 49 34 74 81 -26 9 139 105 90 13 -67
11614 -67 -90 38 26 -140 14 18 -80 -89 -21 -39 77 -27 -9 6 -27 36 67 108 27 -78 -23 22 -90 -10 93 -43
11640 -43 -48 21 -82 115 114 -7 168 67 42 -25 41 -61 -128 -101 -106 -114 -8 -34 -2 79 91 78 34 159 131 62 79 -58
11668 -58 82 -70 -88 -100 -24 -80 -2 80 10 81 202 144 30 -2 122 -31 -24 25 49 -27 -189 -42 -18 34 68 65 1
11695 1 112 106 92 -105 233 13 19 -69 -90 -93 -89 -60 25 -97 -75 -41 -12 103 156 -59 37 11 -11 -10 -61 -97 -54 -70 -13
11724 -13 -34 -47 15 -30 51 113 33 155 -90 156 20 17 76 -10 -178 -244 -22 -145 10 -19 -14 83 27 38 83 140 -1
11751 -1 36 66 -26 -58 -122 76 -91 -25 -37 -75 17 -61 75 45 98 58 42 48 74 28 33 69 7 -49 -149 97 57 -69
11779 -69 64 30 9 199 152 185 166 135 -26 22 21 61 -101 -40 -82 -27 -41 47 99 55 11 37 7 -33 40 31 -45 -36 -96
11808 -96 -163 -118 -81 -116 -34 134 -33 -32 1 -2 51 143 71 32 -66 48 87 -95 -7 76 -165 58 20 43 106 34 38 93
11836 93 128 41 -78 122 46 -14 -28 -82 -128 -136 -29 34 -44 -203 95 3 127 84 96 53 119 93 -105 -137 -36 -127
11862 -127 -48 -117 87 -45 -69 -18 51 143 164 60 19 -65 44 26 90 4 -2 -23 21 -84 19 3 131 49 52 39 79
11889 79 274 69 1 -78 -28 -38 -106 -132 -98 13 16 -61 -48 82 97 77 -12 83 -12 60 45 -77 -3 -102 -65 -142 -177 -139
11917 -139 -49 -77 4 143 99 1 43 68 36 157 102 38 -74 -42 -44 -51 58 72 -96 6 -28 -20 172 29 122 16
11943 16 -15 -24 -91 64 -26 -214 15 38 -148 -56 88 6 -46 -77 57 67 14 5 104 94 -13 -16 -28 -38 98 16 29
11970 29 -114 -24 41 -29 -47 79 273 74 -22 5 -6 -115 -61 -119 -94 -43 -69 -9 48 -55 22 -38 16 -34 31 19 99
11997 99 -49 -86 21 -140 -79 103 -215 -81 -145 44 146 112 123 -39 19 11 78 -61 -23 -33 14 -90 -77 -40 -100
12022 -100 7 105 133 103 23 121 20 89 2 73 -12 -13 -88 -44 -101 0 94 -89 -70 -7 -73 99 80 71 1 2 19 -118
12050 -118 -15 4 -64 -92 -56 -1 -45 -20 117 -18 122 -46 -68 36 26 172 64 15 -123 -59 -182 -13 -20 -49
12074 -49 -61 22 11 48 72 135 169 74 37 -22 -41 -78 30 3 -98 -171 -123 -110 -11 -25 35 53 0 55 268 38 133 -20
12102 -20 -124 13 -53 -158 -53 -60 63 6 -73 38 -14 45 68 133 -60 70 -5 83 -97 27 -2 29 -144 -160 -49
12127 -49 71 43 61 -37 42 -86 15 52 92 71 -37 -57 -86 -76 -34 -54 -121 -26 81 -54 53 88 0 152 -54
12152 -54 46 29 -68 27 -177 36 -51 -18 -69 23 31 5 142 -31 32 116 91 76 15 -57 -36 -104 9 -135 -38 -139
12178 -139 -25 -29 60 126 35 -15 178 -34 140 86 79 42 -10 -155 -52 -138 -134 -92 -35 40 149 100 -6 78 28 -45 46
12205 46 26 64 -47 32 -96 2 -34 -30 -25 64 140 -11 65 43 4 133 47 76 -4 -81 -98 -38 -62 34 -84 75 -108
12232 -108 -86 -148 52 202 76 7 69 100 -76 43 -47 -56 -94 -70 -7 -162 67 -18 178 118 95 25 35 119 59 14
12258 14 -193 -157 -25 -81 71 45 -43 52 18 -112 76 81 35 102 38 135 107 -39 -42 161 18 -37 -187 37 -112
12283 -112 -17 66 -2 20 -49 80 68 64 14 4 -112 -80 -44 -90 -40 -81 54 -31 14 56 36 111 188 24 -29 -6 14 64
12311 64 61 78 -145 -99 -119 -45 3 -83 35 51 12 106 74 95 -58 -44 90 25 6 -68 -82 104 14 3 67 -94 -68
12338 -68 48 99 139 139 116 63 -10 65 36 -57 -74 -44 -227 -36 -53 28 71 172 -24 163 -26 167 68 164 -37 -80
12364 -80 -13 -72 -39 -39 106 -71 6 -24 -114 -4 163 21 57 65 34 100 75 -52 8 -18 -108 -31 26 120 18 17 -14 76
12392 76 43 90 50 124 82 72 -23 -170 -98 -32 -27 -23 -112 15 -32 154 98 -53 59 -45 10 -4 55 -74 -11 14 -32
12419 -32 -26 -37 -104 42 -14 91 -20 45 4 -193 40 81 33 -11 104 -30 44 -53 -13 -81 -47 21 77 41 78 6 -11
12446 -11 6 129 62 69 -3 -121 6 -144 -64 16 -1 -115 70 -42 92 111 1 15 -1 -40 -12 83 -164 -45 -24
12471 -24 -77 5 15 32 -4 -22 22 89 146 145 119 114 -85 -53 1 67 43 -25 -151 -132 -30 -5 10 -70 104 97 72 48 83
12500 83 3 52 -24 -29 -7 -102 -98 -103 -14 42 36 -43 -29 -47 29 101 -62 5 31 -58 -27 39 -1 -222 14 -41 19 -66 -89 20
12530 20 35 10 32 23 86 72 -92 -65 1 -60 -63 -51 -26 62 4 41 102 31 126 140 103 106 39 -31 -69 -102 -85 -45 32 40 -123
12561 -123 26 35 -31 13 126 116 189 148 12 111 94 -31 56 -76 22 -105 -56 -18 -124 -21 -62 156 53 12 127
12586 127 -3 28 54 -68 -126 -74 2 6 -21 -40 -33 98 88 115 118 35 133 72 126 57 54 -56 -20 43 -11 37 -56 12 51
12615 51 10 49 -16 7 142 13 12 101 35 -54 43 58 28 -82 -106 -191 -109 -40 40 143 32 10 -12 61 104 122 34 -95
12643 -95 -59 49 -112 -86 -20 162 72 15 84 91 142 155 148 234 133 -5 -55 -43 75 -15 34 -129 -75 -42 68 -73
12669 -73 14 60 40 -27 40 14 29 20 19 49 -172 -147 -95 -15 -32 -28 5 71 -111 -16 -32 99 113 -97 -29 17 -44 8 0 95
12699 95 -16 -28 -101 89 64 -25 178 -77 -2 -102 -66 41 23 30 -16 -5 98 -137 36 -120 136 80 62 67 66 106
12725 106 29 52 -1 58 -110 20 52 -14 71 28 -35 -134 179 134 9 84 152 188 -40 -43 -50 -67 -16 -187 -147 -76 -129
12752 -129 44 -13 183 17 54 118 -14 -7 38 -23 28 18 -96 106 -56 43 -67 -58 12 -21 46 -80 10 31 -1 24
12778 24 10 -1 41 92 -57 -22 14 -35 -74 -117 32 50 23 -17 148 3 47 95 7 165 -18 -86 3 -121 -97 40
12804 40 -222 -66 48 20 70 69 88 -10 53 10 -11 18 -91 27 -27 -126 -18 -135 -13 -20 -73 56 34 51 20 9
12830 9 11 25 -41 -29 38 -55 -70 -97 2 -110 -103 132 -10 49 -12 -3 11 -39 113 177 72 32 -23 -129 7 -35 -98 -73
12858 -73 40 -54 -17 23 69 -87 -2 59 0 135 -38 -58 -110 -32 -108 33 8 10 -84 64 -38 68 13 98 96 -52
12884 -52 -86 -118 1 -12 -19 -85 -20 71 -37 -33 17 13 -41 5 14 92 -34 10 -72 14 44 -12 -23 -55 61 23 70 67 74 -65
12914 -65 34 143 -8 59 -16 124 47 60 -136 44 20 -12 138 -60 50 123 69 -54 82 -47 106 113 68 -52
12938 -52 53 -2 -116 -88 114 93 7 1 90 -17 -4 20 15 79 -15 -32 16 -77 -62 -119 -83 -117 -60 -29 31 37 -38 9 -72
12967 -72 8 -13 -34 -46 84 50 -75 -115 -20 -151 -103 59 22 45 -53 102 16 103 41 28 35 -77 -103 32 52 58 5
12994 5 32 -39 3 -62 -65 83 -37 46 123 25 -54 -40 -72 5 70 -23 -51 -5 -60 -53 -9 74 120 44 -30 37 101 92 33 58 -63
13025 -63 60 11 49 -26 -32 -5 -130 -99 -105 53 197 80 4 142 38 9 3 -56 -59 -72 72 91 -96 58 110 0
13051 0 11 -87 142 53 54 -104 7 18 78 10 -38 -20 -7 86 -148 50 20 75 63 89 105 44 109 36 -25 86 -33
13078 -33 47 -70 47 -222 -134 9 -57 141 23 0 -27 50 5 -21 -32 -36 -96 -130 18 -22 -26 86 22 3 -35 -9 35
13105 35 27 13 93 -74 14 68 -7 -29 -54 -35 -21 -88 27 7 36 65 -25 79 4 -42 84 115 -72 50 -47 -25 -11
13132 -11 -109 33 74 -54 18 -107 40 54 45 21 -36 52 -56 -76 75 -185 -59 -2 26 -33 114 -1 111 21 -49
13157 -49 109 96 46 5 75 118 76 -59 -30 -32 -54 -70 3 21 23 -51 83 30 75 14 215 53 -8 14 -140 81 -109
13184 -109 31 57 27 43 -162 -137 19 141 -11 -124 70 7 -87 42 44 -58 -75 -107 -119 -6 113 100 -91 -167
13208 -167 -30 -48 61 205 10 -10 -50 -56 -31 -147 -60 -2 47 7 -125 27 116 22 -53 -20 -83 22 70 5 -10 15
13234 15 -65 -84 -203 -29 -24 -14 60 -60 -65 12 10 73 156 -62 -136 -73 -83 36 -1 15 6 -138 16 37 30 0 61 15 105
13263 105 -49 119 89 17 55 4 -3 -52 -78 35 -45 71 -65 -43 85 36 92 -25 43 60 30 96 -65 -139 58
13288 58 -60 -19 -125 -18 -32 12 107 118 65 -19 29 14 -6 10 119 54 -93 16 -4 -129 46 -5 -58 32 -14 37
13314 37 5 61 87 69 126 69 -75 -62 -9 -27 -45 28 -52 79 44 68 -46 95 -40 12 83 35 -60 -11 99 -30
13340 -30 -34 -167 80 -38 -6 99 34 -64 -91 134 -137 -19 79 30 41 104 -120 -80 -31 86 63 -74 -140 29 45
13365 45 67 34 -78 28 5 1 70 -85 -20 -12 -2 42 -28 11 -13 -34 -207 6 -24 40 103 -18 59 -74 -72 -19 -50 -137
13393 -137 -54 34 -64 -13 -26 26 108 -27 122 94 51 40 -22 19 50 -59 -20 -12 -57 162 -24 2 108 -16 -13 -2 25
13420 25 130 79 1 54 -80 -108 8 7 -20 19 72 55 -68 -4 21 -108 95 -1 -85 -23 -47 -81 27 -17 25 57 4
13447 4 -43 84 -40 12 -7 59 59 120 55 -62 -49 103 -14 46 -55 82 -24 -38 13 37 15 3 31 20 37 101 22
13474 22 85 52 -23 20 -57 39 -80 53 -73 18 -45 23 -1 20 28 -26 165 86 70 36 -12 -21 12 -33 -39 -105 -5 56 123
13503 123 -105 64 0 -58 108 86 -22 35 33 -92 47 29 80 71 -53 -24 -45 -40 -58 9 -105 -35 52 -23 -8 -2 -4 -96
13531 -96 -17 -37 -38 122 19 -27 23 39 15 -4 99 96 69 -25 59 -59 63 -67 94 6 -116 35 11 21 55 164
13557 164 -48 54 -40 9 67 62 -15 -32 -2 28 -45 -115 81 -5 62 7 117 -24 13 -36 120 32 -27 -68 -9 51 15
13584 15 -2 -61 14 65 -49 50 68 33 148 127 -97 29 175 70 -22 37 -36 -1 -39 90 41 58 25 -35 -3 -60
13610 -60 92 -29 -4 67 -51 23 -5 -58 -54 -143 -110 -57 -117 50 115 25 -2 118 -5 82 -12 -23 3 -18 28 77 -27
13637 -27 -53 58 35 30 27 91 39 13 27 182 89 63 -29 58 -57 -66 116 -82 19 -19 -68 -4 88 165 4 66 76 58
13665 58 167 58 10 -11 -59 11 -2 14 20 52 61 15 86 -50 -19 23 -19 48 68 -43 17 -116 11 43 -34 -88 -155 19
13693 19 -31 2 17 15 135 51 50 37 9 100 72 25 21 28 19 1 84 50 45 81 21 -1 -15 133 117 154 77 -31 89 15 -80
13724 -80 -74 21 -54 17 -36 -76 85 -88 89 -6 -25 29 4 -1 -2 58 -5 -45 -101 102 4 47 9 -28 -112 -71 90 37 12
13753 12 -23 -10 -62 1 3 -79 -3 -106 11 24 81 -10 -78 0 85 9 79 170 74 0 -48 29 -76 57 21 100 -111 -63
13781 -63 65 -48 -91 -131 -23 85 27 167 16 23 -16 -49 -69 79 -37 -18 -28 6 124 44 72 10 10 -65 44 -89
13807 -89 -111 -69 29 -10 -85 0 -56 -27 -44 -115 -2 1 -76 11 59 72 -14 -29 -19 -84 23 86 21 -42 24 77 77 -7 123
13836 123 174 -1 59 -11 106 -10 -47 -64 21 39 82 -19 -55 17 -81 14 81 -113 39 9 28 15 -57 1 -79 -15
13862 -15 15 44 -50 -59 3 -48 -23 0 122 117 -30 -71 72 92 10 -14 -177 -64 62 -55 -74 8 43 61 78 92 7
13889 7 -43 -14 59 -36 -26 24 58 -6 46 30 0 46 -70 -7 20 9 -114 63 -20 27 27 37 62 -20 -12 -62 119 7 -95
13918 -95 37 -103 -22 18 -16 -68 144 -30 -11 75 -42 70 -101 -20 -12 64 43 139 -76 69 -14 33 195 7 42
13943 42 46 -18 80 42 -106 1 -51 -47 13 -37 -38 22 -132 -32 52 -21 -26 42 24 28 5 95 0 -52 11 -37 17 -159 -48
13972 -48 48 75 40 -7 67 15 -39 35 -116 -26 118 -38 74 -32 1 12 111 102 -17 83 44 53 7 -105 28 24 -22
13999 -22 -106 -14 8 77 28 101 6 25 -41 -30 53 13 171 211 -12 33 37 -25 -7 -76 -61 2 22 -44 -58 28 139 64 -2
14028 -2 -82 -67 35 -33 15 49 10 29 2 44 -104 -86 -43 74 -96 36 8 6 101 -26 9 -30 -63 -34 8 -61 93
14055 93 -138 -128 24 -81 142 25 84 -43 3 -19 -65 64 -12 -49 -68 81 -70 23 35 -24 55 106 27 -33 146
14080 146 -27 115 -94 133 108 -18 4 -26 -38 28 -24 97 -24 -36 -16 90 123 12 -178 30 -44 -18 -62 60
14104 60 29 -6 -11 7 -44 79 2 75 1 38 -57 -73 35 57 88 31 -28 -13 -88 2 8 -29 137 -37 -25 21 63 -2 -89
14133 -89 103 47 12 -10 -61 -19 -36 -53 -65 22 -47 -69 -46 50 -15 -45 -21 72 -97 4 -21 8 -71 -77 -86 -114 34 0 6
14162 6 -142 -8 94 -6 52 -44 78 41 83 97 53 21 -2 15 -40 10 -75 48 26 -35 0 71 -24 -74 92 41 -7
14189 -7 -88 -32 -43 -58 -72 -42 -57 48 5 -133 -60 42 6 -45 -81 5 -16 -18 128 -39 110 -124 -9 -106 -5 63
14215 63 76 26 12 -17 -56 55 50 -34 -75 8 -106 -93 40 106 135 25 17 -11 -64 173 12 10 14 36 -29 4 3 -22 23
14244 23 -25 -78 61 -20 -42 23 -54 54 113 70 9 103 14 42 0 113 -152 52 -20 11 171 -45 -99 -135 102 27
14270 27 -100 18 110 6 -4 -12 -27 5 -3 5 16 -13 73 86 -16 23 106 15 76 -13 22 47 -6 4 -1 97 34 -55 -165
14299 -165 -60 -69 -16 34 -127 -45 -72 -115 2 124 73 -83 18 -33 -17 -43 -46 -27 -61 -91 36 -49 -2 88 2 -26 -22
14326 -22 30 7 84 17 74 -66 -113 16 -20 -115 6 -1 30 60 -1 -20 -45 154 70 -14 -49 -60 -100 76 9 -71 -12 -43
14354 -43 134 78 91 -128 -139 183 37 -38 52 -70 5 -45 3 80 91 0 25 39 30 -23 -37 -83 9 34 -55 60 64 70
14382 70 -72 -62 0 -38 -24 -101 -53 27 11 99 -132 -77 8 11 80 75 69 20 132 109 19 55 157 1 45 -60 105 -24
14410 -24 96 -28 27 41 84 -19 19 -95 -40 7 -50 -87 -68 -9 64 57 124 -73 -39 8 2 51 16 -23 38 4 21 72
14438 72 -33 92 -49 -44 -25 117 121 89 -20 75 1 29 -40 180 54 -21 94 24 31 -130 67 34 52 -2 89 -1
14464 -1 -64 43 72 55 55 -17 -94 -21 -165 -82 25 91 -21 -46 -38 -98 -72 -60 16 127 -37 -21 -47 -5 -14 33 -36 -22 -57
14493 -57 67 62 -46 15 103 136 -36 -13 -24 1 -99 49 -49 -99 14 -15 27 -63 -56 34 46 50 44 -31 28 -67 63 -46
14521 -46 -24 -1 -92 96 110 29 -110 36 -17 -22 99 -18 2 176 0 -95 33 75 -6 -101 -126 -20 8 22 -89
14546 -89 -47 61 -24 -106 8 1 63 100 15 13 14 -40 27 -125 -75 85 -11 34 38 -35 58 14 11 -51 -37 118 -5 -17 79
14575 79 49 -74 -71 -13 -77 -85 -38 45 -24 -58 121 38 -79 142 81 -29 38 34 62 -23 48 0 101 10 24 -122 109
14602 109 50 -74 50 -86 131 103 61 -70 26 -28 -43 -24 -18 -38 52 147 -3 120 18 -5 67 2 91 -72 48
14627 48 85 -21 -16 -77 -145 -18 150 -34 45 45 -92 -19 13 -21 -28 -24 58 -14 -13 -67 -12 20 100 -94 25 -69 -55 -32 -33
14656 -33 56 33 112 -47 31 20 -81 -31 -159 -20 -124 -27 125 97 -69 -28 22 27 30 -61 4 -65 58 77 8 -46 -30
14683 -30 -70 -16 -33 43 128 -8 -29 -46 21 42 -9 -20 -33 -38 35 -32 -3 -42 10 -19 147 65 -20 19 -12 85 19 62 -157
14712 -157 55 31 -107 68 145 -8 -101 -51 129 -77 -47 63 -46 82 -31 -82 -57 -105 -143 105 70 -94 68
14735 68 105 117 12 14 -6 107 183 -64 -13 108 43 26 51 17 -35 2 17 2 65 27 51 12 0 19 -28 30 62 -17
14763 -17 16 -6 23 93 44 95 35 0 -40 -3 -7 94 34 -29 -88 129 46 15 -96 -52 52 -23 -8 45 31 -4 63 56 55
14792 55 89 -67 98 -34 51 -5 -83 -14 63 43 48 11 38 -17 61 -2 218 -68 -8 -76 -46 114 -44 -60 -53 -79 0
14819 0 -26 -31 122 9 59 170 5 90 117 -85 -14 -105 3 -57 -13 115 23 72 -46 -7 28 -12 136 164 91 -47
14845 -47 -17 -74 -104 -116 -16 -32 -28 132 -103 -45 6 36 -32 101 -36 -61 19 -54 12 32 -60 79 -103 -17 -89 -58 -10
14872 -10 -107 -1 5 2 24 57 -17 44 -78 51 -47 4 -4 12 -16 -49 -60 -3 7 -65 65 23 -16 74 -79 6 12 80 57
14901 57 -11 69 32 42 43 31 -102 -154 73 -8 -36 -5 -27 95 -4 -22 -9 87 -91 94 -14 -59 146 38 36 110 22
14928 22 16 -43 7 39 22 -38 5 107 -63 -3 7 -7 76 -24 -79 123 86 81 61 8 57 140 -51 -37 40 -45 64 -3
14956 -3 -89 -33 165 -12 95 -45 111 140 13 -84 45 25 46 40 97 37 -62 -103 -125 -6 62 164 -8 -29 46 112
14982 112 73 11 110 -44 -61 -107 46 58 -54 25 -70 -113 19 73 -92 64 -101 96 -59 17 -11 87 64 49 -2
15007 -2 -62 -17 4 69 -8 -89 -57 113 22 121 -36 -91 36 28 19 75 -8 89 125 -13 141 -64 16 -28 -37 -25 -41 39 150
15036 150 -21 39 158 -98 78 -60 -13 -3 32 -61 4 -117 -47 -33 -31 14 -132 -83 94 123 59 -35 41 17 103 7
15062 7 -70 -8 6 -29 -34 68 126 63 -20 127 127 82 4 -34 -105 -17 14 39 -20 4 25 51 31 30 -12 22 22 20 49 -9 -18 39
15094 39 -87 -55 12 46 81 144 -36 -19 7 39 4 127 178 36 5 19 7 -57 49 19 48 10 74 41 1 41 70
15121 70 -8 79 -14 -75 18 -8 -65 83 1 -26 9 74 141 105 128 -1 -31 13 -57 142 23 -9 24 95 -43 55 -29
15148 -29 -26 -30 9 -27 88 82 -1 -57 59 -40 48 -37 76 -49 -2 -3 -36 -101 80 24 9 10 -1 -29 145 49 16 51 44 79
15178 79 -35 52 -14 -56 -70 77 26 31 -126 -92 -60 -5 2 36 -10 8 48 31 62 50 -61 63 9 41 -67 11 -32 -15
15206 -15 -69 -93 -93 -165 -63 -24 24 29 71 153 28 -30 122 -38 -113 -22 -55 -27 -2 -14 68 14 7 -77 40 48 23 92 -27
15235 -27 -105 21 42 51 -71 3 -34 10 5 59 34 15 107 -107 -27 -56 39 -130 38 55 -17 0 -97 -64 -68 96 133 -40
15263 -40 -5 63 62 -134 81 66 182 -123 57 72 -51 -71 41 99 -130 57 32 -93 -13 119 -19 41 7 -130
15287 -130 27 -20 -15 -122 -131 61 -10 139 -101 12 16 82 -85 -5 102 -59 85 -75 17 43 -49 -97 87 -112
15311 -112 15 35 32 84 67 38 -63 92 205 34 -89 -91 -42 119 58 4 87 -48 56 91 12 5 73 31 38 -8 66
15338 66 -16 87 70 -58 39 28 -42 -145 -90 23 18 -34 -60 34 33 -11 40 47 -12 41 -55 -28 -87 -4 -35 25 9 -103 -74
15367 -74 13 117 18 82 42 51 52 144 19 24 -7 29 -4 28 -3 43 56 30 -16 122 48 14 -27 45 59 -8 9 18 -58 183
15397 183 66 19 -106 116 41 7 -7 0 23 44 -62 16 -39 -6 -26 -21 21 -49 148 34 38 -53 104 71 26 37 121
15424 121 143 107 31 92 -5 -58 -59 59 -5 -1 -90 20 -72 3 49 -12 4 -57 77 10 51 -23 -31 -23 8 65 24 -55 25 -2
15454 -2 -66 41 7 46 -75 -60 13 -12 -127 -68 88 -2 -60 -26 8 -12 25 43 -8 -61 -2 -38 23 -4 -10 98 -8 -24
15482 -24 -109 -34 91 -3 -48 -53 63 -46 14 35 8 48 -57 -27 -23 58 -27 1 -5 -58 -88 62 58 89 159 -135 -28 138
15510 138 29 -9 79 8 58 125 17 -39 72 -9 39 -63 38 46 12 29 37 -65 -9 25 88 -26 -2 6 -1 -81 152
15537 152 -37 -43 20 -140 90 50 -91 -58 -106 4 49 41 49 43 -151 -57 124 14 -18 90 18 53 48 11 -8 112 -86
15564 -86 79 26 -50 -62 29 47 -97 52 63 58 53 11 3 80 108 48 19 -38 -102 -15 26 -13 63 38 61 -55 20 0 57
15593 57 65 50 -77 10 96 45 -4 2 -92 -28 -46 -73 7 -13 92 41 -12 77 63 -20 157 39 28 18 10 -20 74 -73 -64
15622 -64 22 -63 12 25 39 23 12 -110 38 15 26 -89 25 119 85 -9 -67 64 -69 -50 68 22 8 -23 -3 -66
15648 -66 -28 71 8 23 -6 83 -74 36 57 116 17 23 -8 44 89 88 93 107 22 8 56 41 50 -49 13 65 10 -96 41 126
15678 126 79 78 -51 30 11 95 -62 -59 -140 6 69 -56 -39 -52 -39 -43 -54 -44 82 41 2 46 55 18 69 -35 -38 107
15706 107 -12 32 111 146 -9 -67 65 -48 52 -123 -18 -99 24 -100 104 -103 -34 -122 -52 -97 54 92 -7
15729 -7 -46 -15 111 131 32 8 33 -15 -57 16 -72 -132 -79 142 22 36 -10 38 64 2 15 -48 -33 -60 7 2 -83 110 13
15758 13 -122 -42 -38 51 -51 87 -80 -113 82 -3 17 38 -49 97 -1 -17 -73 -13 -105 -100 -63 21 -43 49 78 -83 -5
15785 -5 108 50 40 -89 13 -47 78 46 55 54 38 -48 38 -27 6 -75 81 33 11 -26 34 -28 -75 28 55 49 8 30 -104
15814 -104 7 106 93 6 100 -49 -38 -44 -32 -128 56 -89 6 -68 -115 -5 63 50 -63 42 -87 -10 56 84 -17
15839 -17 27 63 34 45 5 -51 -63 -18 89 81 128 4 -31 -38 -21 89 15 -77 -18 89 119 -25 -19 -74 136 63 -93 13
15867 13 12 -52 36 -57 5 -4 5 -3 -16 -23 25 -91 -60 11 26 5 50 94 -26 -36 39 -49 3 -27 -120 -108 92 17 104 -69
15897 -69 32 -13 -61 -9 -93 168 -57 -135 -87 86 33 35 61 -30 -125 -21 10 -63 -56 94 -104 -60 7 -51 -31 16 -51
15924 -51 -43 -66 2 -4 17 49 18 -10 -127 -18 40 22 -106 78 -59 62 26 62 82 116 52 102 -19 24 4 -16 -45
15951 -45 -21 -6 -9 38 36 -6 43 46 32 -188 4 -93 -31 -35 52 -58 -123 -18 -87 -11 -43 -54 -11 -72 -34 60 -102 92 78
15980 78 7 57 30 -16 29 -99 63 -47 -25 110 -88 30 39 159 10 118 56 -48 99 48 -104 18 -4 -12
16004 -12 53 -28 1 34 -43 -18 10 48 7 44 14 68 -202 -109 -3 -77 22 -35 34 -24 -68 -34 -21 -17 -40 22 58 -21 81
16033 81 8 -16 96 -13 58 10 -150 -9 -69 28 73 -17 80 7 -14 -15 92 -12 44 35 -50 26 -73 -36 63 57 1 -4 -6
16062 -6 3 16 96 -120 18 9 -28 -58 31 67 40 21 -42 -70 -161 126 103 -33 50 239 70 22 16 28 83 13 32 -2 -24
16091 -24 -121 28 -74 38 -72 92 -118 5 6 6 -3 13 9 -62 -52 -5 43 42 -132 -72 -1 -123 -16 -73 -112 -27 -111
16118 -111 74 -59 39 117 26 -16 -111 -24 -38 0 -50 -21 -24 -62 -4 59 118 -54 -10 42 8 -54 -46 28 110 -66 -133 37
16146 37 46 115 112 126 3 18 47 -2 -20 51 -46 -31 -63 52 -128 -86 57 -29 -27 102 -55 -72 5 69 -1 -67 -115 -118 -8
16175 -8 -34 -22 71 -45 -18 -4 -25 -53 17 71 100 4 12 55 24 6 -14 -24 89 114 -67 -23 -2 -62 70 128 -112 51
16203 51 17 138 58 58 59 -104 -63 -151 87 26 -112 48 22 -124 -60 84 -21 102 98 4 -42 -70 -8 -106 -30 -33 30
16230 30 58 -29 -40 36 -6 68 31 -41 114 -22 -55 -38 140 26 40 -11 186 18 -17 10 -14 -24 71 -64 -59 16 51
16257 51 -93 -17 69 55 -15 -8 -19 -80 139 58 -17 -35 48 -71 0 -118 102 28 -58 -44 -4 21 -77 -18 130 -100 -91
16284 -91 97 15 67 14 147 34 -12 64 38 -5 -38 31 -5 -2 -38 -64 -26 98 28 -87 -49 -16 -104 -43 11 -21 4 -66
16312 -66 -87 57 -46 22 102 -16 -28 -42 4 13 19 13 69 -1 128 65 -13 41 58 90 -117 2 -49 -28 114 4 -9
16339 -9 42 -11 81 58 17 -55 -62 87 79 -30 54 110 -5 14 70 111 35 26 38 -83 -123 22 9 45 15 -39 60 55 10 15
16369 15 -96 -29 51 -9 24 79 83 -74 142 154 119 -20 11 -24
16383b4
$$ Imaginary data points
##PAGE= N=2
##DATA TABLE= (X++(I..I)), XYDATA
0 0 0 0 0 0 0 0 0 0 0 0 0 32 -32 32 -32 64 -64 65 -96 128 -129 160 -192 225 -288 320 -384 433 -499 577
30 577 -641 737 -833 961 -1089 1218 -1374 1538 -1703 1907 -2115 2364 -2620 2893 -3204 3537
46 3537 -3906 4305 -4745 5229 -5759 6346 -6995 7720 -8531 9450 -10489 11688 -13080
59 -13080 14728 -16706 19139 -22214 26236 -31757 39846 -52876 77364 -139705 648872 960376
71 960376 -482768 -835887 -454210 211743 275924 164088 40055 58705 -79198 -149756
81 -149756 -64536 180912 189544 -15731 -214337 -92105 188526 338340 109811 -239707 -341040
92 -341040 -74292 180903 173749 2193 -52818 3408 27231 -58227 -114171 -61554 12882 -16476
104 -16476 -36015 96380 265930 207225 -49979 -221943 -162481 -37423 -13466 -28121 52291
115 52291 139005 41547 -167402 -185194 43319 213959 121504 -56453 -69148 59379 115934
126 115934 363 -158391 -172421 -30260 100796 101656 27272 -12358 -4668 -19487 -78429 -90121
138 -90121 17768 137783 97887 -59857 -111124 19344 149755 108990 -46086 -138780 -101294
149 -101294 -27278 -10720 -13062 37839 94110 55959 -49994 -95678 -26942 81570 130870 95682
161 95682 17282 -61959 -124821 -142316 -81659 28173 105950 107627 50024 -31800 -90018 -69551
173 -69551 19956 91663 80351 10420 -50650 -67598 -43223 7563 62838 80487 25040 -69861
185 -69861 -116576 -76060 1826 56300 71405 51845 8764 -27444 -28135 1049 29541 36376 25117
198 25117 6518 -23850 -66153 -88695 -54896 15751 64041 63493 36383 6737 -17931 -27245 -5813
211 -5813 35464 49030 4416 -56199 -62713 -13272 30489 34340 14135 -14321 -42878 -47491 -10038
224 -10038 42315 58709 27124 -9908 -11830 7339 11761 -523 -11391 -21244 -27684 -10215 23174
237 23174 27974 -11650 -54192 -55289 -13703 41826 81252 85269 46009 -26754 -86696 -77910 -8245
250 -8245 48361 46998 13157 -18887 -44281 -55280 -32988 19453 66704 67530 18275 -33511 -42021
263 -42021 -13932 18782 43831 45523 4165 -58984 -87357 -56895 6313 63248 79588 38566
275 38566 -34756 -86285 -70736 10821 96586 109719 44356 -32792 -75098 -82344 -50803 15864
287 15864 69402 59795 -1665 -57606 -62792 -17719 32813 50258 40416 21663 -4106 -25308 -19422
300 -19422 4136 15948 12494 203 -24931 -49098 -42233 -3911 33867 44309 23662 -5493
312 -5493 -13841 -4595 -854 4889 26426 35925 6763 -31992 -41666 -27480 -12675 -5154 -1473 6397
326 6397 18598 20061 8478 1403 720 -4586 -2125 18357 30016 14134 -10112 -25219 -36011
339 -36011 -36911 -18101 10262 28849 25053 733 -19345 -11213 11572 24285 30324 30162 5034
352 5034 -34522 -46339 -20481 10375 23440 16262 -6338 -31792 -43939 -31010 11898 62829
364 62829 72153 25716 -27867 -45961 -32757 -2073 36831 55083 27447 -29293 -74537 -77014
376 -77014 -32025 29712 65097 57368 19259 -26795 -47429 -18428 32477 54661 37516 4406
388 4406 -31547 -59407 -55511 -14737 33285 50361 22036 -24038 -41738 -19873 9972 27858
400 27858 38460 33576 3527 -29239 -33349 -10560 15591 26831 15053 -12815 -37089 -43247 -26845
413 -26845 5229 30285 29213 15462 9939 7147 -257 1502 16415 20798 220 -28484 -40713
426 -40713 -30289 -11810 -1723 3340 14130 23231 18889 10093 7533 2350 -9602 -13142 -1559
439 -1559 11364 13391 5234 -6821 -18497 -26504 -23713 -2164 26691 31771 4253 -25448 -29248
452 -29248 -12170 11795 36194 49944 37867 1436 -34761 -45816 -29601 -5936 6037 3685
464 3685 -9276 -24216 -21186 12568 53497 61701 30835 -10872 -37325 -41761 -25491 6231 35698
477 35698 35621 -2884 -49107 -58694 -23497 25984 58634 58267 22534 -30794 -64859 -52530 -3261
490 -3261 45848 63406 45004 7417 -30245 -51119 -40190 -6669 16054 8568 -10490 -15543 -4235
503 -4235 11276 24236 31745 28166 10915 -11587 -20991 -12784 -4161 -8038 -14617 -15010 -14867 -13352 756
518 756 23597 37630 33003 15593 -5423 -23082 -32182 -26315 -2691 23700 29167 13201 -2794
531 -2794 -9783 -16209 -20896 -13498 939 9201 8094 4625 5187 8357 5788 -2571 -2632 10359 20646
546 20646 17015 1297 -23848 -49911 -53464 -23635 18572 45159 45991 27033 3618 -12243 -16873
559 -16873 -8728 9762 17727 -2742 -32944 -36887 -12123 16432 30569 24918 2426 -20367 -25090
572 -25090 -9060 15978 30714 20878 -5607 -25381 -28467 -15845 13890 46659 47671 6363 -43167
585 -43167 -63673 -46761 -8448 27063 42480 37743 20379 -3551 -19738 -14719 3416 15034
597 15034 14357 1321 -22993 -40950 -31454 -2055 21321 27848 21561 10418 304 -7716 -12116
610 -12116 -3142 15600 17744 -6361 -28929 -24941 -2740 19202 27981 15948 -10135 -29405 -29078
623 -29078 -11409 13086 28525 25055 11141 -2505 -12811 -12762 3361 16958 6782 -15073 -24082
636 -24082 -17008 -5254 3558 5303 2347 2610 8907 17255 23949 19070 -3021 -26398 -29134 -14292
650 -14292 2476 14858 17697 3168 -19804 -28829 -14636 12977 33823 30549 5728 -17326 -22824
663 -22824 -12736 6797 24744 23366 952 -21875 -28585 -20200 -3107 14275 19437 9351 -8365
676 -8365 -20079 -13484 10971 32371 31987 14394 -6885 -25817 -33482 -19679 6280 21493 16079
689 16079 -3077 -21586 -25643 -11517 12113 32266 37383 19339 -11766 -30213 -22849 -1376 16789
702 16789 20831 7244 -15481 -29304 -24926 -6791 13951 24424 18279 2943 -8583 -10984 -3490
715 -3490 11689 22182 15812 -3922 -20065 -22144 -13480 -3070 3248 5514 5215 -401 -8273 -5982
729 -5982 7718 18093 15677 6125 -2381 -5905 -4071 190 403 -5747 -13549 -14320 -5470 4916 6612
744 6612 1698 -314 1676 3653 7566 15155 17931 7370 -11461 -22287 -16631 -1124 8481 5356
758 5356 -4796 -13595 -15603 -6701 10901 24033 22001 8232 -6842 -14586 -12171 -625 13364
771 13364 19591 9345 -13524 -29204 -24399 -7058 7897 16070 16931 7587 -8347 -15949 -6924 12223
785 12223 26153 24284 8028 -13099 -28364 -28369 -10565 11330 17181 5413 -8673 -14563 -11684 720
799 720 19177 29948 22121 -657 -21341 -24070 -8266 10267 16830 10072 -5136 -20919 -25149
812 -25149 -12788 6466 18677 19709 10898 -3633 -12407 -8406 5333 17512 17917 3592 -14352
825 -14352 -20207 -14534 -7221 -210 6442 6261 -673 -5187 -1345 7478 14485 13398 4166 -4835 -7352
840 -7352 -5648 -1390 2995 -84 -9556 -12348 -4786 2317 4283 4663 3524 -214 -1597 2265 9642
855 9642 15348 11117 -4371 -17308 -16192 -6393 2682 8031 5873 -5559 -15427 -13324 -735 14107
869 14107 23815 20537 5120 -10601 -17776 -13888 792 15567 13926 -2905 -16551 -17775 -10952
882 -10952 1579 14141 17586 8855 -6127 -16387 -11743 6628 21878 20830 8316 -7539 -21882
895 -21882 -24754 -10240 8765 15578 9270 -3037 -14164 -15933 -4791 13049 26974 27117 8938
908 8938 -14803 -23970 -16357 -5166 3919 9251 6233 -4667 -11536 -8169 2206 12074 14205 6207
922 6207 -4419 -8927 -7023 481 10716 12829 1978 -9561 -11062 -6996 -3282 1286 4763 3152
936 3152 -3163 -8826 -7453 4048 16088 16728 8947 2339 -2463 -8214 -10510 -9154 -9184 -9423 -4820 3248
952 3248 9812 12185 9277 2461 -3115 -5591 -3661 4398 12563 8897 -6099 -17309 -16422 -7548 4028
967 4028 13377 14599 6656 -5756 -15271 -14883 -3199 10393 15590 12701 5146 -3868 -7940 -2805 3791
982 3791 2902 -4932 -12970 -16234 -12111 -659 12091 19868 18060 5638 -8471 -11411 -1781 9426
996 9426 13086 6618 -8228 -23141 -26615 -14606 6090 23037 26525 14729 -3807 -17399 -19181
1009 -19181 -7372 10665 19790 13349 -1208 -11487 -12381 -5954 2939 7933 4897 -4225 -12939 -13731
1023 -13731 -4005 8722 14625 12191 5089 -1661 -3007 2595 8247 6267 -3945 -15003 -20035 -15965
1037 -15965 -5832 6058 14820 16424 8926 -1369 -4410 465 4708 3345 -1173 -4520 -5005 -3559
1051 -3559 -1739 -650 -637 -3047 -5242 -2736 3899 8146 7243 2054 -5065 -9149 -3894 8944 17840
1066 17840 15250 2367 -12000 -18831 -17308 -10377 -176 9923 11593 2400 -7104 -5404 4946
1079 4946 14619 16632 9378 -2683 -12253 -14857 -10620 -1720 5368 4514 -2033 -7574 -8839 -3844 7978
1094 7978 18322 16228 2806 -10374 -13861 -7172 4813 12745 12155 4390 -7978 -19627 -20120 -7187
1108 -7187 8102 14888 11665 1507 -9431 -10702 410 13997 19282 13065 -1716 -14101 -16373
1121 -16373 -11327 -4410 3392 7793 2084 -7865 -9747 -1804 9266 15955 13421 2924 -5863 -6847
1135 -6847 -2890 1457 3043 48 -5467 -7534 -6719 -6095 -2095 5598 8857 3976 -1397 -941 4146 8712
1151 8712 7110 -553 -6209 -4305 -2043 -2679 -2571 -1649 -3608 -5741 -4453 -1097 4233 9924 9945 3267
1167 3267 -3141 -3658 718 6862 8636 1274 -9004 -12715 -11160 -7982 -432 8412 9929 2923 -4667
1182 -4667 -6753 -712 9651 15510 11812 2633 -8114 -16715 -15942 -4388 7164 9913 5020 -3241
1196 -3241 -10867 -10525 -932 10426 15451 12240 1024 -9854 -11156 -3675 5636 10926 8771 -3046
1210 -3046 -15938 -17354 -7721 4163 11666 11401 3485 -5668 -8266 -3049 8173 17698 15434 700
1224 700 -13897 -18312 -14452 -4978 6260 11052 5641 -3227 -7830 -5068 3630 11293 11239 5052 -1668
1239 -1668 -6670 -7379 -2622 2391 1678 -2012 -4133 -4280 -2271 2218 5253 3252 -1857 -4978 -2803 4730
1255 4730 10859 9025 1985 -3236 -5409 -6911 -6008 -1910 1134 10 -4019 -6443 -2421 6379 12202
1270 12202 9784 3450 -2183 -4629 -3108 1171 2992 67 -4264 -8073 -9870 -6691 2480 12068 14128
1285 14128 5932 -6575 -12184 -6572 3335 9525 11004 7771 -754 -10881 -14423 -8264 2688 9182
1299 9182 6451 -2712 -9924 -9438 -1821 8841 15390 12903 3264 -5894 -9850 -7658 -927 5518 5663
1314 5663 -1716 -10900 -13897 -6829 5778 14276 13765 6948 -2301 -9414 -9322 -558 8633 10434 4127
1329 4127 -4933 -10729 -10704 -5819 1569 7337 6623 -599 -6398 -3719 3216 7694 8109 5537 625 -3812
1345 -3812 -5145 -3746 -1227 -529 -2938 -5900 -6090 -2741 2205 7723 9953 5748 -967 -2500 506
1360 506 2010 707 -1216 -2511 -3163 -3756 -3796 -1107 2929 2412 -3418 -6209 -1837 4784 9041 9352 5028
1377 5028 -1518 -5120 -4780 -1624 2482 4232 291 -6721 -11905 -12314 -5700 6978 15824 13377 4646
1392 4646 -2038 -4425 -3211 713 4367 4249 -427 -8313 -13528 -9126 2392 10099 8829 2246 -5439
1407 -5439 -9504 -5359 4799 12404 12865 6691 -3894 -11572 -10209 -1820 6348 9131 3447 -9004
1421 -9004 -17270 -13484 -1937 9469 16057 15258 6994 -2281 -6471 -5051 158 4231 1849 -5433 -9557
1436 -9557 -8602 -4793 1307 7448 7284 1613 -2292 -1420 2222 5597 5970 2160 -2354 -5006 -5776 -3593
1452 -3593 2528 5765 2075 -4107 -7530 -7953 -4675 2377 7118 7052 5269 4119 3259 3111 2209 -1355
1468 -1355 -4992 -6595 -7757 -7279 -2197 3876 3703 -1187 -3318 -636 5271 11014 11507 5891 -2048 -9032
1484 -9032 -12583 -8766 829 7847 7170 1768 -5708 -10606 -7590 1653 8549 8455 3768 -1543 -3988 -1655
1500 -1655 3053 7131 8324 3494 -7086 -14399 -11568 -2739 3808 5646 3002 -2334 -5214 -1967 5474
1515 5474 12509 14456 8054 -3700 -13089 -15172 -9698 619 8863 7966 -380 -7237 -7570 -2950 3780
1530 3780 9261 9713 5032 -1855 -6976 -5914 648 5550 4696 -33 -4405 -7055 -6071 -1275 2862 2797
1546 2797 -88 -1995 -1110 2450 6303 7736 6406 2576 -3575 -8230 -7322 -2547 263 -260 -1831 -2953
1562 -2953 -2192 445 3839 5946 6097 3959 610 -1166 -944 -839 -1044 -1507 -3118 -5415 -4464 -9 4245
1579 4245 4738 1287 -3042 -3998 -1135 3188 6633 8070 4895 -2482 -8491 -8342 -2463 4264 6418 2170
1595 2170 -5277 -10077 -8751 -1375 8204 12845 9682 1774 -5027 -6891 -3702 3346 7911 4950 -3875
1610 -3875 -11935 -12414 -5112 4560 9297 7765 2911 -2793 -5663 -2312 5244 9515 7299 -201 -8285
1625 -8285 -11795 -7553 673 6555 6743 1397 -5262 -7301 -3405 2477 7032 9129 6575 -1024 -7251
1640 -7251 -6925 -1742 4129 6012 2055 -4236 -7244 -6408 -3361 1212 4684 4543 2605 1433 1222 1618
1656 1618 3321 4165 573 -4773 -7454 -5862 -1606 1888 1115 -2166 -2381 242 2536 4628 6731 5629
1672 5629 1192 -3158 -5419 -4695 -968 2731 2746 -740 -3903 -4917 -2201 2576 4471 1417 -1415 -1632
1688 -1632 -718 1427 5502 7602 4785 -1479 -7401 -9347 -5003 2027 4740 2015 -2788 -7222 -7729
1703 -7729 -622 9061 13907 11505 4481 -4510 -10705 -9547 -2913 3914 6181 1762 -6420 -9711 -4966
1718 -4966 2770 7765 8924 5042 -2058 -6220 -4035 1656 6319 6909 2056 -4974 -8365 -6710 -2141
1733 -2141 3568 5819 1244 -5158 -6930 -3269 2276 8065 11346 8817 2254 -4443 -7994 -6651 -2161
1748 -2161 431 -580 -1839 -2464 -3518 -2388 2188 6246 6521 4378 1674 -973 -1337 -247 27 -775
1764 -775 -2056 -3893 -4192 -1115 2036 1442 -82 -849 -1883 -2439 288 5002 7695 6311 1557 -3080
1780 -3080 -3717 -1498 -413 -1386 -2998 -5146 -6350 -3702 1946 6101 6707 4648 719 -2287 -1111 3081
1796 3081 6256 4943 -1671 -9590 -12086 -6673 1544 6658 7291 3548 -3206 -7489 -5858 1176 8427
1811 8427 10913 6869 -1055 -6528 -6652 -2514 3109 5165 564 -6635 -9869 -7231 -993 5681 9740
1826 9740 8344 2798 -2912 -4522 -460 5461 6664 1779 -5165 -9966 -10336 -5242 2694 7421 6578
1841 6578 2023 -2520 -4269 -2420 2112 6015 6982 3426 -2494 -5390 -3330 -11 761 -785 -2714
1856 -2714 -3960 -4012 -1999 1379 4453 5407 3577 1012 347 1399 2486 2677 677 -3809 -7561 -7330
1872 -7330 -3917 -195 2156 3420 3151 2128 452 -153 1608 3804 2410 -1408 -3325 -2016 116
1887 116 1331 1188 -874 -3811 -5476 -4252 -118 4672 6110 3269 -638 -3209 -2903 1879 8030 9214
1903 9214 2990 -5784 -11087 -10642 -5739 1086 5870 5912 2194 -2844 -3628 1274 7079 7944 3995 -1891
1919 -1891 -7322 -8625 -4000 2587 5370 3248 -1902 -5852 -5647 -1201 3991 6969 6568 1320 -5266
1934 -5266 -6583 -2005 3972 7343 6671 1466 -5339 -9404 -8486 -4239 1486 4918 4335 1852 112 -403
1950 -403 848 4235 5828 2667 -2367 -5097 -5388 -3740 -1209 315 131 -209 -590 -444 1981 5342
1966 5342 5232 1626 -1943 -3982 -3819 -191 3322 3506 888 -2116 -4106 -4296 -1833 758 1563 1633 528
1983 528 -1077 -232 3409 5631 3742 78 -2542 -3693 -2296 -386 -202 -1493 -3177 -4546 -4278 679
1999 679 6797 9358 7020 1968 -4151 -6744 -3875 1332 4064 2928 -1256 -6082 -7233 -3633 1506
2014 1506 5783 7271 3636 -3235 -6233 -2988 2796 6621 6394 1871 -4135 -6503 -4821 -798 3180
2029 3180 3847 -427 -5603 -6829 -3622 2278 8644 10434 5735 -1553 -5794 -5096 -1328 2651 3093 -113
2045 -113 -3918 -6311 -6498 -2350 3885 7188 5781 2320 -710 -2242 -892 1973 2900 1125 -1432 -3753
2061 -3753 -4148 -2465 -653 366 1075 926 -978 -1882 622 3914 4743 2976 411 -1943 -1817 -137
2077 -137 862 610 -926 -3502 -5134 -4477 -1397 1835 4069 4303 1735 -630 -88 2624 4462 3470 -278
2094 -278 -4385 -6073 -4417 -1995 370 1637 715 -1978 -2772 -107 4260 7208 6412 1499 -3921 -5899
2110 -5899 -3523 832 4162 3685 -801 -5447 -7113 -5240 -421 4916 6977 4157 -1060 -3971 -2919
2125 -2919 1832 5969 6481 2939 -2135 -6403 -7481 -4891 -312 2443 1957 -430 -2871 -2268 1612 6353
2141 6353 8048 5911 726 -4397 -5943 -3726 -314 1944 1698 -1059 -4838 -6077 -2999 2599 6799
2156 6799 6906 2921 -1561 -3330 -2379 375 3389 4032 1449 -2329 -4165 -4483 -3059 -736 746 273
2172 273 -887 -1090 698 4007 5851 4133 1046 -802 -1395 -1717 -1156 -661 -1737 -3679 -4966 -4059 -841
2189 -841 3491 6021 5398 2430 -560 -2137 -625 2105 2469 -84 -2260 -3208 -3287 -1970 731 2259
2205 2259 1311 -1782 -4538 -3507 1632 6536 6871 4023 -315 -3850 -4264 -482 3198 3629 357 -4575
2221 -4575 -8346 -7838 -2683 3918 8399 8351 3377 -2507 -3754 -567 2357 3538 2300 -1419 -5375 -6538
2237 -6538 -3957 191 4052 4205 913 -2713 -3093 -1004 2374 5568 5537 1407 -2607 -3791 -2759 -378
2253 -378 2254 2598 -232 -3784 -6240 -5673 -846 4728 6623 5002 2355 -231 -1950 -843 1283 1626
2269 1626 -289 -2769 -4600 -4602 -1588 1688 2604 2094 369 -1278 -364 2677 4107 2452 252 -1891
2285 -1891 -3387 -2514 319 2127 1638 -660 -3727 -4931 -2217 1599 3267 3254 2123 134 -458 1419
2301 1419 3062 2340 170 -2769 -5560 -5370 -2544 1009 3097 2775 25 -2727 -1999 1771 4761 5381
2317 5381 3871 -428 -4880 -6155 -3709 160 3460 3895 802 -3411 -4924 -3609 252 4453 5501
2332 5501 2347 -1243 -2177 -1021 1228 3538 3623 385 -4055 -6847 -6337 -1876 3425 4855 2751 -404
2348 -404 -2292 -1531 2017 5712 5729 2322 -2028 -5826 -6986 -4454 137 3617 3863 1055 -2431 -3224
2364 -3224 -482 2369 3048 2580 1392 -572 -1586 -820 593 1751 1209 -1489 -4085 -4118 -2027 573
2380 573 2028 1784 24 -925 388 2828 4291 4331 2354 -1258 -4521 -5724 -4391 -1183 1455 1176
2396 1176 -954 -1463 210 2558 4110 3885 1566 -1305 -2725 -1860 331 2245 1689 -1172 -3953 -4666
2412 -4666 -2814 919 4167 4099 669 -2911 -3912 -1297 3220 6339 6137 2647 -1973 -5407 -5901 -3019
2428 -3019 398 1295 106 -1997 -3297 -1908 1995 5732 6586 4180 109 -3158 -3408 -1551 245 1368
2444 1368 749 -2397 -5244 -4951 -1097 3350 5917 4690 669 -2992 -3637 -1443 2294 5222 4890 1112
2460 1112 -3202 -5515 -5264 -2111 1598 2342 -120 -2677 -2642 -390 2893 4949 4810 2855 595 -1618
2476 -1618 -2520 -1138 179 -868 -3224 -4390 -3745 -994 2490 4173 3125 1460 108 -468 444 2035
2492 2035 2084 902 -699 -2802 -4080 -2495 379 1111 -24 -1208 -1736 -945 1235 2933 3225 2585 1229
2509 1229 -830 -1424 124 1629 1118 -929 -3857 -5871 -5013 -1082 2657 4234 3768 1251 -1142 -872
2525 -872 1413 3453 4227 2615 -1620 -5691 -6328 -3756 -125 2909 3033 12 -2709 -2543 -242 2927
2541 2927 5342 4675 1096 -1990 -2951 -2397 -290 2289 2307 -1114 -4368 -5458 -3603 703 4218 4103
2557 4103 1945 -22 -1240 -1109 1270 3980 4021 1395 -2458 -5799 -6133 -2701 1072 2519 1804 -244
2573 -244 -1914 -1132 1835 3664 3879 3451 955 -2406 -3662 -2113 164 680 -670 -2642 -3172 -1033
2589 -1033 1380 2226 2440 1747 -249 -1381 -38 1989 2751 2039 -159 -3119 -4081 -2483 110 1372
2605 1372 768 -1154 -2684 -1596 931 2720 3928 4119 1942 -1017 -2423 -1355 -72 554 -543 -2885
2621 -2885 -4182 -3148 -700 2293 4630 4119 1253 -1429 -1992 -979 1024 3115 3009 -225 -3585 -5160
2637 -5160 -3984 -228 3228 3503 1341 -1462 -3478 -2856 604 4398 5248 3310 -23 -2903 -3610 -1402
2653 -1402 1208 1898 65 -3164 -5081 -3394 605 4043 4959 3722 831 -1717 -2279 -362 1984 2755
2669 2755 1032 -2634 -5331 -4640 -1533 1708 3411 3010 599 -1178 -1317 -324 1304 2612 2430 547
2685 547 -1504 -2339 -1391 86 752 -695 -2386 -2364 -1176 227 1758 2778 2367 979 -172 -299 639
2702 639 2109 1541 -871 -3491 -4418 -3722 -1132 1598 2226 1574 564 142 344 1415 2437 2174 531
2719 531 -1994 -3494 -2605 200 1954 1023 -709 -2338 -3200 -1881 1022 3288 3786 2301 -259 -1864
2735 -1864 -1489 810 2459 3112 1127 -2847 -5715 -5117 -2199 961 3122 3482 1689 -275 -1025 115
2751 115 2569 4054 2742 -945 -4013 -4735 -3227 -157 2786 2349 -604 -2811 -2777 -809 2211 4551
2767 4551 4161 1632 -1320 -3370 -2214 1282 3448 2188 -1030 -3764 -5067 -3852 -561 2095 2669
2782 2669 2180 1012 113 818 2313 2730 1594 -511 -2933 -4156 -2641 2 318 -276 -841 -1141 -571
2799 -571 1185 2707 3131 2684 939 -1371 -2005 -657 785 931 440 -1201 -2849 -2925 -1304 -1 692
2816 692 1044 499 50 833 2137 3011 3414 2192 -1246 -4004 -3991 -2157 -591 594 261 -1575 -2808
2833 -2808 -1633 874 3702 5583 4468 929 -2311 -3300 -2572 46 2366 1636 -1137 -3177 -3645 -2280
2849 -2280 386 2800 2845 1108 -718 -1740 -664 2523 4617 3484 493 -2741 -4513 -3715 -1102 985
2865 985 959 -300 -2140 -3023 -1461 2264 5152 5750 3893 -145 -3278 -3748 -1484 258 612 -315 -1821
2882 -1821 -2875 -2155 -215 1609 2774 2411 435 -1090 -294 1161 2190 2118 466 -1951 -2660 -1749 -360
2899 -360 222 -80 -1223 -2212 -1753 -185 1630 3537 4079 2504 48 -893 -727 -251 -217 -926 -2397 -3104
2917 -3104 -2390 -1106 736 2296 2261 1159 400 201 374 1415 2217 1386 -1005 -2912 -3348 -1855 219
2934 219 1545 1174 -110 -1692 -2672 -1688 1035 3634 4189 2837 139 -2225 -2376 -334 1487 1465 -418
2951 -418 -2965 -4300 -3319 -699 2115 3892 3402 961 -1359 -1314 922 2946 2928 573 -2732 -4546 -3976
2968 -3976 -1534 1106 2845 2178 -541 -2267 -1968 108 2816 4280 3002 -41 -2273 -2623 -1197 562
2984 562 1319 388 -1127 -2225 -2722 -1482 887 2614 2304 1018 -16 22 1143 1843 1522 129 -1593
3001 -1593 -2797 -2856 -1660 122 669 421 77 -663 -304 1394 3045 2874 1452 -751 -2137 -1857 -629
3018 -629 306 74 -461 -1378 -2165 -1513 641 2060 2355 1526 -144 -1141 -616 1002 1991 1994 118 -2229 -3332
3037 -3332 -2222 -483 732 1275 745 -874 -1890 -1027 1155 3308 4410 2699 -492 -2791 -3084 -2080
3053 -2080 -5 1225 431 -1419 -2499 -2361 -860 2018 4125 3851 1370 -1206 -2547 -1197 1088 2162
3069 2162 697 -1376 -2732 -3347 -2187 399 2427 2273 703 -1206 -2233 -645 2357 3594 2827 828
3085 828 -1687 -3032 -2299 -432 338 238 -411 -1828 -2360 -860 1309 2822 3155 2093 229 -520 186
3102 186 244 -376 -769 -1588 -2544 -2431 -1049 275 1262 1555 612 -241 32 998 1626 2109 1411 -362 -1796
3121 -1796 -1843 -1199 -404 123 217 -955 -2017 -1724 -443 1213 2711 2766 1162 79 -89 220 900 1506
3139 1506 -64 -2438 -3850 -3556 -1982 469 2451 2519 1050 -512 -1205 50 2562 3696 2178 -388
3155 -388 -2679 -3684 -2987 -372 1429 1532 341 -1388 -2339 -1639 885 2827 3350 2148 -150 -1508
3171 -1508 -614 905 1401 617 -692 -2670 -3880 -3173 -791 1511 3013 2130 237 -843 65 1627
3187 1627 2647 2644 888 -1786 -3319 -3219 -1949 -298 984 884 -352 -1128 -767 662 2287 2543 1309
3204 1309 -24 -399 -256 49 516 503 -879 -2157 -2629 -2098 -533 1015 1293 682 61 20 803 2054
3222 2054 2793 2006 232 -1422 -2403 -2564 -1692 -432 4 -350 -763 -799 240 1898 2682 2326 1103 -496
3240 -496 -1360 -832 309 1174 820 -624 -2373 -3174 -2116 -77 1627 2301 1194 -738 -1641 -594 1659
3257 1659 3256 3258 1458 -1178 -3019 -3278 -2073 -319 927 324 -1166 -1864 -768 1239 3239 3794 2265
3274 2265 -215 -1743 -1744 -743 436 822 -13 -1371 -2316 -2580 -933 1493 2770 1855 195 -875 -963
3291 -963 219 1451 1935 1478 410 -1250 -2423 -2202 -1010 -284 33 -132 -838 -814 637 2187 2490 1871
3309 1871 790 -362 -784 -725 -622 -333 -368 -1326 -2271 -1839 5 1372 2213 1841 692 -617 -467 244
3327 244 1058 1133 729 -692 -1620 -1447 -868 -44 704 255 -1187 -1568 -514 995 2183 2613 1726 14
3345 14 -1122 -1038 -128 766 851 -627 -2271 -3032 -2387 -662 1926 3386 2564 608 -727 -980 -136 1116
3363 1116 1686 825 -824 -2282 -2763 -1886 427 1742 1271 19 -1060 -1500 -261 1760 2658 2006 516
3380 516 -924 -1940 -1068 151 871 614 -508 -2446 -3078 -1352 1040 2313 2604 1690 108 -544 -54
3397 -54 397 718 760 -281 -2031 -2625 -1943 -720 655 1425 849 -28 -116 719 1122 1376 1308 101 -738 -1164
3417 -1164 -1115 -591 251 474 -604 -1586 -1595 -690 722 1917 1712 805 279 12 73 681 1226 505 -966 -1995
3437 -1995 -2446 -1984 -381 1106 995 173 -653 -168 957 2440 2750 1336 -300 -1663 -2434 -1769 130
3454 130 994 521 -875 -2062 -2077 -606 1662 2840 2346 847 -690 -1320 -386 894 1483 1096 -161
3471 -161 -2053 -2786 -2024 -375 973 1438 554 -388 -558 382 1446 2239 2225 1029 -758 -2126 -2133 -1432 -281
3490 -281 341 -197 -1113 -1526 -761 752 2188 2654 1815 632 -431 -1179 -854 249 672 67 -1089 -1896
3508 -1896 -1931 -949 458 1102 829 503 -78 135 925 1691 1722 872 -346 -1308 -1629 -1127 -217 -281 -897 -1564
3528 -1564 -1540 -487 1207 2144 2122 1693 693 -350 -301 133 370 69 -704 -1798 -2442 -1831 -147 1018
3546 1018 1315 958 -268 -353 398 1253 1849 1635 522 -1060 -1971 -1774 -579 671 822 -520 -1955 -2248
3564 -2248 -1297 491 2305 2894 1898 496 -500 -750 9 1007 1150 -170 -1848 -2997 -2791 -859 1235
3581 1235 1744 1106 627 -38 9 705 1644 1686 731 -675 -1879 -2123 -1158 221 549 348 -540 -1347 -1199
3600 -1199 -79 1165 1838 1871 1290 -75 -657 -350 89 491 368 -855 -2148 -2065 -1269 -330 671 1261
3618 1261 938 467 455 865 1249 1361 778 -480 -1762 -1813 -1277 -347 640 340 -730 -1155 -370 354 1403
3637 1403 1973 1429 229 -621 -677 -210 630 1063 30 -1481 -1913 -1693 -805 565 1086 499 -422 -132 249
3656 249 1172 2120 1971 611 -818 -2143 -2459 -1321 356 535 -187 -839 -1186 -811 516 1991 2287 1736
3674 1736 562 -914 -1532 -874 219 803 570 -423 -1677 -1741 -737 480 937 1111 543 -205 -527 209
3692 209 1111 1867 1760 75 -1551 -1959 -1365 -692 102 351 -125 -819 -705 38 1023 1954 2210 1263 -213
3711 -213 -1061 -1470 -855 -127 119 -539 -1059 -646 -513 118 930 1106 632 126 -181 -50 605 1057 770 -34
3731 -34 -793 -1348 -1236 -317 413 76 -519 -871 -757 -46 1310 2015 1790 1017 -158 -1059 -957 -124 219 -222
3751 -222 -1061 -1669 -1570 -345 1294 1886 1503 434 -365 -510 62 870 1247 707 -587 -2056 -2107 -886 436
3770 436 1080 804 -306 -1087 -1022 -54 1045 1935 1916 910 -423 -1053 -869 -312 239 87 -973 -1653 -1544
3789 -1544 -835 308 1340 1925 1439 652 -57 -317 185 811 679 -316 -1405 -2061 -1665 -858 477 1057
3807 1057 846 324 -382 -667 266 1295 1505 1161 -100 -1044 -1392 -591 -22 13 -386 -988 -1171 -888 -1
3826 -1 819 1512 1448 704 82 199 691 820 438 -463 -1640 -2147 -1526 -580 293 702 411 -188 -162 596 1116
3847 1116 1545 1499 391 -700 -1353 -1076 -414 198 -34 -770 -1327 -1088 -555 547 1465 1588 935 -96 -160
3866 -160 84 740 1335 1051 -325 -1708 -2253 -1809 -689 697 683 197 3 -264 -186 1021 2080 1946 1009
3885 1009 -513 -1423 -1600 -636 -53 -101 -293 -861 -1301 -972 178 1066 1497 1591 810 -323 -631 226 666
3904 666 729 196 -895 -1716 -1674 -1053 -425 430 958 471 -66 -94 517 1051 1695 1505 259 -894 -1234 -1301
3924 -1301 -816 -165 -185 -682 -798 -547 -211 1008 1743 1560 642 49 -258 10 596 659 -153 -1262 -1628 -1370
3944 -1370 -670 311 638 410 -178 -300 -35 641 1567 1684 837 -239 -970 -1023 -502 165 17 -662 -1203 -1255
3964 -1255 -860 338 1461 1806 1296 523 -341 -456 263 751 469 -262 -1128 -1726 -1551 -597 257 868 887
3983 887 249 -478 -464 192 1074 1637 1282 94 -1196 -1324 -943 -369 167 200 -438 -1220 -1191 -405 638 1752
4003 1752 1892 1040 -10 -487 -470 269 666 228 -688 -1481 -1518 -1229 -256 743 1244 694 97 -176 103 799
4023 799 1190 607 -30 -679 -1056 -983 -350 -23 -79 -277 -473 -568 -261 387 1277 1220 607 -28 -321 54 376
4044 376 302 -123 -673 -1370 -1513 -904 184 655 774 505 139 -36 454 1071 1259 824 -429 -1290 -1382 -651
4064 -651 -53 130 181 -327 -882 -687 135 1103 1598 1205 155 -652 -647 -294 441 663 187 -786 -1531 -1472 -856
4085 -856 -106 986 1175 639 0 -355 127 933 1570 855 -80 -985 -1419 -1429 -684 91 338 282 -188 -663
4105 -663 -259 744 1483 1490 958 -83 -932 -953 -411 149 153 -23 -803 -1313 -1097 -205 633 1225 1059 312 -256
4126 -256 -22 419 939 852 206 -544 -1287 -1141 -839 -232 69 -113 -402 -342 262 782 1412 1468 672 -344 -552
4147 -552 -510 -257 -19 -264 -628 -1081 -983 -473 260 1064 1258 648 93 73 62 436 1057 651 -196 -825 -1111
4168 -1111 -1154 -528 149 120 -211 -451 -655 -175 1096 1860 1616 860 -126 -763 -831 -186 81 -83 -583 -1189
4188 -1189 -1578 -1004 242 1141 1567 1363 407 -387 -58 500 774 724 127 -833 -1480 -1471 -847 -4 503 495 -259
4209 -259 -557 -187 596 1165 1550 1181 213 -480 -535 -658 -288 -49 -323 -858 -1317 -1031 -558 505 1345 1353 844
4230 844 404 131 125 431 480 -105 -688 -1227 -1430 -1122 -228 225 275 69 -115 -56 604 1300 1222 477 -87 -483
4252 -483 -564 -344 88 -171 -500 -864 -1111 -958 -135 902 975 706 330 114 210 671 952 496 -149 -889 -1375
4273 -1375 -1141 -760 -237 159 221 -157 -401 19 880 1467 1360 847 -52 -802 -851 -557 -160 157 77 -739 -1236
4294 -1236 -1167 -157 667 1292 1287 400 -182 -181 44 402 999 383 -514 -1226 -1579 -1142 -320 379 491 -9 -307
4315 -307 -292 277 983 1475 1074 430 -376 -949 -890 -344 -8 -245 -477 -960 -938 -265 623 995 1085 610 196
4336 196 -109 87 265 240 144 -266 -866 -1095 -681 -103 68 238 90 -178 -49 392 913 954 721 261 -281
4357 -281 -526 -460 -295 -98 -174 -597 -1150 -833 -68 623 1246 1006 358 47 -44 55 363 435 26 -598 -1123 -1214
4379 -1214 -812 46 671 617 -24 -413 -167 261 1038 1168 728 1 -521 -812 -866 -198 276 194 -289 -960 -1120
4400 -1120 -498 561 1008 1250 670 65 -499 -246 258 465 338 -46 -1029 -1464 -1136 -272 475 705 659 -86
4420 -86 -142 204 576 889 908 345 -449 -907 -876 -600 -120 188 -132 -529 -493 -120 447 948 1052 473 -80 -27
4442 -27 -44 -93 229 -12 -479 -853 -849 -735 -180 382 424 267 186 274 494 854 952 471 12 -447 -626 -791 -455
4465 -455 -214 -106 -458 -517 -344 0 682 1118 774 569 312 -233 -312 161 257 27 -302 -878 -1249 -899 63
4486 63 586 830 679 90 -216 178 611 941 923 270 -647 -1158 -1174 -491 19 392 69 -674 -720 -249 457
4507 457 1110 1415 952 50 -321 -519 -333 111 351 -172 -888 -1270 -991 -387 407 917 677 299 195 90
4527 90 314 733 762 318 -523 -865 -1108 -691 -176 73 -198 -248 -186 -111 389 820 1066 728 461 143 -332 -162
4549 -162 -90 -113 -476 -730 -1114 -849 -70 374 495 469 453 202 389 563 716 548 134 -556 -965 -847 -547
4570 -547 -220 -131 -196 -563 -432 118 770 990 1018 776 242 -302 -311 -296 -80 116 -356 -963 -1143 -779 -348 521
4592 521 896 803 232 48 181 386 654 808 450 -315 -1008 -1251 -841 -111 362 -23 -323 -467 -335 315
4612 315 1058 1380 1028 525 -192 -651 -372 29 201 -137 -682 -1120 -1113 -492 411 681 680 534 178 136 445 579
4634 579 649 345 -281 -943 -1046 -699 -373 -137 -34 -58 -80 98 289 587 833 704 347 211 -231 -343 -225
4655 -225 -96 -210 -650 -827 -627 -332 57 296 395 483 365 337 538 701 627 139 -369 -813 -987 -765 -230
4676 -230 136 -140 -287 -107 -61 431 749 1112 824 346 -300 -549 -397 -52 158 -125 -646 -808 -872 -185 327
4697 327 550 652 430 84 -169 208 692 794 469 -130 -893 -1272 -858 -247 129 202 70 -324 -284 188 695
4718 695 1089 1271 720 -304 -661 -607 -517 -13 15 -293 -763 -629 -287 220 805 880 426 78 -46 -81 221
4739 221 535 393 -192 -618 -733 -639 -210 107 -11 -248 -148 -23 96 409 950 881 512 52 -275 -501 -291
4760 -291 -332 -517 -716 -611 -387 -102 355 695 665 537 462 76 -58 177 67 -83 -350 -822 -851 -505 140
4781 140 218 184 241 -121 -373 119 490 705 746 531 -195 -732 -507 -166 63 84 -479 -893 -815 -234 253 776
4803 776 1029 678 166 -65 -57 136 394 221 -459 -1211 -1302 -778 -182 521 757 325 -13 -18 52 352 758 836
4825 836 268 -372 -650 -767 -420 72 182 -239 -283 -524 -314 114 605 836 687 527 142 -49 156 237 102
4846 102 -328 -741 -1023 -858 -318 96 234 392 457 185 515 479 623 478 89 -384 -614 -603 -549 -404 -227
4867 -227 -123 -229 -237 -30 393 418 752 585 87 -40 19 257 208 78 -208 -790 -871 -760 -359 -5 254 204
4889 204 219 130 338 644 1013 1015 391 -259 -636 -805 -651 -268 -85 -255 -317 -462 -166 231 969 1127 851 208
4911 208 -310 -437 -69 382 254 -91 -652 -870 -932 -285 87 543 514 133 -169 -93 460 845 940 577 -162
4932 -162 -615 -833 -628 -489 -258 -144 -325 -245 -181 314 622 928 893 606 181 124 -212 -125 -222 -277 -523 -686
4954 -686 -594 -453 -119 242 603 535 184 275 118 372 594 197 -132 -364 -504 -549 -399 -207 -214 -368 -365 -213 71
4977 71 513 843 709 606 127 -52 106 262 -83 -428 -744 -894 -874 -489 109 455 480 291 4 145 432
4998 432 738 590 338 -218 -756 -813 -504 -176 -54 13 -155 -458 -399 113 438 837 841 466 -95 -27 -12 38 78
5021 78 -103 -542 -790 -772 -653 -235 376 806 371 104 14 248 396 744 505 -156 -522 -676 -680 -438 73 91
5043 91 -37 -61 -225 26 382 696 689 313 54 -302 -243 -77 73 -102 -362 -480 -415 -541 -81 160 442 309
5065 309 198 192 236 498 352 176 49 -329 -610 -433 -291 -274 -127 -1 -97 -12 204 457 628 464 394 -125
5087 -125 -292 2 -157 -38 -97 -255 -577 -566 -338 -49 472 619 387 -47 -42 216 574 625 354 -86 -733 -756
5109 -756 -744 -391 78 110 61 -172 -72 51 543 937 821 177 -237 -430 -450 -117 -14 40 -273 -329 -540 -206
5131 -206 80 458 522 434 299 -71 24 277 346 302 100 -290 -409 -707 -575 -291 20 143 42 82 163 500
5153 500 657 732 504 28 -382 -497 -394 -288 -174 -308 -409 -392 -119 152 600 665 531 223 -79 20 216
5174 216 278 176 -96 -260 -389 -585 -283 -84 -55 -67 -207 -91 168 518 738 613 342 114 -269 -353 -287 -323
5196 -323 -399 -376 -600 -556 -323 291 584 892 617 368 81 -51 68 113 -190 -292 -565 -862 -591 -262 103
5217 103 332 259 -12 -302 -115 403 634 629 588 42 -298 -306 -355 -130 66 -147 -718 -828 -617 -178 454 936
5239 936 1005 494 186 265 99 20 -123 -354 -648 -808 -678 -598 -40 439 321 203 262 151 212 546 396 165
5261 165 18 -230 -317 -325 -153 -169 -227 -195 -347 -575 -205 242 560 585 541 373 180 155 296 -13 -184 -431 -842
5284 -842 -937 -535 -105 140 233 218 69 298 691 694 509 170 -102 -492 -590 -423 -178 -77 -52 -290 -576 -408
5306 -408 29 446 537 475 60 -77 260 273 342 407 140 -382 -717 -642 -561 -256 25 187 -84 -19 201 456 782
5329 782 767 653 12 -279 -557 -831 -504 -149 -23 -135 -341 -361 -105 271 764 721 556 174 -193 -207 50
5350 50 295 -21 -170 -445 -589 -591 -228 100 173 185 148 78 349 583 567 537 309 -130 -451 -431 -364 -258 -204 -295
5374 -295 -536 -293 261 356 605 681 526 73 115 -63 -128 -115 -91 -374 -497 -463 -272 -154 62 204 51 91 21
5397 21 328 467 434 348 120 -242 -433 -445 -308 62 -99 -464 -482 -360 55 358 731 663 352 292 1 -64 180
5420 180 222 39 -336 -758 -650 -452 -32 285 354 207 77 123 222 382 421 332 28 -182 -441 -602 -308 -222
5442 -222 -37 -62 -238 -295 7 167 453 676 425 217 -36 -277 -108 -17 -78 -142 -423 -609 -387 -327 202 536
5464 536 398 350 202 179 179 363 440 130 -359 -557 -609 -534 -67 28 -140 -113 -92 75 291 674 463 174 85 -98
5488 -98 -112 -201 -42 -100 -337 -561 -472 -416 134 433 182 19 135 156 415 486 398 307 -141 -380 -561 -495 -383 -111
5512 -111 -83 -114 -220 -76 149 364 474 512 265 122 -174 -282 -216 -204 -75 -267 -586 -597 -365 -98 200 561
5534 561 532 150 61 191 202 356 318 -89 -275 -526 -677 -572 -42 104 95 -38 81 61 303 458 593 461
5556 461 177 -85 -341 -349 -267 -41 -197 -402 -408 -423 -114 274 386 466 420 135 125 176 287 197 3 -117 -574 -675
5580 -675 -654 -263 -170 -40 93 26 39 380 507 675 446 248 -129 -209 -251 -254 -327 -227 -491 -618 -233 40 436
5603 436 588 487 47 64 184 161 359 192 61 -361 -647 -423 -217 -149 54 -134 -239 -208 230 384 590
5624 590 666 480 191 -44 -247 -206 -284 -264 -513 -566 -490 -351 -25 290 623 654 640 312 -64 -61 148 258 46
5647 46 -241 -468 -582 -413 -268 -53 243 230 51 -145 126 364 498 601 461 130 -247 -193 -251 -179 -161 -421
5669 -421 -708 -620 -64 157 361 638 582 326 219 199 -33 82 -89 -380 -668 -607 -301 -173 -35 148 138 182
5691 182 246 226 327 262 251 118 -173 -168 -82 53 -15 -215 -449 -458 -330 -224 -10 292 429 404 358 196 192 404 290
5716 290 -76 -433 -709 -801 -523 -111 23 145 192 115 80 311 342 470 382 -47 -276 -390 -107 -64 34 -116 -158
5739 -158 -373 -161 -29 201 287 410 380 262 -37 125 116 323 315 -47 -371 -608 -623 -496 -82 202 175 172 240 199
5763 199 227 419 515 286 -131 -462 -569 -499 -57 -17 -125 -58 -90 -194 -27 427 415 259 81 -16 5 101 182 49
5787 49 -177 -382 -425 -505 -157 79 31 68 70 56 230 428 458 438 139 -39 -349 -203 -78 -130 -322 -292 -220 -271 186
5812 186 276 445 375 333 62 4 26 25 76 -211 -356 -502 -416 -297 3 75 240 229 90 51 157 269 490 382
5836 382 115 -172 -276 -462 -508 -125 -12 -112 -137 -137 12 86 552 645 501 265 -79 -203 -84 -58 -88 -275 -478
5859 -478 -333 -440 -183 124 297 246 228 188 261 296 256 240 142 -180 -311 -488 -545 -229 -303 -82 -67 8 33 236
5883 236 287 445 421 281 -18 -102 -75 -92 -273 -162 -371 -427 -374 -126 -63 256 409 224 109 271 315 364 386 26
5907 26 -165 -395 -555 -379 -183 -193 -174 -242 -123 139 251 560 426 468 64 76 -19 -165 -48 -135 -383 -538 -401
5930 -401 -257 6 329 489 155 189 254 95 185 409 330 89 -118 -364 -410 -444 -271 -140 -74 -108 -16 -119 182
5953 182 419 595 641 416 116 -194 -244 -237 -193 -196 -260 -503 -509 -282 108 376 546 384 147 82 235 157 187 -39
5977 -39 -95 -363 -489 -285 -180 -89 -11 -72 -98 -13 52 327 608 516 256 217 132 -171 -50 -248 -233 -409 -432 -311
6001 -311 -142 91 223 389 287 255 195 404 280 94 -80 -241 -256 -367 -194 -220 -158 -31 -30 -70 58 237 408
6024 408 452 409 241 66 -121 -98 23 15 -227 -273 -483 -352 -203 -18 257 482 267 79 86 260 291 283 25 -127
6048 -127 -424 -437 -390 -266 -140 58 11 -43 80 236 349 524 489 132 100 -152 -264 -228 -79 -73 -296 -267 -327 -233
6072 -233 -46 212 286 318 252 123 108 197 192 -23 -53 -228 -402 -397 -194 -159 -21 56 66 -27 214 411 316 294 287 177
6098 177 -207 -78 -176 -228 -360 -365 -381 -370 -103 105 127 338 320 130 165 377 85 6 -67 -164 -349 -364 -96 -189 -4
6123 -4 2 0 16 139 181 206 177 297 98 -154 -99 -57 -122 -81 -93 -336 -348 -185 -195 -27 409 364 291 319 171 -25 225
6150 225 221 32 -67 -364 -505 -525 -236 121 155 179 50 84 -57 249 377 188 101 0 -421 -324 -95 -218 -123
6173 -123 81 -80 -238 -153 23 236 182 311 247 121 214 132 99 24 -97 -287 -440 -409 -354 -202 71 79 56 156
6197 156 349 278 226 124 48 -148 -270 -229 -399 -153 -190 -65 -92 -16 -4 167 281 269 258 90 63 4 41 77 -23
6222 -23 -257 -229 -223 -531 -239 -5 -25 105 44 252 204 413 337 359 37 -127 -58 -326 -267 -110 -235 -166 -30 -160
6246 -160 -119 158 359 309 432 209 119 -56 46 5 17 -29 -151 -452 -544 -290 -129 279 200 237 259 139 236 360
6270 360 349 397 -16 -273 -257 -250 -203 -173 23 -284 -129 -73 14 302 533 327 145 220 -66 -66 -76 52 -255 -289 -324
6295 -324 -278 -328 -188 144 148 259 195 183 337 329 140 35 -73 -149 -230 -327 -359 -417 -190 -116 -207 39 243 350 326
6320 326 275 348 87 -1 -54 -112 -96 -170 -199 -401 -385 -314 -49 148 106 102 79 179 205 317 245 300 68 -192 -320 -387
6346 -387 -308 -153 -65 -183 -288 17 138 450 504 402 175 85 -177 -51 -18 -61 -178 -256 -251 -240 -325 22 170 118
6370 118 87 124 134 25 356 222 138 119 -73 -154 -287 -223 -214 -110 -137 -206 -183 76 270 447 388 350 172 3 24
6395 24 -140 -276 -280 -281 -357 -230 -124 -4 74 259 295 92 116 123 11 -20 43 -146 -68 -149 -250 -154 -113 -151 -167 -252 -24
6422 -24 164 -33 226 321 183 142 222 99 -1 -196 -312 -370 -422 -347 -197 -19 214 365 266 128 216 158 133 102
6446 102 104 -130 -318 -406 -268 -254 19 41 -45 -32 -216 -17 94 292 153 192 19 36 -49 90 -12 -23 -171 -262
6470 -262 -279 -295 -63 36 153 332 189 225 243 250 215 117 -75 -226 -491 -444 -246 -193 -58 38 8 148 223 126 147
6495 147 150 143 68 -33 -188 -208 -116 -35 -124 -180 -210 -160 -162 21 137 200 213 210 139 113 91 38 -63 -218 -335 -348 -298 -86
6523 -86 8 -38 43 135 161 287 311 311 131 73 -114 -186 -79 -125 -219 -208 -180 -208 -143 -38 230 313 186 131 47 179 117
6550 117 111 117 -65 -161 -297 -237 -172 -68 113 102 5 67 140 167 278 374 271 -4 -84 -148 -187 -125 -126 -176 -312 -276 -127
6577 -127 -83 284 394 423 252 249 49 87 136 -142 -155 -158 -154 -366 -192 -185 12 89 70 170 147 215 235 210 60 48 37
6604 37 -170 -252 -258 -232 -52 -143 -345 -38 83 186 155 301 392 270 178 106 -55 5 -83 -179 -290 -376 -311 -94 89
6629 89 151 147 215 146 121 244 200 191 -111 -248 -243 -252 -272 -108 -46 -194 -316 -124 -1 225 222 240 226 63 65 -14 246 177
6657 177 -40 -296 -229 -359 -427 -88 112 15 167 73 94 282 361 318 246 74 -94 -246 -260 -159 -226 -152 -136 -104
6681 -104 1 25 187 228 229 169 232 143 63 -105 -88 -118 -117 -410 -307 -270 -193 -59 126 130 120 175 211 153 261 208 86
6708 86 -85 -119 -242 -235 -199 -246 -123 -146 -5 -71 55 235 283 329 200 -18 92 85 23 -151 -221 -251 -307 -247 -97 21
6734 21 -186 -64 -7 80 165 170 259 166 111 -61 -204 -284 -192 -252 -216 -262 -125 -174 48 235 276 398 231 74 -27
6759 -27 -18 52 69 -3 -187 -353 -326 -140 -141 27 163 184 122 143 158 182 215 330 36 -115 -231 -276 -189 -121 -278 -100
6785 -100 -235 -71 103 261 303 292 217 234 -34 -132 -107 -223 -60 -300 -180 -104 -120 -111 -85 46 109 35 52 111 9
6810 9 217 130 166 29 -64 -15 -157 -141 -350 -180 -148 -54 -119 126 282 265 271 332 15 29 68 -177 -268 -233 -274 -319 -130
6837 -130 2 136 210 110 154 100 107 208 -27 116 -106 -178 -84 -121 -45 -86 -13 -43 -127 -120 -44 128 400 275 306 107
6863 107 157 28 42 -60 -146 -423 -304 -289 -215 -76 199 229 341 212 234 68 -16 71 -22 -44 -161 -282 -330 -154
6887 -154 11 -66 2 -11 -24 -72 93 76 211 133 166 35 -62 3 -62 -92 -216 -123 -233 -133 -155 32 125 283 300
6912 300 421 225 228 24 -90 -109 -232 -396 -343 -332 -261 -64 163 122 -14 192 221 166 127 164 -31 119 -110 -42
6936 -42 -10 14 -116 -273 -199 -193 -102 56 4 152 105 171 268 252 242 139 19 -219 -327 -360 -272 -8 -172 -72 34
6961 34 81 283 257 499 353 193 -67 -23 -258 -228 -90 -80 -135 -109 -206 -111 -61 153 65 172 158 143 186 47 153
6986 153 73 9 -137 -184 -266 -260 -252 -123 -84 2 -77 119 119 171 325 403 195 33 -87 -65 -278 -246 -197 -285 -4 -7 -35
7013 -35 61 232 258 197 52 204 120 159 12 -28 -114 -276 -362 -241 -180 -104 43 37 -29 95 169 342 198 167 102 114
7039 114 115 -140 -45 -155 -320 -286 -252 -164 9 38 202 176 239 215 166 250 130 59 -47 -29 -215 -269 -172 -202 -125 -62
7065 -62 117 67 -22 208 261 273 180 90 53 -89 -6 -158 -253 -190 -182 -198 -129 -17 54 203 254 219 188 207 176 102 116 -12
7093 -12 -100 -246 -161 -299 -280 -70 120 61 -10 37 110 233 215 243 183 31 -127 -326 -256 -155 -217 -148 -160 -188 -74
7118 -74 -14 83 263 287 160 53 98 78 -136 -118 4 -222 -335 -225 -41 -216 76 -30 74 66 69 272 179 189
7142 189 -31 22 -10 -88 -163 -100 -143 -175 -268 -107 -2 171 195 282 260 174 85 159 -2 -51 -250 -211 -137 -212 -240 -138
7168 -138 -76 48 91 117 48 92 39 128 246 -89 7 -160 -124 -261 -122 -184 -65 -133 -115 -206 -8 304 244 254 47
7193 47 143 68 -23 -53 -173 30 -196 -311 -251 0 -10 52 226 120 21 110 207 144 57 28 -8 -169 -248 -139 -308
7218 -308 -112 -256 -71 -113 70 187 238 149 155 137 7 57 -167 -136 -186 -138 -194 -90 -72 -104 -57 87 -29 172 150
7243 150 268 124 264 152 73 58 -115 -172 -190 -57 -198 -214 35 -121 -77 199 313 232 203 10 57 23 -106
7266 -106 -114 -225 -266 -202 -203 -136 -25 116 61 78 188 97 35 163 110 75 -21 -187 -260 -106 -194 -176 -77 -71 -21 -134 -44
7293 -44 13 170 324 268 312 154 130 -29 -95 -141 -116 -181 -245 -252 -209 -125 246 287 179 221 99 112 6 -20 -51 -198
7319 -198 -246 -222 -296 -199 -38 -36 -57 -167 -54 66 230 182 135 265 78 84 61 198 -212 -255 -287 -347 -300 -170 -131 116
7345 116 61 244 275 265 291 320 67 -187 -160 -287 -375 -293 -197 -74 -8 48 159 241 224 246 187 17 98 5 -30 62
7371 62 -37 -66 -145 -197 -218 -220 -43 -127 36 91 93 114 189 182 220 289 55 -111 -354 -355 -269 -264 -104 -83 -62 146 177 96 271
7400 271 332 223 135 51 -160 -156 -210 -74 -142 -39 -165 -56 -258 -1 141 62 82 160 91 179 156 -21 114 106 -78
7425 -78 -247 -93 -261 -219 -111 -76 92 87 252 210 216 319 231 194 -34 -112 -150 -254 -208 -155 -333 -283 -16 -36 219
7450 219 67 118 112 100 67 123 52 -22 -24 -168 -116 -175 -85 -29 -125 -155 -61 132 44 206 327 115 322 166 -47 -114
7476 -114 -166 -179 -213 -51 -169 -33 -37 33 228 74 294 240 158 72 151 4 -34 -10 -209 -258 -224 -175 -55 43 75 129
7502 129 -95 -16 200 173 221 229 26 -174 -143 -118 -67 -200 -92 -156 -147 -25 -6 84 206 123 13 169 -13 74 48
7527 48 43 -37 -75 -169 -234 17 -74 -84 -50 96 91 156 119 190 36 33 129 -97 -104 -158 -173 -151 -272 -45 -95 -152 229 141 179
7556 179 163 124 -31 80 87 -81 -40 -70 -191 -203 -129 -29 -80 2 -51 108 -32 146 209 110 225 150 104 -53 -30
7581 -30 -147 -237 -81 -188 -219 -48 64 -14 184 191 270 153 75 -23 46 -240 -45 -234 -265 -168 -234 -15 -54 77 162
7606 162 142 119 18 -41 99 327 75 2 -111 -217 -193 -25 -50 -26 -102 6 6 -13 231 231 273 261 215 50 137 3
7632 3 -74 -155 -151 -295 -293 -122 17 89 45 99 216 93 141 67 98 17 5 -200 -187 -61 -24 -304 -253 -100 20 -16 -38
7659 -38 19 28 213 173 221 10 -8 -22 -89 -167 -153 -278 -267 -85 -47 -11 104 219 183 158 282 113 223 150 12 -116
7685 -116 -166 -139 -248 -188 -69 -14 -168 59 96 74 164 67 142 66 42 30 70 -30 -105 -181 -271 -204 -230 -77 46 80
7711 80 214 149 156 253 183 284 187 60 -57 -199 -158 -271 -249 -181 -185 9 5 98 107 175 259 217 140 -7 15 -9 -61 -68 -277
7740 -277 -261 -191 -225 -184 0 9 68 202 213 144 251 46 -16 -65 -73 -226 -197 -119 -112 -114 -198 91 47 -20 101 108 164 107 70
7769 70 41 95 46 -53 -226 -305 -197 -235 -208 -189 3 -61 121 235 145 114 162 84 17 -79 -64 -339 -81 -157 -201 -84
7795 -84 -154 43 194 186 144 251 216 289 -25 -52 -12 -166 -177 59 -66 -190 -258 -104 -171 -57 169 196 45 159
7819 159 188 194 138 158 -84 -271 -125 -193 -163 -256 -47 -98 -30 167 217 -36 95 312 107 110 42 -142 -93 -20 -137
7844 -137 94 -57 -63 -45 -113 -71 -101 -55 29 135 4 179 76 -19 -35 -13 -104 -152 -269 -150 -49 -139 22 -63 166
7869 166 86 115 204 39 51 -186 -146 -108 -110 -136 -87 -286 -80 -115 91 79 183 122 2 106 162 -64 15 1 -90 -49
7895 -49 -109 49 -50 -67 18 -16 -134 43 207 74 117 299 24 131 -92 -1 -204 -116 -116 -163 -68 -110 -131 -72 168
7920 168 78 213 113 137 95 -49 21 -108 8 56 -170 -142 -223 -171 -18 81 58 -59 90 22 136 101 -36 -15
7944 -15 -59 -56 -42 -92 -92 -157 -167 -134 87 58 92 121 215 199 128 190 41 5 26 -129 -129 -143 -109 -43 -122 -70 -36 -12 271 94
7974 94 75 124 176 48 17 -45 -190 -82 -199 -321 -67 -60 -37 -110 -7 66 150 160 74 44 118 -3 -74 -37 -68 -75 -151
8001 -151 -160 -31 -73 -52 115 3 -10 35 168 159 336 171 63 42 -59 -19 -147 -184 -213 -216 -169 -141 -40 55 230 298
8027 298 273 138 -19 -102 4 -8 -170 -106 -228 -207 -109 -76 25 38 45 48 -30 114 62 13 172 141 54 63 -97 -234
8053 -234 -167 -207 -208 -75 1 7 133 154 316 264 141 19 104 -55 -2 -127 -211 -176 -154 -186 -115 -43 56 127 83 192 160
8080 160 152 87 -1 -9 -45 -100 -86 -77 -245 -131 -42 5 -160 -31 -15 26 109 176 122 126 153 -50 8 -65 -168 -210 -274 -255 -166
8109 -166 48 89 39 177 222 85 161 228 141 -5 -60 -158 -132 -113 -234 -120 -169 -57 -119 -60 -2 299 56 65 183
8134 183 159 120 64 10 -179 -159 -195 -249 -48 -102 -55 13 63 187 150 195 223 116 96 52 75 -67 -176 -125 -155 -240 -104
8161 -104 31 3 75 -22 93 94 200 39 138 -31 24 -68 76 -85 -221 -164 -79 -119 -121 28 47 73 62 129 124 68 104
8188 104 73 -5 -258 -146 -118 -57 -36 -91 -86 -56 64 115 310 275 51 93 44 149 -40 -79 -23 -115 -132 -188 -140 5
8214 5 -59 -13 171 187 146 7 120 147 -45 14 -41 -115 -231 -218 -98 12 19 -69 -5 -80 184 215 216 91 37 2 11 19
8242 19 -194 35 -57 -61 -159 -54 -51 -88 96 103 60 156 138 55 16 83 -44 12 -106 -179 -214 -220 -126 -23 54 -1 101 125
8270 125 120 226 117 -10 -34 99 -279 -186 -226 -146 -204 -59 -132 3 25 10 84 69 117 17 58 93 64 -35 -88 -151
8296 -151 -25 -194 -105 -159 -106 -61 -69 44 183 205 122 181 92 -54 -55 -161 -173 -147 -171 -275 -153 -8 -4 60 202 211 77
8323 77 108 184 97 67 1 -44 -163 -173 -13 -271 -260 -163 -16 -53 90 144 -7 195 191 105 206 70 4 -79 -92 -260
8349 -260 -278 -173 -100 5 -102 85 -8 248 266 271 44 31 23 -69 -69 -55 -129 -131 -156 -144 -101 -37 73 40 8 75 225 96
8377 96 156 179 -79 -129 78 -65 -234 -288 -242 -275 -147 93 137 167 223 130 181 160 233 22 -3 83 -74 -134 -181 -219
8403 -219 -250 -12 -13 -24 34 37 21 135 154 57 64 -53 -50 -97 -187 -183 -108 -218 -78 -217 -54 87 211 245 154 316 178
8430 178 63 89 9 58 -121 -130 -173 -192 -189 -105 -28 -12 99 162 223 257 122 129 172 46 -140 -77 -51 -207 -149 -199 -129 -163
8458 -163 56 -72 7 161 141 137 147 200 -14 -106 -48 -233 -225 -86 -188 -84 -34 -104 24 83 81 132 32 146 148 -1
8484 -1 -5 -11 -85 -37 -101 -12 -15 -231 -129 -159 -3 169 99 247 203 103 56 134 0 -53 -85 -143 -255 -124 -266 -99 -1
8511 -1 -37 -19 146 301 83 99 162 -78 37 -101 -104 -96 -54 -127 -64 -44 -118 -66 3 100 49 172 134 274 122 82 88 79
8539 79 -9 -76 -92 -212 -278 -60 -6 22 169 125 231 129 173 136 147 -32 -180 -81 -197 -161 10 -128 -55 142 -63
8564 -63 -99 86 45 7 162 97 -12 -17 0 -2 -68 -89 -177 -207 -47 -22 30 80 50 225 170 127 193 4 -27 -18 3 -101
8592 -101 -248 -152 -125 -82 -43 1 -4 187 140 107 73 125 76 -88 40 -73 -70 -81 -179 -201 -166 -81 -19 8 56 104 27 144
8620 144 183 175 207 5 -30 -87 -129 -103 -113 -50 -202 5 -3 46 31 208 155 105 143 208 -74 -87 -171 -146 -156 -156 -68 -174
8648 -174 -104 -17 -42 -28 175 264 51 115 118 156 29 -151 -195 -239 -190 -235 -136 -176 34 86 -17 60 94 166 235 53 62
8675 62 -4 -3 -163 -197 -133 -157 -68 -72 -82 -79 -8 93 69 94 163 208 -56 89 72 -89 -119 -163 -179 -253 -183 -98 -102 -17 130
$$ [...]
16383B9
##END NTUPLES=NMR FID
##END=
