##TITLE=abcd
##JCAMPDX= 6.0         $$ Bruker NMR JCAMP-DX V2.0
##DATA TYPE= NMR FID
##DATA CLASS= NTUPLES
##ORIGIN= UXNMR, Bruker Analytische Messtechnik GmbH
##OWNER= root
$$ XWIN-NMR		Version 3.5
$$ Tue Jul  8 17:48:46 2025 Russian Standard Time (UT+4h)  servis@DPX200
##.OBSERVE FREQUENCY= 200.131235884673
##.OBSERVE NUCLEUS= ^1H
##.DELAY= (6, 6)
##.ACQUISITION MODE= SIMULTANEOUS
##.ACQUISITION SCHEME= undefined
##.AVERAGES= 32
##.DIGITISER RES= 18
##SPECTROMETER/DATA SYSTEM= spect
##.PULSE SEQUENCE= zg
##.SOLVENT NAME= CDCl3
##.SHIFT REFERENCE= (INTERNAL, CDCl3, 0, 16.5164)
##AUDIT TRAIL= $$ (NUMBER, WHEN, WHO, WHERE, WHAT)
$$ ##TITLE= Audit trail, XWIN-NMR		Version 3.5
$$ ##JCAMPDX= 5.01
$$ ##ORIGIN= Bruker BioSpin GmbH
$$ ##OWNER= servis
$$ F:\spectra/data/av/nmr/H1/1/audita.txt
$$ ##AUDIT TRAIL=  $$ (NUMBER, WHEN, WHO, WHERE, WHAT)
(   1,<2025-07-08 17:46:15.75 +0400>,<servis>,<DPX200>,
      <created by zg, POWCHK disabled, PULCHK disabled
       configuration hash MD5:
       00 E9 B6 7A A2 85 ED C7 34 08 36 98 17 FE 4E 26
       data hash MD5: 32K
       63 8A 9C 80 69 06 E1 44 C9 E6 F9 94 E8 81 24 B3>)
$$ ##END=
$$ 
$$ hash MD5
$$ 35 C4 FE 20 67 1A F6 9A 0B A3 40 27 42 38 F6 BB
##$RELAX= 
##$RELAX= 
##$RELAX= 
##$RELAX= 
##$RELAX= 
##$RELAX= 
##$RELAX= 
##$RELAX= 
$$ Bruker specific parameters
$$ --------------------------
##$DU= <F:\spectra>
##$EXPNO= 1
##$NAME= <H1>
##$PROCNO= 1
##$TYPE= <nmr>
##$USER= <av>
##$AMP= (0..31)
100 100 100 100 100 100 100 100 100 100 100 100 100 100 100 100 100 100 
100 100 100 100 100 100 100 100 100 100 100 100 100 100 
##$AQSEQ= 0
##$AQ_mod= 1
##$AUNM= <au_zg>
##$AUTOPOS= <>
##$BF1= 200.13
##$BF2= 200.13
##$BF3= 200.13
##$BF4= 200.13
##$BF5= 500.13
##$BF6= 500.13
##$BF7= 500.13
##$BF8= 500.13
##$BYTORDA= 1
##$CFDGTYP= 0
##$CFRGTYP= 5
##$CHEMSTR= <none>
##$CNST= (0..31)
1 1 145 1 1 1 1 1 1 1 1 1 1 1 1 1 1 1 1 1 1 1 1 1 1 1 1 1 1 1 1 1 
##$CPDPRG= <>
##$CPDPRG1= <>
##$CPDPRG2= <>
##$CPDPRG3= <>
##$CPDPRG4= <mlev>
##$CPDPRG5= <mlev>
##$CPDPRG6= <mlev>
##$CPDPRG7= <mlev>
##$CPDPRG8= <mlev>
##$CPDPRGB= <>
##$CPDPRGT= <>
##$D= (0..31)
0 2 0 0 0 0 0 0 0 0.06 0 0 0 0 0 0 0.0002 0 0 0 0 0 0 0 0 0 0 0 0 0 0 
0 
##$DATE= 1751982375
##$DBL= (0..7)
120 120 120 120 120 120 120 120 
##$DBP= (0..7)
150 150 150 150 150 150 150 150 
##$DBP07= 0
##$DBPNAM0= <>
##$DBPNAM1= <>
##$DBPNAM2= <>
##$DBPNAM3= <>
##$DBPNAM4= <>
##$DBPNAM5= <>
##$DBPNAM6= <>
##$DBPNAM7= <>
##$DBPOAL= (0..7)
0.5 0.5 0.5 0.5 0.5 0.5 0.5 0.5 
##$DBPOFFS= (0..7)
0 0 0 0 0 0 0 0 
##$DE= 6
##$DECBNUC= <off>
##$DECIM= 32
##$DECNUC= <off>
##$DECSTAT= 4
##$DIGMOD= 1
##$DIGTYP= 9
##$DL= (0..7)
0 120 120 120 120 120 120 120 
##$DP= (0..7)
150 150 150 150 150 150 150 150 
##$DP07= 0
##$DPNAME0= <>
##$DPNAME1= <>
##$DPNAME2= <>
##$DPNAME3= <>
##$DPNAME4= <>
##$DPNAME5= <>
##$DPNAME6= <>
##$DPNAME7= <>
##$DPOAL= (0..7)
0.5 0.5 0.5 0.5 0.5 0.5 0.5 0.5 
##$DPOFFS= (0..7)
0 0 0 0 0 0 0 0 
##$DQDMODE= 0
##$DR= 18
##$DS= 0
##$DSLIST= <SSSSSSSSSSSSSSS>
##$DSPFIRM= 0
$$ [...]
##$SUBNAM0= <"">
##$SUBNAM1= <"">
##$SUBNAM2= <"">
##$SUBNAM3= <"">
##$SUBNAM4= <"">
##$SUBNAM5= <"">
##$SUBNAM6= <"">
##$SUBNAM7= <"">
##$SUBNAM8= <"">
##$SUBNAM9= <"">
##$SW= 20.6817932712277
##$SWIBOX= (0..15)
0 0 3 0 0 0 0 0 0 0 0 0 0 0 0 0 
##$SW_h= 4139.07284768212
##$TD= 32768
##$TD0= 1
##$TE= 0
##$TE2= 300
##$TE3= 300
##$TEG= 300
##$TL= (0..7)
0 120 120 120 120 120 120 120 
##$TP= (0..7)
150 150 150 150 150 150 150 150 
##$TP07= 0
##$TPNAME0= <>
##$TPNAME1= <>
##$TPNAME2= <>
##$TPNAME3= <>
##$TPNAME4= <>
##$TPNAME5= <>
##$TPNAME6= <>
##$TPNAME7= <>
##$TPOAL= (0..7)
0.5 0.5 0.5 0.5 0.5 0.5 0.5 0.5 
##$TPOFFS= (0..7)
0 0 0 0 0 0 0 0 
##$TUNHIN= 0
##$TUNHOUT= 0
##$TUNXOUT= 0
##$USERA1= <user>
##$USERA2= <user>
##$USERA3= <user>
##$USERA4= <user>
##$USERA5= <user>
##$V9= 5
##$VALIST= <valist>
##$VCLIST= <CCCCCCCCCCCCCCC>
##$VD= 0
##$VDLIST= <DDDDDDDDDDDDDDD>
##$VPLIST= <PPPPPPPPPPPPPPP>
##$VTLIST= <TTTTTTTTTTTTTTT>
##$WBST= 1024
##$WBSW= 30
##$XGAIN= (0..3)
0 0 0 0 
##$XL= 0
##$YL= 0
##$YMAX_a= 1272546
##$YMIN_a= -1017096
##$ZGOPTNS= <>
##$ZL1= 120
##$ZL2= 120
##$ZL3= 120
##$ZL4= 120
##$ABSF1= 10
##$ABSF2= 0
##$ABSG= 5
##$ABSL= 3
##$ALPHA= 0
##$AQORDER= 0
##$ASSFAC= 0
##$ASSFACI= 0
##$ASSFACX= 0
##$ASSWID= 0
##$AUNMP= <proc_1d>
##$AZFE= 0.1
##$AZFW= 0.1
##$BCFW= 1
##$BC_mod= 2
##$BYTORDP= 0
##$COROFFS= 0
##$CY= 19
##$DATMOD= 1
##$DC= 2
##$DFILT= <>
##$DTYPP= 0
##$F1P= 11.0000007629395
##$F2P= -0.999999237060547
##$FCOR= 0.5
##$FTSIZE= 0
##$FT_mod= 4
##$GAMMA= 1
##$GB= 1
##$INTBC= 1
##$INTSCL= 1
##$ISEN= 128
##$LB= 0.05
##$LEV0= 0
##$LPBIN= 0
##$MAXI= 10000
##$MC2= 0
##$MEAN= 0
##$ME_mod= 0
##$MI= 0
##$NCOEF= 0
##$NC_proc= 0
##$NLEV= 6
##$NOISF1= 0
##$NOISF2= 0
##$NSP= 1
##$NTH_PI= 0
##$NZP= 0
##$OFFSET= 16.51637
##$PC= 1
##$PHC0= -273.6572
##$PHC1= 1.101538
##$PH_mod= 0
##$PKNL= yes
##$PPARMOD= 0
##$PSCAL= 4
##$PSIGN= 0
##$REVERSE= no
##$SF= 200.13
##$SI= 16384
##$SIGF1= 0
##$SIGF2= 0
##$SINO= 400
##$SIOLD= 16384
##$SREGLST= <1H.CDCl3>
##$SSB= 0
##$STSI= 0
##$STSR= 0
##$SW_p= 4139.07284768211
##$SYMM= 0
##$S_DEV= 0
##$TDeff= 0
##$TDoff= 0
##$TI= <>
##$TILT= no
##$TM1= 0
##$TM2= 0
##$TOPLEV= 0
##$USERP1= <user>
##$USERP2= <user>
##$USERP3= <user>
##$USERP4= <user>
##$USERP5= <user>
##$WDW= 1
##$XDIM= 8192
##$YMAX_p= 0
##$YMIN_p= 0
$$ End of Bruker specific parameters
$$ ---------------------------------
##NTUPLES= NMR FID
##VAR_NAME=  TIME,          FID/REAL,        FID/IMAG
##SYMBOL=    X,             R,               I
##VAR_TYPE=  INDEPENDENT,   DEPENDENT,       DEPENDENT
##VAR_FORM=  AFFN,          ASDF,            ASDF
##VAR_DIM=   16384,         16384,           16384
##UNITS=     SECONDS,       ARBITRARY UNITS, ARBITRARY UNITS
##FACTOR=    0.0002416,     1,               1
##FIRST=     0,             0,               0
##LAST=      3.9581328,     0,               0
##MIN=       0,             -1017096,        0
##MAX=       3.9581328,     1272546,         0
$$ Real data points
##PAGE= N=1
##DATA TABLE= (X++(R..R)), XYDATA
$$ [...]
5380 -540 -60 391 -521 -95 524 15 -384 106 296 21 -80 341 -264 -304 387 125 -236 -4 178 -496
5400 -496 -114 384 -71 -388 230 179 -564 -175 426 -211 -279 155 -20 -359 5 427 -446 85 214 -366 -9
5421 -9 462 230 -171 91 364 -120 -203 328 -144 -254 127 71 -360 284 559 52 -98 320 -25 -208 96
5442 96 32 -392 -270 301 -107 -112 147 73 103 129 346 -254 -163 183 7 148 123 218 -48 94 205 -436 -121
5465 -121 242 35 -239 -47 -51 5 -196 -15 -30 -366 218 125 -103 151 205 -198 -123 85 -201 -379 57 49 -118
5488 -118 -103 115 -274 -73 -78 -75 14 32 81 -205 237 116 -15 -111 277 -55 -255 205 -102 -113 19 -23 -61 -24
5512 -24 114 401 -74 283 129 -106 109 32 -176 -43 259 285 -60 91 93 139 81 6 259 297 151 13 7 -149
5536 -149 -91 -164 45 -69 -307 115 125 84 -9 97 155 74 188 -22 -105 43 237 -306 190 38 -164 -53 -271
5559 -271 -70 -191 -156 -187 251 85 333 -8 -385 101 67 -67 106 232 -96 64 19 72 -357 -168 241 77
5581 77 -259 423 207 -168 127 111 -308 94 304 -204 -150 -85 257 -253 150 216 -208 -73 301 -92 -112 37
5603 37 181 -136 170 483 -216 -118 151 11 -317 82 -16 -310 -210 256 134 -56 -19 80 -223 281 125 -340
5625 -340 152 357 -210 -380 146 43 17 -7 164 -184 -184 361 104 -372 137 424 43 102 168 -239 34 299
5647 299 192 -582 104 322 -148 -3 264 52 -124 363 120 -302 -32 438 -399 -436 246 171 -337 209 146
5668 146 -524 -5 215 -251 -537 481 -38 -361 -151 474 -58 -61 140 -69 -286 0 177 -626 37 334
5688 334 -300 -249 175 -64 -429 156 328 -325 28 627 154 -281 302 84 -394 30 48 -262 -232 57 -93
5709 -93 -299 -156 51 -493 59 192 -124 -108 386 23 -303 175 -47 -318 -77 131 -173 -506 -48 10 -257
5730 -257 -173 126 -233 253 484 -119 -315 168 98 -356 -69 295 -295 -166 273 -59 -262 127 -90 -80 349
5751 349 145 -35 -3 143 -95 -95 62 -22 -199 -26 259 -99 -404 206 139 -294 152 89 -169 -18 173 51
5773 51 -210 42 -85 -136 -103 -49 -98 101 -5 -84 -2 275 73 -109 91 198 162 -271 270 -143 -39 162 -155
5796 -155 -61 -6 176 28 -98 67 -136 -140 79 85 134 90 24 88 7 52 -191 8 -1 -173 -171 -165 -102 3 14 -4 -16
5823 -16 108 -4 -77 151 448 187 68 -4 200 132 -248 -117 -64 -117 231 -35 -108 170 235 97 -133 129 140
5846 140 -94 173 160 -382 -173 -51 -176 -166 -77 90 -22 57 227 0 -172 234 91 -142 319 481 -214
5867 -214 -53 163 -365 -7 307 95 -276 98 204 -252 35 305 -166 -222 60 -206 -77 95 253 -198
5887 -198 -194 271 -186 -268 191 108 -305 26 285 -82 -93 287 308 -105 -11 186 -76 -24 234 -200 -401 141 260
5910 260 -21 44 160 -282 -231 483 102 -294 44 106 -366 77 393 -412 -148 464 18 -523 -4 342 -207
5931 -207 88 471 -409 -432 205 166 -499 -132 222 -56 -64 372 -178 -450 202 194 -349 105 191 -116 -113 281 -68
5954 -68 -395 237 115 -317 159 443 -180 -300 232 107 -475 29 191 -281 -140 329 220 -162 35 10 -197
5975 -197 8 293 54 -155 136 9 -192 13 170 -137 19 116 -92 -170 42 206 2 -61 450 -159 -101
5996 -101 356 -234 -144 203 76 -218 284 156 102 -149 353 154 -461 146 156 -180 177 82 -238 -205 190 114
6018 114 -304 10 -135 -346 8 336 103 103 423 226 -93 -101 133 -331 47 207 -257 -298 126 -156 -96 -153
6040 -153 130 -73 -133 32 53 32 -151 82 -207 -65 -28 -73 -266 90 -262 -150 -48 140 151 -137 166 166 151
6063 151 -41 86 -67 126 -47 -10 -7 3 -146 -276 -237 40 56 -93 418 -101 34 221 64 -64 96 144
6085 144 -120 143 -212 -138 -2 154 -133 -71 24 34 -182 28 128 -167 262 131 -46 -72 220 -136 -288 -95
6107 -95 1 63 -10 113 46 -268 294 -210 -16 259 262 -209 94 192 53 -68 -152 -79 -143 159 -73 -102 -145 204
6131 204 -195 -314 346 94 -129 26 132 -30 22 288 -28 -311 252 -21 -112 -33 310 -246 -130 115 -38
6152 -38 16 49 145 76 -144 6 -139 -119 316 13 -211 173 275 -358 202 267 -96 -317 322 230 -55 164 248
6175 248 24 -151 302 -298 -291 211 -6 -332 -66 219 -138 -226 256 -53 -380 431 357 -64 -4 361 71 -311
6197 -311 232 75 -351 25 178 41 -60 275 -264 -325 257 219 -338 -25 339 -129 -219 450 170 -77 120
6218 120 356 -363 -69 189 -64 -393 353 260 -39 -164 211 -12 -240 -10 25 -150 -14 248 -377 -185 310
6239 310 -85 -444 450 165 -201 209 219 -19 12 324 -73 -209 485 -84 -119 246 -41 -23 -113 209 -198 -106
6261 -106 54 140 -65 161 231 -130 45 225 193 -41 -168 95 2 156 -16 -148 -230 320 271 -198 -43 389
6283 389 -241 -35 381 35 -62 7 50 -87 -5 -89 -223 -87 135 135 -23 183 314 -73 -284 252 30 -243
6305 -243 250 90 -183 -138 -17 -137 -74 151 -190 36 121 138 -207 103 253 -4 -156 121 81 -142 95 -53
6327 -53 -68 124 -6 -279 73 -34 -85 -156 7 29 -117 -54 127 23 38 391 -17 -144 16 -47 -187 -23 4
6350 4 -37 -83 -73 6 -138 361 167 89 348 -205 56 179 29 141 -85 173 144 -285 -119 21 2 75 -49
6373 -49 6 -85 -153 58 -196 400 189 4 -165 3 -157 -191 -24 53 -38 -194 1 -91 -120 91 126 -10 -155
6396 -155 137 -49 92 193 -168 -210 165 16 -85 -15 203 -83 28 88 14 -116 84 -1 -247 13 -119 -60
6418 -60 -35 220 -2 -343 162 -131 -269 -115 332 -126 14 352 -113 -68 172 43 -327 125 177 -268 -246 57
6440 57 -37 -108 -117 100 -172 44 97 -272 12 287 303 -153 314 253 -179 -69 197 -133 -111 5 42 -27 126 448
6464 448 263 58 329 18 -142 54 279 -153 -50 -140 -117 -303 3 135 -307 8 337 -142 -221 271 -17
6485 -17 -100 353 126 -188 -7 633 -152 -141 -89 -146 -469 -141 430 -336 -101 255 26 -343 481 30 122 49
6507 49 459 -286 -436 215 -320 -392 -28 116 -206 61 146 -18 -12 219 336 -159 261 417 -161 -118 414 93
6529 93 -348 332 289 -140 168 40 -116 -172 240 -100 -146 74 393 -241 -64 468 -196 -305 49 -84 -190
6550 -190 -144 96 -146 -321 384 -246 -212 171 32 -25 0 20 -183 -65 139 74 -242 -131 232 -268 53 400
6572 400 82 -153 114 140 -150 249 0 12 2 338 -141 -114 -45 22 -235 27 296 -125 -135 361 -204 -95
6594 -95 204 253 -100 21 166 52 122 53 -40 -110 291 -148 -226 44 254 -289 -67 184 398 -178 -190 -46 -110
6617 -110 45 109 -100 79 53 -134 -216 -12 197 -105 93 275 -21 -195 116 87 71 88 36 -196 179 158 135
6640 135 -28 -97 -185 124 -116 -55 49 47 158 14 91 144 140 -191 -138 103 -115 -76 106 -239 232 161 4 9 -136
6665 -136 -51 -106 -147 84 22 -29 366 -171 -76 -91 170 2 57 3 44 76 150 -52 -10 68 203 -51 3 214 -235
6690 -235 -104 24 30 -24 -71 -89 -39 49 286 -333 -250 -8 79 -38 284 68 74 125 278 -66 -247 -5 5 -178
6714 -178 -183 92 -232 111 226 -188 -333 64 197 -185 -95 272 116 -157 46 203 -173 116 70 -133 -61 414
6736 414 -227 -121 164 -209 -55 -53 120 -209 -172 169 152 -198 85 113 -148 -29 -97 -146 -378 180 206 -268 110
6759 110 69 -305 193 186 89 -287 256 111 -162 -67 15 -135 -292 247 -81 -37 39 132 -142 169 376 -114 -280
6782 -280 237 147 -258 34 171 -441 -93 289 -150 -112 -50 196 40 366 61 -62 -233 274 61 -89 69
6803 69 144 10 -37 140 -259 -390 49 -110 -110 104 33 -56 41 264 140 -129 324 116 -355 25 47 -263 -72
6826 -72 -27 184 -396 372 30 -334 193 392 49 -36 211 188 -50 -23 92 -276 -92 35 -73 -42 120 -24
6848 -24 -185 198 67 -165 -12 83 102 -228 76 -40 -349 -34 -103 -302 -151 -12 1 -234 118 176 -246 50
6870 50 157 44 -36 153 -183 -86 131 209 -227 -133 26 205 -143 78 237 -60 -60 201 46 181 150 74 -231
6893 -231 -79 18 -26 -253 -195 -157 -312 312 98 -226 -77 85 -102 -67 78 -189 216 108 -22 -16 47 92 -48
6916 -48 114 19 -224 -3 61 -77 110 109 231 -254 20 275 53 115 282 -45 -221 161 -149 106 17 -28 345
6939 345 129 64 94 -220 -3 241 -48 -15 243 120 233 56 192 57 9 -162 -291 -34 -157 -21 -24 20
6961 20 52 -132 282 358 39 -35 235 -73 -205 -114 -173 -52 10 331 -111 -52 222 -13 41 108 80 -115 38 44
6985 44 101 221 -15 -218 -178 66 34 -38 148 382 -60 -193 208 -72 -87 56 284 -81 7 37 -17 -38 57 44
7009 44 -427 89 221 -328 26 -16 -106 -28 107 60 -88 49 284 -190 -207 19 29 -353 -128 49 -177 -38
7031 -38 242 -107 -12 -37 -54 -251 125 288 54 -7 57 -75 -233 98 -142 -212 -53 314 -46 110 373 -33
7053 -33 95 246 198 -300 63 299 -207 7 145 132 -558 109 50 -60 -29 103 -190 -477 209 89 -163 113
7075 113 247 40 -44 155 28 -157 180 -125 -79 -99 146 -325 -52 112 47 -137 -58 127 -255 -80 224 81
7097 81 -192 77 -100 -120 -83 5 -70 -12 304 37 -105 19 113 -102 -139 185 -56 -18 149 253 -120 -40 229
7120 229 -175 74 383 -195 56 87 -153 -99 92 6 67 -128 146 -38 90 89 -50 -101 -241 51 -201 94
7142 94 -23 -67 -94 38 -12 -171 124 5 -109 103 284 -192 -218 129 38 -113 -109 177 -193 -135 156 174 169 -54
7166 -54 321 -340 -23 -40 -12 -155 -211 -153 -56 221 99 -206 -201 244 68 121 70 42 -6 113 90 -110 -181 -106 -311
7191 -311 -307 -87 -77 -223 -72 -12 -143 203 -65 66 30 -6 4 -148 -70 -36 -22 -321 -116 37 -242 67 -117
7214 -117 -248 235 -64 181 75 153 -65 75 61 -213 112 -89 64 -143 153 18 -261 -31 232 72 -141
7235 -141 1 -123 154 -62 -50 13 345 116 4 -22 -51 76 34 -102 196 26 131 -31 49 -20 -235 198
7257 198 293 199 176 1 10 -46 149 -122 -387 178 -44 116 70 -103 -124 41 201 -177 36 -145 24 2 156
7280 156 -89 -144 -52 203 -252 9 221 -215 -143 22 111 -311 257 -21 -201 38 41 -49 -344 29 83 -167 -284
7303 -284 365 101 -290 74 -101 53 184 233 125 -98 70 -6 -58 42 39 -227 -17 299 55 -172 59 203
7325 203 -149 -146 195 -157 -2 85 196 4 80 110 -191 -142 255 -237 -236 170 -44 -152 56 168 -77 138 254
7348 254 -68 -136 138 2 9 96 301 -20 -15 251 64 -210 -38 27 -342 10 242 79 65 108 80 -122 -49 -75
7372 -75 -365 15 28 -117 -8 153 -135 -132 121 -31 178 61 -15 190 -117 105 -44 8 -116 152 -261 -329
7394 -329 115 -159 -211 56 235 -145 -102 157 61 142 58 -83 -145 146 156 -22 -68 513 -83 -259 -38 138 -69
7417 -69 8 21 21 -67 83 76 -188 199 -121 -172 -146 -40 216 12 193 -8 23 80 43 73 8 335 -22 77 189
7442 189 -163 22 70 18 -104 51 123 -254 -15 174 -21 -84 -101 23 -58 54 187 101 51 336 87 -42 30
7465 30 384 -224 23 -35 -89 -57 187 150 -197 154 -7 -145 124 -82 -38 152 240 -79 239 9 -222 263
7487 263 -327 -99 149 -264 -129 -10 -6 104 -159 70 425 -248 191 -199 62 81 -64 -180 -27 -151 -86
7508 -86 21 -357 25 -48 -189 43 129 311 25 -93 82 293 -136 29 -126 42 -316 -219 47 -91 106
7529 106 -280 -142 43 107 93 194 56 -129 -103 62 30 -187 190 116 41 -59 -87 -86 50 199 -206 -192 -66
7552 -66 11 24 -70 250 166 -91 27 -48 -92 40 78 -60 -207 22 231 -106 165 164 -118 25 51 -85 -193 219
7576 219 -5 -29 94 -136 -297 -18 363 -107 -123 195 230 86 191 280 -62 201 247 134 -86 42 58 -213
7598 -213 -227 135 6 85 279 -22 72 31 217 -199 -67 355 36 120 14 -114 -221 246 23 -1 40 224
7620 224 -143 -103 144 13 -68 24 243 13 -56 122 36 -242 91 -56 -298 -2 26 -209 187 209 90 -41
7642 -41 213 88 14 -105 110 -131 -91 -266 15 -112 -91 -133 -96 41 -47 121 2 459 255 12 166 128 -5
7665 -5 -186 44 173 -263 63 213 -97 -256 93 57 25 157 329 -204 80 426 -232 -92 114 -83 -181 67
7687 67 146 -89 151 73 -129 -7 123 87 -129 209 103 -25 -62 288 -241 -194 135 -16 -272 -105 70 -54
7709 -54 6 184 -5 -146 87 -2 -69 -120 -26 -62 -162 285 -96 16 -147 134 -141 3 27 -202 120 -47 -2
7732 -2 93 -27 176 -88 26 86 -140 -203 284 135 -225 207 -16 122 -63 -229 -170 19 108 236 72 35 216
7755 216 -77 149 45 -94 252 -131 -36 16 -136 45 -127 -63 15 62 46 54 117 44 -104 -147 -87 -112 49 -53
7779 -53 24 246 -9 85 220 114 -52 -1 13 -104 -81 177 -125 58 306 133 -45 -6 223 -57 -357 56
7801 56 -80 -137 110 -93 -169 -109 159 91 -1 189 -22 20 -89 144 56 147 24 40 -95 48 -2 -90 -84 -9 -73
7826 -73 -194 113 -25 -155 -62 164 -192 -110 122 -174 -316 -55 -14 -203 237 93 -177 -169 169 85 -111 63
7848 63 182 -202 172 62 -64 -124 86 -197 -188 48 15 192 -185 78 68 -119 137 -81 12 -178 117 -34
7870 -34 2 146 -252 -178 -45 160 -106 -90 450 41 50 243 0 -77 -11 20 -98 112 50 -192 -81 68 7 -144
7894 -144 4 44 -62 -130 -102 -302 -92 84 115 -21 150 3 -14 -72 104 -33 -114 85 39 -377 105 204 83
7917 83 3 277 204 -187 -45 119 -274 -109 177 -197 -72 12 33 -173 -58 -111 35 -41 -11 194 -402 4 79
7940 79 -6 -134 221 -31 -236 152 -104 -198 64 -40 8 234 218 12 -43 -81 -80 103 -28 142 -182 -59 81
7963 81 -196 -3 153 -5 27 208 216 11 24 189 -143 -52 152 15 -235 -58 -122 -7 12 104 246 -165 -58
7986 -58 107 102 -40 142 58 334 91 349 -125 -137 2 31 81 16 -70 -214 54 37 -73 -77 270 79 -225 80
8010 80 27 -56 38 70 -119 78 -17 -179 -250 -35 -262 174 184 75 -15 92 -10 -246 -24 390 -1 -73 91
8033 91 25 -148 -25 -161 -192 54 236 38 -35 -111 97 88 -9 -22 185 -111 119 126 -126 -226 80 -34 -18 88
8057 88 -5 -40 46 -57 -37 -40 -60 -148 7 -68 -28 36 -123 -159 270 -70 65 -131 -5 255 -47 -9 -115 198 13
8082 13 29 -79 116 -23 -4 30 -100 111 139 -93 28 10 -404 153 44 15 -87 60 -205 -39 -86 139 -68
8105 -68 -178 246 92 174 -279 72 -145 96 -31 -133 -44 100 202 -175 -41 99 -50 -224 -23 207 -15
8126 -15 -58 -319 -349 -77 -15 -123 -97 -119 86 -277 154 70 -61 210 133 24 140 403 -30 -261 64 -82 -56
8149 -56 -236 119 -48 -21 226 -244 34 -116 269 -133 23 221 86 -291 286 -298 -246 1 244 51 -156
8170 -156 266 -72 -187 -158 -1 73 -72 125 -177 -50 252 58 -136 -162 11 -261 -266 53 74 159 29 -44 -2
8193 -2 -101 208 -211 -269 299 28 -115 46 60 -176 -171 170 29 -370 -89 -57 -98 154 52 45 -196 -71 -5 -235
8217 -235 -158 228 -138 14 34 -153 -118 191 -234 -6 73 37 -87 148 488 -350 -136 2 108 -185 186 152
8239 152 -221 -93 24 -77 -19 -1 186 -138 1 110 13 -150 106 -93 -159 5 -80 9 -166 -103 -91 -120 95
8262 95 127 4 176 288 -171 0 18 -27 -152 157 -207 -150 161 -40 -114 -165 76 77 77 -13 115 -36 -37 121 172
8287 172 139 -123 -70 -147 317 10 -14 -199 60 -132 -371 174 -72 77 -107 68 -44 172 80 92 66 10 -192
8310 -192 -75 56 -218 -218 34 333 14 99 -52 -54 -209 209 9 126 -104 136 -78 -38 -85 -86 -189 -13 292
8333 292 -127 9 76 157 104 129 117 49 -21 -113 100 -59 -11 -175 36 265 -100 -30 -265 134 -159 36 151
8356 151 -94 -9 59 111 -139 53 -80 76 142 185 44 -18 -148 79 -272 25 -4 182 -244 34 155 -47
8378 -47 25 89 -197 -37 137 -222 -279 -114 -142 -24 126 20 -203 136 132 26 32 78 -58 -137 106 250 -77 -232
8402 -232 248 98 -174 -45 -42 -42 -31 135 44 102 135 -93 -461 -67 29 -165 153 18 -74 -135 323 -36 26 266
8426 266 222 -15 -83 413 -126 -159 315 137 183 10 -173 170 -79 12 -236 -91 149 -155 -201 -28 309 -18
8448 -18 104 200 -177 -206 103 140 -75 62 -71 -80 -79 -93 -3 25 160 72 65 105 66 -150 25 139 253 -216 -6
8473 -6 113 -191 -139 221 130 -39 78 256 -169 -118 -41 -56 -161 301 -4 23 59 321 127 11 51 -191 -151 -90
8497 -90 89 -352 -58 124 -143 -27 143 -177 -24 -105 116 -44 99 109 -57 23 63 -179 -100 3 -81 -193
8519 -193 -228 154 -74 -387 85 -34 -175 64 194 -40 13 75 -162 -255 40 -285 -90 155 221 -134 -175 266
8541 266 120 -227 185 156 24 -176 174 -163 -163 255 -22 -223 54 -46 -109 -124 -62 -44 -156 87 143 6 -108
8564 -108 168 216 -20 43 94 -174 54 0 149 76 162 70 -73 395 6 189 3 52 -207 153 222 117 119 75
8588 75 32 -64 83 127 -85 -20 -17 -217 1 189 231 24 63 -35 -117 93 80 -134 96 322 -166 -436 -50 218
8612 218 -245 -123 245 -139 -101 147 -68 -64 54 103 -43 -92 -42 -43 49 -21 -217 -148 83 -15 56 -9 212 -187 -149
8637 -149 64 5 -202 96 58 -87 -13 11 -60 46 55 -18 -42 -71 68 -63 0 224 22 -143 11 174 -75 -104
8661 -104 -53 -128 -82 124 -332 -101 44 49 38 102 193 139 -52 216 2 -149 137 -35 -248 -145 -224 -168 -99 248
8685 248 -114 -103 157 -40 240 18 162 -87 -49 194 96 -235 30 99 -220 -172 304 -12 -92 62 -73 -155
8707 -155 -107 135 -209 -140 239 37 -88 69 -43 46 229 2 -52 6 289 275 -254 23 96 -49 -394 225
8729 225 62 -105 149 285 -229 46 140 99 78 140 115 63 -41 95 -12 -73 -34 79 8 78 13 -204 -107 459
8753 459 -314 59 -53 59 54 96 357 -324 137 292 -123 -50 312 -60 -123 -99 78 -57 -75 150 49 -86
8775 -86 143 252 -155 167 414 -127 196 524 -198 54 -23 -56 -164 114 360 -39 -141 137 -126 -108 164
8796 164 66 74 129 164 -127 27 228 -46 71 -32 193 -261 -4 -142 32 8 143 -149 -299 139 66 60 -273
8819 -273 154 78 86 -60 115 -143 -68 169 -84 -35 102 -11 -313 89 337 -144 -2 95 20 52 180 -3 -193
8842 -193 -85 233 -107 -17 234 26 -116 280 64 -47 206 135 30 -91 12 159 -72 160 -169 -155 -90
8863 -90 430 39 -5 80 -39 84 101 -165 -36 -22 251 59 -214 213 -3 101 -103 14 -207 -193 168 -136
8885 -136 -121 137 131 22 81 25 -83 -111 105 -177 -66 12 32 61 -43 -18 -129 -111 -91 40 81 -48 -335 -59
8909 -59 149 -97 -1 -89 -224 -168 -168 288 229 -170 18 150 -41 188 -155 -124 -51 40 -18 -6 222 134 -183 -94 6
8934 6 -101 -88 -159 13 -338 -113 58 -19 9 71 101 92 71 280 -219 -107 -23 20 -190 88 -110 -328 49 26 -65
8959 -65 -137 482 97 -65 -48 83 37 -141 -17 -250 118 -135 68 -119 -85 161 -244 98 185 -66 29 158
8981 158 -2 -265 169 66 4 -123 275 -317 -99 261 131 -286 39 23 -30 269 220 -39 113 3 119
9002 119 -114 -127 220 -270 -141 151 -109 79 30 178 88 45 114 -40 -40 117 -45 -285 31 170 -125 -84 226
9025 226 -16 -55 108 97 -316 -154 154 -141 -119 475 104 -179 107 -38 -68 -92 386 -76 79 63 -169 11
9047 11 1 186 -154 -74 -29 -181 -108 206 -23 -90 -203 54 105 -208 -31 -26 76 190 206 -26 -332 -35 -76 -160
9071 -160 -104 -9 -87 -56 261 -15 96 -74 117 -62 60 -101 15 98 50 -242 7 301 77 224 200 38
9093 38 -35 316 41 25 -179 77 -153 -58 110 9 -55 -70 38 -182 109 32 92 -171 122 58 -221 181 45
9116 45 -114 -127 36 -15 -217 -37 44 -100 158 184 1 78 -64 106 119 80 175 -96 -194 37 -35 -170 -301 153
9140 153 -223 -51 -138 -72 -29 -56 63 -92 22 48 -104 92 -100 -290 -57 -58 -184 -54 90 -126 -112 -26 33
9163 33 -95 -163 20 25 -134 -9 260 -138 -82 -57 -259 11 -73 -145 -147 128 70 -201 -32 326 -5 -45 -14 43 25
9188 25 -118 -51 -255 -132 276 68 104 -21 -63 -134 73 214 -118 -105 167 2 -179 3 -10 -194 -35 130
9210 130 -204 -72 174 -209 -373 104 -81 113 -65 64 22 -226 170 36 -140 9 87 -241 9 -10 -132
9231 -132 -77 -72 106 -16 -5 301 -249 -213 114 -454 -116 70 -139 -236 120 -51 -218 -194 42 0 -129 157 -30
9254 -30 57 112 -213 51 -9 87 -1 -249 178 177 -237 29 177 -198 -142 276 51 -96 46 173 -178 31 328
9277 328 -31 85 345 284 -113 30 25 -74 166 368 -45 -58 208 8 -167 138 112 63 -161 150 -19 -233
9299 -233 -132 18 -271 -132 211 -263 -74 -75 -83 -278 -76 45 -135 -51 173 91 -263 -31 -30 -64 -62 113 -136 -57
9323 -57 174 91 40 113 120 -287 56 170 -16 15 474 243 -185 78 74 -202 49 -4 -286 -384 104 48 -214 -97
9347 -97 259 -192 64 132 77 -76 -81 187 -266 -208 92 -124 -37 124 -139 -177 -202 172 -24 32 -42 -201 -36 160
9371 160 108 -219 151 14 -220 -215 162 191 -187 257 94 98 38 110 162 -158 -9 57 -119 -84 131 -92 -51 197
9395 197 -369 -341 46 -158 -344 108 -268 50 48 103 -110 -114 142 126 -138 -326 68 -239 -19 67 43 -107 287
9418 287 119 5 -68 112 148 34 64 -182 81 53 -66 151 90 76 -205 84 -32 -173 -58 -254 145 -177
9440 -177 132 62 -99 -44 -89 27 -200 -19 -25 -135 15 24 -129 -28 58 -24 -111 0 66 -95 -19 155 -106 120
9464 120 157 -29 -140 -74 73 -46 -134 54 -158 -56 92 -258 -96 46 92 75 145 120 31 -61 48 -79 -164
9487 -164 109 -150 -2 -65 -23 -94 10 168 54 -163 11 -90 166 -40 93 -107 -116 -32 146 -115 115 -59
9509 -59 -51 -25 161 55 -110 -55 -115 -251 -259 54 -55 -70 103 -171 6 -118 -84 73 -154 174 76 -201 86 18
9533 18 5 157 -51 -78 42 179 -97 -54 73 190 -200 -77 49 4 -140 284 27 98 254 69 111 61 104
9556 104 28 -165 106 7 -124 159 258 -38 -112 278 11 -93 48 70 -175 -33 85 -322 -57 -129 55 59 -35
9579 -35 10 13 7 263 184 -192 255 207 4 -67 182 -82 -67 117 -90 -310 115 269 65 -62 113 -139 -53 50
9603 50 -66 120 207 115 -26 -175 40 -310 -308 291 39 -183 -67 258 -128 31 196 -58 -98 140 312 148
9625 148 74 -87 -223 -59 206 203 -191 92 91 135 -74 -17 -95 -123 119 -183 182 24 93 -47 -37 145 6 -137
9649 -137 248 -29 -333 27 436 -348 -364 118 -180 -149 270 94 -18 -284 76 -83 134 155 163 -22 112 59
9671 59 -61 -104 160 -149 -60 225 -159 -63 37 -62 -179 -3 -26 -66 -12 -233 72 -165 -295 81 -30 243 478
9694 478 64 36 214 7 -108 80 -5 -54 -141 100 26 -13 -151 141 -215 -95 -80 169 52 137 142 -191 78
9717 78 108 148 -95 97 80 244 -55 102 -26 -32 -11 -124 41 -50 116 -4 43 256 -35 253 -163 -53 -35
9740 -35 -53 -35 -106 146 96 -323 208 -12 117 -54 -119 -268 -140 226 142 -189 217 -159 -73 -102 43 57 106 137
9764 137 -205 44 -7 -44 -85 90 276 112 -247 257 306 -150 -96 27 103 12 -35 -116 -178 247 -237 58 -183
9787 -183 116 -5 -318 42 -153 -91 139 -160 -178 -138 109 -198 -89 -133 254 -110 -194 73 -205 -243 164 35
9809 35 40 43 288 -32 25 135 -21 -82 -192 85 155 -21 184 48 -36 9 -47 -182 106 64 -202 149 53 -148
9833 -148 -75 -118 -81 -116 -208 -70 -171 -73 211 48 -262 -5 -1 -63 -221 103 -368 -36 -88 40 -201 101 -275
9856 -275 -36 1 -38 -73 -236 206 77 -83 144 68 7 -15 -47 57 -91 109 -204 -140 -56 154 -236 159 28
9879 28 -340 -149 55 90 -91 61 -9 -154 -17 -43 232 -162 188 -58 -73 -16 175 -17 -12 114 -35 140 54
9902 54 186 -294 -187 -114 82 -360 -201 61 -51 169 -106 -171 -17 176 -45 -82 -41 -130 -24 -265 -10 -190
9924 -190 -80 45 -131 -82 74 -30 -115 -154 135 -163 -179 40 131 133 128 89 -102 -57 -63 -43 12 103 223 -76 37
9949 37 126 3 120 87 67 -219 177 143 85 21 63 -47 93 -37 -62 -106 -53 156 162 -44 -83 -145 -11 148 166
9974 166 -92 -222 81 32 -55 -135 -163 -286 -76 -139 -430 -29 13 -91 14 36 -187 -196 71 -121 -110 -202 -7 65
9998 65 -12 -42 -75 -22 -196 167 -46 32 57 61 -43 -157 -71 9 -102 -64 -95 -14 4 -47 1 72 -23 -398 59 89 -44
10025 -44 28 114 -44 106 182 63 66 -215 -190 -134 221 310 -26 -200 -98 168 96 89 93 -204 -12 -32 29 -187 49
10050 49 -69 -123 221 52 -57 50 159 -114 132 213 -114 151 140 0 -81 36 191 -138 -67 57 -320 264
10072 264 -68 -89 98 -26 253 -48 -167 121 137 174 24 -64 -244 25 139 -259 -377 -108 8 -117 21
10093 21 -75 -461 -108 196 96 84 17 437 168 75 65 -29 -68 -33 9 -199 49 -71 156 173 -33 30 -110 -157
10117 -157 38 -45 -90 124 -52 20 132 -67 -295 -237 -43 -59 -234 27 68 2 221 251 -90 -56 -72 -35 19 92
10141 92 -13 39 48 110 -1 -306 208 -19 162 -101 9 -1 57 102 -60 6 37 61 -129 -92 57 -40 169 306
10165 306 -255 -164 202 -178 -179 34 140 -24 28 82 201 92 234 70 162 290 18 39 45 -104 -178 -53 266
10188 266 -130 -158 296 -53 85 74 -48 168 90 295 215 18 -40 60 152 -115 99 -11 76 -12 277 -128
10210 -128 -86 22 -134 -50 153 -16 -78 241 -61 -231 2 85 12 -116 97 156 -146 -20 283 -152 -121 103
10232 103 -126 -143 -56 1 -43 1 90 -117 87 139 -88 73 69 276 84 51 72 -80 -88 218 -180 -58 18 -157
10256 -157 -66 -8 9 -215 -15 -221 222 10 246 294 -59 168 -12 80 -234 242 -12 -102 -5 -48 -292 75
10278 75 -15 58 238 -48 19 -172 -18 -261 19 -19 -243 -133 -82 51 -87 34 57 74 -110 -104 34 -120 34
10301 34 -63 131 238 240 214 29 78 98 -58 -55 -182 259 -225 -7 -265 2 167 -41 -134 -407 285 204 -279
10324 -279 -36 76 -3 -135 5 -156 -134 -104 -46 -134 -58 21 -45 -54 303 -145 -96 124 -43 -370 -211 250 29
10347 29 242 20 -171 -48 60 63 -26 91 318 -88 48 64 238 -52 23 -87 173 -141 31 264 24 274
10369 274 23 -78 -84 -82 75 -245 146 41 -127 88 -36 311 -85 323 -215 -236 205 -71 24 -99 79 -91
10391 -91 117 250 158 -35 140 111 -138 75 30 -180 -304 23 -67 -210 52 263 -132 -122 139 -222 16 35
10413 35 247 -63 80 -126 -15 84 144 -93 -303 84 69 -18 36 128 -114 -3 -67 44 148 189 212 -99 94
10436 94 108 82 -420 133 130 56 33 16 -24 243 109 -187 -63 -41 -54 -161 79 37 -134 -134 21 148 -139 -91 12
10461 12 -338 -124 200 -102 116 53 -120 -216 -19 -3 117 -121 98 -94 -393 67 10 -288 -25 165 10
10482 10 -139 56 -27 37 -54 -44 -243 -218 155 -250 -8 -24 -21 -282 65 112 -103 143 279 -160 -229 91 74 -324
10506 -324 -151 -196 -25 -113 177 -58 -315 -7 -9 -61 -57 -2 15 92 -173 -125 223 125 68 205 -31 -101 -19 -333 -40
10531 -40 -99 15 -59 -89 110 -204 248 43 97 -56 171 75 -143 -13 -268 -149 -15 -106 130 -108 93 -71
10553 -71 -337 -86 -203 -76 -243 16 -331 69 65 161 6 -10 -106 155 30 -10 23 25 24 -41 19 175 -127 89
10577 89 120 164 68 -32 -211 1 244 125 131 94 50 46 25 -102 57 -281 -77 84 -288 -187 101 -35 35 -390
10601 -390 -173 -309 47 214 -71 -134 -129 -60 106 -66 76 -13 2 -72 -114 -89 86 -8 21 -60 -9 -11 95 -54 -370
10626 -370 53 137 147 -135 -110 3 69 18 95 83 -186 226 36 -274 -182 76 61 37 -42 171 -6 -87 5 -135
10650 -135 163 8 -371 -162 167 -232 64 -86 -27 127 -228 62 95 -62 -25 39 -238 -40 64 321 23
10671 23 294 -51 21 234 39 101 -35 85 -22 -25 -154 -18 -25 165 -7 20 202 131 24 38 127 -166 -147 -155
10695 -155 -15 -134 22 390 -131 -63 -305 117 130 81 110 36 -46 234 6 -36 79 -151 47 -32 -15 -225 -184
10718 -184 4 146 195 -213 -252 99 113 238 191 -186 65 127 -9 21 -76 -281 -76 -152 -31 17 -211 -256 -78
10741 -78 108 182 -3 19 -122 -26 -74 229 -55 25 156 139 -184 -89 416 -93 -102 -5 116 233 283 229 259 -141
10765 -141 -84 70 -269 11 -24 108 156 -19 -8 -172 8 20 -62 -235 107 -99 75 132 197 29 -137 203
10787 203 -50 52 70 50 -64 -38 99 -94 126 4 -93 274 373 -14 -45 223 -217 -67 -8 -175 -44 -140
10809 -140 -106 -112 -67 -127 99 -263 2 206 160 153 -162 -155 -39 262 75 -9 -129 -91 -284 62 33 216 -93 -116
10833 -116 -144 -41 -157 109 -23 -178 -102 135 145 -107 -41 -191 -374 44 -106 -222 -103 -259 -172 -186 37 29
10855 29 -58 89 207 -6 304 7 -199 -245 -150 -67 93 161 -104 168 112 60 -270 -25 9 68 -144 -59 -27 -4
10879 -4 210 231 -102 -46 -41 -91 -34 -199 50 -37 5 -70 -358 77 -211 65 -46 -23 97 -101 -30 27 51 -93 18
10904 18 -11 42 55 218 11 192 71 -136 -224 121 102 -13 -44 -107 -2 -73 40 1 -72 43 14 -75 104 162
10928 162 108 136 282 -30 -108 91 141 -75 -1 -280 -163 -249 255 75 -137 178 5 -57 -42 342 84 -155
10950 -155 -10 -88 -9 20 -18 -157 -55 -60 0 -77 193 151 19 63 272 62 -55 86 -123 61 193 52 -51
10973 -51 36 209 -30 -181 192 45 -79 33 39 17 -107 120 -332 -12 124 51 -123 134 90 -65 155 142
10995 142 -94 -107 -83 83 50 -74 -30 -125 -32 -86 26 -230 -55 -32 103 7 58 -56 -18 111 -78 -90 133 126
11019 126 147 136 -10 -10 -11 74 123 -114 -115 28 225 -98 135 -22 -32 181 -34 83 221 -141 -165 -161 285 139
11043 139 63 -123 48 -27 72 313 105 -64 -97 3 116 110 105 -23 -60 132 -86 -114 40 45 124 -29 162 236
11067 236 239 55 -67 -127 -96 154 -3 -55 -14 -31 11 178 -69 -184 -61 -21 -200 -2 219 20 -172 115 115
11090 115 -94 44 -111 94 -83 134 -43 139 -349 35 108 -55 115 -201 -114 77 38 -8 21 25 -14 42 105
11113 105 -48 47 -68 92 98 -93 142 -119 35 18 -24 -64 5 137 -137 -17 146 23 -140 -92 -74 -145 -30
11136 -30 -177 -241 -207 -63 8 31 -13 -72 96 129 51 -128 -127 43 -95 -42 221 -102 5 -70 14 -112 24 -47 100
11161 100 99 -60 -50 10 97 -183 -270 128 73 -60 -90 -107 -46 -2 25 15 72 -14 -49 -37 -115 -71 -167 -252 -56 -133 90
11188 90 151 -220 -118 199 135 -157 76 -146 -105 203 29 234 -132 -106 110 259 214 -167 42 14 61 -38 -98
11211 -98 94 49 244 -195 113 -178 154 2 -117 40 82 -78 179 -78 -137 3 -38 -39 68 99 -201 -6
11233 -6 158 32 -228 62 181 74 -7 15 247 13 323 -16 39 69 -38 -165 35 -99 -127 128 158 -177
11255 -177 -18 -138 90 -167 -233 192 134 63 -187 -84 161 18 -84 122 248 9 100 131 3 -268 -7
11276 -7 -78 -24 -178 233 8 -140 115 10 42 -70 -28 55 -195 -173 89 41 211 -106 -100 -89 427 -18 -25 -51 83
11301 83 32 -173 7 151 -59 -200 24 96 -77 269 -92 -272 40 -27 -24 29 81 185 -33 -157 -47 -143 75
11324 75 109 -20 171 -105 -32 22 28 -31 -196 68 -118 209 73 166 68 -142 77 54 -38 263 152 -254 147
11347 147 27 156 223 66 -129 -85 256 -62 -174 -107 66 -42 69 7 70 155 229 -166 -75 75 -42 -161
11369 -161 -106 76 37 -194 -78 45 63 -121 -195 90 -19 58 2 -133 -66 17 -38 -123 -44 40 -1 70 -149 -114 -9
11394 -9 -83 -1 106 58 -56 -261 53 15 -39 22 -34 262 -313 -49 -26 200 -134 189 -160 -187 -70 -17 137 5
11418 5 82 -193 -154 -74 10 -39 303 8 -131 96 -219 195 37 -54 -42 148 234 19 6 19 209 -35 -3 -43
11442 -43 -94 -227 70 0 21 120 -39 -6 130 55 27 -190 -129 -3 -70 41 -128 35 -178 14 -221 -174 26
11465 26 19 36 68 55 -107 -50 107 4 204 238 -57 -184 -7 -33 45 -212 183 -19 116 39 212 -73 -97 25
11489 25 0 -49 134 91 1 101 -102 -102 -291 26 -195 -103 -28 -41 -93 -234 -139 -116 -93 210 -167 61 -11 -39 77
11514 77 -32 -163 -71 -7 -56 -86 -141 50 32 -89 214 -362 -48 64 336 -33 -115 0 -3 -75 83 -14 231 208
11538 208 122 239 -52 -278 -121 -124 -143 92 83 -86 137 -48 -201 309 -19 -289 -191 -35 61 -54 -76 53 -78
11561 -78 -39 71 8 43 173 138 -23 -96 -82 -339 -107 -45 -57 56 -38 13 -25 128 126 12 -107 107 77 -292 103
11586 103 -100 98 16 161 -91 -222 121 -116 -110 49 121 4 273 -4 35 -63 128 -133 -15 146 -43 -113
11608 -113 -53 -191 190 -36 -138 -45 14 52 -116 -42 23 -88 118 -48 -6 119 -120 94 -10 -195 38 -22
11630 -22 76 -137 6 42 -106 1 70 46 136 156 -25 124 -35 -131 91 -97 -198 -55 -222 -19 -48 -194 -23
11653 -23 -155 79 -130 -121 -97 -227 69 -48 -112 103 198 81 82 -43 -27 58 94 -98 -26 -112 -376 38 -337 123
11677 123 190 75 -75 -8 -9 -46 88 22 -63 144 -219 -67 -47 148 14 -259 -78 170 -69 -43 -152 6 -77
11700 -77 23 -55 -149 -182 34 -34 210 -69 -110 -66 -39 66 183 320 67 -11 12 25 -229 26 -80 49 -204
11723 -204 -88 -93 -48 14 96 -81 34 84 -184 -85 -44 -26 -153 -26 -36 -123 -37 -70 -159 25 1 -88 -172 38 136 -33
11749 -33 82 84 -122 -96 98 -122 27 3 -13 -9 132 151 48 -58 130 183 -38 -24 -140 -1 232 470 101
11772 101 -75 -28 83 -11 -177 90 -29 42 55 -187 35 78 207 -273 116 95 8 -78 201 -25 -193 176
11794 176 -54 -146 -229 112 -67 54 -94 -4 41 150 -25 0 21 -4 143 174 15 24 -70 46 -48 -112 -184 -68
11818 -68 -22 175 78 -31 -107 -112 48 -159 -18 48 172 160 -48 112 -163 19 267 227 147 11 323 -97 -40
11841 -40 -25 45 -90 -46 59 128 54 8 -47 -259 76 -152 -345 -24 -145 -266 107 93 125 15 151 342 21
11864 21 -90 52 169 -265 174 63 60 -94 -35 -189 -70 314 192 -148 10 92 46 105 -7 -52 144 296
11886 296 -4 103 -35 -94 -89 224 -147 -8 62 73 19 160 -1 137 114 94 -72 111 137 347 -215 -90 -66
11909 -66 8 -365 -2 86 -128 31 -141 -3 36 3 -4 97 217 -8 155 203 -235 35 132 -140 -31 84 -42
11932 -42 -182 106 102 150 130 69 55 -44 -92 -57 147 -79 57 33 -127 -2 -76 -9 90 -92 328 -1 -65 -129 -24
11957 -24 16 224 84 -1 -160 1 -20 296 136 242 -45 249 -36 91 -118 114 251 -45 124 137 114 -9
11979 -9 76 -195 124 55 -38 325 249 251 -18 -65 97 -131 -81 72 9 -220 -140 -37 222 -160 83 248 -116 67
12003 67 -175 36 124 -23 -17 -3 -32 -207 -87 -37 -15 -269 129 152 93 -78 308 43 72 165 139 -93 -137 58
12027 58 187 69 -107 -11 28 291 79 -114 41 65 -78 116 -11 -214 -14 -109 -93 -60 128 -26 66 81 122
12050 122 12 -227 143 -40 -71 -163 121 -43 85 -103 140 -52 64 104 -228 59 60 90 37 -13 -69 5 24
12073 24 17 204 44 -228 -178 69 78 61 -48 -190 16 77 73 -67 -26 76 -81 -106 -132 -243 -45 -165 -103 102
12097 102 301 42 -4 -51 56 -22 -94 106 -187 -7 24 -235 -15 -139 17 126 -114 71 128 47 46 81 296
12120 296 158 -94 14 68 24 -79 113 72 -158 62 113 73 268 -91 179 202 -50 34 -9 -198 -44 -30 101
12143 101 269 -54 266 -105 17 -202 -18 26 -15 -266 149 76 -28 86 22 200 -22 -51 107 -31 26 119
12165 119 -97 25 -259 56 -90 -234 155 -201 95 -71 257 -85 -175 247 206 98 232 149 41 -58 -107
12186 -107 -142 32 -67 -8 -200 43 -27 -30 54 167 -292 -39 -50 -218 334 174 69 84 83 13 152 -82 -1 75
12210 75 -34 139 153 -1 -127 -41 30 240 135 -117 313 167 -15 128 30 -151 -78 -100 281 152 -156 64
12232 64 -4 -164 37 -51 1 -257 -93 -125 -22 -83 -37 -293 221 -125 63 14 56 213 -1 23 -154 -47 180
12255 180 -108 -88 78 74 150 21 -86 -57 43 -65 -130 22 -144 28 -50 7 6 16 -52 -109 -92 -143 -99 25 105
12280 105 -156 -187 91 -290 -109 374 -8 -268 -82 -78 40 120 141 78 -28 -200 -89 73 -50 -121 248 181
12302 181 222 -18 -60 -111 -98 -249 -2 301 -39 -197 -178 16 -70 -15 -153 202 -56 135 0 -219 -13 -43
12324 -43 307 -60 -8 -64 9 -83 -5 131 -81 -83 34 -99 -438 49 -13 59 142 81 3 17 128 -31 101 51 60
12349 60 -138 -91 -22 116 -28 25 -119 6 35 -92 74 87 -94 61 84 -11 -51 -98 -4 -4 59 -166 -72 253 27
12374 27 -6 200 -220 148 4 -155 -32 165 -139 -236 -37 243 176 62 167 -68 -116 55 118 -175 106 150
12396 150 11 57 59 84 -90 -62 202 45 178 -174 -19 -158 -119 111 70 -8 -81 122 50 14 -111 -78 61 71
12420 71 251 93 172 27 -37 -74 -130 -57 30 -41 -154 -77 238 9 103 -248 -468 366 0 195 -17 -172 44
12443 44 60 -89 51 10 274 37 42 -150 -74 74 -175 -103 21 35 -55 74 68 -200 44 170 -120 151 175 83
12467 83 188 109 128 162 -127 -17 -190 -23 -64 -11 186 56 -31 89 27 -21 0 -137 -132 -77 184 -96 -39 17 -25
12492 -25 -98 131 51 214 -58 -42 42 88 112 -14 -90 -39 80 -50 9 96 154 210 -57 -24 -33 80 -138 94 14
12517 14 149 -34 -103 -152 199 -112 41 79 193 -52 93 71 -1 6 -255 196 -92 -120 -134 152 137 -225 12
12540 12 174 -43 -34 208 -151 206 -19 -294 11 3 296 1 131 -39 478 -162 -208 -109 -88 -148 7 56 -28
12563 -28 -173 -55 11 -106 -57 27 153 -42 37 -156 -171 -51 -120 8 -46 79 -107 -160 45 80 152 241 -43 -41
12587 -41 -39 -116 -131 -68 120 5 300 278 -10 37 -84 217 -205 270 135 -105 10 138 134 193 -114 283 -226
12610 -226 -54 -232 108 28 116 274 -76 -222 4 -141 -187 23 -94 -52 75 -192 -19 120 -72 -18 10 115
12632 115 -244 77 -65 -39 -157 -162 -81 -76 -27 -179 -248 121 -142 7 80 26 56 -43 253 -104 183 0 163 -98
12656 -98 -7 57 148 54 -162 -12 30 -149 25 -64 97 -233 15 17 -27 -207 -265 17 47 -16 -53 -50 -49 158 94 -123
12682 -123 52 -71 143 -96 -134 -82 -85 85 39 -54 19 19 105 109 -12 -93 -27 -35 176 -200 -92 141 109 31 57 124
12708 124 216 0 -20 -16 196 -1 -18 -76 205 24 -176 233 -285 130 22 -85 108 81 25 -114 -45 50 86
12731 86 334 19 -55 -148 -18 17 -58 -97 110 20 -172 167 -27 -184 65 3 140 91 -2 161 59 18 -184
12754 -184 46 48 -35 66 14 -34 118 -15 -110 -23 103 103 18 -48 186 -48 135 -5 33 18 118 70 119 54 -135
12779 -135 169 -167 -69 18 -7 210 16 114 -135 109 28 -123 -3 -86 24 -28 20 33 -17 -54 -178 -107 -1 -21
12803 -21 -159 -105 95 -320 56 0 25 -19 265 -52 -227 -21 -99 71 80 84 70 112 17 76 -179 -124 -173 10 -71
12828 -71 -192 -14 -6 190 -175 -84 -145 -54 93 -93 -49 -31 -136 62 -35 76 7 153 157 -11 42 -101 -148 4
12852 4 -70 94 43 -87 -219 -59 -169 207 6 -140 250 -101 -6 25 -122 -70 -166 -178 174 19 23 20 211 283
12876 283 -232 -97 109 117 6 104 201 15 -58 49 -10 29 -2 125 -201 -23 -88 -105 194 152 -152 -213 -46 -351
12900 -351 164 -70 -182 293 -5 -151 -17 185 12 -36 -8 -64 -172 139 -25 164 104 106 -124 -221 49 268
12922 268 138 166 36 -54 46 53 -22 108 132 248 -14 -184 -105 -211 -22 -83 -18 -280 -45 -3 84 -35 11 -110
12946 -110 -27 -123 137 -149 7 90 -63 74 -114 -11 -191 -232 -415 -50 15 53 13 10 -71 9 64 -176 30 -66
12970 -66 164 -18 73 -118 167 -4 69 -13 -23 -33 -21 119 174 60 18 8 63 136 20 -53 -38 -114 -176 3 -27
12995 -27 -92 130 170 -57 -210 -37 14 -93 -47 -254 -13 123 -107 -17 56 118 -175 -224 82 -84 -212 -47 156
13018 156 131 153 51 -52 47 -69 -43 109 -11 -58 80 28 117 85 -85 325 -3 13 89 -158 -132 135 73 89
13042 89 -85 119 -54 154 -8 181 -47 177 16 -149 190 -50 -17 154 -102 228 -323 -183 -98 -147 -82
13063 -82 -80 54 -64 -33 250 -141 16 55 433 -34 -164 -17 -110 -118 -118 -49 157 148 -361 119 53 32 270 -23 -24
13088 -24 34 72 -98 -253 203 -171 33 111 -15 -113 -37 41 -170 -245 -169 -5 -48 244 -29 -142 -167 122 121 71
13112 71 -134 103 37 -96 -71 -162 53 -98 -128 66 -44 -175 74 -304 -22 189 -21 142 253 21 34 142
13134 142 69 246 79 -65 192 106 56 106 216 -43 -91 0 -98 -67 165 117 -93 54 -152 220 -30 212 -150
13157 -150 148 292 -300 92 -57 -98 -56 16 60 17 -14 -5 -294 -18 177 -93 -15 32 -97 -8 98 -25 117
13180 117 -9 131 -222 -214 -76 -136 -280 -43 150 76 200 420 73 -202 51 14 77 81 -20 -124 9 74 -125
13203 -125 86 -150 219 -209 -53 -67 -21 -27 155 -104 -35 50 161 -65 89 277 38 174 146 127 88 -30 187
13226 187 -39 56 107 24 147 -117 -57 144 -223 -110 23 -39 -176 -77 -218 14 -102 -197 70 -56 -49 82 121
13249 121 -106 -35 85 -24 129 16 419 186 37 143 -183 117 -251 -92 -166 26 -205 136 -156 -204 -11
13270 -11 -99 -205 -77 194 -44 119 125 69 -68 128 146 62 -223 51 8 -18 160 -157 -4 -85 -153 -27 6 -199
13294 -199 -106 16 -233 169 239 99 -195 109 34 -39 -152 -294 -148 77 199 140 112 88 27 45 -163 61 -215
13317 -215 -244 43 -199 17 -96 17 3 62 83 26 -66 60 -51 -57 -294 -8 76 51 103 -143 -275 12 59 79
13341 79 12 -71 154 161 -141 -114 -107 62 -177 140 129 -171 27 -95 193 11 233 -94 122 -30 74 -57 21
13364 21 -84 -158 83 50 -67 -308 189 14 3 -164 18 96 85 26 3 82 -25 -19 -94 75 -63 124 133 103 -183
13389 -183 22 -1 -234 -206 -71 -18 303 233 52 23 -81 87 -76 236 49 -186 -52 -5 155 -383 -138 -19
13411 -19 231 -20 185 25 -133 26 23 90 -237 -100 113 -106 -146 58 25 -81 -66 97 -208 -51 -23 -31 131
13434 131 -97 -31 -47 81 119 230 162 -198 286 -17 -42 -106 -164 57 73 -187 60 -230 -53 -90 74 -5 80
13457 80 237 -130 62 63 130 -60 -57 43 -128 76 -192 111 33 -63 -9 -33 7 -26 -135 -32 -71 -70 -19 -25 -142 32
13483 32 168 226 -67 4 32 67 -26 196 -52 176 106 -245 23 213 -190 -111 -223 59 -122 -270 108 75 125
13506 125 -143 6 -258 101 69 33 -29 -54 21 88 89 66 125 -2 273 -27 -245 217 -82 -121 74 -8 9 -177
13530 -177 -92 2 37 41 76 -65 -10 -159 -85 -28 155 271 -198 -53 -217 29 -179 52 124 -21 -63 -1 83 -57
13554 -57 -111 174 26 236 33 -85 -155 32 341 5 -53 -32 -36 181 122 34 -61 47 336 -177 -218 -35 -89 54
13578 54 52 -25 -214 -107 129 34 313 -52 27 282 -129 -206 -26 -184 -171 -70 -33 208 -79 -134 -45 -9 43 -88
13602 -88 -109 -94 -297 34 -148 -20 -64 1 109 62 79 171 -12 58 -237 -317 -45 38 -42 83 201 -49 -75 209
13626 209 -233 -48 -243 -109 -119 50 64 94 -55 -12 326 46 81 -291 -50 38 367 12 55 -35 45 -98 55
13649 55 162 -10 -17 151 140 101 145 113 -30 75 20 107 180 118 -7 239 79 -142 -4 -193 -53 -40 -66 -193
13673 -193 43 -89 182 -49 229 270 -102 10 -47 161 23 184 -159 -20 96 32 33 -135 217 149 83 -126
13695 -126 -101 32 309 -84 226 163 59 216 -30 140 95 251 -109 4 20 45 -234 -252 19 78 58 -39 -77
13718 -77 95 84 17 15 67 -47 13 92 0 8 49 -35 50 8 -61 46 73 24 -181 -242 94 42 -111 -163 19 133 -10
13745 -10 77 101 101 -47 24 55 -105 -69 20 -102 133 133 117 -28 117 108 -48 280 92 -73 44 45 -10 -37 -71 -6
13771 -6 112 -97 -92 -173 194 -153 -127 -42 -147 -243 -342 47 123 -70 10 302 135 -56 6 3 -25 188 56 53 -86
13796 -86 -56 1 126 106 -117 185 -232 76 122 -193 432 -35 68 215 89 168 106 -58 48 -152 11 195
13818 195 -137 -67 94 39 13 54 -107 -109 192 -61 48 -193 -216 -70 -47 -97 -55 -116 -116 -92 -112 81 -53 -30 -174
13843 -174 287 -6 -19 -59 12 -177 -4 221 2 -9 86 -66 -63 -38 45 -228 84 160 -15 -4 145 77 -12 20
13867 20 39 89 75 267 278 -150 -134 -54 151 -5 -22 -136 -50 -172 63 79 -200 -37 45 231 -73 149 157 10
13891 10 278 144 85 -234 -99 287 123 193 34 43 -100 -76 -98 -74 134 -21 273 73 53 -8 -83 -65 -43 -13
13915 -13 26 -98 265 -155 169 -51 33 73 -194 -86 -76 216 32 -106 -139 -63 -104 78 249 -197 99 22 -8
13938 -8 60 55 -35 -160 -80 -105 166 107 8 51 -36 -62 -10 -123 12 -37 -166 -58 -7 -56 10 -30 151 -140 191 72
13964 72 143 -87 -99 -58 46 78 292 144 88 166 -14 64 -133 291 124 -7 -153 60 216 -107 43 99 3
13987 3 -125 100 -208 -191 -54 -100 8 77 -64 180 39 35 -132 -326 61 -62 154 87 -175 -108 108 -40 -61
14010 -61 114 59 -70 103 -71 -171 -23 -73 71 -13 5 -52 -67 -309 69 105 -101 118 47 -247 50 -60 -15
14033 -15 -139 -119 4 -28 50 153 6 -147 -52 -28 -24 69 85 -69 74 -69 18 33 194 -123 6 -63 200 108
14057 108 -105 -54 27 -207 -413 20 -256 -170 -71 -15 -80 -32 51 -130 241 347 -163 -102 10 -113 -183 -65 -82
14080 -82 -43 93 16 -86 -287 -102 27 -53 -22 222 234 -190 -160 55 -137 -232 269 36 -134 -144 -87 14 131
14103 131 157 22 -94 -107 179 -180 114 -75 -52 -113 -13 -231 216 -122 -46 223 -133 -122 -13 -46 -72 -95 -144
14126 -144 219 -67 98 -238 -52 322 5 63 -172 93 50 -146 -25 -172 2 -143 77 89 -62 -30 316
14147 316 35 13 -25 31 -52 11 -77 -65 -106 -87 320 -153 167 39 44 -76 -301 -34 164 -237 -70 -48 36 -78
14171 -78 -171 -223 77 -241 82 104 4 -45 10 93 -352 253 -142 -9 43 124 -295 72 142 72 89 38 277 46
14195 46 -196 116 65 -89 -94 41 -11 -141 -17 85 168 189 -70 -2 6 49 -45 -34 113 10 58 219 111 163 170
14220 170 -88 151 -87 -107 -21 5 -22 231 12 64 111 -149 96 45 -3 55 105 93 73 -24 -75 -167 283 210 -184
14245 -184 -82 -47 -148 1 240 -180 14 3 183 200 -97 4 -101 -111 -170 -87 -135 -69 -132 -30 89 -52 -208
14268 -208 161 230 190 -70 43 15 31 186 -69 17 -25 5 -10 -132 112 24 161 -107 167 -85 -96 78 13
14291 13 -245 -240 -173 91 15 -91 106 -80 58 122 33 15 -247 -38 125 92 7 0 75 64 -82 -47 -1 83 206
14316 206 -48 -113 35 235 159 80 153 -116 -34 -102 -42 352 -90 68 -2 116 -83 34 165 -243 46 15 -10
14339 -10 -143 -5 4 -69 37 191 149 -27 42 -206 28 -221 94 -212 -109 156 142 -114 -121 48 154 78 102
14362 102 -26 -95 -17 -22 67 -35 -55 82 -57 134 -15 210 452 141 137 -10 51 125 -76 39 51 231 124
14385 124 -63 -258 288 149 52 -69 -69 74 136 -19 -50 -44 -45 -113 8 -139 -118 -158 -155 97 -106 253 24 41 83
14410 83 51 -105 63 -218 -12 -166 136 -120 53 -35 28 74 -113 -72 -81 160 -84 20 34 -15 143 129 -27
14433 -27 49 -77 166 111 22 -107 116 42 85 26 -67 -209 -3 91 -229 -137 -112 29 146 90 -165 88 185 -7
14457 -7 101 126 109 75 -188 -118 87 -151 40 156 142 228 -299 -172 -8 34 213 -79 139 208 -1 -96 -62 -20
14481 -20 222 -156 -150 -133 0 -129 -18 183 16 -195 -213 187 117 -171 174 310 -137 129 52 -182 -69 317
14503 317 -143 26 112 -115 7 -23 28 -227 -88 65 -103 83 159 198 -105 5 36 -32 267 114 -53 -154
14525 -154 -5 38 -4 -51 -31 274 23 -59 -287 54 -14 -177 -23 -327 -35 -158 -145 -1 -79 -89 118 -95 177
14548 177 -195 -160 72 -213 130 157 -28 -188 -192 12 83 19 -2 -180 297 -141 -167 55 151 -10 151 35 13
14571 13 -55 115 -40 -207 73 -35 95 -13 282 46 -158 -70 233 -1 -268 50 -7 245 13 -185 -19
14592 -19 66 -26 83 -425 134 -60 -11 -41 198 -71 10 16 -82 -26 366 9 132 200 164 -115 -61 280 -195 142
14616 142 -65 -130 -228 187 103 -45 139 176 307 49 318 60 -105 83 -44 -97 -130 270 15 15 28 -62 -108
14639 -108 42 -91 -154 -149 -45 -155 157 180 110 -80 55 -139 -55 -40 -214 -59 -73 -49 91 458 -43 104 71
14662 71 40 78 205 206 131 -102 -30 9 -2 76 48 -6 -22 117 -80 156 -15 -184 -42 -75 -262 8 -21 -40 26
14687 26 175 135 22 -72 26 -219 48 -84 9 102 180 16 50 25 133 2 75 -10 -66 215 33 -17 49 174
14711 174 -48 -175 154 220 117 229 93 142 -25 -83 -68 -54 188 -71 -255 -192 45 -128 -114 20 -120 -82
14733 -82 365 -77 248 95 -134 49 -113 -122 -108 -66 -169 141 -1 54 122 87 -156 -98 -219 24 46 57 52 -25
14757 -25 388 -183 -23 -90 174 -88 -5 208 70 67 127 170 32 -174 77 -95 -159 -10 -257 -85 1 -48 -129
14780 -129 42 -34 -126 -43 -48 229 20 264 58 114 -13 105 143 47 -45 -39 -20 -31 89 27 104 -106 56 -48 -38
14805 -38 -159 -100 298 -56 56 -60 -155 -105 -96 -301 100 -247 221 109 77 74 73 203 41 6 -138 -1 -141 -67
14829 -67 -65 -147 9 -93 -18 -113 -55 -35 -172 69 92 -30 3 -161 68 403 -222 -62 -251 126 -90 194 3
14852 3 328 21 -35 -123 -250 -79 163 -69 101 185 306 -63 -9 203 -139 -127 37 26 -59 -214 -127 -64 -1 190
14876 190 -200 -71 133 128 -152 -161 -186 66 -170 8 43 -40 154 -41 -130 177 -134 -64 -242 168 108 5 154
14899 154 -148 164 -74 -57 -6 95 -79 -71 38 -73 -77 122 -135 -151 -257 -41 120 42 118 24 214 -85 -218
14922 -218 110 -75 -118 -200 79 -107 -167 -127 -145 -141 6 161 21 -176 173 -2 -95 10 108 179 67 78 84 -41
14946 -41 -4 0 -15 -35 -27 184 -91 -141 264 99 185 -125 -167 141 -60 -177 238 204 79 -4 172 51 202 -117
14970 -117 -11 132 -145 -101 65 -12 -260 -65 50 -188 11 89 -152 339 131 -33 91 -287 -158 -67 216
14991 216 67 -18 -81 -221 -37 181 -145 144 95 16 67 40 157 80 -21 31 -153 -22 -101 67 -15 64 156 -219
15015 -219 46 -10 114 -32 97 32 -166 -52 102 -88 -93 -112 -14 -141 159 88 21 40 -110 38 -29 252 -92
15038 -92 -20 -77 43 -131 185 -119 259 15 81 155 -40 -159 205 41 28 73 75 150 160 59 -21 -91 -69 29 63
15063 63 187 -215 165 46 -152 112 100 -85 -108 -73 -169 -288 -103 -127 124 -208 -146 -166 25 -11 90 270 -54
15086 -54 -381 186 56 -94 -21 255 5 -18 33 -189 224 82 -15 -19 -9 85 -18 -97 173 -72 -287 96 5
15109 5 -28 -50 14 36 219 160 -56 -29 95 10 39 -272 -63 -127 -39 -24 59 134 39 -34 -40 55 -296 -264 -215 -6 2 -20
15137 -20 -168 16 -45 -69 207 25 -56 -9 -113 4 29 -15 106 -23 268 68 106 109 -42 -53 66 -202 -110 13
15161 13 157 -27 118 46 71 14 83 -129 189 -131 -87 216 -12 21 -186 -181 282 156 -116 -112 -65 50 -22 143
15185 143 168 -126 188 267 116 -109 -36 140 -89 281 212 -108 40 87 -46 -83 -183 396 35 83 137 -53
15207 -53 63 -3 -51 -145 102 55 -207 -230 -96 21 -228 -121 -36 -61 -139 39 4 -152 160 -236 37 127 23
15230 23 -58 -33 -11 -3 30 54 -200 -96 -14 35 251 -36 -39 -154 324 -24 -94 147 -76 -56 -186 -75 39 -23 16
15255 16 -182 -134 -57 -119 227 -136 -130 -61 -144 -270 -42 185 -317 5 -10 154 -173 -112 128 96 91 1 10 192 110
15280 110 87 287 -64 -53 55 -61 17 102 49 170 64 -62 163 99 55 282 26 2 118 68 -119 6 21
15303 21 131 -120 -125 -171 -74 156 -42 -166 -35 14 -54 -273 -158 20 -29 -90 -250 44 69 -18 -52 144 220 -34
15327 -34 -65 405 112 112 -14 -222 126 144 -172 186 -149 104 -32 -117 4 104 -138 92 -19 78 140 157 -42
15350 -42 -279 -74 -224 15 22 2 27 94 -112 -105 28 -155 -126 -96 -68 96 -54 -82 -205 -2 16 -192 -101 -177 -173
15375 -173 -97 134 168 73 93 119 175 -17 -22 78 -25 25 -66 -121 -70 83 -109 -185 -29 87 1 -208 -21 -88 -51
15400 -51 -81 -69 -31 -86 79 223 32 -35 -118 -20 10 81 42 189 -166 32 169 140 175 -19 96 133 -128 321
15424 321 -131 -53 80 32 150 97 70 -157 286 -105 -115 -103 55 62 -49 178 66 -60 -60 120 206 175 123 122 -108
15449 -108 -9 18 119 -61 -119 3 -62 -20 63 131 -110 100 -236 17 70 16 -123 -220 27 -206 -179 -150 -126 43
15473 43 -38 -111 -243 127 90 -225 41 -59 268 140 6 189 63 159 131 23 -191 -29 108 -77 -30 175
15495 175 -79 -97 -11 -6 -140 -79 272 15 242 127 -143 -93 -107 -76 164 46 290 153 26 -138 -159 32 135
15518 135 31 117 10 27 -148 -74 79 -8 -222 4 158 -61 -55 20 -65 198 260 170 177 -74 43 -53 51 -58
15542 -58 -95 23 34 118 64 139 129 -41 -23 -25 -163 345 12 193 32 -59 70 -117 -141 -35 -179 -54 12 -186
15566 -186 -23 109 61 -36 205 61 33 219 128 -7 -42 -13 -37 -54 49 119 -62 31 -129 -164 -90 -116 26 190
15590 190 -168 168 267 -76 97 90 -154 23 -97 41 201 -33 134 167 158 101 70 -6 -70 -18 -40 9 -38 101
15614 101 -124 34 40 294 -120 -11 -27 175 59 107 231 209 -19 28 -5 70 -177 9 44 -239 38 142 -7
15637 -7 15 215 135 -93 57 214 162 16 116 -50 -130 -151 60 -104 5 -4 -144 -3 -98 -174 40 169 0
15660 0 45 203 -98 124 -112 -190 -95 -14 113 -49 -161 -162 172 75 51 -34 -23 -71 -45 162 17 148 320 25
15684 25 82 -192 135 101 85 -142 -157 153 113 -199 -126 121 -58 -50 -83 -49 -60 -27 -180 -142 14 -125 -25 -44 -187
15709 -187 194 96 57 -5 -43 42 121 -24 -59 34 384 202 24 68 -74 -19 302 186 -188 120 -29 -72 43
15732 43 -19 -139 -243 -37 53 4 -125 -170 -5 19 -63 -99 46 -14 49 -28 198 -149 156 36 -104 -102 -340 -31
15756 -31 -63 37 185 127 109 193 65 -8 -51 222 213 204 13 5 -87 172 -132 64 -110 -133 46 181 126 131 39 -40
15782 -40 -27 -85 -28 -115 -257 32 -60 154 137 -180 53 112 -67 -110 -75 -319 26 -76 51 -319 173 75 -179
15805 -179 21 73 -200 104 134 382 -28 14 161 -184 221 -151 112 -37 -99 117 82 -214 103 114 13 -49
15827 -49 142 -106 -164 -135 -114 -51 -97 -183 -365 116 -13 -9 170 105 -47 -80 -29 105 37 -233 31 -28 -120 146 56
15852 56 -25 24 55 67 37 -98 -287 -131 -1 -42 51 102 191 -39 -160 -92 -48 77 -114 49 -161 26 127 124
15876 124 -13 -171 69 -175 243 -24 -169 117 107 -133 152 51 124 -88 110 248 -189 -34 76 8 20
15897 20 -93 0 -229 -105 -54 39 276 -8 -3 246 -22 24 -100 39 98 77 -147 166 -150 -95 193 -80 171
15920 171 37 55 162 -60 210 142 131 242 -6 111 74 -73 -133 -17 -69 -20 159 50 -15 -204 -23 126
15942 126 26 44 55 -141 -144 161 -315 -62 -42 47 85 92 85 105 41 -218 342 -63 -78 247 -189 43 167 107 141
15967 141 18 76 -259 -60 -20 28 -52 -98 -358 -50 110 123 5 68 -1 -118 83 119 216 -62 -92 201 51
15990 51 146 191 -60 -150 -1 277 53 -317 123 244 -278 -56 126 242 236 -69 -16 -151 -14 -309 212 27
16012 27 -172 183 129 179 -101 130 -17 137 -118 170 -108 26 30 -123 -179 -109 51 -152 -27 113 -114 -37
16034 -37 -58 240 -138 84 -47 50 -24 -275 33 107 300 120 39 44 -210 135 82 127 21 110 337 -109 -31 131
16058 131 59 -113 -19 109 143 128 -94 -22 8 -187 138 -41 122 132 -141 -144 84 100 -56 -95 5 -155 -84 -40
16082 -40 95 -67 60 26 56 245 336 151 215 -107 44 91 126 36 60 119 167 -170 5 28 -165 184 72 218
16106 218 112 56 -47 -176 32 -3 -201 -59 85 -39 70 -176 -1 106 -184 -179 -16 -90 -200 255 5
16127 5 200 -202 86 -6 -22 -62 -98 3 -54 25 -148 105 -134 -19 -64 70 132 -32 7 -37 -41 -145 -268 -76
16151 -76 152 -22 57 128 -1 -55 -244 -2 17 14 69 120 71 -42 301 -16 139 -124 -16 169 60 218 277
16174 277 81 169 125 -78 -53 213 -42 7 -32 -70 -30 168 332 -127 276 -132 42 98 -124 153 199 -11 -188
16197 -188 115 21 -74 26 99 22 257 -12 66 147 49 82 -8 130 -126 41 -165 -160 -62 22 152 69 176 257 -55
16222 -55 -64 136 27 128 230 128 249 67 -142 48 -2 121 105 -86 -144 -77 154 168 74 -138 -151 -40 -3
16245 -3 71 23 179 -290 99 -65 30 -32 328 -107 -214 -66 -5 -112 -18 114 196 -164 -43 -37 65 223 -21
16268 -21 -35 -161 -61 -48 5 34 61 19 116 6 -42 73 -109 122 -146 123 118 8 292 -137 6 137 -98
16291 -98 67 -108 137 56 -58 185 95 220 7 -211 -121 -155 221 -156 32 23 260 367 -111 44 -220 60
16313 60 -114 -43 -264 71 71 108 73 -72 10 -81 -163 -104 174 -291 263 -3 -179 52 -45 52 -214 -214 223 -137
16337 -137 260 192 82 216 164 -16 253 19 61 163 -54 202 -152 -108 -33 -18 128 297 52 -162 197 113
16359 113 191 29 -49 -55 210 -36 -117 -126 1 -265 -146 50 215 -16 -33 -76 -44 173 84 170 210 48 176 103
16383A03
$$ Imaginary data points
##PAGE= N=2
##DATA TABLE= (X++(I..I)), XYDATA
0 0 0 0 0 0 0 0 0 0 0 0 -32 32 -32 32 -32 64 -64 96 -96 128 -160 192 -224 256 -289 352 -396 466 -544 609
30 609 -705 801 -897 1025 -1153 1313 -1473 1634 -1826 2050 -2274 2530 -2805 3106 -3431 3793
46 3793 -4187 4617 -5086 5603 -6173 6802 -7500 8275 -9144 10128 -11244 12525 -14019
59 -14019 15781 -17895 20493 -23776 28067 -33949 42536 -56315 82056 -146719 665692 737395
71 737395 -944031 -1017096 -243088 633227 679808 179561 -442397 -360493 -79028 -51288 -28418
82 -28418 393738 445124 -92209 -586356 -462286 71787 671097 633675 -177875 -799990 -384569
93 -384569 327646 472165 190740 -86852 -297441 -255901 -10838 122895 155331 246084 68676
104 68676 -364371 -375073 142911 421325 186655 -133733 -248821 -130192 116855 140751
114 140751 -81062 -63377 188093 88148 -281237 -271566 108317 331130 218124 -105849 -367331
125 -367331 -188461 275070 335687 -61843 -242377 -31859 111467 12359 -121920 -105888
135 -105888 121538 295481 20019 -419212 -300257 269221 468431 96938 -300537 -327808
145 -327808 -21273 292324 235035 -96096 -193669 -5949 41077 -79465 -40067 123697 140530
156 140530 -8651 -177616 -198945 38334 299134 192358 -155313 -253938 -45184 133888
166 133888 133224 29261 -79169 -80989 -920 -4282 -50722 40434 144400 23453 -163205 -118763
178 -118763 80152 161807 57291 -96861 -118877 31470 132906 9442 -136826 -54872
188 -54872 112404 95578 -61689 -138074 -51988 98095 137657 1670 -128454 -60355 81687
199 81687 69091 -40359 -41150 54020 73633 -33817 -139679 -88081 107272 203261 25383
210 25383 -215104 -185309 69552 209915 102908 -72679 -130703 -53982 49478 71022 31227
221 31227 22865 15325 -73185 -136156 -27767 140173 145910 -9667 -155116 -153463 12264 183368
233 183368 145502 -53500 -144000 -56577 36431 60381 58820 25177 -34720 -66511 -68398 -31639
245 -31639 80045 144648 10227 -165224 -122825 58480 138849 80433 -30368 -107014 -57405
256 -57405 62601 68276 -15240 -14938 21086 -30043 -67708 -5579 47541 43568 22402 -43089 -96808
269 -96808 -4095 118456 64519 -56587 -54908 1373 20292 33607 8485 -50733 -18696 54478
281 54478 -1265 -78791 -6246 70904 16231 -35774 -18205 -7846 19270 59140 2245 -67089
293 -67089 -189 63553 -8440 -53228 5553 20688 -6096 6474 -13970 -54085 12520 80401
305 80401 1395 -65710 -395 40204 7419 10067 6031 -37629 -7161 47220 -13619 -59922
317 -59922 23404 52072 -36148 -50380 13941 21465 18526 30683 -26820 -60649 32491 76446
329 76446 -15403 -45838 11448 1374 -22984 20624 14639 -37670 -4044 28871 -32580 -32639 55109
342 55109 43518 -33827 -22756 6002 -5959 31423 51492 -37143 -70804 23094 45482 -24779
354 -24779 -17622 18510 -17502 -21667 23313 4506 -14382 36531 23090 -53983 -21823 56949
366 56949 23305 -25888 -3206 -10571 -31876 20832 39154 -32105 -37949 24829 11723 -21480
378 -21480 15927 22738 -19530 -1037 25334 -16448 -14864 42858 13312 -52491 -17144 30021
390 30021 714 -10256 7204 -20129 -22472 32921 26114 -27966 -4864 30305 -9060 -19623
402 -19623 25795 16160 -20413 -608 4621 -29587 -6525 35766 1379 -32363 -1294 7919 -9181
415 -9181 16817 26795 -17249 -17618 23452 6271 -21712 12414 25761 -16901 -25776 -2077 -5617
428 -5617 1657 27465 2897 -35362 -9716 20483 3830 5090 25344 74 -28418 -4581 13448
441 13448 2035 9459 13573 -21402 -35573 -1724 15920 10595 15840 2388 -32351 -23275 21116
454 21116 30188 14294 8941 -10941 -36842 -16327 27599 31716 5659 -17805 -36147 -27757 15284
467 15284 38786 14017 -11540 -13670 -17157 -11422 21029 40649 17831 -15910 -32198 -29618 -862
480 -862 39283 39002 -8631 -47222 -39783 -3350 35077 46836 10626 -36589 -35957 1882 23863
493 23863 24323 20572 1531 -29420 -33405 -7822 16670 30155 23795 -16131 -53294 -33056 20411
506 20411 45935 36461 3849 -41512 -49857 5981 54611 36413 -5473 -26803 -34840 -19422 18932
519 18932 29912 5906 -5434 -9640 -30662 -23619 24217 45591 22145 -2533 -30211 -49149
531 -49149 -5223 63173 52766 -16497 -51478 -42818 -10802 40175 49960 -7595 -41547 -12411
543 -12411 2338 -6269 18436 38555 10089 -14444 -20155 -35213 -12554 56614 60538 -20885 -69019
556 -69019 -45743 -2430 51279 70459 -2081 -75317 -38947 26475 30276 24809 24911 -13787 -39645
569 -39645 -12002 2138 -1580 32837 42546 -26261 -68718 -27971 16372 43319 62076 8708
581 8708 -81167 -64492 33242 67370 38652 5483 -45484 -65978 559 54728 20764 -10100
593 -10100 -1422 -22594 -40508 2192 31091 18057 26367 17517 -52217 -65752 23085 75977 40821
606 40821 -9343 -57298 -75569 2497 87838 44080 -41993 -41975 -14334 -8606 22243 39868 1561
619 1561 -10601 12633 -17419 -48235 11127 65906 29364 -21920 -47746 -61095 -6505 85581
631 85581 64908 -41994 -69115 -20887 9476 38530 55410 1969 -48491 -19845 6517 -6879
643 -6879 16242 43919 1325 -42107 -27949 -17532 -3448 53130 58118 -28083 -72692 -25199
655 -25199 22962 49726 59112 -1630 -78152 -49224 31531 44225 19981 4862 -32784 -50831
667 -50831 -439 34172 9097 5079 20309 -13512 -43904 -8233 30080 34049 31433 -6318 -68017
680 -68017 -46701 42933 62194 5607 -29818 -37541 -30002 17984 50445 10546 -26058 -6248
692 -6248 3305 -11015 4772 23133 7342 -1033 359 -26250 -30825 20198 41724 249 -26849
705 -26849 -19262 -12549 7924 35145 17087 -20100 -13968 4742 -1763 3126 18773 3841 -15259
718 -15259 -4197 -2033 -15613 -1869 20584 9121 -10790 -11330 -11629 -3858 24962 30015 -4900
731 -4900 -25081 -10659 2553 10931 19550 4819 -23180 -20376 2055 5582 2205 8752 5436 -8961
745 -8961 -10818 -3213 5061 18251 21000 -5238 -28555 -13677 13938 18501 6839 -8022 -20608
758 -20608 -16762 4821 16806 6992 -2608 -3845 -6084 -4109 7559 13534 5207 -1040 -3564 -10280
772 -10280 -8074 7839 11847 -3851 -12538 -6671 -3010 558 9893 8105 -3395 -3546 1979 -1127
786 -1127 1918 12653 5438 -10035 -5475 1715 -6409 -5046 8533 2927 -10060 -4313 1490 -3604
800 -3604 5226 15611 1391 -10360 1120 3938 -2476 7891 11156 -11394 -17085 2097 2953 -4799
814 -4799 6843 6543 -13787 -10158 10126 6201 1767 13318 1700 -18247 -1404 17554 936
827 936 -6864 4234 -8079 -19177 4812 15694 -4910 -5394 5282 -8590 -7708 19878 14201 -11450
841 -11450 -2049 8267 -9968 -4349 18999 1433 -21445 -3340 6306 -8851 1972 15330 -8710
854 -8710 -16001 11757 10330 -7008 9222 13279 -15513 -10528 17071 3257 -14166 4370 3278
867 3278 -19011 -2523 17535 -4823 -11330 10815 1607 -13734 11767 20128 -10934 -9289 13600
880 13600 -2320 -12765 11741 7040 -20025 -5436 12506 -7869 -7865 15532 -291 -17616 9823
893 9823 17016 -10459 -2203 17906 -5745 -16523 12195 8763 -16149 -1116 9771 -14266 -9632
906 -9632 16830 492 -16080 9166 11860 -12770 1387 20138 -5754 -14432 12773 5967 -15984
919 -15984 2886 11275 -14347 -9146 13259 -3677 -13969 12472 10108 -15729 -119 18718 -3565
932 -3565 -8611 13570 2240 -15687 4863 11292 -13165 -6501 12341 -6594 -15200 9967 8107
945 8107 -11969 3467 14507 -9043 -8445 16236 5874 -11651 4280 6738 -13172 -3902 12311
958 12311 -5231 -11385 8182 282 -16081 5055 18121 -4329 -7863 8299 -631 -7152 12300
971 12300 9852 -12226 -5598 7214 -7266 -8356 11030 3564 -13348 -1617 5528 -6212 2489
984 2489 17248 135 -14468 1554 8663 -1344 4178 6705 -10598 -11419 4831 1435 -6608 6024
998 6024 6910 -12072 -9929 8631 8060 2242 5689 -1408 -10415 1764 11310 -133 -5399 2568 -3120
1013 -3120 -11715 -2147 5863 1908 2445 2738 -9397 -10039 9571 17211 3385 -6387 -5646 -3176 3388
1028 3388 8419 -671 -8829 -2031 2079 -6713 -7135 5300 10009 2039 -4956 -7429 -3503 9561 16654
1043 16654 4287 -11691 -9951 -28 4253 4875 2666 -5819 -10405 -3396 2178 782 3936 7661
1057 7661 -640 -8649 -1451 6664 6032 5553 3695 -7492 -12355 -2543 4892 4579 5806 -1604 -17804
1072 -17804 -13204 12720 19395 2819 -6892 -6963 -4247 7707 14126 -1371 -10921 2441 5117 -10374
1086 -10374 -9687 4893 6963 4663 277 -16586 -17126 15429 30634 2315 -19685 -10102 2219
1099 2219 10709 15653 -2215 -21084 -3618 13448 -3954 -13957 4881 9603 -1790 -1636 -4704
1112 -4704 -11018 8542 27472 3166 -21392 -7962 4535 3280 11304 7563 -18293 -18336 8145
1125 8145 7673 -4868 5553 5815 -12433 -4975 13821 2288 -5497 11172 6977 -12357 -5326 3637
1139 3637 -6047 4111 19534 -7535 -31779 -4906 20552 11378 3204 -3872 -20088 -5762 28224
1152 28224 14934 -19144 -8823 11406 155 -5886 577 -7847 -2967 19658 3321 -31760 -12414
1165 -12414 26420 19182 -3749 -8579 -15038 -5923 26417 20800 -20519 -19275 11313 5971 -9096
1178 -9096 1374 1203 -8366 6277 8731 -16641 -9984 21846 14021 -10825 -4177 489 -8150 7566
1192 7566 19848 -6581 -19276 1627 2653 -8466 8103 12908 -12962 -13504 10134 5907 -3890
1205 -3890 8103 4467 -11121 2305 12557 -10066 -12251 15029 10890 -14584 -11970 -1108 -667
1218 -667 12972 15551 -15944 -24544 11019 23399 -318 -6838 -609 -4753 2905 12061 -7441 -17449
1232 -17449 9714 16670 -11985 -17833 2556 8911 7698 7334 -11009 -18724 10512 24438 -1809
1245 -1809 -13915 1003 2528 -3347 3553 726 -8783 1786 8369 -10072 -12472 10072 11617 -4111
1259 -4111 -3047 1103 -3502 3874 11382 -2245 -9590 3977 3270 -10102 -2841 9563 1077 -7147
1273 -7147 -3210 -2981 -145 11381 6643 -10932 -5718 11134 6500 -5841 -2473 2482 213 936
1287 936 -3122 -9942 -893 12546 2758 -12766 -6848 6925 8159 3676 -1390 -6386 -46 10327
1301 10327 3651 -9629 -5078 7249 3998 -6386 -8110 -1997 5072 7084 -2047 -10272 -1700 11472
1315 11472 8232 -4512 -5937 2586 5769 1345 -4150 -4590 708 5306 -671 -9810 -5972 6867
1329 6867 8001 -2675 -6138 -236 5208 6136 2306 -4269 -3289 5588 5113 -6190 -7505 2903 4453
1344 4453 -3094 -5995 -3269 1258 7049 4490 -6696 -5177 8496 8006 -3993 -3901 3469 1927 -941
1359 -941 -1045 -5472 -4194 6539 3226 -10224 -5878 8455 5678 -2588 -626 -315 -339 7263 5287
1374 5287 -8956 -5494 9863 3696 -10115 -5020 2422 -135 1681 1328 -8464 -3465 13397 6283
1388 6283 -11059 -2704 9948 2451 -2463 1118 -4313 -4045 7983 1688 -14074 -3727 11200 697
1402 697 -7489 1770 1600 -1849 7299 5124 -9655 -1637 13873 881 -11621 798 5494 -4233
1416 -4233 -1101 1999 -8547 -2120 12221 -61 -12984 3181 12064 -2556 -3752 5518 -1074
1429 -1074 -2621 7964 -924 -13188 2058 11412 -6806 -9880 5169 2277 -4266 5138 2819 -9048
1443 -9048 3033 13912 -3958 -10299 7086 6442 -6957 -910 2504 -7647 -396 9962 -5645
1456 -5645 -12513 7532 9675 -7517 -2881 7894 -991 -1154 8231 -2477 -10259 6764 9173 -10552
1470 -10552 -7400 7309 -136 -5757 4323 205 -8921 4950 10597 -6870 -6128 10775 4333 -7244
1484 -7244 1547 3602 -6012 1382 7245 -8298 -9490 8101 4656 -9331 -332 6683 -3369 -1144
1498 -1144 8105 -1139 -5354 7684 4390 -9773 -1273 8534 -2770 -6535 3515 -1274 -7357 4080
1512 4080 5672 -6947 -1977 9236 -63 -6014 4906 4899 -3892 1049 3266 -6730 -2853 8411 -743
1527 -743 -10385 3 5126 -3240 -691 5049 -2282 -2338 6944 1863 -6308 2552 7114 -3252 -4592
1542 -4592 2456 -1353 -4057 3512 1046 -7473 -1927 5767 -330 -2117 4205 2001 -3300 2154 3603
1557 3603 -2220 -120 4527 -2360 -6189 1039 2147 -3100 -1048 1620 -2021 -1914 2976 1538 -725
1572 -725 3057 2883 -2772 -1264 3702 1540 -1887 -393 -1875 -4342 -483 2870 -587 -2557 213
1587 213 644 66 2020 2653 221 693 1678 -2 -2222 207 1730 -879 -2693 -2487 -1692 -736 2051
1604 2051 2633 -1250 -2639 314 3096 2625 2224 662 -2188 -816 2147 533 -3604 -1347 1189 -1404
1620 -1404 -2719 -345 103 342 3581 1973 -3459 -1650 4753 3762 -59 -342 -2318 -4502 1212 4581
1636 4581 -2579 -5122 412 964 -2129 1077 2410 -1658 787 5134 -529 -4072 2899 4248 -1598
1651 -1598 -847 -325 -5986 -2715 6826 2237 -7121 -3108 2187 -29 2872 5056 -3083 -4600 6029
1666 6029 4636 -4771 -1878 3275 -1444 -1902 1974 -4383 -6662 5505 7085 -5835 -5994 2729 2053
1681 2053 2508 6911 -2049 -9018 2734 8934 -2922 -5860 2164 -771 -3702 3041 255 -7655 1151
1696 1151 8814 -1801 -6613 3375 3429 -750 5510 3160 -9385 -3543 8765 1961 -6276 186 -283
1711 -283 -6198 2518 6608 -5001 -4624 7168 2933 -4766 2498 3673 -4194 1698 7620 -5314 -9203
1726 -9203 4435 5653 -4026 -1707 -330 -6770 710 11253 -314 -9469 2222 6669 -1682 303
1740 303 3492 -4541 -2614 8177 -330 -11062 -143 7772 -1798 -3504 891 -3892 -1611 10567
1754 10567 4172 -9828 -2147 8213 845 -2303 3211 -2281 -5490 4063 3190 -8195 -2596 6933
1768 6933 -681 -5279 2529 1408 -3603 4302 6571 -5115 -4151 5695 1376 -3858 2783 1325 -7551
1783 -7551 -1370 5600 -1878 -3714 3543 155 -4662 3927 5323 -4071 -1737 6783 989 -4657 942
1798 942 1292 -3055 2202 2755 -7187 -5119 6359 3498 -4462 -1000 1311 -1346 3021 5441 -3190
1813 -3190 -4175 5250 3440 -5237 -2898 1876 -810 -163 1166 -4491 -4433 5285 5281 -3863 -3113 3506 1941
1830 1941 606 2290 -944 -3068 2511 2541 -4955 -3494 3109 1066 -3013 -841 252 -884 2555
1845 2555 3249 -1938 -1390 3639 2159 -2006 16 1396 -967 -1291 -151 -1765 -1387 1925 -87 -3723
1861 -3723 -776 3349 1577 -737 353 1302 985 1303 -445 -1879 217 2294 -925 -4242 -1853 1731
1877 1731 1195 -975 -2109 -978 1933 3131 1359 -1914 -407 3287 2381 -1937 -2719 327 1692 -271
1893 -271 -2017 -3128 -1177 2858 2249 -2514 -2676 2647 3636 151 -856 -77 236 1566 973 -2908 -3045
1910 -3045 2102 1698 -3394 -2799 779 570 326 1570 -403 -1352 3023 3186 -2245 -1715 3137 996 -2928
1927 -2928 -572 -129 -1746 752 1082 -3989 -2505 4433 2112 -3562 133 3367 -225 283 1961 -1763
1943 -1763 -1453 4061 640 -6307 -1363 4177 -705 -3063 909 -417 -1458 4170 2359 -4331 -426
1958 -426 5773 648 -4165 1351 1091 -2087 897 922 -5671 -1802 5533 -189 -5742 1382 3871 -1377
1974 -1377 169 2974 -2090 -795 5428 201 -6054 1074 4371 -3463 -3228 2230 -1552 -2532 3484
1989 3484 900 -4994 1089 6605 -2075 -3290 4080 1997 -2709 1679 882 -5161 -97 5200 -3024
2004 -3024 -5980 3206 2945 -3649 13 3031 -2323 209 5634 -1375 -4621 4189 4412 -4906 -2334
2019 -2334 3490 -1562 -2529 2893 -1236 -5452 2863 4637 -4314 -2303 5603 1098 -2868 2760 1394
2034 1394 -3260 2316 3725 -5369 -4267 5020 1523 -5054 56 2085 -2143 863 3837 -3096 -2542
2049 -2542 6182 2847 -5402 -526 4169 -1095 -1732 1847 -2844 -3854 4277 2355 -5659 -1846 4517
2064 4517 -179 -1848 2625 568 -2258 3507 2791 -4581 -1481 4984 -429 -4753 318 993 -2861
2079 -2861 580 2119 -3031 -1151 4856 754 -3569 2223 3697 -1704 -1042 1516 -1285 -1180 2991
2094 2991 -879 -5373 413 3376 -1695 -2492 2131 885 -523 2154 624 -2641 1738 4532 -1595
2109 -1595 -4249 999 1830 -846 -578 -995 -3326 348 3490 -816 -2976 2101 3106 -570 -657 1041
2125 1041 -141 659 1939 -1481 -3491 713 2124 -1629 -2214 142 17 -7 1211 571 -592 1292
2141 1292 1803 -797 -1184 1541 1457 -1007 -1696 -827 -570 341 89 -1432 -1183 1272 1573 -332 -1022 1136
2159 1136 2014 518 -710 -1033 303 1164 1257 -1812 -2866 -718 1351 202 -1316 -976 211 751 1120
2176 1120 709 -927 530 2496 924 -2128 -842 1262 -185 -975 -589 -1806 -1506 1516 1340 -1244
2192 -1244 -318 1333 -238 -161 2341 933 -1821 419 1228 -1479 -978 1071 -1025 -2173 1092 824
2208 824 -2639 -299 2529 209 -553 1431 -99 -1518 3014 3001 -2968 -2639 1779 143 -1429 867
2224 867 -763 -3121 1128 3257 -2150 -2347 3286 1932 -1403 1624 1098 -2435 844 4117 -2056 -4473
2240 -4473 1151 1538 -2167 558 1051 -3609 -790 4945 471 -3427 1787 2723 -1639 391 2386 -2858
2256 -2858 -1996 4041 687 -5158 -403 2233 -1551 -323 2632 -2606 -2997 4510 3413 -3265 -886
2271 -886 3314 -994 -760 2931 -1333 -4359 2302 2669 -4283 -2070 2870 -592 -1752 3189 252 -3967
2287 -3967 2597 4903 -2138 -2559 3152 -54 -2770 2544 1072 -4889 -638 3653 -1935 -2917 3009
2302 3009 743 -3187 2549 3294 -3119 -992 4501 177 -2813 1840 288 -3579 1317 3310 -4085
2317 -4085 -3683 3521 1463 -2359 1432 1189 -2920 1492 4877 -1974 -3887 3155 2545 -2713 -702 711
2333 711 -3261 -22 3880 -1845 -4973 2534 4069 -1782 -724 1833 -1054 -522 3934 -414 -4477
2348 -4477 1667 2972 -2897 -2483 1614 -926 -1936 2360 653 -3435 1038 3843 -956 -1286 2817
2363 2817 337 -1980 1794 1428 -2877 -935 1657 -1750 -2041 2210 616 -2860 650 2605 -980
2378 -980 -266 2246 15 -498 2565 679 -3365 -234 2729 -788 -2920 -243 -414 -439 1687 586
2394 586 -2832 87 3579 953 -1821 450 1170 228 922 -230 -2737 -865 2470 94 -3060 -1080
2410 -1080 1207 487 594 153 -900 242 2969 975 -1593 -264 1481 63 -871 -772 -902 -227 642
2427 642 -372 -1380 -18 1200 448 -112 639 988 760 233 108 58 188 -52 -736 -1383 -303 947
2445 947 -86 -1442 -781 1104 1271 258 -287 46 1080 1502 231 -1651 -648 1526 784 -2051 -1809
2462 -1809 197 449 175 -133 -1538 -703 2292 1921 -1317 -1005 1747 1305 -96 81 -905 -1138 1338
2479 1338 956 -2536 -2037 1614 1049 -1173 159 409 -354 1272 1673 -998 -834 2539 656 -2519 -202
2496 -202 1288 -1118 -1393 623 -1253 -1464 2044 732 -2241 594 3033 -118 -1219 1764 831 -842
2512 -842 1534 472 -2996 -376 3019 -1161 -3616 799 1319 -1258 776 1073 -1819 215 3818 -231
2528 -231 -2982 1765 2627 -1659 -689 727 -1854 -1113 2900 -399 -3648 995 3001 -1435 -1276 2339
2544 2339 91 -1142 2398 793 -3080 964 3101 -2193 -2925 1730 298 -2437 1109 954 -2776
2559 -2776 769 3368 -1460 -2324 3531 1942 -2591 115 2116 -1665 -729 2194 -1719 -3280 2343
2574 2343 1718 -3083 -575 2583 -760 -1039 2591 -114 -1927 2725 2495 -3306 -1549 3020 -309 -2573
2590 -2573 854 -137 -2847 1248 2359 -2436 -1550 3808 577 -2445 1769 2080 -1676 212 2026 -2232
2606 -2232 -1899 2628 147 -3696 43 2162 -1634 -960 1945 -412 -1139 2929 1206 -2731 736 3470
2622 3470 -1038 -2251 1143 -290 -1758 1337 629 -3221 -320 3249 -716 -2204 1680 1712 -907 1313
2638 1313 1426 -1819 -142 2588 -711 -2950 676 1097 -1983 -202 1125 -1269 -837 2324 469 -1542
2654 -1542 1404 2288 -1096 -701 1606 -419 -1009 841 -71 -2226 378 1577 -1854 -1381 1585 906
2670 906 -827 668 1020 -336 921 1315 -1485 -1249 1580 604 -1424 -803 298 -662 -59 338 -940
2687 -940 -918 1706 1510 -768 -321 855 505 241 492 -617 -1072 662 373 -1632 -893 411 258 -251
2705 -251 -355 -36 112 686 856 -258 261 563 58 -132 -51 -17 -648 -628 -781 -169 -46 86 -451 -178 382
2726 382 380 687 56 -324 784 957 32 -842 116 20 -173 -240 -747 -1056 312 1451 -260 -823 309 873
2746 873 337 1003 60 -855 287 1178 -531 -1481 -184 422 -558 87 235 -1088 -102 1794 311 -1299
2764 -1299 656 1523 -392 368 802 -1193 -995 1315 -32 -1714 135 742 -1081 -527 1539 -311
2780 -311 -1353 1418 1455 -768 107 1348 -881 -454 1866 -382 -2345 220 1273 -1290 -577 1001
2796 1001 -1050 -978 2150 793 -1941 583 2288 -616 -443 1265 -820 -1780 1534 686 -3047 -664
2812 -664 1965 -459 -1262 1469 -116 -1734 2035 2358 -1864 -970 2380 -205 -1453 1282 14 -2504
2828 -2504 353 1943 -2193 -1922 1900 167 -1589 1315 1060 -1956 476 3172 -812 -2064 1410
2843 1410 657 -2138 773 940 -2915 -1188 2527 -830 -2279 1091 1515 -1311 678 2163 -1566 -1031
2859 -1031 2920 381 -2536 455 922 -1688 -319 1805 -2088 -2207 2095 1256 -1958 542 1971 -1209
2875 -1209 -406 2627 -396 -2292 1541 1331 -2099 -710 1346 -1660 -1213 1861 17 -2558 722 2084
2891 2084 -1023 -58 2057 -672 -1276 1995 967 -2563 -594 1546 -1168 -1218 951 -951 -1712 1942
2907 1942 1513 -1776 -556 2174 360 -581 1203 81 -1676 1704 1753 -2161 -2078 1814 -182 -1601
2923 -1601 465 249 -1534 1015 1924 -1176 -964 1934 1144 -870 237 686 -1292 -290 1102 -1106
2939 -1106 -1340 635 376 -1200 386 1040 -626 -263 1416 287 -739 691 241 -1092 217 816
2955 816 -1243 -1460 295 234 -984 261 -76 -707 791 1674 -393 -1075 845 1513 -21 -427 -241 -872
2973 -872 -35 698 -1066 -1748 167 1171 -259 -378 -160 89 739 1149 74 -962 492 1174 164
2990 164 -947 -918 -365 50 84 -898 -677 233 324 116 -162 230 575 512 108 -18 303 342 -312 -641 -75
3011 -75 -434 -160 0 -295 -332 581 454 -688 143 1134 480 -112 186 -292 63 996 233 -1529 -835 905
3031 905 286 -1041 -599 -479 -208 844 618 -1097 -315 1780 978 -909 -425 385 -64 246 309 -1763
3049 -1763 -841 1343 691 -1509 -299 942 -173 93 1222 -369 -365 1463 555 -1615 -16 1388 -439
3066 -439 -1013 335 -381 -1208 768 474 -1331 283 1921 -461 -1095 1653 1394 -664 -3 610 -1211
3083 -1211 -164 1675 -1011 -2187 764 1164 -1323 -524 1300 -374 -181 1904 -171 -1866 1534 2235
3099 2235 -1624 -1399 859 -169 -1039 955 -545 -2404 798 2203 -1019 -1042 1823 783 -797 1003
3115 1003 684 -1613 763 1943 -1429 -2042 1392 741 -1906 -171 1029 -1415 -153 2057 -456 -1271
3131 -1271 1959 1458 -1850 0 1832 -604 -889 967 -773 -1746 1285 711 -2370 -703 2280 18
3147 18 -1650 1430 518 -802 1473 1327 -2089 -667 2259 -3 -2378 -4 750 -1271 -95 1130
3163 1130 -1220 -883 2542 629 -1951 459 1926 -543 -338 1161 -900 -994 1654 -26 -2655 110
3179 110 1742 -823 -1099 1119 277 -675 1285 628 -1456 429 1926 -591 -1655 954 409 -1269
3195 -1269 89 368 -1413 -147 1671 -495 -1488 1180 1561 -537 25 544 -430 -73 1082 -501 -1614
3212 -1614 516 1274 -1667 -1370 644 -173 -254 881 19 -1006 1354 1839 -861 -786 971 211 -633 -124
3230 -124 -155 -1085 99 684 -1098 -1012 1229 746 -454 97 627 0 336 809 -527 -614 915 289 -1255
3249 -1255 -446 219 -229 -489 -342 -398 -188 1161 441 -798 -110 1243 710 -141 -238 -196 159 182 -150 -793
3269 -793 -282 549 70 -677 -430 314 717 472 -55 -484 279 669 407 -402 -599 -196 270 -208 -628 -413
3289 -413 129 196 -177 72 -47 19 833 362 -366 258 717 -66 -356 122 227 -530 -402 -294 -474 277 434
3310 434 -503 -921 777 676 -38 -186 594 258 174 587 -734 -1069 801 593 -1181 -999 87 50 306
3329 306 607 -511 -943 1005 1413 -442 -437 862 167 -436 390 -465 -1358 324 1045 -1203 -1203 837 472
3348 472 -639 315 284 -913 771 1424 -291 -912 938 21 -1347 82 706 -1216 -701 955 -574
3365 -574 -910 925 635 -1118 263 1571 -550 -772 1327 107 -1253 673 214 -1612 -116 1485
3381 1485 -325 -1611 733 882 -766 799 1104 -1000 -182 1974 -98 -1945 486 863 -1120 -459
3397 -459 736 -1159 -641 1615 59 -2222 483 1553 -584 51 1596 -460 -1195 1515 393 -1802
3413 -1802 -178 1186 -1173 -1118 1070 -402 -1502 1005 992 -1383 303 1924 -426 -817 1446 331
3429 331 -1582 346 1194 -1005 -1021 1031 -499 -1301 1266 679 -1390 49 1692 -667 -308 1437 -87
3446 -87 -1277 1111 1081 -1625 -817 1374 -486 -1337 506 -167 -1308 832 1372 -873 -536 1645 514
3463 514 -885 821 524 -1280 44 1224 -1247 -1453 1140 81 -1304 264 867 -963 12 1551
3479 1551 -144 -992 971 771 -693 284 726 -1086 -758 1254 -285 -1486 458 465 -830 185 1103
3496 1103 -375 -647 1032 436 -1028 330 638 -584 -222 822 -935 -1076 725 590 -1070 -3
3512 -3 162 -244 22 1170 161 -607 453 716 -376 -218 410 -563 -564 369 -113 -890 68 352 -118 -48
3532 -48 457 -117 -72 903 548 -376 -51 443 197 -122 -2 -762 -476 261 175 -706 -490 310 389 312 156 -203
3554 -203 85 796 357 -407 -345 -227 -33 181 -248 -699 -321 144 159 93 -215 -89 276 642 356 -45 143
3575 143 281 -120 -246 59 -316 -381 194 52 -414 -3 84 -224 173 898 -114 -325 536 623 -60 168 185
3596 185 -781 -323 826 -534 -756 114 556 -433 -99 398 -106 267 1173 209 -1012 507 911 -210
3614 -210 -266 324 -719 -589 900 128 -1262 22 1131 -318 -202 897 275 -505 745 521 -1266
3631 -1266 -213 948 -216 -898 314 -180 -1164 449 824 -890 -437 1397 126 -620 879 623 -937
3648 -937 407 829 -976 -556 823 -34 -1205 567 607 -1247 -80 1456 -64 -743 854 353 -731
3665 -731 846 994 -1076 -626 1551 217 -1471 204 374 -1296 212 1040 -1069 -743 1545 617 -1081
3682 -1081 507 837 -800 -32 1176 -1030 -1566 1130 478 -1668 -273 712 -526 -353 872 -196
3698 -196 -1140 1043 947 -1205 -126 1396 -525 -1051 936 -113 -1458 346 806 -1194 -526 1524 -328
3715 -328 -991 1201 860 -1128 224 1360 -766 -393 1215 9 -1460 418 906 -1082 -470 708
3731 708 -654 -649 1078 180 -1262 588 1323 -568 -480 1095 -322 -853 744 92 -1058 62 975 -1027
3749 -1027 -1232 1072 162 -793 562 756 -646 360 1218 -230 -855 762 411 -1122 -48 459 -798
3766 -798 -541 853 -411 -799 830 930 -582 -80 1049 -373 -370 965 -111 -1010 191 613 -886
3783 -886 -300 746 -42 -364 366 148 -771 685 703 -456 -217 833 180 -561 61 69 -760 -117 276 -724
3803 -724 -521 523 -147 -685 293 557 34 209 446 -84 -236 444 190 -773 -36 337 -350 -325 143 -166
3823 -166 -18 424 16 -289 235 643 21 -36 385 107 -106 109 -353 -571 111 184 -438 -530 77 208 54
3844 54 154 -260 -56 473 384 10 89 100 -91 228 -336 -506 -65 298 -376 -313 87 28 153 230 387 -124
3866 -124 6 725 139 -629 133 96 -530 -225 114 -648 30 354 -194 -625 390 722 17 89 649 -205
3886 -205 -159 581 228 -563 297 278 -853 -570 520 37 -609 446 299 -403 292 649 -399 -327 847
3905 847 58 -705 317 405 -625 -163 469 -938 -723 872 351 -648 256 491 -340 38 1134 -301
3923 -301 -821 784 350 -1284 -11 658 -634 -743 733 -209 -740 806 842 -611 -142 1366 -176
3940 -176 -507 1148 458 -859 213 539 -832 -356 902 -287 -1094 452 646 -894 124 1137 -269
3957 -269 -534 1027 259 -1296 708 901 -1066 -467 774 -646 -667 1005 12 -1181 552 1145 -472
3974 -472 -613 1095 20 -528 733 495 -1195 -231 1236 -905 -870 618 -18 -897 457 658 -823
3991 -823 -219 1352 -151 -550 912 281 -873 318 857 -1061 -522 933 -338 -779 599 496 -916
4008 -916 -185 1028 -155 -560 805 288 -653 575 501 -803 -300 1023 -469 -1085 691 284 -540 561
4026 561 619 -601 -166 1412 134 -879 228 560 -487 22 888 -485 -550 650 207 -890 -111 570
4044 570 -396 58 1032 -155 -590 849 442 -612 -16 555 -598 -563 775 -112 -848 104 545 -478
4062 -478 -239 435 -95 8 752 174 -660 471 500 -61 -223 76 -359 -467 348 -22 -829 -253 588 -119
4082 -119 -278 288 176 -333 582 472 -284 -305 570 -150 -303 85 -367 -484 262 351 -355 -169 345 390 70
4103 70 462 45 -37 79 382 -117 -334 125 -373 -113 -46 -460 -272 61 96 -159 -350 228 99 278 183 46
4125 46 -166 17 224 -47 -98 -25 -234 -12 399 -309 -102 216 -119 249 272 65 -219 470 507 -200 -110 303
4147 303 -155 -103 -17 -256 -330 34 393 -235 -346 407 298 -77 360 580 -357 -66 449 -223 -651 227 -445
4168 -445 -585 467 257 -485 -623 559 43 -93 300 364 -462 243 556 -401 -590 493 6 -620 189
4187 189 -209 -656 166 692 -340 -644 548 567 -443 249 296 -369 -169 736 -167 -841 377 131 -865
4206 -865 -38 330 -579 -441 827 -185 -811 730 631 -596 43 571 -374 -514 610 244 -910 178
4224 178 795 -714 -672 1000 -80 -646 801 766 -468 156 562 -672 -290 622 -58 -1226 60 273
4242 273 -789 -331 368 -175 -421 885 300 -928 402 1090 -663 -489 797 -189 -757 632 119 -1137
4260 -1137 -29 644 -562 -787 428 13 -649 570 552 -760 -122 1482 -174 -778 416 119 -850
4277 -850 -48 618 -754 -218 850 44 -937 453 731 -643 114 650 -264 -288 603 -60 -1237 218
4295 218 570 -745 -428 578 -276 -467 569 430 -563 130 897 -170 -351 1050 261 -778 94 101 -716
4314 -716 -182 452 -775 -427 614 199 -563 243 350 -114 -84 506 -267 -510 709 197 -912 -87 483
4333 483 -315 -324 533 -298 -442 575 423 -686 -145 879 12 -203 302 451 -421 184 242 -472 -237 525
4353 525 -50 -517 -26 236 -293 145 588 -19 146 485 72 -339 160 329 -491 -190 70 -279 -248 116
4373 116 -40 -400 154 547 -65 25 351 58 38 10 2 -462 -85 167 9 -406 -63 67 -88 302 -150 -73
4395 -73 452 369 14 258 254 1 -68 -95 -201 -82 325 42 -301 -131 170 -148 212 -101 -143 304 278 125 -40
4418 -40 204 408 -35 -400 52 35 106 22 -343 -471 279 338 -322 -114 6 81 229 473 129 -118 356 26
4440 26 -703 -426 563 -78 -322 327 -297 -278 414 209 -142 96 634 192 -224 309 100 -368 184 347 -657
4461 -657 -363 543 -120 -416 77 218 -341 247 474 67 -184 662 83 -464 42 340 -461 -136 202 -358
4481 -358 -424 378 130 -1021 27 584 -196 -248 571 -19 -213 321 104 -818 -127 582 -398 -682 329 105
4501 105 -542 113 468 -653 -122 767 -208 -546 368 519 -677 154 515 -498 -229 642 -156 -715 480
4520 480 263 -560 -8 833 -151 -496 718 8 -462 286 588 -730 -538 617 30 -799 337 -6 -668
4539 -668 189 570 -638 -458 936 192 -600 374 580 -693 -64 411 -610 -402 659 239 -597 215
4557 215 383 -374 183 839 -31 -491 368 292 -553 -277 434 -389 -401 403 10 -831 209 344 -503 -237
4577 -237 650 -202 -251 849 213 -400 376 600 -611 -38 659 -129 -726 353 117 -611 90 414 56
4596 56 -234 596 2 -516 564 651 -189 -399 287 -263 -289 206 -237 -567 0 377 -562 -389 626 333
4616 333 -221 270 174 -225 311 504 -199 -560 36 -52 -430 -73 164 -377 -152 493 -85 -287 453 323 -52
4637 -52 -69 399 -415 -344 266 -52 -274 66 34 -319 -29 198 -310 -96 403 31 244 255 292 -55 16 268
4659 268 -75 -284 -143 -159 -105 -8 -89 -10 109 -7 -79 -145 142 131 -12 260 122 -156 -11 -36 119 -430 -84
4682 -84 76 12 -217 37 -147 403 149 96 153 123 106 124 292 237 -144 -81 108 -420 -126 92 -524 -211 142
4705 142 20 -208 342 142 -13 240 241 -112 -350 235 57 -162 57 21 -399 -19 154 -227 -71 524 -69
4726 -69 -390 150 300 -342 -70 448 -294 -292 200 145 -155 54 118 -333 -222 381 -98 -347 327 408 -55 142
4748 142 417 -237 -266 222 -204 -541 100 582 -446 -159 443 -259 -249 557 216 -493 256 467 -205 -202 469
4769 469 -23 -582 428 207 -670 -10 461 -297 -331 567 63 -483 227 444 -236 -11 351 65 -345 302
4789 302 164 -572 67 443 -542 -411 293 151 -251 430 568 -492 232 754 -509 -107 136 41 -696 -6
4809 -6 257 -583 -375 592 -164 -669 495 166 -603 61 604 -210 -352 626 -28 -722 239 33 -548 -367
4829 -367 374 -479 -251 656 84 -575 17 387 -379 -130 703 -290 -509 594 318 -311 -171 -21 -580 -156
4849 -156 471 -431 -583 419 530 -229 -67 502 -210 -317 409 8 -547 285 383 -436 -320 191 -103 -681
4869 -681 392 12 -575 462 616 -155 -112 444 43 -384 281 409 -462 -172 281 -369 -444 287 173 -315
4889 -315 125 309 13 31 672 -52 -277 437 162 -593 -161 76 -330 -302 126 27 -481 142 106 -196 147
4910 147 611 -176 -7 169 151 -51 215 138 -318 -243 457 -163 -511 365 109 -153 -16 180 -117 -8 261
4931 261 228 -288 97 82 -454 -83 120 -104 -19 -33 -82 -211 68 68 -129 197 367 106 120 237 -167 155 341
4954 341 265 -190 -278 -73 -244 109 -37 -120 -315 89 152 107 283 393 282 192 71 -83 16 259 -33 -351
4976 -351 65 135 -244 -62 267 -305 31 203 89 -225 148 21 -117 44 27 -236 -288 56 -294 -215 221
4997 221 134 -86 -173 287 16 1 389 141 -29 385 148 -507 -200 195 -158 -440 40 -143 -193 -230 407 -200
5019 -200 46 535 129 -181 188 294 -2 -81 256 -405 -290 243 -56 -434 129 438 -340 -292 224 -106 -21
5040 -21 582 -17 -364 494 247 -411 -328 390 -96 -160 183 183 -294 85 471 -134 -103 395 249 -301 372 302
5062 302 -455 -97 426 -160 -461 202 141 -535 96 257 -312 -129 456 -143 -127 397 66 -504 56 372 -224
5083 -224 -487 457 -223 -929 115 245 -762 29 447 -204 -149 567 301 -500 318 261 -405 -213 276 -114
5103 -114 -741 108 247 -585 48 420 128 -65 713 -4 -353 536 277 -374 -5 442 -247 -453 450 276
5123 276 -702 -149 269 -368 -11 431 127 -81 723 206 -409 79 354 19 -418 172 -122 -414 261 202
5143 202 -464 -313 374 -30 22 378 222 -430 370 306 -369 -170 181 -268 -552 193 31 -196 56 478 -191
5164 -191 -214 431 -66 -38 574 385 -229 185 262 -188 -277 -8 205 -431 35 229 -241 -316 339 30 -368 38
5186 38 147 -316 185 147 -64 -117 171 -134 -439 -119 -80 143 -354 34 -2 42 218 233 -282 18 275 160
5208 160 -261 268 143 -246 -109 34 -322 -167 33 -230 110 280 -46 -247 -105 202 150 133 216 -220 45
5229 45 100 -230 -182 -2 135 -308 159 -73 -180 -207 305 33 114 317 -165 -10 82 135 -363 -93 162 30
5251 30 -135 -56 115 -59 9 278 -359 -32 390 13 2 209 66 -206 -53 -45 -150 -79 88 143 -5 160 124
5274 124 -110 250 76 -109 244 224 173 56 318 94 -288 -86 23 -265 -297 46 -177 -240 178 -20 -32 383
5296 383 242 -212 134 343 56 -20 -39 -147 -366 -93 297 -179 -18 126 214 -380 365 233 -143 -29 474
5317 474 -279 -268 163 -15 -639 -50 170 -463 -107 268 -133 -306 330 100 -156 90 434 -455 -42 348
5337 348 82 -430 225 303 -495 -92 415 -526 -455 598 114 -180 119 497 -325 -140 383 -111 -379 35
5357 35 154 -484 -186 435 -629 -115 352 -91 -434 457 297 -477 -178 210 -213 20 478 -98 -362 -23
5377 -23 312 -387 -358 142 -117 -505 328 92 -296 142 443 -664 -208 562 -256 -303 294 74 -411 -198 218
5398 218 -397 -497 534 -156 -446 360 409 -176 -107 306 -119 -132 212 362 -150 -37 427 -362 -564 386 137
5419 137 -318 260 200 -326 -372 386 -5 -328 565 160 -325 271 218 -503 -180 252 64 -512 -37 -142 -375
5440 -375 -67 176 -125 161 542 161 -221 228 304 20 -58 198 -274 -152 131 14 -433 157 44 -73 170
5461 170 168 164 -266 335 239 -85 29 284 -318 -104 4 -175 -288 175 251 -190 202 344 34 -179 223 132
5483 132 -176 67 -22 -359 -117 308 -62 -173 224 35 -496 -57 -10 -136 -200 249 -42 -291 -5 -59 -296
5504 -296 -131 25 -27 -157 -11 -15 -155 113 119 -37 -15 25 238 -54 -44 220 34 147 129 -136 140 125 -355
5527 -355 -33 -85 -181 -27 165 -101 -30 372 187 -211 -195 207 110 -109 -12 -233 -202 195 31 -204 -147 -39 -72
5550 -72 -45 -74 -112 -57 169 108 -26 10 7 -101 -242 229 -2 -254 125 -190 -290 106 276 -318 -73 161 259
5573 259 -147 212 254 -61 -16 453 60 -487 -68 84 -193 -56 -6 -171 51 370 -223 -222 281 215 -16 -20 303
5596 303 -307 -163 48 -78 -405 -208 466 -487 -211 373 36 -501 408 125 -101 60 175 -295 -232 152
5616 152 -373 -166 144 253 -374 117 519 -202 -181 630 312 -393 7 386 -320 -10 210 -162 -192 265 84
5637 84 -351 120 147 -190 -202 278 39 -207 406 252 -367 238 538 5 -210 248 52 -583 263 62 -230
5658 -230 -177 293 1 -292 199 400 -287 192 265 -191 -161 318 -216 -521 150 -123 -353 -231 256 -161 89
5679 89 328 -46 -69 197 179 53 45 673 -35 -346 170 -101 -303 81 161 -255 -441 317 0 -307 239 262
5701 262 -165 186 436 -163 -122 537 97 -263 -109 76 -271 -128 233 -187 -201 169 28 -143 32 238 98
5722 98 -35 133 161 -587 -69 121 -146 -267 73 -309 -371 265 200 30 -82 492 -20 -21 289 -26 -195 16
5744 16 302 -442 -122 148 -312 67 304 -39 -270 136 -21 67 199 231 -165 -163 98 -53 -91 101 313 -108
5766 -108 -72 23 -239 -233 168 -38 -64 134 335 19 -195 134 21 -143 32 -160 -338 -86 47 10 -74 128
5788 128 -58 -69 51 -191 -210 2 40 4 14 99 -24 -166 -40 -202 58 -53 89 11 143 253 -117 -91 -122
5811 -122 11 162 -6 145 -290 -236 -19 -268 -264 -166 -77 -89 -86 -113 -41 -85 133 -5 8 230 -9 -137 -64 47
5835 47 -108 -5 97 -87 -212 202 4 -99 -5 130 107 227 -25 -26 121 158 -13 -202 16 146 -59 31
5857 31 18 -271 -151 117 40 -332 264 219 -92 129 412 -72 -303 236 61 -303 183 -95 -196 70 330
5878 330 186 -489 50 245 -120 82 452 -229 -74 531 -33 -245 180 71 -253 -13 364 -245 -431 115
5898 115 419 -198 14 241 -238 -22 495 19 -147 343 249 -374 -4 356 -161 -276 314 -44 -353 -103
5918 -103 389 -352 -149 318 89 35 283 267 -176 20 89 -330 -286 312 150 -110 89 336 -377 -194 370
5939 370 -169 -123 247 237 -307 251 -70 -462 -291 240 -144 -201 59 130 -404 113 484 -160 -231 541 190 -195
5961 -195 288 38 -374 12 265 -324 -514 322 265 -156 17 315 -322 195 343 -248 -261 200 208 -218 84
5982 84 179 -376 -111 31 139 -291 94 190 -335 -47 252 -136 58 375 2 -133 455 260 -364 -250 133
6003 133 22 -259 17 42 -429 35 260 -332 -54 173 -124 -210 250 144 -167 -138 154 -141 -250 250 -6
6024 -6 -262 55 142 -391 39 371 184 -15 327 197 -73 11 10 -310 -284 -126 -60 -105 -4 53 -191 -147 215 235
6048 235 172 244 137 -30 121 281 -483 -309 220 113 -242 212 -171 -341 -105 -92 -276 -17 164 -107 -202
6069 -202 309 224 -111 121 -21 -52 -107 477 167 -240 -37 213 -114 167 170 -135 58 32 -99 -141 58 -141
6091 -141 61 -102 7 77 -37 -54 -225 -22 -77 -23 28 36 172 -36 101 186 37 -57 -4 -155 -368 160 109 -153
6115 -153 -62 185 34 -158 360 -34 -41 -77 4 -108 30 144 -220 -118 -115 -268 -348 -68 78 -222 -7 73 -296
6138 -296 -50 309 28 -268 170 468 -133 -74 286 -25 -221 -60 -114 -298 203 75 -219 -165 194 -201 -201 231
6160 231 147 -399 158 327 -132 -182 427 -66 -261 -71 111 -228 -13 63 -127 -188 283 74 -300 166 125 -177
6182 -177 -122 303 -95 -517 -29 120 -496 -119 377 -28 73 285 -92 -335 321 226 -8 41 200 -100 -336
6203 -336 -160 -275 -443 116 344 -185 18 309 49 -147 164 364 -134 18 396 -103 -92 208 14 -292
6223 -292 329 30 -276 -78 312 -465 -183 365 133 -219 351 236 -124 -432 251 -38 -229 62 56 -305 -154
6244 -154 209 -408 -178 247 373 -53 141 222 -108 -30 195 -360 -73 277 -22 -212 -125 222 -321 -111 266
6265 266 -113 -359 216 129 -124 292 209 -390 12 343 -43 -280 -2 303 -391 122 185 -93 -181 477 208
6286 208 -220 140 451 -197 97 232 -26 -323 263 212 -368 -55 32 -173 105 111 18 -4 131 229 -27 59 64
6309 64 -63 -93 126 -108 -173 207 299 -245 -158 355 -26 -135 -6 98 -144 253 224 -205 -17 146 32 -424
6331 -424 -144 -235 -441 -163 -109 25 -332 84 -49 14 112 50 -145 120 -3 8 -26 77 -106 -194 179 -84 -174
6354 -174 -262 184 240 83 53 81 3 12 67 20 213 -53 286 212 -218 -102 -181 87 46 -205 1 184 -60 156
6378 156 139 281 -16 -218 160 -155 19 124 1 -134 39 -262 37 35 205 -103 129 -135 -13 -404 200
6399 200 309 -345 232 249 -20 -69 -17 -130 -111 128 115 -351 132 307 -107 85 -25 -15 -186 408 10 -37
6421 -37 -142 303 -131 -25 136 -119 -69 -23 138 -268 10 219 66 -194 242 -20 -273 179 261 -121 42
6442 42 242 -285 -171 137 -165 -143 297 167 -131 4 392 -49 -98 176 198 23 205 136 -501 -7 203 -150
6464 -150 -116 312 -105 -205 -86 466 -117 -94 375 137 19 71 396 -417 -157 48 167 -317 64 -111 -14
6485 -14 -23 340 -170 -157 326 150 -62 155 285 -97 -4 294 -381 -177 49 -27 -240 254 54 -258 -21 280
6507 280 148 77 328 -26 -137 55 269 -216 -163 201 -155 -213 -2 -180 -183 88 278 -107 -62 254 141 -264
6529 -264 8 -96 -294 -24 51 -49 -204 17 -144 -120 -14 -12 -283 -64 494 183 66 349 10 -21 12 289
6551 289 -151 -297 196 -71 -176 271 147 -384 32 196 83 -154 61 140 -204 27 308 9 -276 328
6571 328 -245 -197 -154 -105 -324 71 -93 -33 -78 121 -101 -276 137 5 -209 2 -49 -140 -188 24 28 -315 37
6594 37 278 -90 -38 108 -190 -164 42 151 -163 89 313 30 -72 -3 -62 -302 12 18 -28 131 -169 -95 0
6617 0 28 -126 -29 141 121 -177 232 17 -106 -53 181 -226 -107 -8 218 -97 -111 275 -173 74 -67 -40 -73
6640 -73 4 79 -56 158 -200 32 -115 -59 -59 -225 49 -14 -103 -118 304 -113 272 77 82 -9 79 154 -178 88 -166
6665 -166 -177 130 -37 -173 172 15 -34 -11 164 306 -248 47 68 -74 64 130 -68 -302 111 194 77 -155
6687 -155 -54 -102 10 25 137 -132 -212 185 -56 -299 112 -66 1 67 42 -271 36 121 -79 -12 290 -27 -130
6710 -130 13 62 -106 -103 131 -143 -171 -6 -49 -211 -114 121 -161 -124 384 -3 -251 166 -12 -87 -54 129 -22
6733 -22 -143 178 -272 -87 189 87 -229 -82 246 67 -194 42 36 -82 -39 26 -81 -40 246 170 -198 113
6755 113 132 -235 29 367 -227 -142 176 -9 4 71 123 -290 90 442 -249 103 229 -10 -555 308 -7 -309
6777 -309 -143 181 62 -239 160 -20 -149 -162 -36 -121 -273 304 -36 -248 140 137 -64 39 278 -67 -271
6798 -271 230 108 -205 142 234 -34 -20 363 -169 -399 312 77 -291 -82 28 -67 6 -33 87 -333 42 103
6820 103 -19 62 307 -145 31 347 -26 -269 -14 156 -176 87 274 312 -115 308 308 -171 -72 213 -172 168
6842 168 189 161 -408 331 204 1 47 176 -235 -161 68 313 -98 85 264 -21 -48 -116 192 -168 66 -4
6864 -4 -231 -14 98 -137 -66 146 -58 -182 72 78 113 6 216 -277 -163 256 -3 -244 -39 78 -316 -386
6886 -386 -236 -352 -110 -54 71 -13 -29 63 -163 -6 149 37 -33 141 -102 45 -279 14 23 -157 242 -164
6908 -164 -125 18 13 -107 114 84 -64 -1 -42 56 -65 69 87 -201 -82 55 -128 210 124 -310 177 174 -60 38
6932 38 129 40 34 137 31 -113 78 -206 -5 -19 -220 -286 -85 14 -45 -209 -131 -144 167 -48 -37 -24 95 -276
6956 -276 10 -213 -234 82 27 38 -52 303 -371 -306 219 -135 -127 93 -9 -201 144 -44 -261 -119 40 -9 -337
6979 -337 63 124 -278 77 131 -137 -59 323 -126 -117 107 393 -126 -35 44 28 9 367 13 -187 181 77 -157
7002 -157 -16 177 20 -29 183 -44 -178 44 142 -103 -119 286 -156 -181 -28 80 -303 99 342 -182 -17
7023 -17 195 -57 -81 397 -68 -313 -25 380 -35 -220 231 94 -130 -40 188 -144 244 -15 125 -245 251
7044 251 125 -207 221 -5 -318 -28 -20 25 -258 195 148 -139 133 145 -51 -198 214 31 -8 158 25 -243
7066 -243 -111 75 -128 -8 91 104 101 30 289 -207 -2 170 -7 106 -33 392 55 42 334 -175 -172 110 309
7089 309 -251 -137 299 -227 -21 296 122 -21 158 49 -168 111 67 -50 105 66 111 -63 -192 107 1
7110 1 5 24 82 8 -63 108 -71 -32 377 8 -165 310 -353 -184 192 137 -135 -287 182 -5 -96 181 -15 -17
7134 -17 364 19 -47 16 300 -219 -88 -12 40 68 130 -27 -99 -127 220 -44 -48 208 39 43 -202 161 -12 -9 -29
7159 -29 -1 -22 94 152 58 210 -76 -236 -59 15 211 198 74 23 -133 -58 235 -171 222 -258 -156 -288 -161
7182 -161 -118 -175 -320 13 85 89 90 276 1 -186 -21 53 -281 285 -196 -90 -30 -99 -21 -190 288 -80 119 38
7206 38 -133 -103 122 51 71 -188 -224 -146 25 40 -137 -92 -32 228 -56 -70 139 -62 -101 -33 25 274 62 -56
7230 -56 67 -94 -21 143 6 77 38 -208 123 -235 2 19 106 44 219 122 -97 -99 227 -134 28 -89 67
7253 67 -231 -24 -182 107 175 -175 93 -263 -10 299 -40 18 336 -21 151 21 36 14 -189 -226 -96 -143
7275 -143 163 38 -78 218 270 -113 -103 229 -75 -69 79 292 -309 210 155 -92 -176 45 -219 -308 -47 162
7297 162 -130 75 -46 -116 -19 143 -136 -258 47 16 -35 -204 97 23 -348 45 155 -147 364 198 -35 218
7319 218 183 -202 -253 106 -95 -57 22 280 -64 -262 158 97 -128 102 304 -134 155 53 -338 -50 179 88
7341 88 -176 -140 30 -208 -164 18 -113 -353 53 22 -249 81 241 -265 -12 305 -15 -200 -124 23 -62 66
7363 66 27 65 -58 53 239 -161 273 253 -129 -74 -73 42 -411 244 413 40 171 230 -29 -61 -31 129 -190
7386 -190 16 224 -24 -107 -119 34 -91 12 -155 -41 53 170 -102 -98 -204 -63 -91 33 84 -178 40 179
7408 179 -68 -55 84 135 -90 215 102 -220 -176 128 -119 51 -12 26 54 175 256 -169 247 213 18 -167 108
7431 108 -121 -256 30 139 -82 91 116 162 -242 118 153 -104 126 89 -36 -269 189 50 -104 32 14 164
7453 164 -46 -45 -152 72 15 -209 -129 39 13 -39 -106 110 -198 -88 66 -62 -59 30 78 59 33 -97 -190 46 -65
7478 -65 -230 157 234 -67 141 150 29 -107 -2 181 -58 90 352 30 -186 81 -159 -121 26 140 -68 -146
7500 -146 233 -84 -53 9 281 -6 -283 -84 -87 -184 -56 -82 -372 -51 204 -126 -209 275 137 -280 93 360
7522 360 -58 76 123 -278 -21 -77 92 -273 -214 340 40 79 201 -149 -51 204 -131 -42 63 66 19 -242 6
7545 6 -42 -320 204 1 -64 -10 220 -140 22 133 -215 -111 98 124 -101 137 126 48 -68 -11 -43 -118 12 111
7569 111 -237 106 227 51 62 -40 91 38 -62 -59 -237 -279 73 -104 -62 111 247 -273 311 -36 -41 127 101
7592 101 95 -176 78 -26 -118 37 134 -2 -225 215 -150 -8 -145 242 -233 -82 127 -89 3 257 193 -87
7614 -87 -89 131 -119 -274 143 -27 -214 58 -19 -108 -184 -176 72 -216 368 61 -310 -42 321 -82 -96 76 -102
7637 -102 -181 186 108 -202 -38 223 109 -164 122 15 -188 53 97 -227 -32 435 -131 -186 224 219 85 148
7659 148 259 -411 126 270 260 -61 123 130 -130 226 197 25 -175 48 -129 -297 66 289 -160 -206 118 -83
7681 -83 26 152 214 -87 125 285 -135 141 5 53 -325 58 26 -163 67 11 -161 -26 236 280 38 196
7703 196 30 6 183 177 -128 -161 -60 -53 -91 53 113 64 78 81 -177 -27 168 119 -350 167 83 35 3 99 -280 -125
7729 -125 -43 -122 -34 22 1 -59 -45 138 -37 14 118 93 -126 -81 129 -299 -82 291 -80 -78 -19 -67 111 55 -13
7754 -13 -154 159 -36 -97 -50 68 -12 -306 -142 57 -18 -171 103 178 51 140 -107 -113 144 73 28 -35 -15 105
7778 105 31 129 325 -45 -37 -169 -83 -155 133 -4 -248 86 -25 81 -112 176 -89 178 279 169 -19 131
7800 131 25 105 -71 149 37 3 30 -29 -94 103 187 -133 130 128 111 -63 7 49 -135 12 -11 -251 -76 129
7824 129 125 74 191 66 -138 42 -32 -228 38 -160 -79 -73 140 6 -150 -2 70 -263 -355 15 -43 21 66 400
7848 400 -4 145 165 -147 156 38 116 -28 106 42 -358 -77 301 -305 -139 270 -196 -81 52 108 33 75
7870 75 212 200 130 -27 110 -181 128 203 68 -113 11 -219 -89 90 161 -60 -253 190 -62 -97 101 252
7892 252 -102 69 129 -210 -153 219 186 -78 127 48 -100 38 322 33 3 270 78 -245 74 136 -90 29
7914 29 194 -195 -162 -47 18 -144 -54 226 -167 -29 226 196 -91 131 -186 -200 -73 -125 -245 -238 -163 -84 -222 -121
7938 -121 282 54 -336 172 44 -75 230 -43 -284 -2 -161 41 42 338 -105 -220 95 172 -47 -47 -25 54
7960 54 -131 36 159 -96 -4 208 -131 -51 285 -18 -29 210 207 -223 -78 162 143 -20 125 87 -175 337 -49
7983 -49 -50 -31 9 73 -138 231 31 -359 22 79 -20 200 80 56 303 21 -38 -339 -88 178 -229 -29 54 90
8007 90 19 149 196 -155 131 22 -49 83 297 -71 76 37 159 -43 -110 118 21 -135 121 -238 -22 -52 42
8030 42 -96 -60 45 62 -156 219 46 -374 -76 222 72 -143 135 -266 81 6 127 -169 20 -106 -183 177
8052 177 -11 -82 -45 -59 58 49 200 27 -80 46 238 4 -19 149 -63 24 168 -96 -168 -76 87 173 -81
8075 -81 -101 -127 -175 274 27 -193 -103 159 -111 38 -1 -47 31 326 207 -314 81 252 -181 -154 170 -19 -87
8098 -87 -28 -103 -177 13 122 27 1 68 -273 11 -142 294 -117 222 -22 -272 -196 30 207 -43 109 114 11
8121 11 -19 93 138 -108 19 -56 -161 -89 86 -123 -251 -39 36 -79 -65 65 -420 -8 90 180 -155 110 25
8144 25 -22 -27 69 79 -102 346 105 -180 43 -100 -325 26 15 -180 -190 126 -136 -149 24 -51 -103 157 70 -127
8168 -127 8 95 -175 -67 -82 -57 -27 -37 278 101 -146 -91 236 -74 -142 297 -177 -156 227 -108 -427 48 -270
8191 -270 -145 -81 81 243 106 253 -121 -312 4 303 125 131 84 103 -47 -66 32 -245 -263 161 -112 -104 -51 39
8215 39 -79 61 30 -94 91 64 65 57 72 46 -258 -154 138 3 -196 40 202 -205 395 241 -150 221 57
8238 57 -88 61 110 -33 -145 36 -189 -531 61 306 -132 -106 120 -30 0 81 77 -249 -97 140 -157 -130 -49
8261 -49 197 -318 36 142 -271 -216 -78 140 -93 263 139 -72 89 46 -10 -67 207 34 19 57 32 -52 -106
8284 -106 -299 111 53 -139 -140 -126 -25 -46 -77 42 41 38 35 -29 -49 -214 124 16 -47 -103 -111 161 183 49 -13 -61 141
8311 141 94 21 -2 114 -41 78 113 -85 -208 74 -265 -202 285 61 41 5 390 46 -218 -67 219 -137
8333 -137 -37 127 -222 141 79 39 -252 138 1 -20 263 234 -73 196 181 -193 -80 -87 -174 -10 30 89 52 -199
8357 -199 -168 -146 21 -57 49 166 3 -151 137 -245 -15 -158 -305 -82 133 -147 93 97 -156 -170 -73 23 72
8380 72 89 20 -97 15 -295 -58 -288 140 258 50 -56 -88 -135 266 80 113 11 -77 151 -5 144 104 88
8403 88 -65 120 -41 28 49 60 103 -100 31 -138 60 120 129 -99 84 11 45 -40 42 90 130 92 135 -224 -71
8428 -71 24 -122 -161 141 86 92 114 104 -202 12 412 72 39 44 147 -128 -59 -251 -358 -212 283 55 -302 -68
8452 -68 -82 -131 -60 315 -11 -25 439 143 127 -115 1 27 -184 192 -310 29 226 110 -107 5 35 143 79
8475 79 208 206 -98 -9 175 -21 -171 -42 158 -8 197 189 -39 357 98 -142 82 -102 53 39 177 59
8497 59 -128 -151 128 -174 -131 57 -137 -381 79 210 -39 99 229 -191 -41 131 134 -72 101 272 -247 -49
8519 -49 298 -137 -109 85 -1 25 -34 308 -44 -46 251 46 59 183 166 -3 -164 166 -196 -130 38 61 -102 -61
8543 -61 57 -111 -120 52 60 29 137 222 20 -55 -14 -245 129 276 -116 -106 56 -54 112 144 253 -192 -264 244
8567 244 5 -162 31 106 -182 -82 95 -185 -368 156 157 -61 16 -53 -163 178 104 70 153 132 2 -118 98
8590 98 -4 36 162 -90 -132 108 4 -167 -37 152 44 -239 -206 64 -7 -28 -23 -125 -248 51 101 135 57 -118
8614 -118 -127 31 43 -128 113 113 -77 220 29 275 277 -48 -27 -85 11 -270 -269 -23 -150 33 205 -77 145 -54
8638 -54 -120 44 -87 -17 118 115 -217 -107 -37 127 25 -57 212 29 -216 23 -102 -104 188 79 98 28 -102 -70
8662 -70 -199 -152 -28 -333 -158 52 -37 -37 93 -135 -35 132 98 -183 318 45 -38 -8 -2 -172 -108 -101 -34 -133 89
8687 89 67 -54 32 90 86 -107 -112 122 -242 69 413 -148 -155 25 35 -61 -191 1 -338 174 137 5 83 184 108
8712 108 -216 374 164 -14 -221 62 113 -328 -6 -9 -121 -121 -25 -39 -117 386 -49 170 268 189 11 -151 233
8735 233 107 -56 -49 377 65 -6 162 -52 138 230 56 148 -11 -76 11 37 107 70 -41 158 85 -61 10 -43
8759 -43 -186 -139 -73 -116 -276 95 220 -32 26 175 -161 -257 165 137 -209 89 69 -5 -171 56 27 -84 181
8782 181 -75 -89 156 355 -343 -124 135 -109 -47 265 134 -237 -130 217 -32 -94 -33 -63 -136 122 145 85 401
8805 401 174 -38 -104 212 82 -244 95 7 -115 -5 323 328 53 49 -187 -123 276 208 -178 128 69 24 -204
8828 -204 -81 81 42 -26 230 -318 60 323 -16 -231 -40 323 -34 -111 151 3 -93 101 -173 220 -210
8849 -210 174 -87 -39 102 220 -38 -45 217 -75 137 44 -70 44 203 -129 -151 -30 -153 -144 175 -72 -46 -321
8872 -321 262 -127 -116 237 174 56 298 171 52 24 -111 -96 -207 -353 -158 -47 -211 -175 127 -42 -99 163
$$ [...]
16383a63
##END NTUPLES=NMR FID
##END=
