##TITLE=abcd
##JCAMPDX= 6.0         $$ Bruker NMR JCAMP-DX V2.0
##DATA TYPE= NMR SPECTRUM
##DATA CLASS= NTUPLES
##ORIGIN= UXNMR, Bruker Analytische Messtechnik GmbH
##OWNER= root
$$ XWIN-NMR		Version 3.5
$$ Wed Sep  3 18:44:02 2025 Russian Standard Time (UT+4h)  servis@DPX200
##.OBSERVE FREQUENCY= 200.131235884673
##.OBSERVE NUCLEUS= ^1H
##.ACQUISITION MODE= SIMULTANEOUS
##.ACQUISITION SCHEME= undefined
##.AVERAGES= 32
##.DIGITISER RES= 18
##SPECTROMETER/DATA SYSTEM= spect
##.PULSE SEQUENCE= zg
##.SOLVENT NAME= CDCl3
##.SHIFT REFERENCE= (INTERNAL, CDCl3, 0, 16.4885)
##AUDIT TRAIL= $$ (NUMBER, WHEN, WHO, WHERE, WHAT)
$$ ##TITLE= Audit trail, XWIN-NMR		Version 3.5
$$ ##JCAMPDX= 5.01
$$ ##ORIGIN= Bruker BioSpin GmbH
$$ ##OWNER= servis
$$ F:\spectra/data/av/nmr/H1/1/pdata/1/auditp.txt
$$ ##AUDIT TRAIL=  $$ (NUMBER, WHEN, WHO, WHERE, WHAT)
(   1,<2025-09-03 18:43:09.79 +0400>,<servis>,<DPX200>,
      <created by zg, POWCHK disabled, PULCHK disabled
       configuration hash MD5:
       00 E9 B6 7A A2 85 ED C7 34 08 36 98 17 FE 4E 26
       data hash MD5: 32K
       98 2C E3 44 9C 8C C1 F5 B1 EE B1 C6 E5 1A 6F E8>)
(   2,<2025-09-03 18:43:13.04 +0400>,<servis>,<DPX200>,
      <Start of raw data processing
       efp BC_mod = 2 LB = 0.05 FT_mod = 6 PKNL = 1 PHC0 = -261.8114 PHC1 = -12.69845 SI = 16K 
       data hash MD5: 16K
       C8 5A CF D4 42 2F D5 13 FD BC EB 08 82 F4 53 3D>)
(   3,<2025-09-03 18:43:33.96 +0400>,<servis>,<DPX200>,
      <pk PHC0 = -2.8 PHC1 = 0 
       data hash MD5: 16K
       C6 CA 1D 39 B7 14 90 2B C8 D3 E4 39 47 0F 70 62>)
$$ ##END=
$$ 
$$ hash MD5
$$ C9 34 9E F0 30 8D 68 8F 06 DE 48 12 37 DD 80 D3
##$RELAX= 
##$RELAX= 
##$RELAX= 
##$RELAX= 
##$RELAX= 
##$RELAX= 
##$RELAX= 
##$RELAX= 
$$ Bruker specific parameters
$$ --------------------------
##$DU= <F:\spectra>
##$EXPNO= 1
##$NAME= <H1>
##$PROCNO= 1
##$TYPE= <nmr>
##$USER= <av>
##$AMP= (0..31)
100 100 100 100 100 100 100 100 100 100 100 100 100 100 100 100 100 100 
100 100 100 100 100 100 100 100 100 100 100 100 100 100 
##$AQSEQ= 0
##$AQ_mod= 1
##$AUNM= <au_zg>
##$AUTOPOS= <>
##$BF1= 200.13
##$BF2= 200.13
##$BF3= 200.13
##$BF4= 200.13
##$BF5= 500.13
##$BF6= 500.13
##$BF7= 500.13
##$BF8= 500.13
##$BYTORDA= 1
##$CFDGTYP= 0
##$CFRGTYP= 5
##$CHEMSTR= <none>
##$CNST= (0..31)
1 1 145 1 1 1 1 1 1 1 1 1 1 1 1 1 1 1 1 1 1 1 1 1 1 1 1 1 1 1 1 1 
##$CPDPRG= <>
##$CPDPRG1= <>
##$CPDPRG2= <>
##$CPDPRG3= <>
##$CPDPRG4= <mlev>
##$CPDPRG5= <mlev>
##$CPDPRG6= <mlev>
##$CPDPRG7= <mlev>
##$CPDPRG8= <mlev>
##$CPDPRGB= <>
##$CPDPRGT= <>
##$D= (0..31)
0 2 0 0 0 0 0 0 0 0.06 0 0 0 0 0 0 0.0002 0 0 0 0 0 0 0 0 0 0 0 0 0 0 
0 
##$DATE= 1756910589
##$DBL= (0..7)
120 120 120 120 120 120 120 120 
##$DBP= (0..7)
150 150 150 150 150 150 150 150 
##$DBP07= 0
##$DBPNAM0= <>
##$DBPNAM1= <>
##$DBPNAM2= <>
##$DBPNAM3= <>
##$DBPNAM4= <>
##$DBPNAM5= <>
##$DBPNAM6= <>
##$DBPNAM7= <>
##$DBPOAL= (0..7)
0.5 0.5 0.5 0.5 0.5 0.5 0.5 0.5 
##$DBPOFFS= (0..7)
0 0 0 0 0 0 0 0 
##$DE= 6
##$DECBNUC= <off>
##$DECIM= 32
$$ [...]
##$SUBNAM4= <"">
##$SUBNAM5= <"">
##$SUBNAM6= <"">
##$SUBNAM7= <"">
##$SUBNAM8= <"">
##$SUBNAM9= <"">
##$SW= 20.6817932712277
##$SWIBOX= (0..15)
0 0 3 0 0 0 0 0 0 0 0 0 0 0 0 0 
##$SW_h= 4139.07284768212
##$TD= 32768
##$TD0= 1
##$TE= 0
##$TE2= 300
##$TE3= 300
##$TEG= 300
##$TL= (0..7)
0 120 120 120 120 120 120 120 
##$TP= (0..7)
150 150 150 150 150 150 150 150 
##$TP07= 0
##$TPNAME0= <>
##$TPNAME1= <>
##$TPNAME2= <>
##$TPNAME3= <>
##$TPNAME4= <>
##$TPNAME5= <>
##$TPNAME6= <>
##$TPNAME7= <>
##$TPOAL= (0..7)
0.5 0.5 0.5 0.5 0.5 0.5 0.5 0.5 
##$TPOFFS= (0..7)
0 0 0 0 0 0 0 0 
##$TUNHIN= 0
##$TUNHOUT= 0
##$TUNXOUT= 0
##$USERA1= <user>
##$USERA2= <user>
##$USERA3= <user>
##$USERA4= <user>
##$USERA5= <user>
##$V9= 5
##$VALIST= <valist>
##$VCLIST= <CCCCCCCCCCCCCCC>
##$VD= 0
##$VDLIST= <DDDDDDDDDDDDDDD>
##$VPLIST= <PPPPPPPPPPPPPPP>
##$VTLIST= <TTTTTTTTTTTTTTT>
##$WBST= 1024
##$WBSW= 30
##$XGAIN= (0..3)
0 0 0 0 
##$XL= 0
##$YL= 0
##$YMAX_a= 251103
##$YMIN_a= -223231
##$ZGOPTNS= <>
##$ZL1= 120
##$ZL2= 120
##$ZL3= 120
##$ZL4= 120
##$ABSF1= 0
##$ABSF2= 0
##$ABSG= 0
##$ABSL= 0
##$ALPHA= 0
##$AQORDER= 0
##$ASSFAC= 0
##$ASSFACI= 0
##$ASSFACX= 0
##$ASSWID= 0
##$AUNMP= <proc_1d>
##$AZFE= 0.1
##$AZFW= 0.1
##$BCFW= 0
##$BC_mod= 2
##$BYTORDP= 0
##$COROFFS= 0
##$CY= 18.4799938201904
##$DATMOD= 1
##$DC= 0
##$DFILT= <>
##$DTYPP= 0
##$F1P= 9.9274215381318
##$F2P= -0.165520771350173
##$FCOR= 1
##$FTSIZE= 16384
##$FT_mod= 6
##$GAMMA= 0
##$GB= 0
##$INTBC= 1
##$INTSCL= 4.127829e-11
##$ISEN= 128
##$LB= 0.05
##$LEV0= 0
##$LPBIN= 0
##$MAXI= 10000
##$MC2= 0
##$MEAN= 0
##$ME_mod= 0
##$MI= 50
##$NCOEF= 0
##$NC_proc= -9
##$NLEV= 6
##$NOISF1= 3.799351
##$NOISF2= 2.8
##$NSP= 0
##$NTH_PI= 0
##$NZP= 0
##$OFFSET= 16.48848
##$PC= 4
##$PHC0= -264.6114
##$PHC1= -12.69845
##$PH_mod= 1
##$PKNL= yes
##$PPARMOD= 0
##$PSCAL= 4
##$PSIGN= 0
##$REVERSE= no
##$SF= 200.130005582386
##$SI= 16384
##$SIGF1= 3
##$SIGF2= 2
##$SINO= 400
##$SIOLD= 16384
##$SREGLST= <1H.CDCl3>
##$SSB= 0
##$STSI= 16384
##$STSR= 0
##$SW_p= 4139.07284768211
##$SYMM= 0
##$S_DEV= 0
##$TDeff= 32768
##$TDoff= 0
##$TI= <>
##$TILT= no
##$TM1= 0
##$TM2= 0
##$TOPLEV= 0
##$USERP1= <user>
##$USERP2= <user>
##$USERP3= <user>
##$USERP4= <user>
##$USERP5= <user>
##$WDW= 1
##$XDIM= 16384
##$YMAX_p= 459367755
##$YMIN_p= -7039055
$$ End of Bruker specific parameters
$$ ---------------------------------
##NTUPLES= NMR SPECTRUM
##VAR_NAME=  FREQUENCY,     SPECTRUM/REAL,   SPECTRUM/IMAG
##SYMBOL=    X,             R,               I
##VAR_TYPE=  INDEPENDENT,   DEPENDENT,       DEPENDENT
##VAR_FORM=  AFFN,          ASDF,            ASDF
##VAR_DIM=   16384,         16384,           16384
##UNITS=     HZ,            ARBITRARY UNITS, ARBITRARY UNITS
##FACTOR=    0.252644378177508, 1,           1
##FIRST=     3299.83951724647, 0,            0
##LAST=      -839.233330435636, 0,           0
##MIN=       -839.233330435636, -7039055,    0
##MAX=       3299.83951724647, 459367755,    0
$$ Real data points
##PAGE= N=1
##DATA TABLE= (X++(R..R)), XYDATA
$$ [...]
7758A985299R9056k39021m35605m7244l04090k89294J639317m04737p99334J182697
$$ 1985299 2084355 1845334 1409729 1362485 1058395 769101 2408418 2003681 1204347 2387044
7748B387044m56983K40342J432661j84093j337k030062J465246j112626K175822
$$ 2387044 1930061 2170403 3603064 3418971 3417634 1387572 2852818 1740192 3916014
7739C916014m27828J263267j419695Q34993k85788J311038O05738p14569R59809
$$ 3916014 3488186 4751453 3331758 4166751 3880963 5192001 5797739 5083170 6042979
7730F042979l53906M56105K13296Q71957N95729P99483j074082J430849J039249
$$ 6042979 5689073 6145178 6358474 7230431 7826160 8625643 7551561 8982410 10021659
7721A0021659n67660J49410l64212J38874Q60829n10716K651811j221883M69468
$$ 10021659 9453999 9603409 9239197 9378071 10238900 9728184 12379995 11158112 11627580
7712A1627580J317476j139814J508748j50259j625534O55460J62709J0152o34900
$$ 11627580 12945056 11805242 13313990 13163731 11538197 12193657 12356366 12366518 11731618
7703A1731618K31595j510097j310400J359207j720650p44495J05367j395232Q67598
$$ 11731618 11963213 10453116 9142716 10501923 8781273 8036778 8142145 6746913 7614511
7694G614511p81561N02667k768548O97838M38836j769382N37330p76391L05768
$$ 7614511 6832950 7335617 4567069 5264907 5703743 3934361 4471691 3695300 4001068
7685D001068R53500j380460J14654j173579K19731L40709P19327L5819o51302
$$ 4001068 4954568 3574108 3688762 2515183 2734914 3075623 3794950 3830769 3179467
7676C179467M64748k352956M67080K15466j04263J268513j363196n7654O05557
$$ 3179467 3644215 1291259 1758339 1973805 1869542 3138055 1774859 1717205 2322762
7667B322762k087186P32300k57711K051887L04388j758196N64583n73739j245837
$$ 2322762 235576 967876 710165 2762052 3066440 1308244 1872827 1299088 53251
7658E3251J779209j286993J048784j785594K095375o12159K56462n38263K314282
$$ 53251 1832460 545467 1594251 -191343 1904032 1291873 1548335 1010072 3324354
7649C324354k378956m33357O96778j340427J759132N29405j392664O75406M72985
$$ 3324354 945398 512041 1208819 -131608 1627524 2156929 764265 1439671 1912656
7640A912656K43052k956348L219902j581467K99656p52939K19650l57330J744398
$$ 1912656 2155708 -800640 2419262 837795 1137451 384512 604162 246832 1991230
7631A991230j535214Q24630r76806n19392J720769j225804o93717O14991M10753
$$ 1991230 456016 1280646 303840 -215552 1505217 279413 -414304 200687 611440
7622F11440J038073P64281j955974o73405R45266L35713r13998j381450J073603
$$ 611440 1649513 2413794 457820 -215585 729681 1065394 151396 -1230054 -156451
7613a56451P30436q4939Q90915p0213l64955j72750j411223K299412j452824j213293
$$ -156451 573985 489046 1379961 1309748 944793 772043 -639180 1660232 207408 -1005885
7603a005885K443361j203053Q50800r99854L24556L46985o71404m85410J966386
$$ -1005885 1437476 234423 1085223 85369 409925 756910 85506 -399904 1566482
7594A566482j418490l86038M97514q14538K36429J156500m03889O70348j216094
$$ 1566482 147992 -238046 259468 -555070 -318641 837859 433970 1104318 -111776
7585a11776K29006P13476j313308K39958O53177p30128J698813P45329j664091
$$ -111776 117230 830706 -482602 -242644 410533 -319595 1379218 2124547 460456
7576D60456n92887N34979J325814j999896j652962K340981O57048l92557l4805
$$ 460456 -132431 402548 1728362 -271534 -1924496 416485 1073533 680976 646171
7567F46171j487248P19498R83138j848168J041927M11479K025498p82481r06455
$$ 646171 -841077 -121579 861559 -986609 55318 466797 2492295 1709814 803359
7558H03359J86250p9210N25128n55790r12898J800621j058675R5885J134767j511177
$$ 803359 989609 910399 1435527 879737 -33161 1767460 708785 804670 1939437 428260
7548D28260M20983o36017N64961R45710M1629k037506k83833o14204J656782K20898
$$ 428260 849243 213226 778187 1723897 1765526 -271980 -555813 -1170017 486765 707663
7538G07663N02282K82228j456302J34462l70715J522475n61386j65364m82958
$$ 707663 1209945 1492173 35871 170333 -200382 1322093 760707 595343 112385
7529A12385j95333m06143O31397Q30208R9092q93360j64692Q75185L35053p42825
$$ 112385 -82948 -489091 142306 972514 1071606 178246 13554 888739 1223792 480967
7519D80967j353686M01799n16024k4228K863213q59433p10801K20117j79367O32798
$$ 480967 -872719 -470920 -986944 -1011172 1852041 992608 281807 501924 322557 955355
7509I55355k483813K447145j413765J829355K50942j203197o53012j554370J015407
$$ 955355 -1528458 918687 -495078 1334277 1585219 382022 -270990 -1825360 -809953
7500h09953q5353J163283q5527o94368Q14883q92027J100108j249585M56279N91533
$$ -809953 -895306 267977 182450 -511918 302965 -589062 511046 -738539 -282260 309273
7490C09273J69369l73187j047124L228452k625725k09526j59994K915794p94997
$$ 309273 478642 105455 -941669 2286783 -338942 -548468 -708462 2207332 1412335
7481A412335q70266k27567q49430R37231j2582r95122m2458R4119J562057q97305
$$ 1412335 542069 314502 -534928 402303 389721 -605401 -647859 -553740 1008317 111012
7471A11012j415278P14398J223794q66468J02671O65601n58118J111192j421234
$$ 111012 -1304266 -589868 633926 -232542 -129871 535730 -22388 1088804 -332430
7462c32430P30425j117582l88650J266849l28191O45297p96954J127J597066j059479
$$ -332430 397995 -719587 -1108237 158612 -169579 475718 -321236 -320109 1276957 217478
7452B17478J259389r87992m2124j351532q42828M69323O33524k16783R63732K06729
$$ 217478 1476867 488875 446751 -904781 -1747609 -1278286 -644762 -861545 102187 308916
7442C08916j643045J781544M23647j267261J93002K46280o81977J652962k029466
$$ 308916 -1334129 447415 871062 -396199 -203197 43083 -638894 1014068 -1015398
7433a015398M35429K97315M62885J91215q05982O98133j82059k40349N50258n00644
$$ -1015398 -579969 -282654 180231 371446 -434536 263597 81538 -158811 391447 -109197
7423a09197p4952O96686Q9910l23752J066037l60312r46713O29224L97482j656955
$$ -109197 -184149 512537 602447 278695 1344732 984420 37707 666931 1064413 -592542
7413e92542Q02351n60441j077832J163291Q72250J75751j385813Q73443q60075
$$ -592542 209809 -350632 -1428464 -265173 607077 782828 -602985 270458 -589617
7404e89617J199754N15970j065518r6521n0119M45247O28248k492846Q68580L096352
$$ -589617 610137 1126107 60589 -35932 -86051 359196 987444 -1505402 -636822 2459530
7394B459530j904581P38162j889320K43862J865977q06805k81872n70273J595664
$$ 2459530 554949 1293111 -596209 -352347 1513630 706825 424953 -145320 1450344
7385A450344j343351K036631o93717o62534p46936J086230P68566k269193m24934
$$ 1450344 106993 2143624 1449907 787373 40437 1126667 1895233 -373960 -798894
7376g98894J006472J038614K08265j97468k44422l25991K7043l06221p440J402744
$$ -798894 207578 1246192 1454457 1256989 1012567 686576 713619 407398 399958 1802702
7366A802702k37385q86545K14408l12201K74740k80747J221144L65872j003917
$$ 1802702 1565317 678772 893180 580979 855719 574972 1796116 2161988 1158071
7357A158071p46320O0338J144144n88111j831643J996218j030453J216120J220820
$$ 1158071 411751 472089 1616233 1028122 -803521 1192697 162244 1378364 2599184
7348B599184k544458K07690K28920r96904K362760r63075L71033j225154l78962
$$ 2599184 54726 262416 491336 -505568 1857192 894117 1265150 39996 -338966
7339c38966J733227j329646M78401N18148K26834q93432L02979J184357j369332
$$ -338966 1394261 64615 543016 1061164 1287998 394566 697545 1881902 512570
7330E12570N42796j214958O94380J81986j663411J338248P20331Q66720j256333
$$ 512570 1055366 -159592 534788 716774 -946637 391611 1111942 1978662 722329
7321G22329J071356o3755j791507J126187K45563p30490j272691J756138m02628
$$ 722329 1793685 1729930 -61577 1064610 1310173 579683 -693008 1063130 660502
7312F60502l42205J77789J387273k031102J931885k11565j305086K004262m66220
$$ 660502 318297 496086 1883359 -147743 1784142 1572577 267491 2271753 1805533
7303A805533l14340m9292q66878l7371L82070J59133o85137L64850j82157J77366
$$ 1805533 1491193 1441901 575023 537652 919722 1078855 393718 758568 576411 753777
7293G53777j543317J740851l08874Q66891j666041R00592m75489M22033Q3444
$$ 753777 -789540 951311 642437 1509328 -156713 743879 268390 690423 773867
7284G73867N48616J436833o20660k139157J962323j083414J342825p35388M34032
$$ 773867 1322483 2759316 2138656 -501 1961822 878408 2221233 1485845 1919877
7275A919877q97314O97325j110226J496536L9344j248941K006633j341210J446453
$$ 1919877 1022563 1719888 609662 2106198 2145542 896601 2903234 1562024 3008477
7266C008477j69846p55869j146057J294707k66910o38643J687622n14716K3283
$$ 3008477 2838631 2082762 936705 2231412 1964502 1325859 3013481 2498765 2522048
7257B522048j256121J070276J748210j393553Q3797m28283n00607R38798j228207
$$ 2522048 1265927 2336203 4084413 2690860 2774657 2346374 1845767 2784565 1556358
7248A556358J501046N95312M06358j365651K401677l169264K435784L32667p96609
$$ 1556358 3057404 3652716 4059074 2693423 5095100 1925836 4361620 4694287 3897678
7239C897678L48438J965299n54085j97900n91786J941035j198907J307521n45614
$$ 3897678 4246116 6211415 5657330 5459430 4867644 6808679 5609772 6917293 6371679
7230F371679J015048J041898K38506j82834K80508N14816K89281J443607k24531
$$ 6371679 7386727 8428625 8667131 8484297 8764805 9279621 9568902 11012509 10787978
7221A0787978K897575j346851K446439J516875k611470J021062K214193l318147
$$ 10787978 13685553 12338702 14785141 16302016 13690546 14711608 16925801 13607654
7213A3607654j467820j342846J9662J72990j66751l410511J439304j323469j399465
$$ 13607654 12139834 10796988 10816650 10989640 10822889 7412378 8851682 7528213 6128748
7204F128748J026963O91864j481390j48984p44575K434705o66876j389162Q17457
$$ 6128748 7155711 7847575 6366185 6217201 5472626 7907331 7240455 5851293 6668750
7195F668750j192056M88675O33113J906683q46018M52721k043976J191094K671010
$$ 6668750 5476694 5965369 6598482 8505165 7659147 8111868 6067892 7258986 9929996
7186I929996k067350j53807L28904M46738J76236K712312P3181k93271J613330
$$ 9929996 7862646 7708839 8037743 8484481 8660717 11373029 11446210 11152939 12766269
7177A2766269o6840J31300O92969J185914J732772L093195Q8879l06271J979055
$$ 12766269 12699429 12830729 13523698 14709612 16442384 19535579 19624458 19318187 21297242
7168B1297242K774683J756744L421992L126883L616474K627667M857881K474924
$$ 21297242 24071925 25828669 29250661 32377544 35994018 38621685 43479566 45954490
7160D5954490K251475J069689J763802L572141M579402M098579Q115711N479719
$$ 45954490 48205965 49275654 51039456 54611597 59190999 63289578 71405289 76885008
7152G6885008N511010L166086N610306L979433K009211J524872O535889J3326950
$$ 76885008 82396018 85562104 91172410 95151843 97161054 98685926 105221815 118548765
7144A18548765J4992542J7599758P464289K123155m406008j2352624j5509364
$$ 118548765 133541307 151141065 158605354 160728509 156322501 143969877 128460513
7137A28460513k0000856j6676320j4795563q442965j0738314n920441n863394
$$ 128460513 108459657 91783337 76987774 68544809 57806495 51886054 46022660
7130D6022660n687858m026980k762539l091156l762787j682380k293205o34298
$$ 46022660 40334802 36307822 33545283 30454127 26691340 25008960 22715755 22081457
7122B2081457l22771k355617L128l608861O72643q90059j016802k058893K419102
$$ 22081457 21758686 19403069 19406197 15797336 16469979 15579920 14563118 12504225 14923327
7113A4923327j998887j405794J225547k037400J685873j110928q80535l35160
$$ 14923327 12924440 11518646 12744193 10706793 12392666 11281738 10401203 10066043
7105A0066043l20942j382435J012332m00309M68719j691794j191886J157634J238928
$$ 10066043 9745101 8362666 9374998 8974689 9443408 7751614 6559728 7717362 8956290
7096H956290j891422j121266J558958k108712L022761q23066j3264M46604k160456
$$ 8956290 7064868 5943602 7502560 5393848 8416609 7593543 7580279 8026883 5866427
7087E866427P77678j623291J312636J622725k679182K037629j363647q44041K56697
$$ 5866427 6644105 5020814 6333450 7956175 5276993 7314622 5950975 5106934 5363631
7078E363631M14754J50137q4099n2039m48054n7285N86323p03179p97750R03415
$$ 5363631 5778385 5928522 5844423 5792384 5344330 5287045 5873368 5170189 4372439 5275854
7068E275854m91143L26791P3466r58548L69219M37493M31049q97621n75201J222387
$$ 5275854 4784711 5111502 5184968 4226420 4595639 5033132 5464181 4566560 3991359 5213746
7058E213746k095831K056233j355688M39538O96635j237105M03361l2197K62059
$$ 5213746 3117915 5174148 3818460 4257998 4954633 3717528 4120889 4088692 4350751
7049D350751r21355m05466N48510l91847M73284K338090k023174m57104K23936
$$ 4350751 3429396 3023930 3572440 3180593 3653877 5991967 3968793 3511689 3735625
7040C735625p34745P40908j02167n79575n34369K32781K21639R9201q45694O74486
$$ 3735625 3000880 3741788 3639621 3060046 2525677 2758458 2980097 3079298 2233604 2908090
7030B908090r18270J266836n25j128049n4393j07318J06708l3041J445702r74068
$$ 2908090 1989820 3256656 3256131 2128082 2073689 1966371 2073079 2040038 3485740 2511672
7020B511672p8984j41511J414903r35766m10224J71753j210608K95560R88769
$$ 2511672 2432688 2291177 3706080 2770314 2360090 2531843 1321235 1616795 2605564
7011B605564J73999j597456P57221N98619J626935k283400J936934j398575J26134
$$ 2605564 2779563 1182107 1939328 2537947 4164882 1881482 3818416 2419841 2545975
7002B545975q67121L31367m77684R6112J763287p35789r58935l61279Q33050p12472
$$ 2545975 1678854 2010221 1532537 1628649 3391936 2656147 1697212 1335933 2168983 1456511
6992A456511m17819J392495k54940j026495J060486p85323O23219Q448J89109
$$ 1456511 1038692 2431187 2176247 1149752 2210238 1424915 2048134 2056582 2245691
6983B245691J23462q41635R7997L22471m34663K262Q6615P3213k39779J366020
$$ 2245691 2369153 1527518 1625515 1947986 1513323 1515585 1602200 1675413 1435634 2801654
6973B801654M75102k756326P88272J213782R92587j725995j15888J78673J563644
$$ 2801654 3276756 520430 1308702 2522484 3515071 1789076 1673188 1851861 3415505
6964C415505k458279J827519q07518L35937k81522R4672M62800l98415N15050
$$ 3415505 957226 2784745 1977227 2313164 2031642 2126314 2589114 2190699 2705749
6955B705749k154695N97989K75724J010502K65727j006538M86252J0045r3547
$$ 2705749 551054 1149043 1424767 2435269 2700996 1694458 2180710 2190755 2097208
6946B097208J016240j65674q83569O60501r19594K50852o17846L63471P21180
$$ 2097208 3113448 2947774 2064205 2724706 1805112 2055964 1438118 1801589 2522769
6937B522769j122891j32040P92705k20157r22681J282129n59625j359256K070000
$$ 2522769 1399878 1267838 2060543 1840386 917705 2199834 1640209 280953 2350953
6928B350953M95731k194293J760344m67142j44565K32168O6427r12905J219497
$$ 2350953 2846684 652391 2412735 1945593 1801028 2033196 2099623 1186718 2406215
6919B406215N2855m72116j629923K297535j798652J230474L04737j209360K19708
$$ 2406215 2459070 1986954 357031 2654566 855914 2086388 2391125 1181765 1401473
6910A401473N07904m33992J672743j533767J12454L33136r56092M85362q80337
$$ 1401473 1909377 1475385 3148128 1614361 1726815 2059951 1103859 1589221 708884
6901G08884J409066n23397J019668o89066K74079r25076m77957J117389o17934
$$ 708884 2117950 1594553 2614221 1925155 2199234 1274158 796201 1913590 1295656
6892A295656J022867p15169Q13592k7212j634169J853700l91837l64038p58530
$$ 1295656 2318523 1603354 2416946 2389734 755565 2609265 2217428 1853390 1094860
6883A094860o2456J84290O16207J341986j050873q67627P6554Q12922j807192
$$ 1094860 1032404 1216694 1832901 3174887 2124014 1256387 1332941 2145863 338671
6874C38671J342877p66531J594775m49637L17484j132108k0268K005122J02428
$$ 338671 1681548 915017 2509792 2060155 2377639 1245531 1225263 3230385 3332813
6865C332813j043265j381333O07895j282695J544541j148120J554264j355302
$$ 3332813 2289548 908215 1516110 233415 1777956 629836 2184100 828798
6857H28798m34518K558175k799385Q61739R25099j283553L29783q20706K120624
$$ 828798 394280 2952455 153070 1014809 1939908 656355 986138 165432 2286056
6848B286056k176497J195304R37391J92518J003248k099923Q62612l33001m6024
$$ 2286056 109559 1304863 2242254 2434772 3438020 1338097 2200709 1867708 1821684
6839A821684j613341K081244k51026j560335J161835r71949J008595M66103q51347
$$ 1821684 208343 2289587 2038561 478226 1640061 668112 1676707 2142810 1291463
6830A291463m19825o63255N05414m72543J309066J711305p09392o83409M2661
$$ 1291463 871638 208383 713797 241254 1550320 3261625 2552233 1868824 1911485
6821A911485j145930J08286O91730j163341J532783j092772J113959j649480R06900
$$ 1911485 765555 873841 1565571 402230 1935013 842241 1956200 306720 1213620
6812A213620J040498j059778N39541r50491N95503K17977Q27964k435749P34408
$$ 1213620 2254118 1194340 1733881 783390 1378893 1596870 2424834 -10915 723493
6803G23493n6988M65573k85294K2325J499215r42484j224979M8354K66494Q54273
$$ 723493 666505 1132078 846784 869109 2368324 1425840 200861 249215 515709 1369982
6793A369982L02169k12393j200870L00066R40601j711645J109750J140965j800112
$$ 1369982 1672151 1459758 258888 558954 1499555 -212090 897660 2038625 238513
6784B38513J153390J26571j979069K465052j284889k30474J853330p78263L34003
$$ 238513 1391903 1518474 -460595 2004457 719568 489094 2342424 1564161 1898164
6775A898164n05187j023291l18542J756338j278320M46647J622650k640372l14293
$$ 1898164 1392977 369686 51144 1807482 529162 975809 2598459 -41913 -356206
6766c56206J755871j457197K633109j325660J080820q15966Q321k93479k14427
$$ -356206 1399665 -57532 2575577 1249917 2330737 1514771 1523092 1229613 1015186
6757A015186P61897q40873J582794m82004K16853j80575j695371P89188R05827
$$ 1015186 1777083 936210 2519004 2037000 2253853 2073278 377907 1167095 2072922
6748B072922p05845J260037m82047q32069J642655k687777O95067J120579N95487
$$ 2072922 1367077 2627114 2145067 1312998 2955653 267876 962943 2083522 2679009
6739B679009J06081l93548K44702M21378m35388l40117j354523J906009M30904
$$ 2679009 2785090 2391542 2636244 3057622 2622234 2282117 927594 2833603 3264507
6730C264507k183209n45801J464516o637K422432k507174N62364K1793p45155
$$ 3264507 1081298 535497 2000013 1993376 4415808 1908634 2470998 2492791 1747636
6721A747636K169287l311955J197106q49360L802R6663K59654j73185j992632
$$ 1747636 3916923 604968 1802074 952714 956516 1053179 1312833 1139648 -852984
6712h52984L077299k318697K860487q28858J5090q2443l19121L61418j93518p42081
$$ -852984 2224315 -94382 2766105 1937247 1952337 1869894 1550773 1912191 1718673 976592
6702I76592m52143J496654q50947j613789K561068j524259K53457p49565Q61133
$$ 976592 524449 2021103 1170156 -443633 2117435 593176 846633 97068 958201
6693I58201K78700k07801J20558N87356j400447J454735k801793J173468p27586
$$ 958201 1236901 1029100 1149658 1737014 336567 1791302 -1010491 162977 -564609
6684e64609P71795J089800N12641j413668N77932j52676j762961M421260k025628
$$ -564609 207186 1296986 1809627 395959 973891 821215 -941746 3479514 1453886
6675A453886j535961Q74603K49075J30972j82912j316226L67100J65868J477950
$$ 1453886 -82075 792528 1041603 1172575 989663 -326563 40537 206405 1684355
6666A684355J80213j174667Q91267k35791L02399O94793r41055q5393r95433p40203
$$ 1684355 1864568 689901 1581168 1345377 1647776 2342569 1401514 1316121 320688 -419515
6656d19515R67105L73688J136157j135313J63030j52137Q49251j988733O88446
$$ -419515 547590 921278 2057435 922122 1085152 933015 1782266 -206467 481979
6647D81979R28738j280708J536239j694192J065871r33969r42597J633910Q34284
$$ 481979 1410717 130009 1666248 -27944 1037927 103958 -838639 795271 1629555
6638A629555j068459J250453p21485K15447j273900J034029Q48192J95861l115764
$$ 1629555 561096 1811549 1090064 1305511 31611 1065640 1913832 2109693 -1006071
6629a006071J757051j232807k18633M40696P69531J470492j213925m6588n90549
$$ -1006071 750980 -481827 -700460 -259764 509767 1980259 766334 719746 129197
6620A29197J610149q30689k328433L570359j716306j34833J147808j084946R22422
$$ 129197 1739346 908657 -1419776 2150583 434277 299444 1447252 362306 1284728
6611A284728m05517O21272j138166k88762N68316M07183m6148J15803l98542J165873
$$ 1284728 879211 1500483 362317 73555 641871 1049054 1002906 1118709 720167 1886040
6601A886040j432154j00563N989Q27624M42535m05002P21150j751010J054987
$$ 1886040 453886 353323 359312 1186936 1629471 1224469 1945619 194609 1249596
6592A249596j181527O37784j22387O65061k7235N32018k077423J371393M81525
$$ 1249596 68069 705853 583466 1248527 1221292 1753310 -324113 1047280 1528805
6583A528805j347309J196746j41346j015570O91121J94278L17949L46770j34039
$$ 1528805 181496 1378242 1236896 221326 912447 1106725 1424674 1771444 1637405
6574A637405R80481j317811J340596j547966K056693m54509j212567j99442J08328
$$ 1637405 2617886 1300075 2640671 1092705 3149398 2694889 1482322 1282880 1391208
6565A391208O80023P78856j412614l91057O66145J50393j768609N92933J132573
$$ 1391208 2071231 2850087 1437473 1046416 1712561 1862954 94345 687278 1819851
6556A819851M04503m07863j208041Q87980k41784J0078O34908p83357M67787R01606
$$ 1819851 2224354 1816491 608450 1496430 1254646 1264724 1899632 1116275 1584062 2485668
6546B485668j424674n0291o30586K594432k219896J441190j801961J479447j187083
$$ 2485668 1060994 1010703 380117 2974549 754653 2195843 393882 1873329 686246
6537F86246J697861r46367J66671P58960j230317m28853Q8496o20260J805638
$$ 686246 2384107 1437740 1604411 2363371 1133054 704201 792697 172437 1978075
6528A978075k013761J222755j121710J368679p16798J474685j424441o53245J559481
$$ 1978075 -35686 1187069 65359 1434038 717240 2191925 767484 114239 1673720
6519A673720N22058j787936R57460K47357j089078N50436p26830L08150n11954
$$ 1673720 2195778 407842 1365302 1612659 523581 1074017 347187 655337 143383
6510A43383J751282k250561J058224k53393J068336m05052j613114J849836Q46266
$$ 143383 1894665 -355896 702328 448935 1517271 1112219 -500895 1348941 2195207
6501B195207k30396M56185j125058k81835R12923j113639l75785p59552J511288
$$ 2195207 1964811 2420996 1295938 1014103 1927026 813387 437602 -321950 1189338
6492A189338J85934j559681r6017J932057l21290l76297m76836j15887J741948
$$ 1189338 1375272 -184409 -280426 1651631 1330341 954044 477208 361321 2103269
6483B103269j400307n40668J055833P21788n17596k04378K70405P14216j605023
$$ 2103269 702962 162294 1218127 1939915 1422319 1217941 1488346 2202562 597539
6474E97539J653298l402535K195097j200526K317271k283079P8200J179533O498
$$ 597539 2250837 -1151698 1043399 -157127 2160144 -122935 -44735 1134798 1141296
6465A141296O49643L87529n92871r54231r4964j36308J024303j20110j127029
$$ 1141296 1790939 2178468 1585597 631366 536402 400094 1424397 1304287 177258
6456A77258J468809m78025p84256P29411p56217J807252j061743L865J4693J77878
$$ 177258 1646067 1168042 383786 1113197 356980 2164232 1102489 1106354 1121047 1298925
6446A298925M50044M68839k145166J818733j505006J749461j668057J519347l88274
$$ 1298925 1748969 2217808 72642 1891375 386369 2135830 467773 1987120 1598846
6437A598846k86724j140099O78364Q62334j163297N54198P3184L71355j190398
$$ 1598846 1312122 172023 850387 1712721 549424 1103622 1176806 1548161 357763
6428C57763J157524J607044k304001K13888o21326J332943j298236J026548J331490
$$ 357763 1515287 3122331 818330 1032218 410892 1743835 445599 1472147 2803637
6419B803637k637698l14873k49682n05992J987595o48372R57600q87283J801799
$$ 2803637 165939 -148934 -398616 -904608 1082987 434615 1392215 504932 2306731
6410B306731n13609m10798P19884p09229k36040o9655Q77994l54207m90309j368685
$$ 2306731 1793122 1382324 2102208 1392979 1156939 1087284 1965278 1611071 1120762 -247923
6400b47923Q28541N41569N85144j901152J288247M02892j380019M42409K83087
$$ -247923 580618 1122187 1707331 -193821 1094426 1497318 117299 559708 842795
6391H42795K33097J297726j826629r31763Q29547L14085K231503k708091R49923
$$ 842795 1075892 2373618 546989 -384774 444773 758858 2990361 282270 1232193
6382A232193o78471l73938J410923p07991o87124J509629N76342j296462M93775
$$ 1232193 553722 179784 1590707 882716 195592 1705221 2281563 985101 1478876
6373A478876o89382L35447J350795o60685j403908J284842o30051j013200R00322
$$ 1478876 789494 1124941 2475736 1815051 411143 1695985 1065934 52734 953056
6364I53056j19975J841852j644169J395054j522693j64980J125020M06574M55219
$$ 953056 833081 2674933 1030764 2425818 903125 738145 1863165 2269739 2724958
6355B724958K19406n86757k486153J661184P44248l8495j139057n83608M51515
$$ 2724958 2944364 2357607 -128546 1532638 2276886 2238391 1099334 515726 967241
6346I67241K31164M41437R24221O49087L25864j360128M84731j562231K121505
$$ 967241 1198405 1639842 2564063 3213150 3539014 2178886 2663617 1101386 3222891
6337C222891j232265l264p7750q94895R32199J295753k503739J235623K4339P64114
$$ 3222891 1990626 1987362 1909612 1014717 1946916 3242669 738930 1974553 1998892 2763006
6327B763006j441568l53850J378497j782446K762008j610300J551972k100448
$$ 2763006 1321438 967588 2346085 563639 3325647 1715347 3267319 1166871
6319A166871K14741N40038M12587o93433m94591k18360J122736K92193j242288
$$ 1166871 1381612 1921650 2334237 1640804 1146213 927853 2050589 2342782 1100494
6310A100494J398354o66621K056408k111375J48751j097806K08259M29240P35787
$$ 1100494 2498848 1832227 3888635 1777260 1926011 828205 1036464 1465704 2201491
6301B201491K33023j154878p93713J003665k61613m10381J652232j845595J870385
$$ 2201491 2434514 1279636 485923 1489588 1227975 817594 2469826 624231 2494616
6292B494616j564315M08110n24559J342733j379097K54985L04384j911139K326938
$$ 2494616 930301 1338411 813852 2156585 777488 1032473 1336857 -574282 1752656
6283A752656M07270j250251K032728j659365k56874N39178P77314n10902j701065
$$ 1752656 2159926 909675 2942403 1283038 1026164 1565342 2342656 1831754 130689
6274A30689J576033K82754k586111K430106o30134o55115J546481j718308j00077
$$ 130689 1706722 1989476 -596635 1833471 1203337 548222 2094703 376395 276318
6265B76318O17787N87196N8861K73349p83875j178390N13912k51498J777709j242598
$$ 276318 894105 1481301 1540162 1813511 1029636 -148754 365158 113660 1891369 648771
6255F48771N71405r71215R55216m1166m56144O24591p44119J058237j588567L4617
$$ 648771 1220176 248961 1204177 1163011 706867 1331458 587339 1645576 57009 91626
6245I1626P26725Q8316p94988J393387r22995l93805m0885L45055p23445J582706
$$ 91626 818351 906667 111679 1505066 582071 188266 147381 492436 -231009 1351697
6235A351697l57392m0574N25314K05024K4921j06723K09933j493789q3343k23330
$$ 1351697 994305 953731 1479045 1684069 1708990 1602267 1812200 318411 235068 11738
6225A1738J520183j422955R84054j06002q54570N49274M28822l177P61047r47769
$$ 11738 1531921 108966 1093020 987018 132448 681722 1110544 1107367 1868414 920645
6215I20645N25501j065373J487602j11157M09145j915340l47050J093873L98280
$$ 920645 1446146 380773 1868375 1757218 2166363 251023 -96027 997846 1396126
6206A396126n93528j112835p4400J637017P83528k057109J91917J074711n80016
$$ 1396126 802598 -310237 -384637 1252380 2035908 -21201 170716 1245427 665411
6197F65411Q20261J123234j784011J364229q33189l27502m25242J502240k116596
$$ 665411 1485672 2608906 824895 2189124 1355935 1028433 603191 2105431 -11165
6188a1165K30069R69276o57343J72856r14049J134756p9988J184098q6091j633360
$$ -11165 218904 1188180 530837 703693 -210356 924400 844412 2028510 1942419 309059
6178C09059l84035K522452j03968j135462j160584J27433N24882l0184L9516N44939
$$ 309059 -74976 2447476 2343508 1208046 47462 174895 699777 669593 709109 1254048
6168A254048P22537j262413O65306j742517J798824P941k68109J87110l14221
$$ 1254048 1976585 714172 1379478 -363039 1435785 1443726 1175617 1362727 1048506
6159A048506M90809l24282K32533J629480j629204q17187J622162j397263R65172
$$ 1048506 1539315 1215033 1447566 3077046 1447842 630655 2252817 855554 1820726
6150A820726k10283k85551N35810J17496q7575p71605m75268J135259M03759j453750
$$ 1820726 1610443 1324892 1860702 1978198 1890623 1119018 643750 1779009 2182768 729018
6140G29018l39803M8856J923245l141646J646555R25371k85238j316002J310133
$$ 729018 389215 438071 2361316 -780330 866225 1791596 1506358 190356 1500489
6131A500489k05484J028375j904910j016287K286557o40800N19522J069989j486294
$$ 1500489 1295005 2323380 418470 -597817 1688740 1047940 1567462 2637451 1151157
6122A151157K128144j296144n36520J411394k341254K648785p42767q63927O54223
$$ 1151157 3279301 1983157 1446637 2858031 516777 3165562 2422795 1558868 2213091
6113B213091l66699q50648j8890J57008K202593k067808K652492k476866P80435
$$ 2213091 1846392 995744 976854 1133862 3336455 1268647 3921139 1444273 2224708
6104B224708j005155Q47518l20748j53926m72973J389607l88890m5220j250723
$$ 2224708 1219553 2067071 1746323 1592397 1119424 2509031 2120141 2074921 824198
6095H24198k50224n50354Q47576J677373j654519M92427J514008k950662K027759
$$ 824198 573974 23620 871196 2548569 894050 1386477 2900485 -50177 1977582
6086A977582p0143l08755K95267L68669r7325j64212o0249Q41461q17254R69949
$$ 1977582 1907439 1598684 1893951 2262620 2165295 2001083 1940834 2782295 1965041 2934990
6076B934990l740679K645104J037653k409144O08942O27303k67023J43560J184522
$$ 2934990 -805689 1839415 2877068 467924 1076866 1704169 1437146 1580706 2765228
6067B765228r94957J4273p5114j049762K697789k138629L72853j405029J307767
$$ 2765228 1770271 1784544 1709430 659668 3357457 1218828 1591681 186652 1494419
6058A494419k3979K63298r51624j673q53949m52389K270709k80067q1617j275186
$$ 1494419 1470440 1733738 782114 780441 -73508 -525897 1744812 1464745 1383128 107942
6048A07942J520692J111700j174328N685N388l00153j18995J021822Q77474q37096
$$ 107942 1628634 2740334 1566006 1571691 1577079 1276926 1157931 2179753 3057227 2220131
6038B220131r81528N74663R72831r63180l99928q26986J623402l03156Q50967
$$ 2220131 1238603 1813266 2786097 1822917 1422989 596003 2219405 1916249 2767216
6029B767216L80794j066130n69381M52214Q74218o89335J62458J55946k15363
$$ 2767216 3148010 2081880 1512499 1964713 2838931 2149596 2312054 2468000 2252637
6020B252637n5778n14745L39606l27228O58737P28897j865463M50899o06222J141671
$$ 2252637 2196859 1682114 2021720 1694492 2353229 3082126 1216663 1667562 1061340 2203011
6010B203011o4209M61910r77531J327153j155830K87854k528665L344184j217675
$$ 2203011 2138802 2600712 1623181 2950334 1794504 2082358 -446307 2897877 1680202
6001A680202m14747J280996q65422j43678Q2434L57864J67161r07135J2240P17159
$$ 1680202 1265455 2546451 1681029 1537351 1619785 1977649 2144810 1237675 1249915 1967074
5991A967074J575128j459583j066381M76851N33810k58557Q03079n2659p49818
$$ 1967074 3542202 2082619 1016238 1493089 2026899 1768342 2571421 2518762 1768944
5982A768944k43601L3164J071783N36199k557900M88183K092295l11488o03667
$$ 1768944 1525343 1558507 2630290 3166489 608589 1096772 3189067 2877579 2273912
5973B273912M65226M82482n51021O0198o92753l19648J172193M95001k970265
$$ 2273912 2739138 3221620 2670599 2730797 2038044 1718396 2890589 3385590 415325
5964D15325J642835j884544L82177O99799J813424j947774J028800m05974J246498
$$ 415325 2058160 173616 555793 1255592 3069016 1121242 2150042 1744068 2990566
5955B990566R82122j211154j133261L9977Q25285J023075j547796Q84523j51575
$$ 2990566 3972688 2761534 1628273 1668250 2493535 3516610 1968814 2853337 2701762
5946B701762K27242P06825j547499R89557n12819j257276J370374j80947O29696
$$ 2701762 2929004 3635829 2088330 3077887 2565068 1307792 2678166 2497219 3126915
5937C126915j420078M6480J036055J1392q16578n92103L9976R83734K4166J331243
$$ 3126915 1706837 1753317 2789372 2800764 1984186 1392083 1432059 2415793 2439959 3771202
5927C771202p24197j329741p7719P53695J003463l69193L25177k53771K76686
$$ 3771202 3047005 1717264 1639545 2393240 3396703 3027510 3352687 3098916 3375602
5918C375602j267611J233691L38316j094522L14363Q38493j46221N18727q87067
$$ 3375602 2107991 3341682 3679998 2585476 2899839 3738332 3592111 4110838 3223771
5909C223771l7995M1849K46803m18478m63708K78587J962837j022991L74092M87542
$$ 3223771 3185776 3227625 3474428 3055950 2592242 2870829 4833666 3810675 4184767 4672309
5899D672309j113371L29278j06202j53619j51915J279306k27849K52379q49467
$$ 4672309 3558938 3888216 3782014 3628395 3476480 4755786 4527937 4780316 3930849
5890C930849P48174k05542J475242j079338J2452O62613o83309J159731j746037
$$ 3930849 4679023 4473481 5948723 4869385 4881837 5544450 4861141 6020872 4274835
5881D274835P40686J39041j221808l67644J330332p25866R37681J000720M30279
$$ 4274835 5015521 5154562 3932754 3565110 4895442 4169576 5107257 6107977 6538256
5872F538256l67798r24871p91157L023990k632150J589388j65813J27974O83337
$$ 6538256 6170458 5245587 4454430 7478420 4846270 6435658 6269845 6397819 7081156
5863G081156r40873J278538j005850J719397k76663R31309o03019l1139L33698
$$ 7081156 6140283 7418821 6412971 8132368 7855705 8787014 8183995 8152856 8486554
5854H486554M82742n8059l29049J367065p236L98876J420877j712844J125555
$$ 8486554 8969296 8911237 8582188 9949253 9942017 10340893 11761770 10048926 11174481
5845A1174481J070334p18226J391121m83686J941595n32367J086296Q14094o54565
$$ 11174481 12244815 11526589 12917710 12434024 14375619 13843252 14929548 15743642 15089077
5836A5089077N26125J949382n82712R78222O29109J317324M74060J086541P44359
$$ 15089077 15615202 17564584 16981872 17960094 18589203 19906527 20380587 21467128 22211487
5827B2211487m49387j09133Q04487J174757P77715R03952l34007m27479J537923
$$ 22211487 21762100 21652967 22457454 23632211 24409926 25313878 24979871 24552392 26090315
5818B6090315O00813j172189N34610Q08228j801474Q54809n9939j005143J21615
$$ 26090315 26691128 25518939 26053549 26861777 25060303 25915112 25855173 24850030 24971645
5809B4971645N32953j743744L52210j567809r75318o71747j900708k26936p07513
$$ 24971645 25504598 23760854 24113064 22545255 21569937 20898190 18997482 18770546 18063033
5800A8063033j064759m53158j535089o26232J051366j908043R83885q90829p57947
$$ 18063033 16998274 16545116 15010027 14383795 15435161 13527118 14511003 13620174 12862227
5791A2862227j25340j207226j171988J473124j394760k036423J238766p60754
$$ 12862227 12736887 11529661 10357673 11830797 10436037 8399614 9638380 8877626
5783H877626j42410j3224l36569N42754p16170l37483O96808j29367n94132Q86739
$$ 8877626 8735216 8721992 8385423 8928177 8212007 7874524 8571332 8441965 7847833 8734572
5773H734572o54617o8831j481111O21086O49506Q4371Q98313q69549k20082j198104
$$ 8734572 8079955 8011124 6530013 7151099 7800605 7884976 8783289 7913740 7693658 6495554
5763F495554P81958L95242J73475n38817n47589M49964m70312n37804J019312
$$ 6495554 7277512 7672754 7846229 7307412 6759823 7209787 6739475 6201671 7220983
5754G220983q81607j35579N76922J495448l08214l13672j337487K175570j252623
$$ 7220983 6339376 6203797 6780719 8276167 7967953 7654281 6316794 8492364 7239741
5745G239741O12073J65987p29170j5159n85202J717988j046935j984586K651791
$$ 7239741 7851814 8017801 7288631 7273472 6688270 8406258 7359323 5374737 8026528
5736H026528l05200m98139j57884K177574j509164k034643J597285k38909N60512
$$ 8026528 7721328 7223189 7065305 9242879 7733715 5699072 7296357 7057448 7617960
5727G617960k276532L395259n99665p63780J17670K00277L63922J153344m75081
$$ 7617960 5341428 8736687 8137022 7373242 7490912 7691189 8055111 9208455 8733374
5718H733374K34513k391208J203972n10885Q30222j72873P42470j952868K064992
$$ 8733374 8967887 6576679 7780651 7269766 8099988 7927115 8669585 6716717 8781709
5709H781709l75652q60133J339368m03553k65968l70971Q03960N9383J776671
$$ 8781709 8406057 7545924 8885292 8481739 8215771 7844800 8648760 8708143 10484814
5700A0484814j178946J08467J297988j158134R12949o781n01247O01608k58361
$$ 10484814 9305868 9414335 10712323 9554189 10467138 10460357 9959110 10560718 10302357
5691A0302357q55817o2961L66881R93000p86187J065056j026073p13076J159455
$$ 10302357 9446540 9383579 9750460 10743460 9957273 11022329 9996256 9283180 10442635
5682A0442635p71351N09729n68998J104132o48532m01333m61245J303917k57396
$$ 10442635 9671284 10181013 9612015 10716147 10067615 9666282 9205037 10508954 10251558
5673A0251558Q9135J991755j263801O41888j818346L96155Q45818j195270K617171
$$ 10251558 10340693 12332448 11068647 11710535 9892189 10288344 11134162 9938892 12556063
5664A2556063j239513L61909j035628P40897j001859o30863j266024j3300L31045
$$ 12556063 11316550 11678459 10642831 11383728 10381869 9751006 8484982 8471682 8802727
5655H802727M80653l39909K06631q9097p6269j160431J103847q69055N72944j150678
$$ 8802727 9283380 8943471 9150102 9061005 8984736 7824305 8928152 8059097 8632041 7481363
5645G481363P55887N30000L89175p80733j553895j64219J826457j148880k43731
$$ 7481363 8237250 8767250 9156425 8375692 6821797 6657578 8484035 7335155 7091424
5636G091424O83539k65843q4862m0994J816655k498915J179661M1545m92292r23266
$$ 7091424 7774963 7509120 7424258 7383264 9199919 6701004 7880665 7922210 7429918 6506652
5626F506652K70584K20510j02762j22098l11353j048955J848450j505863M23359
$$ 6506652 6777236 6997746 6894984 6772886 6461533 5412578 7261028 5755165 6178524
5617F178524Q27732o79346R35643L43161l16231P5378j617833J597120j501436
$$ 6178524 7006256 6326910 7262553 7605714 7289483 7364861 5747028 7344148 5842712
5608E842712q3953J875702k308982J260696l01568L21842R1272J160454j139602
$$ 5842712 5758759 7634461 5325479 6586175 6284607 6606449 6697721 7858175 6718573
5599F718573p28760J310957r87583R59410j143424J027017M93088q68442p82435
$$ 6718573 5989813 7300770 6313187 7272597 6129173 7156190 7649278 6780836 5998401
5590E998401L19955j199585J221419q98501J695647m65256j83523N09421L58402
$$ 5998401 6318356 5118771 6340190 5441689 7137336 6672080 6488557 6997978 7356380
5581G356380j764489O27593j431332K784738k6140n27053K13489p05987K49381
$$ 7356380 5591891 6219484 4788152 7572890 7546750 7019697 7233186 6527199 6776580
5572F776580K08760l05098o63803j257705J226407l69544J064017Q61563q97049
$$ 6776580 6985340 6680242 6016439 4758734 5985141 5615597 6679614 7541177 6644128
5563F644128L38711k359467J131449P87108R99169l55170n53303j989173K967734
$$ 6644128 6982839 4623372 5754821 6541929 7541098 7185928 6632625 4643452 7611186
5554G611186J88041k428610J457326j7485j656781J925221J14428q80572j167832
$$ 7611186 7799227 5370617 6827943 6810458 5153677 7078898 7193326 6312754 5144922
5545E144922O87511O3075Q62886j319200J89249k62484L06188r77771K06371J652560
$$ 5144922 5832433 5895508 6758394 5439194 5628443 5365959 5672147 4694376 4900747 6553307
5535F553307m16868j679369R31570J390152O0724l71662p75080K115393r5680
$$ 6553307 6136439 4457070 5388640 6778792 6839516 6467854 5692774 7808167 7712487
5526G712487o98324j684870J725710q39536J752846j387416J537108o61364o00321
$$ 7712487 7014163 5329293 7055003 6215467 7968313 6580897 8118005 7456641 6856320
5517F856320k77478O37846n79760J52551j638798N6126J31326J191443l40331
$$ 6856320 6578842 7216688 6636928 6789479 5150681 5206807 5338133 6529576 6189245
5508F189245Q89167k080801R98185n71822n18900K80690K678761k538416Q34408
$$ 6189245 7078412 4997611 5995796 5423974 4905074 5185764 7864525 5326109 6160517
5499F160517n24522p51638Q03468M8650O32405p42589o48053K263452j910649
$$ 6160517 5635995 4884357 5687825 5736475 6368880 5626291 4978238 7241690 5331041
5490E331041J490120o26104m79550J142643J973319k073556o12533M57070o27399
$$ 5331041 6821161 6195057 5715507 6858150 8831469 6757913 6145380 6602450 5975051
5481E975051P17400m53245J594205j800636L65241J276560J449921r00912j211032
$$ 5975051 6692451 6239206 7833411 6032775 6398016 7674576 9124497 8223585 7012553
5472G012553P07374j475173p88639L34285P0868J679891p10852l35393M82476
$$ 7012553 7719927 6244754 5456115 5790400 5861268 7541159 6830307 6494914 6977390
5463F977390j815513J849979J360140j606396J731528m75826j251484N35579p34200
$$ 6977390 5161877 7011856 8371996 6765600 8497128 8021302 6769818 7305397 6571197
5454F571197j63467Q74721J048393k753586P74427J152563M3325m57561O54492
$$ 6571197 6407730 7282451 8330844 5577258 6351685 7504248 7547573 7090012 7744504
5445G744504j225188L89992J628864j098332J31656j77686J636150q96134n25364
$$ 7744504 6519316 6909308 8538172 7439840 7571496 7393810 9029960 8133826 7608462
5436G608462J154218r52395K98138M8772K45937Q8615j462250P90278J37774j31488
$$ 7608462 8762680 7810285 8108423 8157195 8403132 8491747 7029497 7819775 7957549 7826061
5426G826061O86699j252418J521206n30471J572869j99744j234709J494041j776304
$$ 7826061 8512760 7260342 8781548 8251077 9823946 9624202 8389493 9883534 8107230
5417H107230K693238k235412o67518L076184j196837M72375j734610j65409J076079
$$ 8107230 10800468 8565056 7897538 10973722 9776885 10249260 8514650 8349241 9425320
5408I425320k62154O31854m53443L94209P69547j051945j710505J599314K74472
$$ 9425320 9163166 9795020 9341577 9735786 10505333 9453388 7742883 9342197 9616669
5399I616669O65226j328865M82641M0302o29611m46120N11345O72412o03351q97374
$$ 9616669 10281895 8953030 9435671 9475973 8846362 8400242 8911587 9583999 8980648 8083274
5389H083274J842357m60321K12143p23096k64502J533705K08230k496793K329990
$$ 8083274 9925631 9465310 9677453 8954357 8689855 10223560 10431790 7934997 10264987
5380A0264987j303365J59783j83212R07686o63920o92996K31647Q75415j350724
$$ 10264987 8961622 9121405 8938193 9845879 9181959 8488963 8720610 9596025 8245301
5371H245301m70595J159096J051128j653201J304767J463648q96780j320218O32343
$$ 8245301 7774706 8933802 9984930 8331729 9636496 11100144 10203364 8883146 9515489
5362I515489J68010j581679J132649Q96545o56742k69647k89092R31247O0952
$$ 9515489 9683499 8101820 9234469 10131014 9474272 9204625 8915533 9846780 9907732
5353I907732l06317J26254n63980k11834J005606l3174o28624O39164J296660
$$ 9907732 9601415 9727669 9163689 8951855 9957461 9924287 9295663 9934827 11231487
5344A1231487r46394k65362N73055J251577j070336P84468j533558N88598J373281
$$ 11231487 10285093 10019731 10592786 11844363 10774027 11558495 10024937 10613535 11986816
5335A1986816J92877j357402J073358j191161K212340j557592K2759P94255K13422
$$ 11986816 12179693 10822291 11895649 10704488 12916828 11359236 11381995 12176250 12389672
5326A2389672m99229K7116J064771N92584l41044J217270k117334J264150J680298
$$ 12389672 11890443 11917559 12982330 13574914 13233870 14451140 12333806 13597956 15278254
5317A5278254j019248j348521J372951O94396j66167J552862j116003o0187J167115
$$ 15278254 14259006 12910485 14283436 14977832 14811665 16364527 15248524 15188337 16355452
5308A6355452k0203j350350N35248J86186R82645J2608J819805j389595P73145
$$ 16355452 16335249 14984899 15520147 15706333 16688978 16701586 18521391 17131796 17904941
5299A7904941r456J476871j130458J610437L63933R61394J283900m70623p84633
$$ 17904941 17895485 19372356 18241898 19852335 20216268 21177662 22461562 21990939 21206306
5290B1206306J229485K725652m83802n50933K460494Q18765J59283Q93808J35918
$$ 21206306 22435791 25161443 24677641 24126708 26587202 27405967 27565250 28459058 28594976
5281B8594976O55747R92876K101467m49142L097544K05784J749766Q73626J316035
$$ 28594976 29250723 30243599 32345066 31895924 34993468 35199252 36949018 37822644 39138679
5272C9138679K249650K307024p8587K350918M541455P06069J315354K445131K164002
$$ 39138679 41388329 43695353 43616766 45967684 50509139 51215208 52530562 54975693 57139695
5263E7139695L935780K313315L776574K610597L382022M771764M192624M486331
$$ 57139695 61075475 63388790 67165364 69775961 73157983 77929747 82122371 86608702
5255H6608702L067492N446828M714876P075087M057824M816618N336112M353119
$$ 86608702 89676194 95123022 99837898 106912985 110970809 115787427 121123539 125476658
5247A25476658J27653J414235l83803R7580r92738J14610K087134R25561K961687
$$ 125476658 125604311 127018546 126634743 126732323 125739585 125854195 127941329 128866890 131828577
5238A31828577J305250K569110N201972N119947L352545N086257Q068903N881142
$$ 131828577 133133827 135702937 140904909 146024856 149377401 154463658 162532561 168413703
5230A68413703M567429L350235M38521r18729l883967m431755o886427n897343
$$ 168413703 172981132 176331367 176769888 175851159 171967192 167535437 160649010 154751667
5222A54751667o612657o142446l969572n618085l238596k055153k115817J473939
$$ 154751667 148139010 141996564 138026992 132408907 129170311 127115158 124999341 126473280
5214A26473280j501796p4663J319293L462404Q83653J570597Q49954l729111m278023
$$ 126473280 124971484 124896821 126216114 129678518 130562171 132132768 132982722 129253611 124975588
5205A24975588n648667r081254p091943p009318p326629o144093n863597n892224
$$ 124975588 119326921 110245667 103153724 96144406 88817777 82673684 76810087 70917863
5197G0917863m166747l004679k654067j322222j762415j624069q53965o63139
$$ 70917863 66751116 63746437 61092370 59770148 58007733 56383664 55529699 54866560
5189E4866560m26963p13852j600789K424737q06498j140716J337618r15315J697023
$$ 54866560 54439597 53725745 52124956 54549693 53743195 52602479 53940097 53024782 54721805
5180E4721805O73775J725531R09365q58908J98890L439915O42779J168565J779422
$$ 54721805 55395580 57121111 58030476 57171568 57370458 60810373 61453152 62621717 64401139
5171F4401139K123366K488795M31200L963110o06744K819098M05441L886205J113261
$$ 64401139 66524505 69013300 69444500 73407610 72800866 75619964 76025405 79911610 81024871
5162H1024871K875591J582703K627792K549520J230738J100371K805069J899728
$$ 81024871 83900462 85483165 88110957 90660477 91891215 92991586 95796655 97696383
5154I7696383K384530K816883L489039K045693J595849N460646L223984L754591
$$ 97696383 100080913 102897796 106386835 108432528 110028377 115489023 118713007 122467598
5146A22467598M624648M096956M360902K858364M711145L613347N514715L727512
$$ 122467598 127092246 131189202 135550104 138408468 143119613 146732960 152247675 155975187
5138A55975187M756776N447959O308949O323184O903735Q600201N767186R259909
$$ 155975187 160731963 166179922 172488871 178812055 185715790 194315991 200083177 209343086
5130B09343086Q411236O782878J0766261J0204959J4280316J5237637J0766509
$$ 209343086 217754322 224537200 235303461 245508420 259788736 275026373 285792882
5123B85792882J2959629Q804239O266616L457009J141784J478817M726247O111447
$$ 285792882 298752511 307556750 313823366 317280375 318422159 319900976 324627223 330738670
5115C30738670R076908R955907J3479660J2439196P969468Q678159N901168N086090
$$ 330738670 339815578 349771485 363251145 375690341 383659809 392337968 398239136 403325226
5107D03325226N697576P544996J0419708J1799765J0281113O625614L673757l859375
$$ 403325226 409022802 416567798 426987506 438787271 449068384 455693998 459367755 455508380
5099D55508380p546837p014299r009992n960869k413094j38818J676545M26116
$$ 455508380 447961543 440947244 431937252 425976383 423563289 423424471 425101016 425527132
5091D25527132j009658n416034q155787j1408506r726390j2532855o701506r197042
$$ 425527132 424517474 419101440 410945653 399537147 389810757 377277902 370576396 361379354
5083C61379354o145491l070136n456358n569806q851897r922603j0794150j1153801
$$ 361379354 355233863 352163727 346707369 341137563 332285666 322363063 311568913 300415112
5075C00415112q534406m119666m461692k260986o065914p159284j2557295j2412370
$$ 300415112 291880706 287761040 283299348 281038362 274972448 267813164 255255869 242843499
5067B42843499j6112780j5714824j4518843j3293781j2510521p393143n964643
$$ 242843499 226730719 211015895 196497052 183203271 170692750 163299607 157334964
5060A57334964q120410k297764m608685j166753j215616j025607M7874P45691
$$ 157334964 149214554 146916790 142308105 141141352 139925736 138900129 138948003 139693694
5052A39693694j89663R09394K110688R14250o93979L56795K18830p79568J144379
$$ 139693694 139504031 140413425 142524113 143438363 142744384 143101179 143320009 142540441 143684820
5043A43684820k14100Q22221R79728J047291L568160L064703N528806N206991
$$ 143684820 143470720 144292941 145272669 146319960 149888120 152952823 158481629 163688620
5035A63688620O561257R405573M812048N468241K405866J446779n164074k709434
$$ 163688620 170249877 179655450 184467498 189935739 192341605 193788384 188624310 185914876
5027A85914876l153094k695221k918313L27852J156180o9300J864301L370913
$$ 185914876 182761782 180066561 177148248 177476100 178632280 178562980 180427281 183798194
5019A83798194J544233P155905M504016Q263392O916849R803551O466306Q230923
$$ 183798194 185342427 192498332 197002348 205265740 212182589 221986140 228452446 236683369
5011B36683369L006639J580499l729410l823997n859569l516402j34501N91R19058
$$ 236683369 239690008 241270507 237541097 233717100 227857531 224341129 224206628 224207219 225126277
5002B25126277P27811m90746n99339l699897j968542j978714J21429p95128N111721
$$ 225126277 225854088 225363342 224764003 221064106 219095564 217116850 217238279 216443151 221554872
4993B21554872J527334L269473J587291J188081K262478k861689o44818J88606
$$ 221554872 223082206 226351679 227938970 229127051 231389529 228527840 227883022 228071628
4985B28071628o97876Q09788l014885n23281m664330n205239r352925q572590
$$ 228071628 227373752 228183540 225168655 224645374 219981044 214775805 205422880 196850290
4977A96850290r705213r881811o388660r175942o442685l410048n112432l021598
$$ 196850290 187145077 177263266 170874606 161698664 155255979 151845931 146733499 143711901
4969A43711901j079595j635044M76842j08357K859876J872187J106926J444882
$$ 143711901 142632306 140997262 141474104 141365747 144225623 146097810 147204736 148649618
4961A48649618k075028o342733o167994j0722630r923037q519686j0339810p955917
$$ 148649618 146574590 140231857 134063863 123341233 113418196 104898510 94558700 86602783
4953H6602783n997097o098930m668149n253992l760600j707712l295310k413196
$$ 86602783 80605686 74506756 69838607 64584615 60824015 59116303 55820993 53407797
4945E3407797k720831j210181L8934j831234k854392j011294j606179K24017j887880
$$ 53407797 50686966 49476785 49515719 47684485 44830093 43818799 42212620 42436637 40548757
4936D0548757l081565J13304j95817j999242j472363j067121k300951J080868
$$ 40548757 37467192 37580496 37384679 35385437 33913074 32845953 30545002 31625870
4928C1625870k78332k239086N62766j143849K53053j684670j58723l66200K0329
$$ 31625870 31347538 29108452 29671218 28527369 28780422 27095752 26937029 26570829 26591158
4919B6591158j345150o65506R17080m68285r59461J508168j979473p34858N53743
$$ 26591158 25246008 24580502 25497582 25029297 24069836 25578004 23598531 22863673 23417416
4910B3417416m67176j300867J3622o72672o38153o62509J011594j281584l48088
$$ 23417416 22950240 21649373 21662995 20990323 20352170 19689661 20701255 19419671 19071583
4901A9071583p79243K454250k367636K98863O23300j570032m34672M15766M36598
$$ 19071583 18292340 20746590 18378954 18677817 19301117 17731085 17296413 17712179 18148777
4892A8148777j107315R25514m18919k76740k060090n26512P31449p1994R3267
$$ 18148777 17041462 17966976 17548057 17271317 15211227 14684715 15416164 15344170 15437437
4883A5437437K010425j826755M60048j000044K13830Q00166j023783K58098n18329
$$ 15437437 17447862 15621107 16081155 15081111 15294941 16095107 15071324 15329422 14811093
4874A4811093M83363m79601j161000k58861N73910O60049j50696L61106o9377
$$ 14811093 15294456 14814855 13653855 13394994 13968904 14628953 14478257 14839363 14769986
4865A4769986p91045K36791O53284j572280p50040J076288r92320O27214j056491
$$ 14769986 13978941 14215732 14869016 13296736 12546696 13622984 12630664 13257878 12201387
4856A2201387K89806l88948j190644J167609k10960j723018K311718j177343R27456
$$ 12201387 12491193 12102245 10911601 12079210 11868250 10145232 12456950 11279607 12207063
4847A2207063n96016j97727j18378p5704k43621J501120j377256n73923J466553
$$ 12207063 11611047 11413320 11294942 11219238 10975617 12476737 11099481 10525558 11992111
4838A1992111K32027K25025l84799m51765J67747m7177l05648K033189m73587
$$ 11992111 12224138 12449163 12064364 11612599 11780346 11733169 11427521 13460710 12987123
4829A2987123J40890m40049j501314O12212J2394j307406L160487k087839O19247
$$ 12987123 13128013 12687964 11186650 11798862 11811256 10503850 13664337 11576498 12195745
4820A2195745l14887j218189J922992j863450P96127k76150R34718o31872p36307
$$ 12195745 11880858 10662669 12585661 10722211 11518338 11242188 12176906 11545034 10808727
4811A0808727J963103r50155r84815K210977o32992j783322N99796Q20707k85378
$$ 10808727 12771830 11821675 10836860 13047837 12414845 10631523 11231319 12052026 11766648
4802A1766648l23183J551844L13680j052494q0200M32998j258561J233383p73299
$$ 11766648 11443465 12995309 13308989 12256495 12176295 12609293 11350732 12584115 11810816
4793A1810816J328929j635745J373205o11565P74406r36201j636208J803657k87009
$$ 11810816 13139745 11504000 12877205 12265640 13040046 12103845 10467637 12271294 11984285
4784A1984285Q69395J73344j33701n48671J721097k220243J001194p81140j77326
$$ 11984285 12853680 13027024 12893323 12344652 14065749 11845506 12846700 12065560 11888234
4775A1888234n124R06683j588970K075145j362356N9071k89468j1930L48342L75220
$$ 11888234 11883110 12789793 11200823 13275968 11913612 11972683 11683215 11671285 12019627 12394847
4765A2394847n51448l11660J748039j259456l71748L76837O87894j196167K00787
$$ 12394847 11843399 11531739 13279778 12020322 11648574 12025411 12713305 11517138 11717925
4756A1717925j145872J166999j666059J100593P07957p6793j230733J753887k368768
$$ 11717925 10572053 11739052 10072993 11173586 11881543 11804750 10574017 12327904 9959136
4747I959136O1151J27074J454769j145429N9705M33628j754493O60276J035478
$$ 9959136 10020287 10147361 11602130 10456701 10516406 10950034 9195541 9855817 10891295
4738A0891295j493880R50175j151663R36911J366775j691832j59365J099158r57339
$$ 10891295 9397415 10347590 9195927 10132838 11499613 9807781 9648416 10747574 9790235
4729I790235N34584n86723n32483K38100q6686J48577n46065K007183j112278
$$ 9790235 10324819 9738096 9205613 9443713 9357027 9505604 8959539 10966722 9854444
4720I854444R81799j533172K57279k59784L32839P97928N84015j607728J34784
$$ 9854444 10836243 9303071 9560350 9300566 9633405 10431333 11015348 9407620 9542404
4711I542404R88699L79788j147921K077484k688862L326491j862736L37586l0480
$$ 9542404 10531103 10910891 9762970 11840454 9151592 12478083 10615347 10952933 10922453
4702A0922453n36018Q21237K37496n08945l14236J417513n2227j241121J729400
$$ 10922453 10386435 11207672 11445168 10936223 10621987 12039500 11987273 10746152 12475552
4693A2475552M87484j302945J14155J087214q25932l40954J4197J02081J137659
$$ 12475552 12963036 11660091 11774246 12861460 12035528 11694574 11708771 11810852 12948511
4684A2948511l38589M16069j527528J038146j052165J123652P473n9744M25090
$$ 12948511 12609922 13025991 11498463 12536609 11484444 12608096 12615569 12555825 12980915
4675A2980915O61101J66559k807J533167j608531J676834j762131M14141K71265
$$ 12980915 13642016 13808575 13805768 15338935 13730404 15407238 13645107 14059248 14330513
4666A4330513L23249m46815j080402J373734J117744p39530o83820J009287l84047
$$ 14330513 14653762 14206947 13126545 14500279 15618023 14878493 14194673 15203960 14819913
4657A4819913J034496k53095o24483k63802l09211o45552N04849L40402j259300
$$ 14819913 15854409 15601314 14976831 14713029 14403818 13758266 14263115 14603517 13344217
4648A3344217K187855j72702k16129j157472J784702M11921K68293j213487j1747
$$ 13344217 15532072 15359370 15143241 13985769 15770471 16182392 16450685 15237198 15225451
4639A5225451j084276J977541m79496O22016j4421k65018j216735K238340j689475
$$ 15225451 14141175 16118716 15639220 16261236 16246815 15981797 14765062 17003402 15313927
4630A5313927J083254L73073o99105L67452j99604J480851o18337l06525J062064
$$ 15313927 16397181 16770254 16071149 16438601 16238997 17719848 17101511 16794986 17857050
4621A7857050J597137k05597l06188l98844O47583M9963p60364J951084k482549
$$ 17857050 19454187 19248590 18942402 18543558 19191141 19241104 18480740 20431824 17949275
4612A7949275N82454R77288q80440J609379q74384J484622j713496K440558j373690
$$ 17949275 18531729 19509017 18628577 20237956 19363572 20848194 19134698 21575256 20201566
4603B0201566O31513K021676k244468N93589l40952K57678J482107M23808k78907
$$ 20201566 20833079 22854755 20610287 21203876 20862924 21120602 22602709 23026517 22747610
4594B2747610J268742q41755O04517N71789m91427R63096J502463k259374j4764
$$ 22747610 24016352 23174597 23779114 24350903 23859476 24822572 26325035 24065661 24050897
4585B4050897J127597M9636p27191J203310K43998k03887J411954m32535J080238
$$ 24050897 25178494 25228130 24500939 25704249 25948247 25744360 27156314 26723779 27804017
4576B7804017P1600P40728M16761J562476k99911P60301l93594J600388J796661
$$ 27804017 27875617 28616345 29033106 30595582 30295671 31055972 30662378 32262766 34059427
4567C4059427O21948j32122K793031q83623Q46957j65831K986474J094630M92952
$$ 34059427 34681375 34549253 37342284 36458661 37305618 37139787 40126261 41220891 41713843
4558D1713843K302753K05381J754965J295641L620465r02745L236723J777106
$$ 41713843 44016596 44221977 45976942 47272583 50893048 49990303 53227026 55004132
4550E5004132L363955J555766M583348K752528K522106K995404L592060N026363
$$ 55004132 58368087 59923853 64507201 67259729 69781835 72777239 76369299 81395662
4542H1395662K024921N128640N567398L067134N369579P007218N916775O860093
$$ 81395662 83420583 88549223 94116621 97183755 102553334 109560552 115477327 122337420
4534A22337420O628680M638047N087100M326051P454430N746908Q073972J0146345
$$ 122337420 128966100 133604147 138691247 143017298 150471728 156218636 164292608 174438953
4526A74438953J2096821J1361958J0630081O925554P115346M583289K513562K137895
$$ 174438953 186535774 197897732 208527813 215453367 222568713 227152002 229665564 231803459
4518B31803459M016748L957059N790196O959089N484761R138229M279292Q925878
$$ 231803459 235820207 239777266 245567462 252526551 258011312 267149541 271428833 280354711
4510B80354711P249189R718680J0995815J3525247J5136098J7418773J6518222
$$ 280354711 287603900 297322580 308318395 321843642 336979740 354398513 370916735
4503C70916735J5085353R035865J456372l933151o436726p946323n993314q477744
$$ 370916735 386002088 395037953 396494325 392561174 386124448 378178125 372184811 363707067
4495C63707067n633668k612263n819908k680825l511574k658142l035587m15207
$$ 363707067 358073399 355461136 349641228 346960403 343448829 340790687 337755100 337339893
4487C37339893N561898O543592J0707198J3997871J3027316R129325L650283k999355
$$ 337339893 342901791 349445383 360152581 374150452 387177768 396307093 399957376 396958021
4479C96958021j1831106j4892719k0297909j9624605j8194588j2112832j1950877
$$ 396958021 385126915 370234196 349936287 330311682 312117094 300004262 288053385
4472B88053385j0893105r423341p991459j0499558q570255q997251p543496m430146
$$ 288053385 277160280 267736939 259745480 249245922 240675667 231678416 224134920 219704774
4464B19704774l532585k015092K14547J933115j540722m315407o449995o669425
$$ 219704774 216172189 214157097 214371644 216304759 214764037 210448630 203998635 197329210
4456A97329210j1389182j1143977j0474833r997744p597681p956503m092812m852507
$$ 197329210 185940028 174796051 164321218 154323474 146725793 138769290 134676478 129823971
4448A29823971l228478l899523m383210l718996l663560k755089m371416k266417
$$ 129823971 126595493 122695970 118312760 114593764 110930204 108175115 103803699 101537282
4440A01537282j706772k838944k344277j257604m37486J706660O06236j577854
$$ 101537282 99830510 96991566 94647289 93389685 92952199 94658859 95265095 93687241
4432I3687241P24706Q86994J53484J005188K893339J851644J582735K868380L332878
$$ 93687241 94411947 95298941 95452425 96457613 99350952 101202596 102785331 105653711 108986589
4423A08986589J447859K637463M573880M064787K303058M724455O194398M522406
$$ 108986589 110434448 113071911 117645791 121710578 124013636 128738091 134932489 139454895
4415A39454895O394523M725146O443057N441468N862038Q355497R376969R531310
$$ 139454895 145849418 150574564 157017621 162459089 168321127 176676624 186053593 195584903
4407A95584903J1447809R458184Q319384L749442j595812J424730m413899p130212
$$ 195584903 207032712 216490896 224810280 228559722 226963910 228388640 223974741 216844529
4399B16844529k795891n23510k193128J14855K875788l53850L287811N016410
$$ 216844529 214048638 213525128 211332000 211446855 214322643 213968793 217256604 222273014
4391B22273014N099600O415935Q032368O558562J1099194O260632N291464j313864
$$ 222273014 227372614 233788549 241820917 248379479 259478673 265739305 271030769 269716905
4383B69716905k883977j0902935j0639123j3955122j2232878j4102488r676048
$$ 269716905 266832928 255929993 245290870 231335748 219102870 205000382 195324334
4376A95324334p712965o968302o180353l997363k246282k156177j347457n90920
$$ 195324334 187611369 180643067 174462714 170465351 168219069 166062892 164715435 164124515
4368A64124515K386266L325710r65425N79266m308838m850607q352605j1694298
$$ 164124515 166510781 169836491 168871066 169450332 165141494 160290887 151938282 140243984
4360A40243984r676376j0297587q350358r306328q361479m914601m366883n614472
$$ 140243984 130567608 120270021 111919663 102613335 94251856 89337255 84970372 79355900
4352G9355900m790219l613050j893106k388199l000543q00806j475809j802358
$$ 79355900 74565681 70952631 69059525 66671326 63670783 62869977 61394168 59591810
4344E9591810j968523k188113j226183r5934j301881n48090k780470p83822j416886
$$ 59591810 57623287 55435174 54208991 54113057 52811176 52263086 49482616 48698794 47281908
4335D7281908m57868j63410k55019p89945n18066k337134J00781L090964l245405
$$ 47281908 46824040 46660630 46405611 45615666 45097600 42760466 42861247 45952211 42706806
4326D2706806L32125l100496K225636r55513j900128J728269m45254q04604K29707
$$ 42706806 43038931 39938435 42164071 41208558 39308430 41036699 40591445 39786841 40016548
4317D0016548M46373n93495j140415O29510q42956P42943P88877k866278J189185
$$ 40016548 40462921 39869426 38729011 39358521 38515565 39258508 40047385 37181107 38370292
4308C8370292j888391J482595R51099n34158Q12739Q58505N62425j813639M11905
$$ 38370292 36481901 37964496 38915595 38381437 39194176 40052681 40615106 38801467 39213372
4299C9213372K80527N19995O37219R94059O63651R29167K141106n47548J745579
$$ 39213372 39493899 40013894 40651113 41645172 42308823 43237990 45379096 44831548 46577127
4290D6577127R48454j7394M50157L967434j31197L163590q6194K891398J42343
$$ 46577127 47525581 47508187 47958344 51925778 51794581 54958171 54871977 57763375 57905718
4281E7905718J474345r33880P82842j282091j812984j284419n17140k42441j616500
$$ 57905718 59380063 58446183 59229025 57946934 56133950 54849531 54332391 54089950 52473450
4272E2473450K066226O86582k307138K400139M78277K13856J932323l05481M99425
$$ 52473450 54539676 55226258 52919120 55319259 55797536 56011392 57943715 57638234 58137659
4263E8137659J822428K608302L290439n5809K021177j038424j602065j178920
$$ 58137659 59960087 62568389 65858828 65803019 67824196 66785772 65183707 64004787
4255F4004787r30445m476936r75670l322151l289520n35674j352927j207392j68392
$$ 64004787 63074342 58597406 57621736 54299585 51010065 50474391 49121464 47914072 47745680
4246D7745680k117871J48809M7911l30024P48711j187881N98970M04364K089438
$$ 47745680 45627809 45776618 45824529 45494505 46243216 45055335 45654305 46058669 48148107
4237D8148107P25212r26536Q67944k654921p00332j212938L64874j963779k575936
$$ 48148107 48873319 47946783 48814727 46159806 45459474 44246536 44611410 42647631 40071695
4228D0071695N51065k222011j530628J008053k499939J010583j289287Q79128
$$ 40071695 40622760 38400749 36870121 37878174 35378235 36388818 35099531 35978659
4220C5978659n45355q43436n13697k38422J236486j94271m19810p17253k34518
$$ 35978659 35433304 34589868 34076171 33837749 35074235 34879964 34460154 33742901 33508383
4211C3508383L39739J200926j072285j045554j88013J296359n26990J285449n27358
$$ 33508383 33848122 35049048 33976763 32931209 32743196 34039555 33512565 34798014 34270656
4202C4270656j99658n94492r21081O2356j13919P15948J121504j321471J477918
$$ 34270656 34070998 33476506 32555425 32617781 32503862 33219810 34341314 33019843 34497761
4193C4497761j783718J710334j363058J104686M94083j036271M52648j74876N94629
$$ 34497761 32714043 34424377 33061319 34166005 34660088 33623817 34076465 33901589 34496218
4184C4496218n65477R90096N78248l82999J283848j447429n72172J953707r7588
$$ 34496218 33930741 34920837 35499085 35116086 36399934 34952505 34380333 36334040 36236452
4175C6236452l80275m44742L15158J202085M77020o56888M70033r87408K700186
$$ 36236452 35856177 35411435 35726593 36928678 37405698 36748810 37218843 36231435 38931621
4166C8931621j613308j31033M40866R96708J300977q32468K32646o12547N80588
$$ 38931621 37318313 37187280 37628146 38624854 39925831 39093363 39326009 38713462 39294050
4157C9294050j450791J791064K84986l57201R69018j109856J861912j091167m59804
$$ 39294050 37843259 39634323 39919309 39562108 40531126 39421270 41283182 40192015 39732211
4148C9732211M41104l2782O93663n27841O33865J210529q37281J257063j150843
$$ 39732211 40173315 40140533 40834196 40306355 40940220 42150749 41313468 42570531 41419688
4139D1419688K342750l46239L98170O03568j290885J820538K61445K37069k071304
$$ 41419688 43762438 43416199 43814369 44417937 43127052 44947590 45209035 45446104 43374800
4130D3374800K199385J242191j048760J366537o47676n61974O86606r90501N01968
$$ 43374800 45574185 46816376 45767616 47134153 46486477 45924503 46611109 45620608 46122576
4121D6122576J269688j715865O62643K92429M50950j138052p13198L90958p53684
$$ 46122576 47392264 45676399 46339042 46631471 47082421 45944369 45231171 45622129 44868445
4112D4868445Q36983l31828q33489J46690j15476M74273j524311K170480J278842
$$ 44868445 45705428 45373600 44540111 44686801 44571325 45045598 43521287 45691767 46970609
4103D6970609m99742p7191M67373J32341J441203P07065r96659j652958Q15888
$$ 46970609 46470867 46393676 46861049 46993390 48434593 49141658 48144999 46492041 47307929
4094D7307929m83664m30938n4525l77489q06070J753564k645171K338592p56362
$$ 47307929 46824265 46393327 46338802 45961313 45155243 46908807 44263636 46602228 45845866
4085D5845866J195351j805224k12516N22620P42643l38862k47753k22051R82059
$$ 45845866 47041217 45235993 45023477 45546097 46288740 45949878 45702125 45480074 46462133
4076D6462133L07164r49379j2324p94687k58734L64283o76944P3429k02098N08958
$$ 46462133 46769297 45819918 45807594 45012907 44754173 45118456 44441512 44514941 44312843 44821801
4066D4821801r43052Q11453q22603n33713N64818J111081J33671r92946M15438
$$ 44821801 43878749 44690202 43867599 43333886 43898704 45009785 45143456 44150510 44565948
4057D4565948p39489J495651j111898O37765K014633j070314J419169p5858j55573
$$ 44565948 43826459 45322110 44210212 44847977 46862610 45792296 47211465 47135607 46980034
4048D6980034k74945J623824m30700M03770N98898O33625Q17938j239662N20838
$$ 46980034 46705089 48328913 47898213 48301983 48900881 49534506 50352444 49112782 49633620
4039D9633620k13350J844680J176218j045313K7320J776528n56957O81221J064339
$$ 49633620 49420270 51264950 52441168 51395855 51423175 53199703 52642746 53323967 54388306
4030E4388306O96550N36145J969433l13606P78158R42099Q66733P09540j660795
$$ 54388306 55084856 55621001 57590434 57276828 58054986 58997085 59863818 60573358 58912563
4021E8912563K887385j917857O89172l80589Q42273k096536J037896j330907q97319
$$ 58912563 61799948 59882091 60571263 60190674 61032947 58936411 59974307 58643400 57746081
4012E7746081P14714m11177M4484J582896J192162q67600M60895J085226Q09945
$$ 57746081 58460795 58049618 58094102 59676998 60869160 60001560 60462455 61547681 62357626
4003F2357626P95490k224198K674470J036928Q92650k34845J134173K377062j964674
$$ 62357626 63153116 60928918 63603388 64640316 65532966 65298121 66432294 68809356 66844682
3994F6844682J556676k70712P87872Q06126j197781J826835j197295o83105L99633
$$ 66844682 68401358 68130646 68918518 69724644 68526863 70353698 69156403 68473298 68872931
3985F8872931K65525R06466M37500j357065j045591J756628N56184K041032p35117
$$ 68872931 69138456 70044922 70482422 69125357 68079766 69836394 70392578 72433610 71698493
3976G1698493O93904M30702O0964L5553J450537k14761j205760K628448m74045
$$ 71698493 72392397 72823099 72884063 72919616 74370153 74155392 72949632 75578080 75104035
3967G5104035K009145l34333k07400J815463j349271Q38361L89813j073914J204942
$$ 75104035 77113180 76778847 76571447 78386910 77037639 77876000 78265813 77191899 78396841
3958G8396841l94195N1489M5384J001819j34973J712636Q9831L40930L89915j065573
$$ 78396841 78002646 78054135 78099519 79101338 78966365 80679001 80768832 81109762 81499677 80434104
3948H0434104L513787k030013J561515K128310J340964n17109O7768L502336J50454
$$ 80434104 83947891 81917878 83479393 85607703 86948667 86431558 86499326 90001662 90152116
3939I0152116J750920J174833o33685L075667J731378P17870K604803J587134
$$ 90152116 91903036 93077869 92444184 95519851 97251229 97969099 100573902 102161036
3931A02161036J318879L012589J005077K315203K712895K184199K474627N733328
$$ 102161036 103479915 106492504 107497581 109812784 112525679 114709878 117184505 122917833
3923A22917833J498458K954719L589620K572172P83777K962373K64802J004560
$$ 122917833 124416291 127371010 130960630 133532802 134316579 137278952 137543754 138548314
3915A38548314L996950K216148J417281J465203L063846L665228R89587L622435
$$ 138548314 142545264 144761412 146178693 147643896 150707742 154372970 155362557 158984992
3907A58984992M459406M682924M259326O564306J516832M654203K440157M837107
$$ 158984992 163444398 168127322 172386648 178950954 180467786 185121989 187562146 192399253
3899A92399253J588151L368966K928757O946663M403308O752043K942810L294039
$$ 192399253 193987404 197356370 200285127 207231790 211635098 218387141 221329951 224623990
3891B24623990j171079J243238l000104r82903j895348j118920R35305L66369
$$ 224623990 223452911 224696149 221696045 220713142 218817794 217698874 218634179 219000548
3883B19000548J45067J428733J816414J590105O413163K090000N312703P709464
$$ 219000548 219145615 220574348 222390762 223980867 230394030 232484030 237796733 245506197
3875B45506197N325934L947288K997290l76768J740309l634180l488909r03714
$$ 245506197 250832131 254779419 257776709 257399941 259140250 255506070 252017161 251113447
3867B51113447R47051j023159L87880J033487k380737k584954j975805p058910
$$ 251113447 252060498 251037339 251425219 252458706 250077969 247493015 245517210 238458300
3859B38458300m242269n881828m980454l521025k651027j939956l096771L83081
$$ 238458300 234216031 228334203 223353749 219832724 217181697 215241741 212144970 212528051
3851B12528051N8588q46819P69262K621013M994285J868608Q48892L16195l298046
$$ 212528051 212586639 211739820 212509082 215130095 220124380 221992988 222841880 223158075 219860029
3842B19860029l426797n813502o922704n415581m873391n036322m095727l854320
$$ 219860029 216433232 210619730 203697026 198281445 193408054 188371732 184276005 180421685
3834A80421685l330626m335009n181000k614892n871015l753961l279246l537729
$$ 180421685 177091059 172756050 167575050 164960158 159089143 155335182 152055936 148518207
3826A48518207m038952j190575j772933j753557m36545j485333l71095K277283
$$ 148518207 144479255 143288680 141515747 139762190 139325645 137840312 137469217 139746500
3818A39746500l392582j445303k13880Q2421m126955j069388j922674m464532
$$ 139746500 136353918 134908615 134694735 134777156 130650201 129580813 127658139 123193607
3810A23193607j012591l662367j539139m90727l093884j20368j067003l919969
$$ 123193607 122181016 118518649 116979510 116488783 113394899 113274531 112207528 108287559
3802A08287559o38242K01877r27498J222242j940670j536524Q20537j679342n3654
$$ 108287559 107649317 107851194 106923696 108145938 106205268 104668744 105489281 103809939 103756285
3793A03756285P59429m2616n16865L54586Q3240k34918j140171Q73285j511972
$$ 103756285 104515714 104473098 103956233 104310819 104394059 104159141 103018970 103892255 102380283
3784A02380283K249963j739503K300672n59752n10750o40561J212103Q86802M30458
$$ 102380283 104630246 102890743 105191415 104631663 104120913 103480352 104692455 105579257 106009715
3775A06009715j02271J358757k41108j591360L62225m62013J19167l47361k310877
$$ 106009715 105907444 107266201 107025093 105433733 105795958 105333945 105453112 105105751 102794874
3766A02794874J191597J144531q4726Q2803R19717K1565j061403j791038l99387
$$ 102794874 103986471 105131002 105046276 105129079 106048796 106070361 105008958 103217920 102818533
3757A02818533K69k092459K396880j786620J201799j118943l504588l30938k209466
$$ 102818533 102818802 100726343 103123223 101336603 102538402 101419459 97914871 97583933 95374467
3748I5374467p87161l154693j600640j854264K07186k581409L06156j601180P05742
$$ 95374467 94587306 91432613 89831973 87977709 88184895 85603486 85909642 84308462 85014204
3739H5014204j949824k7692j496184J203193j265201Q7977q70787j585765j80173
$$ 85014204 83064380 83036688 81540504 82743697 81478496 81566473 80695686 79109921 78929748
3730G8929748j96994n67772j370567j528126N86543q00528j339980m9658j246837
$$ 78929748 78732754 78164982 76794415 75266289 75852832 75052304 73712324 73662666 72415829
3721G2415829N21388l33780j221571l52770P86974q76297j440843K991694k894176
$$ 72415829 72937217 72603437 71381866 71029096 71816070 70939773 69498930 72490624 69596448
3712F9596448J680919j38166l80298J278876J25637Q184m16960K92246J087610
$$ 69596448 71277367 71139201 70758903 72037779 72163416 72171600 71754640 72046886 73134496
3703G3134496j352924K237322q86809K68321k137235J618282K17739N8013O81782
$$ 73134496 71781572 74018894 73132085 73400406 71263171 72881453 73099192 73157205 73838987
3694G3838987j630387p6621K476385j454080L62471J566957j607277k60838J487287
$$ 73838987 72208600 72131979 74608364 73154284 73516755 75083712 73476435 73215597 74702884
3685G4702884N69949J77588m35396J888099N87641o29483K073791j138211J660459
$$ 74702884 75272833 75450421 75015025 76903124 77490765 76861282 78935073 77796862 79457321
3676G9457321M17797j133748M70525J043425k244587J138376j781211K112333
$$ 79457321 79875118 78741370 79211895 80255320 78010733 79149109 77367898 79480231
3668G9480231k346493J830706M86118l23787L91456o01525k03523L14037j03531
$$ 79480231 77133738 78964444 79450562 79126775 79518231 78916706 78713183 79027220 78923689
3659G8923689J409497p97407R57863M23063j459754J060256J47045K299692j092416
$$ 78923689 80333186 79535779 80493642 80916705 79456951 80517207 80664252 82963944 81871528
3650H1871528O03627J542427p40188k83481J142449N26970n23976Q91747R49166
$$ 81871528 82475155 84017582 83277394 82993913 84136362 84663332 84139356 85031103 85980269
3641H5980269Q42305j703149Q98239M02217J704167m37845q08996J174169j821715
$$ 85980269 86822574 85119425 86017664 86419881 88124048 87686203 86877207 88051376 86229661
3632H6229661J429521R91739J263319L6899j61907J573732J667178j717851R4340
$$ 86229661 87659182 88650921 89914240 89951139 89789232 91362964 93030142 91312291 91406631
3623I1406631O13334k410283J505058K585261j380604r23187j45251J768989p10803
$$ 91406631 92019965 89609682 91114740 93700001 92319397 91396210 91250959 93019948 92309145
3614I2309145j849903J022780P38805J94608Q79109n34094l52041N06010N02475
$$ 92309145 90459242 91482022 92220827 92415435 93294544 92760450 92408409 92914419 93416894
3605I3416894R50174Q76154O18043p68037J016084J664056k357030J820650N12364
$$ 93416894 94367068 95243222 95861265 95093228 96109312 97773368 95416338 97236988 97749352
3596I7749352j888650J471690j066997k929512Q1823M72513o56524j512865j381916
$$ 97749352 95860702 97332392 96265395 93335883 93417706 93890219 93233695 91720830 90338914
3587I0338914o14899l01554q75435j87345j245578j665153k05429L86034j954755
$$ 90338914 89724015 89422461 88547026 88359681 87114103 85448950 85243521 85629555 83674800
3578H3674800l28627P44810j672556l30065j447363L37068m37384M20901j977951
$$ 83674800 83346173 84090983 82418427 82088362 80640999 80978067 80540683 80961584 78983633
3569G8983633j168021R18122j764968J259734j831881r30249j327421p93436j895509
$$ 78983633 77815612 78733734 76968766 78228500 76396619 75466370 74138949 73345513 71450004
3560G1450004P02819j039823k460587m83731m96989j636370r05401m87266K23398
$$ 71450004 72152823 71113000 68652413 68168682 67671693 66035323 65129922 64642656 64866054
3551F4866054O3094j732840j327764K60983L17965k89381r06525N97892k372895
$$ 64866054 64929148 63196308 61868544 62129527 62447492 62158111 61251586 61849478 59476583
3542E9476583Q06630k102078J045490Q1107o40220l08292J26106L43569J045684
$$ 59476583 60283213 58181135 59226625 59307732 58667512 58359220 58485326 58828895 59874579
3533E9874579j316213L44556j067213m65359N79705j126002J87569n36417l31222
$$ 59874579 58558366 58902922 57835709 57370350 57950055 56824053 57011622 56475205 56143983
3524E6143983p8474J66753l49533n71375r1342N53835o0151R82755j960648R1600
$$ 56143983 56065509 56232262 55882729 55311354 55220012 55773847 55713696 56696451 54735803 54827403
3514E4827403N31917N47895j357983J457473j034545n16021r39683J661096m30382
$$ 54827403 55359320 55907215 54549232 56006705 54972160 54456139 53516456 55177552 54747170
3505E4747170J21282J09284q25644K25233o5773n63620Q14450K73889k81689o25017
$$ 54747170 54868452 54977736 54152092 54377325 54311552 53747932 54562382 54836271 54554582 53929565
3495E3929565J118356p02661O334j729275L235513r33409j055748J087704k093017
$$ 53929565 55047921 54345260 54351594 52622319 55857832 54924423 53868675 54956379 52863362
3486E2863362J788806p08149M86592J086356r71490P59415r31844K84322N20884
$$ 52863362 54652168 53944019 54430611 55516967 54545477 55304892 54373048 54657370 55178254
3477E5178254J268288P47915j605110N66107J318590k044053K004719m39748j291368
$$ 55178254 56446542 57194457 55589347 56155454 57474044 55429991 57434710 56994962 55703594
3468E5703594R46838n91301J173507M122j226024J494849k344687O85456m68349
$$ 55703594 56650432 56059131 57232638 57236760 56010736 57505585 55160898 55846354 55378005
3459E5378005j6921Q32452p01546J854632o79233p19987K551816k764262J089113
$$ 55378005 55361084 56193536 55491990 57346622 56667389 55947402 58499218 55734956 56824069
3450E6824069l62603J531325L02802j81513J2055j27170M36625N79022j549572
$$ 56824069 56461466 57992791 58295593 58114080 58126135 57998965 58435590 59014612 57465040
3441E7465040m7432N52809J173805n37369k58146j9756J028590j260210J58020
$$ 57465040 57417608 57970417 59144222 58606853 58348707 58328951 59357541 58097331 58255351
3432E8255351Q30960M32700q47784O95228m04646L11181J20711J87736j338451
$$ 58255351 59086311 59519011 58671227 59366455 58961809 59272990 59393701 59581437 58242986
3423E8242986K513733j41787P92720k264109K378394j657042J642866J24895m00519
$$ 58242986 60756719 60614932 61407652 59143543 61521937 59864895 61507761 61632656 61232137
3414F1232137K49307R37317q25038l60420n1791l07257j179411O71343M23273
$$ 61232137 61481444 62418761 61593723 61233303 61181512 60874255 59694844 60366187 60789460
3405F0789460N77033O39603j706067j212783K421550j546235N59859J0398L57192
$$ 60789460 61366493 62006096 60300029 59087246 61508796 59962561 60522420 60532818 60890010
3396F0890010n67631J732788j859299n57435J453724l62433J655036j927515J239944
$$ 60890010 60322379 62055167 60195868 59638433 61092157 60729724 62384760 60457245 61697189
3387F1697189r68569J693609J66629J089884L79531P98359k24557P54274J362685
$$ 61697189 60728620 62422229 62588858 63678742 64058273 64856632 64632075 65386349 66749034
3378F6749034j55612J403208j689031R09391J188920O78671P87853J279452Q18644
$$ 66749034 66593422 67996630 66307599 67216990 68405910 69084581 69872434 71151886 71970530
3369G1970530J772302k33594N15247J601781j31762R5189K575074j173124N12335
$$ 71970530 73742832 73509238 74024485 75626266 75494504 75589693 78164767 76991643 77503978
3360G7503978J713813K254330o99377m56177J539942J328626R9299j363236J638625
$$ 77503978 79217791 81472121 80772744 80316567 81856509 83185135 83284434 81921198 83559823
3351H3559823N77742j755971k84900o24943K580637J080268N2708j687767N89607
$$ 83559823 84137565 82381594 82096694 81471751 84052388 85132656 85185364 83497597 84087204
3342H4087204J77867n56427J827683m53882J875210j907710J484682k36199O88970
$$ 84087204 84265071 83708644 85536327 85082445 86957655 85049945 86534627 86298428 86987398
3333H6987398O90233l50163j1369N78839n14112J620070o81020O12843o16614
$$ 86987398 87677631 87327468 87316099 87894938 87380826 89000896 88319876 88932719 88316105
3324H8316105Q62018j913287P29394r51027r27047p08697Q24614k332118O92275
$$ 88316105 89178123 87264836 87994230 87043203 86116156 85407459 86232073 83899955 84592230
3315H4592230j781644r4689j81690K2522j350245L553045k853200k23397J485407
$$ 84592230 82810586 82715897 82534207 82556729 81206484 84759529 81906329 81682932 83168339
3306H3168339l00066j359398m51798P5479M57015j807774J169300j608455J199856
$$ 83168339 82868273 81508875 81057077 81132556 81589571 79781797 80951097 79342642 80542498
3297H0542498j085722k95866m93460M36421j534503j214334R2636L14999J452637
$$ 80542498 79456776 79160910 78667450 79103871 77569368 76355034 76447670 76762669 78215306
3288G8215306j833531k100702J418563M11829m0681P83275j004648l22795J538373
$$ 78215306 76381775 74281073 75699636 76111465 76070784 76854059 75849411 75526616 77064989
3279G7064989O59996j35364j878478Q36132R11702N26193r55152k65329Q01719
$$ 77064989 77724985 77589621 75711143 76547275 77458977 77985170 77030018 76764689 77566408
3270G7566408j8123q2798m67915J796447j699118q66587J061796O7664P35243
$$ 77566408 77548285 77465487 76997572 78794019 77094901 76228314 77290110 77357774 78093017
3261G8093017q9150K62235M31484l99521Q72344R84737j843142L092458o94021
$$ 78093017 78003867 78266102 78697586 78298065 79170409 80155146 78312004 81404462 80710441
3252H0710441R49995j307283j276126m74302J391548k32845j13794K20184N44631
$$ 80710441 81660436 80353153 79077027 78602725 79994273 79761428 79647634 79867818 80412449
3243H0412449q25094J613428j238818J132816M25859m76986J279978P6900J079577
$$ 80412449 79587355 81200783 79961965 81094781 81520640 81043654 82323632 82400532 83480109
3234H3480109J184151q48336J258357Q97153J57965Q48832M22701p63028J255499
$$ 83480109 84664260 83815924 85074281 85971434 86129399 86978231 87400932 86637904 87893403
3225H7893403n65795N11703j004287j36171J568800j728813K02548J79276M63334
$$ 87893403 87327608 87839311 86835024 86698853 88267653 86538840 86741388 86920664 87383998
3216H7383998j014134o34346K443815m65921n3789l89424R19551n19043N62850
$$ 87383998 86369864 85735518 88179333 87713412 87659623 87270199 88189750 87670707 88233557
3207H8233557J005132o2489J164050L14631p23602L76915J478426J881970k152805
$$ 88233557 89238689 89176200 90340250 90654881 89931279 90308194 91786620 93668590 91515785
3198I1515785q65656M752375j354557Q44139J75357Q76998J04284l8162J588653
$$ 91515785 90650129 95402504 94047947 94892086 95067443 95944441 96048725 96010563 97599216
3189I7599216j20604r19089L70679L37777P36936J867707R89304j005519J044529
$$ 97599216 97478612 96559523 96930202 97267979 98004915 99872622 100861926 99856407 100900936
3180A00900936R13908l18663K785474j180569O94262J408931J998621j613777
$$ 100900936 101814844 101496181 104281655 103101086 103795348 105204279 107202900 105589123
3172A05589123O66430J840371k045390K214233P91726m57461J216476q61998N52082
$$ 105589123 106255553 108095924 106050534 108264767 109056493 108599032 109815508 108953510 109505592
3163A09505592o46340Q99547k572139K355048j213535L78277O27285l23499k313064
$$ 109505592 108859252 109758799 107186660 109541708 108328173 108706450 109333735 109010236 106697172
3154A06697172K637496m42766j417677J208949m6502M73765j432281j49381M67235
$$ 106697172 109334668 108891902 107474225 108683174 108636672 109110437 107678156 107528775 107996010
3145A07996010o88321Q32773N31723k57448k67079o17083o16101n07783J50958
$$ 107996010 107307689 108140462 108672185 108414737 108147658 107530575 106914474 106406691 106557649
3136A06557649k575373P81563q3870p38398M04309k107716K8167j41020j169368
$$ 106557649 103982276 104763839 104679969 103941571 104345880 102238164 102266331 102125311 100955943
3127A00955943O78468k183159J758114k494314K84634P13164j56281j206210j880803
$$ 100955943 101634411 99451252 101209366 98715052 98999686 99712850 99556569 98350359 96469556
3118I6469556O90734j020495O83369j320596K54429p90996J800337k821851N83485
$$ 96469556 97160290 96139795 96823164 95502568 95756997 94966001 96766338 93944487 94527972
3109I4527972K274970m174719k70935N87487j479062o83817j168917j682605l53082
$$ 94527972 96802942 92628223 92357288 92944775 91465713 90781896 89612979 87930374 87577292
3100H7577292l07625j169468O47198k574243o43296j028791j181454j147800O76315
$$ 87577292 87269667 86100199 86747397 84173154 83529858 82501067 81319613 80171813 80848128
3091H0848128j3223k783126k12281M01103r29225k19038o47624k269768L500323
$$ 80848128 80834905 78051779 77839498 78240601 77311376 77092338 76444714 74174946 77675269
3082G7675269j922425j648301n1615L89490O289j806678L88251n65966o79026
$$ 77675269 75752844 74104543 74052928 74442418 74448707 72642029 73030280 72464314 71785288
3073G1785288R77555j452166o62195O6802r44392j592985J640037p08474j918315
$$ 71785288 72762843 71310677 70648482 70715284 69770892 68177907 69817944 69109470 67191155
3064F7191155M76549l47517j74302N92955j519311j0451j27761l47624Q42682
$$ 67191155 67667704 67320187 67145885 67738840 66219529 66209078 66081317 65733693 66576375
3055F6576375j148691q05286J041366l35642r85206R86305N00171l27189m05463
$$ 66576375 65427684 64622398 65663764 65328122 64342916 65329221 65829392 65502203 65096740
3046F5096740r7721k422744N85450Q00092J109759k309263J887611q65212O54666
$$ 65096740 64999019 62576275 63161725 63961817 65071576 62762313 64649924 63784712 64439378
3037F4439378j246903J213626K95780J073610r26606j121559J133375J03854k59438
$$ 64439378 63192475 64406101 64701881 65775491 64848885 63727326 64860701 64964555 64705117
3028F4705117q02774l63459P18617p84206P71484P44780K97774j179204o16721
$$ 64705117 63902343 63538884 64257501 63473295 64244779 64989559 65287333 64108129 63491408
3019F3491408J932750j962358J199190p7000q86311K079481p8426j159085Q45167
$$ 63491408 65424158 63461800 64660990 64583990 63697679 65777160 65698734 64539649 65384816
3010F5384816n22020J907526k280057n16034l71119P69867o99579P77828P16459
$$ 65384816 64862796 66770322 64490265 63974231 63603112 64372979 63673400 64451228 65167687
3001F5167687Q70965k94249J018213j700602O52161k6184q65913J445079o60291
$$ 65167687 66038652 65744403 66762616 65062014 65714175 65687991 64822078 66267157 65606866
2992F5606866M89203r47633J236932Q81796m48905N59623r7023J112351l67166
$$ 65606866 66096069 65148436 66385368 67267164 66818259 67377882 67280859 68393210 68026044
2983F8026044L33544o78688J216592J833160k041027l89220J949721l16866k18515
$$ 68026044 68359588 67680900 68897492 70730652 68689625 68300405 70250126 69933260 69714745
2974F9714745L18992L64162l61131n60993L683798j096615N65455j236776M06990
$$ 69714745 70033737 70397899 70036768 69475775 73159573 72062958 72628413 71391637 71798627
2965G1798627L64701L47440L26982J130194n85127J916115o87128M63852J001673
$$ 71798627 72163328 72510768 72837750 73967944 73382817 75298932 74611804 75075656 76077329
2956G6077329M6660k08677M19969R66889j020625K536987K89521J908077j567418
$$ 76077329 76123989 75915312 76335281 77302170 76281545 78818532 79108053 81016130 79448712
2947G9448712J030405R60712o03172K008558N99473K78695P62234K485810q41799
$$ 79448712 80479117 81439829 80836657 82845215 83444688 83723383 84485617 86971427 86129628
2938H6129628Q22752P96120J943582P17099J479859K315991j066409K054639N02258
$$ 86129628 86952380 87748500 89692082 90409181 91889040 94205031 93138622 95193261 95695519
2929I5695519Q38160J314456J600226J270069K758812J35466K111882K236239
$$ 95695519 96533679 97848135 99448361 100718430 103477242 103612708 105724590 107960829
2921A07960829J127892Q28485K644863Q42369K213975p94203J895343K358428
$$ 107960829 109088721 109917206 112562069 113404438 115618413 114824210 116719553 119077981
2913A19077981J643945J927389J589705J695309J990797J748636L85026L687879
$$ 119077981 120721926 122649315 124239020 125934329 127925126 129673762 130058788 133746667
2905A33746667J115333J069477J715086K827715k57178K947246J148603K481127
$$ 133746667 134862000 135931477 137646563 140474278 140217100 143164346 144312949 146794076
2897A46794076L206166J64512L707853K592482J249481P95639J012181K449084
$$ 146794076 150000242 150164754 153872607 156465089 157714570 158510209 159522390 161971474
2889A61971474J913365R03496K935079n83836M152140J545385J409948K790889
$$ 161971474 163884839 164788335 167723414 167139578 171291718 172837103 174247051 177037940
2881A77037940K87266K533747K415444K366604L02551O05182K411771N92629J976128
$$ 177037940 177325206 179858953 182274397 184641001 184943552 185548734 187960505 188553134 190529262
2872A90529262M01688R99582K320348N20077q77857L348151o3258K006599o49722
$$ 190529262 190930950 191930532 194250880 194770957 193893100 197241251 197177993 199184592 198534870
2863A98534870k11519K645910q06113j699171J698417j972594M53515k120866
$$ 198534870 198323351 200969261 200163148 198463977 200162394 198189800 198643315 196522449
2855A96522449k132166r22259j513556j431367q07744k672702p73730k624599
$$ 196522449 194390283 193468024 191954468 190523101 189715357 187042655 186268925 183644326
2847A83644326l136727k835325l088220k051898k511350j201035k685467l255186
$$ 183644326 180507599 177672274 174584054 172532156 170020806 168819771 166134304 162879118
2839A62879118l308638j366213l917153k168003m339273j736953m405258k799478
$$ 162879118 159570480 158204267 154287114 152119111 147779838 146042885 141637627 138838149
2831A38838149j151746m338257q84833k089399k752718l027047j740002j219795
$$ 138838149 137686403 133348146 132463313 130373914 127621196 124594149 122854147 121634352
2823A21634352k438241k169340j732477j320395J93806j406067l126171M73345
$$ 121634352 119196111 117026771 115294294 113973899 114167705 112761638 109635467 110108812
2815A10108812j300020j736940J145415j427825m69968j519979q73116j398658
$$ 110108812 108808792 107071852 108217267 106789442 106319474 104799495 103926379 102527721
2807A02527721j497207J459659j599026k47004m03616M80285r59607j589540R51890
$$ 102527721 101030514 102490173 100891147 100644143 100240527 100720812 99761205 98171665 99123555
2798I9123555k191772m26163O79709j663796j651066J073569j090903K89464o51592
$$ 99123555 96931783 96505620 97185329 95521533 93870467 94944036 93853133 94142597 93491005
2789I3491005j169146l025158J03847j484362j617038j169975J073436k170267
$$ 93491005 92321859 89296701 89400548 87916186 86299148 85129173 86202609 84032342
2781H4032342j481789p49291j439769j846666J737209k592501k649026m33246
$$ 84032342 82550553 81801262 80361493 78514827 80252036 77659535 75010509 74577263
2773G4577263p31144k10234k156837j223274j081208j664756n48891j626284n178
$$ 74577263 73846119 73635885 71479048 70255774 69174566 67509810 66960919 65334635 65329457
2764F5329457k345632m4290l158441M1285m84389m80863j525049o57003n21078
$$ 65329457 62983825 62939535 59781094 59822379 59337990 58857127 57332078 56675075 56153997
2755E6153997k464482M62657j147421J306158j801995m75044n38096q80280o78644
$$ 56153997 53689515 54152172 53004751 54310909 52508914 52033870 51495774 50615494 49936850
2746D9936850j734773Q1511J172312j828516n61613j578913J345612r4649q64475
$$ 49936850 48202077 48283588 49455900 47627384 47065771 45486858 46832470 46737821 45873346
2737D5873346L73356k170555P57531r68267L95353O4696k634644J750965j003575
$$ 45873346 46246702 44076147 44833678 43865411 44260764 44325460 41690816 43441781 42438206
2728D2438206L03690j703077j108009Q63735j240706J513014n20597j33517j279152
$$ 42438206 42741896 41038819 39930810 40794545 39553839 41066853 40546256 40412739 39133587
2719C9133587R00614L71663j029316p73534j342071N33256J47899n62206J013742
$$ 39133587 40034201 40405864 39376548 38603014 37260943 37794199 37942098 37379892 38393634
2710C8393634q41356j502187L55324J180787j027614M04363j966242J665744o66136
$$ 38393634 37552278 36050091 36405415 37586202 36558588 36962951 34996709 36662453 35996317
2701C5996317j929286J803538k57946j432698L89274O15074j734034J024285k36427
$$ 35996317 34067031 35870569 35612623 34179925 34569199 35184273 33450239 34474524 34238097
2692C4238097J70866m2992N0035m68027r32895R05794M84497L22267k24426K15583
$$ 34238097 34408963 34365971 34416006 33947979 33015084 33920878 34405375 34727642 34503216 34718799
2682C4718799j903540R42643o09087l1218K8049P3260J114219j832828N18258
$$ 34718799 32815259 33757902 33148815 33117597 33145646 33218906 34333125 32500297 33018555
2673C3018555j955465J722322o70727j249822J074281L61339l40188k246976Q54141
$$ 33018555 31063090 32785412 32114685 30864863 31939144 32300483 31960295 29713319 30567460
2664C0567460O23491R1983k998271J185391j01461N29560p43519n52630J104869
$$ 30567460 31190951 31282934 28284663 29470054 29368593 29898153 29154634 28602004 29706873
2655B9706873j168858P45012J52846R99030j845267m96026O90886J48897j004225
$$ 29706873 28538015 29283027 29435873 30434903 28589636 28093610 28784496 28933393 27929168
2646B7929168J016477k83368m30789J005272j206523N12308p66866O87503j847972
$$ 27929168 28945645 28662277 28231488 29236760 28030237 28542545 27775679 28463182 26615210
2637B6615210q83609J22063J433270R51500j696696j08263K32802J12594j56438
$$ 26615210 25731601 25853664 27286934 28238434 26541738 26433475 26666277 26778871 26622433
2628B6622433N50812r10327l75517l15247J206663j861463R31479m86383J935238
$$ 26622433 27173245 26262918 25887401 25572154 26778817 24917354 25848833 25362450 27297688
2619B7297688k460051J935564k190791P41738L37954j889659J492847k81097j136302
$$ 27297688 24837637 26773201 24582410 25324148 25662102 23772443 25265290 24984193 23847891
2610B3847891L22059L88794R64370L08728m75709j16758o46099J136332p77026
$$ 23847891 24169950 24558744 25523114 25831842 25356133 25239375 24593276 25729608 24952582
2601B4952582q06965K3460K065155l35713j002383J000400l02623L23263M91799
$$ 24952582 24145617 24169077 26234232 25898519 24896136 25896536 25593913 25917176 26408975
2592B6408975j041084l55370Q92249q78584m38366J636478J65023n09461J786232
$$ 26408975 25367891 25012521 25904770 25026186 24587820 26224298 26389321 25879860 27666092
2583B7666092k814734L50162J547604o25493j33682N86296J272736n74230o26761
$$ 27666092 24851358 25201520 26749124 26123631 25989949 26576245 27848981 27274751 26647990
2574B6647990p14862J926031L24517l78077O38456K126438j100250O01042R89471
$$ 26647990 25933128 27859159 28183676 27805599 28444055 30570493 29470243 30071285 31060756
2565C1060756P2711O72330M69279q3759J716989j447130K962394l48527N8513
$$ 31060756 31133467 31805797 32275076 32191317 33908306 32461176 35423570 35075043 35133556
2556C5133556K213859J045876K10020J242134O56922J731777K516498R41479n21544
$$ 35133556 37347415 38393291 38603311 39845445 40502367 42234144 44750642 45692121 45170577
2547D5170577M932246j110113L262567K440377m60016M466098K716460K251581
$$ 45170577 50102823 48992710 52255277 54695654 54235638 58701736 61418196 63669777
2539F3669777J163419N670641J551610M343840N004547N136688K459827P438727
$$ 63669777 64833196 70503837 72055447 76399287 81403834 86540522 89000349 96439076
$$ [...]
##END NTUPLES=NMR SPECTRUM
##END=
