##TITLE=abcd
##JCAMPDX= 6.0         $$ Bruker NMR JCAMP-DX V2.0
##DATA TYPE= NMR FID
##DATA CLASS= NTUPLES
##ORIGIN= UXNMR, Bruker Analytische Messtechnik GmbH
##OWNER= root
$$ XWIN-NMR		Version 3.5
$$ Tue Jul  8 19:29:36 2025 Russian Standard Time (UT+4h)  servis@DPX200
##.OBSERVE FREQUENCY= 200.131235884673
##.OBSERVE NUCLEUS= ^1H
##.DELAY= (6, 6)
##.ACQUISITION MODE= SIMULTANEOUS
##.ACQUISITION SCHEME= undefined
##.AVERAGES= 32
##.DIGITISER RES= 18
##SPECTROMETER/DATA SYSTEM= spect
##.PULSE SEQUENCE= zg
##.SOLVENT NAME= CDCl3
##.SHIFT REFERENCE= (INTERNAL, CDCl3, 0, 16.5164)
##AUDIT TRAIL= $$ (NUMBER, WHEN, WHO, WHERE, WHAT)
$$ ##TITLE= Audit trail, XWIN-NMR		Version 3.5
$$ ##JCAMPDX= 5.01
$$ ##ORIGIN= Bruker BioSpin GmbH
$$ ##OWNER= servis
$$ F:\spectra/data/av/nmr/H1/1/audita.txt
$$ ##AUDIT TRAIL=  $$ (NUMBER, WHEN, WHO, WHERE, WHAT)
(   1,<2025-07-08 19:27:46.87 +0400>,<servis>,<DPX200>,
      <created by zg, POWCHK disabled, PULCHK disabled
       configuration hash MD5:
       00 E9 B6 7A A2 85 ED C7 34 08 36 98 17 FE 4E 26
       data hash MD5: 32K
       29 E0 9D AE CA 60 1B 7A F6 3D 67 E2 81 16 EF 8C>)
$$ ##END=
$$ 
$$ hash MD5
$$ 18 53 D8 00 34 2A F8 A9 6E 1C 9C 63 41 0C F2 A9
##$RELAX= 
##$RELAX= 
##$RELAX= 
##$RELAX= 
##$RELAX= 
##$RELAX= 
##$RELAX= 
##$RELAX= 
$$ Bruker specific parameters
$$ --------------------------
##$DU= <F:\spectra>
##$EXPNO= 1
##$NAME= <H1>
##$PROCNO= 1
##$TYPE= <nmr>
##$USER= <av>
##$AMP= (0..31)
100 100 100 100 100 100 100 100 100 100 100 100 100 100 100 100 100 100 
100 100 100 100 100 100 100 100 100 100 100 100 100 100 
##$AQSEQ= 0
##$AQ_mod= 1
##$AUNM= <au_zg>
##$AUTOPOS= <>
##$BF1= 200.13
##$BF2= 200.13
##$BF3= 200.13
##$BF4= 200.13
##$BF5= 500.13
##$BF6= 500.13
##$BF7= 500.13
##$BF8= 500.13
##$BYTORDA= 1
##$CFDGTYP= 0
##$CFRGTYP= 5
##$CHEMSTR= <none>
##$CNST= (0..31)
1 1 145 1 1 1 1 1 1 1 1 1 1 1 1 1 1 1 1 1 1 1 1 1 1 1 1 1 1 1 1 1 
##$CPDPRG= <>
##$CPDPRG1= <>
##$CPDPRG2= <>
##$CPDPRG3= <>
##$CPDPRG4= <mlev>
##$CPDPRG5= <mlev>
##$CPDPRG6= <mlev>
##$CPDPRG7= <mlev>
##$CPDPRG8= <mlev>
##$CPDPRGB= <>
##$CPDPRGT= <>
##$D= (0..31)
0 2 0 0 0 0 0 0 0 0.06 0 0 0 0 0 0 0.0002 0 0 0 0 0 0 0 0 0 0 0 0 0 0 
0 
##$DATE= 1751988466
##$DBL= (0..7)
120 120 120 120 120 120 120 120 
##$DBP= (0..7)
150 150 150 150 150 150 150 150 
##$DBP07= 0
##$DBPNAM0= <>
##$DBPNAM1= <>
##$DBPNAM2= <>
##$DBPNAM3= <>
##$DBPNAM4= <>
##$DBPNAM5= <>
##$DBPNAM6= <>
##$DBPNAM7= <>
##$DBPOAL= (0..7)
0.5 0.5 0.5 0.5 0.5 0.5 0.5 0.5 
##$DBPOFFS= (0..7)
0 0 0 0 0 0 0 0 
##$DE= 6
##$DECBNUC= <off>
##$DECIM= 32
##$DECNUC= <off>
##$DECSTAT= 4
##$DIGMOD= 1
##$DIGTYP= 9
##$DL= (0..7)
0 120 120 120 120 120 120 120 
##$DP= (0..7)
150 150 150 150 150 150 150 150 
##$DP07= 0
##$DPNAME0= <>
##$DPNAME1= <>
##$DPNAME2= <>
##$DPNAME3= <>
##$DPNAME4= <>
##$DPNAME5= <>
##$DPNAME6= <>
##$DPNAME7= <>
##$DPOAL= (0..7)
0.5 0.5 0.5 0.5 0.5 0.5 0.5 0.5 
##$DPOFFS= (0..7)
0 0 0 0 0 0 0 0 
##$DQDMODE= 0
##$DR= 18
##$DS= 0
##$DSLIST= <SSSSSSSSSSSSSSS>
##$DSPFIRM= 0
$$ [...]
##$SUBNAM0= <"">
##$SUBNAM1= <"">
##$SUBNAM2= <"">
##$SUBNAM3= <"">
##$SUBNAM4= <"">
##$SUBNAM5= <"">
##$SUBNAM6= <"">
##$SUBNAM7= <"">
##$SUBNAM8= <"">
##$SUBNAM9= <"">
##$SW= 20.6817932712277
##$SWIBOX= (0..15)
0 0 3 0 0 0 0 0 0 0 0 0 0 0 0 0 
##$SW_h= 4139.07284768212
##$TD= 32768
##$TD0= 1
##$TE= 0
##$TE2= 300
##$TE3= 300
##$TEG= 300
##$TL= (0..7)
0 120 120 120 120 120 120 120 
##$TP= (0..7)
150 150 150 150 150 150 150 150 
##$TP07= 0
##$TPNAME0= <>
##$TPNAME1= <>
##$TPNAME2= <>
##$TPNAME3= <>
##$TPNAME4= <>
##$TPNAME5= <>
##$TPNAME6= <>
##$TPNAME7= <>
##$TPOAL= (0..7)
0.5 0.5 0.5 0.5 0.5 0.5 0.5 0.5 
##$TPOFFS= (0..7)
0 0 0 0 0 0 0 0 
##$TUNHIN= 0
##$TUNHOUT= 0
##$TUNXOUT= 0
##$USERA1= <user>
##$USERA2= <user>
##$USERA3= <user>
##$USERA4= <user>
##$USERA5= <user>
##$V9= 5
##$VALIST= <valist>
##$VCLIST= <CCCCCCCCCCCCCCC>
##$VD= 0
##$VDLIST= <DDDDDDDDDDDDDDD>
##$VPLIST= <PPPPPPPPPPPPPPP>
##$VTLIST= <TTTTTTTTTTTTTTT>
##$WBST= 1024
##$WBSW= 30
##$XGAIN= (0..3)
0 0 0 0 
##$XL= 0
##$YL= 0
##$YMAX_a= 724505
##$YMIN_a= -546823
##$ZGOPTNS= <>
##$ZL1= 120
##$ZL2= 120
##$ZL3= 120
##$ZL4= 120
##$ABSF1= 10
##$ABSF2= 0
##$ABSG= 5
##$ABSL= 3
##$ALPHA= 0
##$AQORDER= 0
##$ASSFAC= 0
##$ASSFACI= 0
##$ASSFACX= 0
##$ASSWID= 0
##$AUNMP= <proc_1d>
##$AZFE= 0.1
##$AZFW= 0.1
##$BCFW= 1
##$BC_mod= 2
##$BYTORDP= 0
##$COROFFS= 0
##$CY= 19
##$DATMOD= 1
##$DC= 2
##$DFILT= <>
##$DTYPP= 0
##$F1P= 11.0000007629395
##$F2P= -0.999999237060547
##$FCOR= 0.5
##$FTSIZE= 0
##$FT_mod= 4
##$GAMMA= 1
##$GB= 1
##$INTBC= 1
##$INTSCL= 1
##$ISEN= 128
##$LB= 0.05
##$LEV0= 0
##$LPBIN= 0
##$MAXI= 10000
##$MC2= 0
##$MEAN= 0
##$ME_mod= 0
##$MI= 0
##$NCOEF= 0
##$NC_proc= 0
##$NLEV= 6
##$NOISF1= 0
##$NOISF2= 0
##$NSP= 1
##$NTH_PI= 0
##$NZP= 0
##$OFFSET= 16.51637
##$PC= 1
##$PHC0= -273.6572
##$PHC1= 1.101538
##$PH_mod= 0
##$PKNL= yes
##$PPARMOD= 0
##$PSCAL= 4
##$PSIGN= 0
##$REVERSE= no
##$SF= 200.13
##$SI= 16384
##$SIGF1= 0
##$SIGF2= 0
##$SINO= 400
##$SIOLD= 16384
##$SREGLST= <1H.CDCl3>
##$SSB= 0
##$STSI= 0
##$STSR= 0
##$SW_p= 4139.07284768211
##$SYMM= 0
##$S_DEV= 0
##$TDeff= 0
##$TDoff= 0
##$TI= <>
##$TILT= no
##$TM1= 0
##$TM2= 0
##$TOPLEV= 0
##$USERP1= <user>
##$USERP2= <user>
##$USERP3= <user>
##$USERP4= <user>
##$USERP5= <user>
##$WDW= 1
##$XDIM= 8192
##$YMAX_p= 0
##$YMIN_p= 0
$$ End of Bruker specific parameters
$$ ---------------------------------
##NTUPLES= NMR FID
##VAR_NAME=  TIME,          FID/REAL,        FID/IMAG
##SYMBOL=    X,             R,               I
##VAR_TYPE=  INDEPENDENT,   DEPENDENT,       DEPENDENT
##VAR_FORM=  AFFN,          ASDF,            ASDF
##VAR_DIM=   16384,         16384,           16384
##UNITS=     SECONDS,       ARBITRARY UNITS, ARBITRARY UNITS
##FACTOR=    0.0002416,     1,               1
##FIRST=     0,             0,               0
##LAST=      3.9581328,     0,               0
##MIN=       0,             -546823,         0
##MAX=       3.9581328,     724505,          0
$$ Real data points
##PAGE= N=1
##DATA TABLE= (X++(R..R)), XYDATA
$$ [...]
9892i5J06J49k27Q1Q3q6LN7k11R5J51k00p4J22nk76J40J26K8O6J35k31r4N61k34
9917A70k12L14j72l27k6L36k72R6J06j39PK19j27K5k65M11l29K41o4o8L7J31j09
9940a7L9J85j63R9k26k2J48R4k75J45n4J4k15K88o0J79K9Lk62J64j86J52J20k57
9964g8j00L78j31k11K29J00p9j70J81R7j39K2J3j22j4Rj63K25j13R7k94K49lp0
9988h7p4K22N5j67J75l1k12K56j96K21J26l11l19J67J33l2Q3O4k32M09l70K18
10010I8j37N0P5R0l02Q2K14j79j22K24j2j37J83pm53L05P2K49l47J26J32n33K27
10033a02L60k16m4J79l64J86j5J23j89K25K1q9j60O6n3j06K29q7LJ91j3j41R4
10056I8j23J66k01N9J86j58j62L33l46L13k68K89m0k50L51j34o2j25n5M7J9Kl26
$$ y = [-95, 11, 160, -67, 14, 97, 11, 14, 71, -140, -45, 106, -94, -168, -46, -51, -327, -187, -61, -33, 33, 168, -63, -157, 404, 170, -42, 272, 100, -227, -253, 83, -189, -93, 13, -126, -119, 100, -27, -2, -267, 144, -185, 56, -8, -76, -39, 92, -17, 22, 207, 44, 143, -83, -105, 43, 137, -138, 7, -47, -33, -248, 40, -20, 159, 188, 191, -71, 93, -93, 59, 179, -78, -178, 200, 69, -142, 87, 187, 108, -62, 119, 216, 77, 99, 112, -10, -24, -15, -178, 47, -66, 31, -263, -14, -17, -87, -161, 61, 116, -51, 124, 93, -119, 137, -59, 162, 288, -23, -342, -175, -42, -74, 9, 73, -159, 250, -120, 98, -39, 11, 86, 176, -126, -44, 170, -9, -131, 93, 81, -56, 127, 120, -333, -28, 44, 293, -54, 72, 204, -329, -102, 258, 42, -2, 177, -187, -1, -16, 107, -82, 143, 164, 75, -85, -19, -72, -178, 51, -36, -33, 158, 145, 4, 98, -25, 141, -60, -1, 185, 27, -135, 198, -148, 165, -103, 186, 146, -104, 247, 113, 51, -74, -129, -82, -63, -61, -387]
10079c87J59K53k63K33K8o9k3O4J62j02j16J48l81K09K95j97m9K33l7k09l2J13
10101C2l35M19P7j81l9l5J40l63K43K72l23K37j36j95K77J21j27l06R7J43nj17
10123a04J99P3k25m3J98l05J87mQ7k24J87r8N5J28K0j09J09k31R0m8R1Q0l07J95
10147AJ34k56J7L07k06k08K43q0l6k14L63o4O9P1j39r1Q0J12q8l49N30l79O7R5
10171b1J94m07K2L17j35K96j1k00j84L2J8rJ08J96m7k84J52N1m3rJ37r4p9J73
10195A73M3j61K29k14l54J93K57l04K69ml17J06mO7M7J27k24k57J32J61M7k06
10217a94L01q7q2J06K9j53J48j30K63m18J95r0J30J82j94O8k28K5K4J4mL92m72
10240a75M1L59j96J6qj68J9J66J51m41J07J55pJ62k91m0m9J04j30L0L20j1j3k51
$$ y = [-387, -228, 25, -238, -5, 23, -46, -69, -5, 157, 55, -61, 87, -294, -85, 210, 13, -36, 197, 160, -49, -81, 32, -303, 116, 193, 12, -27, -62, 78, -285, -42, 230, -93, 144, 8, -187, 90, 211, 84, -222, -125, 18, 13, -104, 95, 168, -57, -100, 98, -207, -20, -24, 63, -161, 26, -72, -17, 111, 131, 22, 131, -100, -10, -58, 33, 113, -194, 1, 135, -121, -104, 203, -3, -211, 32, -48, -84, -298, 65, 1, 70, 141, 2, -89, -9, 103, 15, -334, 196, -183, -116, -21, 173, -234, -212, 105, -30, 266, 255, 55, -129, -97, -79, -88, 20, 216, 169, -115, 37, 88, 45, 36, 173, 79, 0, 173, 216, 55, 284, 70, -284, -91, 166, -138, 131, 127, -190, -84, -88, -21, 26, 153, -71, -328, -196, -35, 12, -194, 107, 20, -62, 44, 73, -80, 68, -62, 201, -217, -22, -112, 18, 200, 6, 74, -154, -129, -105, -91, -95, 297, -175, -134, 225, 29, 45, 37, -131, -112, 54, 205, -236, -129, 26, 19, 181, -110, -150, -199, -95, -225, -195, 125, 114, 101, -150]
10264a50K35r9j05J48N8o5k0J27k52L5K5J36k57OJ98k16J21K89k50j31K33r7J59
10287A28o7J35k89L9j13m5L21p5K45l26j6Q2J8k60L29j72j8%M01m18k55L07j06
10310a55j05L66K29p62K22J72r0R1o9l6L39j68K65k28l27L85j86J15o3j57k5L30
10332A43r5k39L68j15j31J09J10k5JJ4l1j56k7L83p5K2l15J73r8j73J9K2L09j35
10356E8J20q2j50K58k30j2J03l91M89j57J8l14J23K02q6K1J80r8j78K37J23j12
10378A22q6oo4QJ32j90K33J22k11j55J21j6k02K3L06k49r3P07l99j52Q2l1R4L0
10402A26N1j13l43L42ll02K87j7j9M6J24J18j88j34L15j30n6k20K06m11N07Q8
10424B74o62M11RP6o5Q6m85M62Q0p2r8K72r4j84k82K79n5J57p2L0j13J26o7Q3
$$ y = [-150, 85, -14, -119, 29, 87, 22, 2, 129, -123, -88, -63, 73, -184, -178, 20, -196, -75, 214, -36, -167, 66, -31, 128, 61, 196, -93, -54, -167, -212, 109, 34, 279, -47, -63, 19, 37, -223, 106, -66, -84, -84, 317, -101, -356, -49, -155, -260, 106, 335, -427, -205, -33, -123, -32, -101, -137, 202, 34, 299, 71, -256, 129, -57, 58, -5, -162, -187, 143, 48, -191, 177, 62, -69, 40, 150, 125, 126, 140, 109, -47, -74, 309, 234, 256, -59, 114, 16, -157, -138, -116, 193, 58, 178, 96, -54, 204, -26, -38, 65, -326, 163, 6, 24, -290, -167, 35, -51, -30, 150, 52, -126, 111, 234, 122, 36, 30, -34, -26, 106, -84, 149, 271, 60, -95, 26, 10, -192, -169, 137, -112, -205, 502, 103, -49, 33, 2, 96, 126, 177, 64, -279, 63, 60, -242, 45, 28, 9, 55, 179, 297, 109, -25, 290, 160, 104, -116, 90, -321, 186, 274, -388, 23, 32, 108, 43, 129, -356, 106, 186, 114, 16, 288, 194, 10, -272, 7, -48, 109, 37, 67, -46, 80, 13, 96]
10448I6j99K70k22K45j11N5j79J29K7k31J24j00J40j87R1o0r0L70r9P2k20j1K37
10471A47K8l99J61l9K7K72k74QK25j79j21J64r8j02o3K64j29J29j65K38j52L9
10493a9J95j18l27L02j09L6J76q7l1j89L78k68J65Qq3K2j68J01%Q6J85n56L57
10516E6J21l38P7J26N5P0j34Nk16J30L96j30j73j44K87l22L61p5m19J29L99k85
10538b4O1R7N6k16q4J80n6K9J29j68K16k92R8M8l02J40J98o9r0ok3p9M36p9m12
10563b12M47ol98K56r4q4J77q9K87m20L97k91J5J59j86j62L02j01J19k51L07Q3
10585B55j88N3j26J3r0p9K36j08lM4j88L1K80j4j00J9J32l96J22M9n7J63Q2M1
10609A71j53k5J72q3j89L02k99J37J40n2j37L5J6j9l8k8l3J04p0j1JQ4R4j83J60
$$ y = [96, -103, 167, -55, 190, 79, 134, -45, 84, 111, -120, 4, -96, 44, -143, -52, -112, -202, 168, 69, 141, -79, -90, 147, 175, -224, -63, -102, -75, 197, -77, -69, 156, -23, -144, 20, -78, -180, -243, 21, -108, 21, -144, 94, -58, -19, 176, 58, -269, 33, -76, -40, 136, 49, 18, -171, 207, -61, 104, 112, 29, 51, -117, -16, -16, 70, 255, -301, 56, 177, -161, -84, 42, 97, 167, 33, 38, -178, -48, 348, 218, 45, -99, 188, -134, 227, 152, -267, -138, 261, -24, 37, 134, 190, -26, -110, 70, 14, 43, 172, 4, 220, -72, 26, 74, -228, -88, 110, 41, -49, -55, -78, -157, 279, 200, -212, 235, 229, -169, 87, -7, -91, 86, -3, 284, -136, 261, -30, -15, 144, -42, -204, 98, -3, 116, -135, 172, 255, 67, 120, -6, 7, -83, -162, 74, -34, -37, 7, -181, -150, 130, 116, 16, 35, 167, -229, -107, -58, -115, 48, 130, 171, 18, -7, 165, 82, -107, 195, -104, 33, 173, 121, -16, 19, 35, 16, -22, -50, -83, 21, -49, -60, -59, 25, 119, -64, 96]
10634I6j03K05o3L9k29%K9Kj38L19j48k57K24J07k89L33m4P4J0r8k1k42K10O8
10658H4p2p8R8o8O6mK16k74O8K02l47k8J13K04r1J6oq0j85J70J74k57J61p7j64
10683a59K9K00j75K2K25J06j35o8J24J21m72L05j7k10L0K29m05L30L7j62o2J11
10705Dp1N7J66J88m28J99M6k41J51M7m09L45j17J91l26J00K35n2j12K37m7k98
10727a35M1R6K4j12K95j05k71J36j20Q3kJ68j47q7K75j4P8p3j10j26J69j01J4
10750b4J73j07J51k44jP5l6P4j06K8n8L4o3K17k56M16m14j39J02L12l1P2j41j30
10774i6J83J15k84K89j27Jl9m9jl6J46o2k20L28k11R0k2R9j71l10L98K2j23j35
10798b15L21p2k07J16K08j90n0K57l50J40J47J05k80J6J34j51J19Rl3J9%O5l44
$$ y = [96, -7, 198, 135, 174, -55, -55, -26, -24, -162, 157, 9, -248, -24, 83, -206, 127, 83, 157, 167, 69, 48, -194, 16, 84, 12, -66, 32, -36, 30, 26, 242, -32, 36, 238, -109, -137, -24, 180, 89, 105, 99, 19, -166, 4, 178, -79, 82, 5, -159, -130, 70, -105, -83, 142, 248, 113, 45, 169, 290, -182, 123, 106, -104, -74, 155, -250, 80, 117, -45, -107, 4, -67, -10, 156, 344, -84, 115, 161, -80, 71, 118, -291, 54, -63, 128, -198, -98, 137, 85, -27, 210, 163, -135, -94, 2, 26, -86, 209, 104, -167, -31, -151, -68, -70, 98, -49, -136, 139, 125, 203, 130, 20, -106, 63, -38, -24, 149, 42, 193, -51, -52, 23, -13, 61, -45, -17, -75, -41, -104, 113, -143, 273, -141, -280, -178, 134, 103, 175, 34, -96, 87, 202, -82, 207, 80, 81, 42, -7, -8, -44, 102, 40, -180, 148, -63, 27, 5, 104, -67, -377, 21, 43, -80, -215, 106, 34, -173, -57, 151, -39, -89, 168, -182, -42, 105, 210, -70, -54, 80, -71, 48, 57, 24, 43, 43, 108, -236]
10821b36K06L28n23K26j33M67j16k52n5L0L12J28o00K04J15j36m9K93J3j48k04
10842a30J89M0j09J18j5O1j43J84k84o9L42k82P0O1J48k63q4O4J7M2J44j3k79
10865a91L08r0j06q7N83n29R1o6k3N7L09j68j48L41k90l4j22OJ57K5m4Q9j29L0
10889c1L24l60o1K78J4n3L2O7k48q9J37m4%j20M10j06J20l29Rj82Q1L76k91J44
10913G8kl07J32K51l25J76M1J22l24L24p1o3j64K99p0o0K36l90R8J36J6j20k62
10936b49L99l15J71N1o9j15L17Rj35n1Q3j01k79K68J7P1q6L40l81r6L81k76J09
10959F3j43J66k54R2K31j61k0L42m78K57j01K11m29K00K17m59K50j14K79k27R3
10980A5j51N5J50J48j84K55k87P1q7K2J98j38k16K88j54P2j59l6P4J80R6j37k27
$$ y = [-236, -30, 298, -225, 1, -132, 335, 219, -33, -88, -58, 254, 382, -218, -14, 101, -35, -84, 209, 222, 74, -130, 59, 99, -10, 108, 93, 154, 11, 195, -89, -158, 184, -98, -28, 33, 181, -82, -166, -102, -85, -43, 101, 88, -191, 117, 27, -79, -166, 417, -112, -21, -87, -110, -53, 256, 88, -60, 281, -9, -43, -165, -159, -2, 23, -21, 68, -61, -31, 293, -67, -128, 150, 164, 111, 143, 210, -38, -127, 10, -34, -34, -154, 256, 150, 270, -59, -50, -232, -151, 225, -66, 78, 76, -231, -99, 152, -173, 3, 44, 166, -158, 166, 95, 32, -132, 167, 97, 37, 273, -117, -19, 117, 133, 13, -249, 150, -165, 6, 57, -12, -127, 190, 199, 64, 13, 96, -5, -284, -16, 1, 72, -14, 326, -55, -151, 230, -46, 63, -80, 86, -168, -76, 155, -6, -26, 316, -162, 95, -6, 205, -224, -24, 193, -266, -16, -130, 149, -78, 15, -136, -81, 69, 217, 33, 288, 1, 72, -15, 7, 205, 67, -149, 139, -15, 57, -102, -138, -64, 116, 212, 75, -152]
11003a52K42N0l21J89N1j72L07k7k69L13j40j23jQ4n7j28L21n2j42K0m0Q1j8r0
11027g4K84j73j79P8K12k49J07j68J54k6J14k74L72K03l23k39J90K45m51J57M6
11048Fj63Q5K75k65J00oj32J34M4R4m9k13R6J80j21J60J8k32j59M06k73K37k72
11071e0J38j2K04l05l5J40m4k72J63K24l53K22J03m6l02J72M6R6j78J30p7k73
11093c09M05o5j79K38kk50L6O0J11p9J49j32j56r6K70O8j77K97j43k24Q3L61k56
11116A0k71M17M0l03Q2J9j66K49K64n54K40R8l7k06J44M5K2o9K56k2m6l17L2K16
11140A43p7J4j86q4M92l49nK99j18J17k16n1N0L9J8k9O9k4k8j44K4K9j12n0J62
11165a7O1Q6k41M2P1K3j79Q7j77K34r7p1O9J20k71L50K61k72Q3p8j9m05L36N8
$$ y = [-152, 90, 140, -181, 8, 59, -113, 194, 167, -102, 211, 71, -52, -53, 31, -26, -154, 167, 115, -27, -7, -47, 34, 16, -74, 210, 37, -142, -64, 148, -101, 6, -162, -8, -34, 80, -194, 178, 381, 58, -181, 9, 254, -197, -40, 6, -157, -72, 203, -62, 38, 32, -100, 34, 78, 172, 123, -90, 6, 186, 65, 225, 243, 11, -148, 258, -15, 222, -50, 88, 76, 280, -25, -60, 80, 36, -236, -73, 151, -202, 20, 123, 77, -225, -53, -7, 89, -89, 41, -36, -309, 96, 31, -148, 90, 88, -162, -126, -66, 45, -34, 115, -17, -173, -269, 1, 69, -108, 189, 46, -178, -95, 266, 10, -261, 156, 196, -107, -25, -6, -172, 77, 341, -213, 27, 125, 88, -118, 26, 71, 93, 24, 280, 258, 212, -105, -73, 143, 66, 80, -106, -190, 302, -47, -52, 247, 129, 246, 30, -21, 29, 68, 86, 57, 126, 102, 74, -70, -46, -17, -129, -179, -17, 44, 130, -111, -69, 2, 25, -154, -67, -244, -10, -107, -178, -109, 11, -260, 90, 351, 79, 162, 84, 65, -340, -4, 54]
11189E4K60o08M78m07J40K54J62l77J28N6j77J74P9q2k70K09L1j45j15L76n40
11210c20K21M4ql13M22j02j00J42K01l42K99k36j5q4J61O5r5K23j3k49j2J59J6
11233F4n8J0k4K75k89L41l82k87M50r7q4K33j95k06M30j09K09k97J72k63J44j22
11255h5K39k59j16L31l4l66J79K12r6j3Oo9kM13j13n27%N07j70j3M0J57j80q6
11279d5J96l23J73K51k95O3j61L12l89K56R0k85K81j38J48j86K30j70j66J38m0
11300f0J68r5j20K15l44M11k31J05J37p7k81K51N5r2j71K47j16M1J45ol5l03L26
11323A70j40k26J35m7J24n7R6qJ16j08Ml7Q5m6m1J4r0N6JM4N2k4j60J02k1p2J07
11350B9r7j05J02r4j65N53p1k53J16J99l64J27L41k87ro5JM8j1k2m0Q6p0j18L96
$$ y = [54, 314, -294, 184, -223, -83, 171, 333, -44, 84, 140, -37, 137, 216, 134, -136, 73, 104, -41, -156, 220, -320, -99, -55, -63, -376, 46, -56, -156, -14, 187, -155, 144, -92, -107, -191, -30, 35, -60, 163, 150, -99, -111, 48, 64, 6, 16, -8, 267, -22, 319, -63, -350, 100, 3, -81, 152, -43, -249, 181, 72, 281, -16, 156, -107, 37, -85, 154, -105, -221, 110, 76, -290, -111, 101, 5, -8, -2, -71, -73, 340, 227, -300, -300, 207, 37, 24, 64, 221, 41, -45, 151, -172, 1, 252, -43, 20, -141, 171, -218, 38, 128, -157, 124, -14, 134, -52, 178, 8, -158, -20, -60, 108, 13, -107, 108, -236, 175, -56, 49, 186, 109, -172, 79, 134, 42, -129, 118, 2, 43, 188, 182, 147, -156, 170, 30, -196, -61, -108, 16, -41, 55, 47, 163, 55, 59, 22, 107, 61, 20, 34, -56, 0, 1, 45, 97, 73, -87, 15, -6, -78, 29, -68, -173, -71, -165, -330, 223, 152, -101, 15, 214, -150, -23, 318, 31, 22, -43, -42, 6, -5, -27, -67, 19, -51, -169, 227]
11375B27n6l1j89J7J54j64P8J0j7j40K3L0J36k18K97k30P5N0j44N8m1K71j68q4
11399e6k7J78l90M83kk23J58j49K65k48J3J13k85K22J57l95J34M9M7j04RJ09J59
11422B17l30n4J70k7j31J36j37J92J51j90m1J97j80o6K79l17J5J03K1j09L27m19
11444a93P9j37L90M3k32K2Kn6J55J31l90J03L70l43O2k08J14K76l45J84l16J39
11466a50Q6L31k89J50j1k0O9j07p4r9M13j44o5p4J79q4o9K29l35J23n6Q6K9j60
11490d2m3K11N7k05J13K4m5J25k28n4M05l70J19k65L73k17J16p4l0j01M44k17
11512I6k78m3L55k00l2K80k28N2L8j06J1J11J41k63o0L04k73K07k14J32L8Q1j08
11535D1m23L37j6R8m8k5j16O4K58j23k08Q2J41J0p4k4K2L5r7J97j6J76k91k9j07
$$ y = [227, 171, 140, -49, -32, 122, -42, 36, 46, 29, -111, -88, -58, 78, -140, 157, -73, 2, 52, -92, -34, -75, 196, 28, -56, -83, 95, -295, 188, 186, -37, 121, -28, 237, -11, 2, 115, -170, 52, 209, -186, -52, -3, 44, -60, -51, 58, 217, -113, -167, 3, -24, -155, -19, -156, 36, 187, -3, -44, 153, -27, -93, 186, -131, -116, -13, 8, -101, 226, -193, -114, -251, 139, 182, -50, -28, -26, -82, 73, 204, -186, -83, 287, -56, 6, -202, -88, 188, -157, 27, -289, -150, -64, 267, -22, 128, 117, 97, 166, 59, -15, -114, 299, 155, 90, 16, 195, 111, 42, 271, -64, 59, 3, 89, 118, -42, -85, 126, 183, -22, 91, 115, 70, 195, -33, -87, 318, -52, 67, -198, 175, -42, 74, 0, -30, -131, 313, 96, -182, -225, 130, -70, -102, 178, -50, 2, 40, -66, -55, 56, 197, -66, -126, 178, -95, 112, -102, 30, 68, 149, 41, -382, -45, -61, 37, -11, -36, -152, -88, 170, 47, -161, -79, 62, 72, -2, -26, -4, 31, -66, 131, 115, 291, 0, -29, -136]
11560a36K28k11l5j52O76n87J38PJ68l5P3j41J8k0k0J42k6j13L0j06J33J29q6
11583G4j71J58J50k47M9k73K50J5r1L78m21K60J42k40r4J55k77K50Q2K4k25pJ35
11606G6l6J28r9P2o2j1j82J14J11o4j45J42J3j20j00J70JJ95k2Qj21m9J25n3j66
11631g5J46J92l59J62m3p5k48M30k64P9N8j90M08j77j50j17K80j78mJ87l25K05
11653e8J77j33O7j80l8K10P8k97J06J21J18r9n9J28k57K52j71o2J45l2j28M5J47
11676H0k56N1K26k25K07j79J34k66K21om4J9K07j39j97J72J1j07L08j08K03k64
11698D8l7k80J53K91k50M8Q5j54J71k5j00J1r3r7K47k1p7J6N3M4K50mj47k8l9
11723F5j09L6nr3P6J14J0q5j6J44k99L6Q8j60J08J30k14K28O7R6m08K03j7o8J46
$$ y = [-136, 92, -119, -154, -306, 370, -217, -79, -72, 96, 61, 134, -7, 11, -9, -29, 113, 87, -26, 4, -102, 31, 160, 74, -97, 61, 211, -36, 13, -260, -10, 5, -86, 292, -129, 131, 273, 33, -61, 94, -183, 67, 149, 173, -52, -59, 76, 40, 168, 69, 141, 79, 68, -114, 0, 111, 47, -98, 44, 57, -63, -163, 7, 8, 203, 181, 189, 68, 19, 144, 91, -75, 71, 263, -96, 66, 23, -52, -300, 130, -134, -55, 3, -187, 221, 44, -106, -223, 57, -121, -125, 62, -263, -58, 119, -14, 53, -127, -165, 45, 123, -174, -68, 53, 171, 72, 13, 141, -116, 136, -35, -97, 48, 16, -112, -67, 80, -176, -125, 101, -124, 83, -96, 38, -228, -7, -13, -57, -38, 169, 30, -167, 5, 16, -91, 217, 109, 312, 48, 11, -269, -116, 175, -75, -27, 58, -96, 75, 50, -50, -39, -132, -229, 18, -3, -80, -64, -11, 33, 283, 279, 132, 104, 65, -44, -8, -13, -106, -30, 84, 94, 9, -7, 137, -162, -126, -38, -198, -90, 40, -174, 54, 121, 217, -191, 12, -5, -73, 73]
11748G3q6j0J20Q1N4k85Q3J18j48r4n3L69j83j72J84k18J77k8J71l8j6j28L5r0
11772h4M07m86oJ72J5K4j4K77n44K31J69k28L7O3J7l41M36k3k05P8K69j37j11
11795A6q7J49j3j78rOj4M01k65n0j22n1N3K65n9l52J94O5J01j17J37P8l40J31
11819f1L26o3l24L9K80l66M52k05j45K30l55Q9k3l5K73j98o2Q4q0N2J85o5p6Q6
11843C8rn8K21r9k59J39P9K6k70Q3R2o5N2L6J51j83J47l34J15P3J8J08M8o9l54
11868b74M7L35j29r1Q6j32r7J66J9j78R0oJ67j33J25R1k05L09k51O1kj18P6q6
11892a30L26j51K4Ml0j02j3K68M4l00K78l95J79q8K31o9k94K69n3j91J92J49k10
11915f2q0K56Ol79N03k17N3j28j27O3j50L82p7j90mK33Q9l14K39J54m44M10k02
$$ y = [73, -13, -23, 97, 178, 232, -53, 30, 148, 0, -94, -147, 222, 39, -133, 51, -167, 10, -18, 153, 115, 99, -29, 6, -84, 323, -163, -169, 3, 18, 42, 28, 305, -239, -8, 161, -67, -30, 33, 50, -291, 145, 122, -83, -5, 264, 127, 16, -71, 78, 65, -113, -122, -116, -130, 271, 6, -44, -166, -217, -164, 101, 42, -310, -116, -51, 50, -67, 70, 148, -192, -61, 265, 202, -122, -83, 197, -169, 283, 78, -67, 163, -192, -103, -126, -161, 112, -86, -148, -64, -144, -92, 93, 28, -48, 38, 29, -29, 192, 93, -166, -27, 52, 78, -192, -109, -17, -82, -30, 6, 157, -26, 121, -213, -98, -25, -7, 101, 149, 80, -274, -227, 108, -21, -112, -26, -158, -255, -89, -70, -248, -158, -164, 3, -130, -5, 86, -119, 190, -61, 0, -2, -120, -44, -130, 196, 45, 69, 73, 43, -59, -72, 196, 240, -60, 218, -177, 2, -86, 145, 76, -218, 51, -2, -193, -1, 148, -62, -142, 114, 120, -259, 244, 27, 80, -48, -175, -112, -262, 120, 43, -147, -151, 82, 171, -143, 96, 250, -194, 216, 14]
11938A4j53j09J31R1j52J38R0R6q4n0K9j0N9j13p1K45K2k29J13k95O0K74k78L11
11962A29P9N0j54l24L47J9j89J59p9m9n0l7K52j38q7J46o4Lj9j66J32j01j4J55
11986@j01L39k45L7m8R5J21m14J50m11N45j55K0J0K05k44J06R2L2R9k81J13j20
12009e5P9O5L2k80N0LM4m8j48J26p4K86n3o5J26k8k31J16J37j66p5J68j37K92
12033A64l1j17J33k70K24l18K19Q8r4nl0L03l41o0j7K56j52J4q9J38k6K66k64
12056ij99K38P6j80J11O0j52P6K75l54q4QL56k90J58j87k1L20j2j83k09J80K82
12079B60l12j0L18n12L27j31N6k73K17n5j7J93k24R0o8K58j0K4n1q3L57m26K58
12102A86j39k40L60N4l75K40L18m01j20j0L3K26k05L95m51r4L61J8m2J48k42j4
$$ y = [14, -139, -248, -117, -26, -178, -40, 50, 146, 62, 12, 41, 31, 90, -23, -94, 151, 173, -56, 57, -238, -178, 96, -182, 129, 208, 258, 104, -220, 127, 146, -43, 116, 37, -12, -62, -99, 153, 15, -72, 74, 10, 13, -6, -172, -40, -141, -155, 0, -101, 238, -7, 30, -18, 77, 198, -216, -66, -477, 68, -87, -67, -57, 148, -96, 10, 102, 134, 233, -48, 65, -55, 24, 89, 121, -159, -109, -106, -62, -110, -258, -132, -206, 80, 27, -38, 88, 60, -171, -55, 82, -84, -159, 9, -128, 164, 133, 16, 149, -121, 103, -215, 4, 92, -2, -7, -37, 266, -75, -135, -152, 104, -48, -34, -123, 15, -11, 255, -9, -208, 30, 106, -74, 37, 97, -55, 21, 296, -58, -142, -134, 222, -68, 90, -97, -118, 202, 190, 7, -202, -22, 260, -52, -62, 256, -256, 71, -60, -4, -277, -60, -115, -132, 61, -163, -73, -141, 117, 107, 131, 80, -3, 354, -72, 186, 47, -193, 167, 221, -154, 86, 404, 3, -117, -127, -94, 132, -73, 322, -129, -223, 138, 156, 114, 262, 20, 6]
12124FO5K27j23j32J94o8j54K5l0j78%J89J45pj27K1p3k7l0j33J80K9L8j1N3j06
12150b7n0P0N5o9J55n3l22J51Jl1M0Jn1o4J81K13l12K56J09k85M8J90k71qJ60
12175H7k52J77j76P8mP3O9j13J8lL9l6K9M9Qj35J91k31J5K03p5n9k8K33j99p8
12201a20J99k16O6J22n%o6n1J05N8M4n5j90k8K86j76j32K35p0M7K4P3j72N7Q2
12226A17j40J64j60O1nq6p9K27k01K94n4k81J2L8P2r9L04j78N1r1M0M6j47J3q9
12251a71O8L40k81qJ08j73J09O8k11R3K66l18j16J71M65n30M0J16Mj19p3K14R8
12274A60k34j96K51o1Rj77M45k58J4J19k00JJ05j45qL19k09j9KM5j90M54m37K86
12298G6o5O3q1L7J37k43J26K1j32J31k13J51q2L01j63p3j40Q3K63l80J25J65j96
$$ y = [6, 71, 298, 175, 43, 237, 169, 15, 40, 10, -168, -168, 21, 166, 159, 32, 53, -20, -47, -77, -210, -30, -1, 37, 26, 79, -27, -77, -7, 48, -21, 134, 81, -241, -90, -89, -120, -80, -79, -130, -194, -13, 200, -112, 144, 253, -32, 16, 206, -65, -73, 87, -165, 12, -164, -86, -90, -17, 52, -61, -43, -46, -7, -43, -14, 35, 43, -92, 99, -132, -117, 86, 11, -48, -76, 157, -42, -120, 79, -137, -71, 51, 46, 46, -20, -71, 34, 92, 136, 81, -109, -137, 149, -27, -159, 76, 6, 53, 77, 150, -22, 35, 117, -23, 141, -19, 42, 37, -49, -128, 99, -102, 192, 138, -143, -131, -93, -21, -120, 184, 6, 57, -34, 6, 52, -95, -82, -171, -103, 237, -44, -52, 56, -117, -8, 60, -151, -58, 208, -110, -226, -55, 410, -120, -80, 36, 40, -79, -152, 62, 160, -74, -270, -19, -80, -71, -248, 197, -61, -47, 72, -128, -127, -22, -167, -175, 144, -65, -84, -82, -37, -227, 227, -210, 76, 11, 74, -7, 30, 167, -76, 50, 71, -61, 70, -143, 8, -74, 227, 64, -9, -149, -66, 197, -183, -58, 107, -89]
12321h9o0N1k2M5j49M07j69L0l0L0j56L6K97l68J79K63l30lK51k73K84j25R5m42
12345b48R9K66j83O9J20j35K4l5J07j9J63j06k86m6L20kj9j14q2J92j93J80N8
12368A30j02m7J9J86k96j3J63j27K00L8l28K63j50P0j05K53k6k11lN2M1j24j30
12391b47K46J16n6oj40K32J14k84j93L61k70p9K69j69l4L47j03q0k0p0O9j86K40
12414E7l8j96J64J66m56K16K86k95K99k81O4p2J36n3m8l5m3MP0L91n3j51P2l3
12438A71l35R8n2n5N7r6J30P5J89L6m16J73K40k09k8p8P8j55L8L55l36K3oO5K16
12463A78j08J47j53J29q8k59J3J75q2J0L25j40j03M5j49R0l14N56l16J29Q6j11
12485F0N1J46k32k1j24K38M4n3p7j20K32k28J75j67J31j35K23k29o5J48l2J25
$$ y = [-89, -149, -98, -120, -75, -224, 183, 14, 44, 14, 44, -112, -76, 221, -147, 32, 295, -35, -38, 213, -60, 224, 99, 194, -248, -149, 117, -66, 3, 123, -12, 12, -23, 84, 65, 228, 122, -164, -210, 110, 108, 89, -25, -107, 85, -108, 72, 130, 28, -19, 0, 186, -110, -123, 40, -87, 113, 151, -177, 86, -64, 6, -99, 154, 128, -83, -86, -34, 7, -117, -247, -1, 115, 59, 53, -87, 145, 259, -25, -218, 143, -127, -206, 63, -106, -140, 207, 104, 24, 4, -66, 3, -183, 57, 19, -177, -13, 153, -303, -87, 199, -96, 203, -78, -14, -86, 50, -3, -51, -86, -129, -125, -55, 336, 283, 132, 204, 171, -164, -66, -118, -173, -116, -212, -82, -7, 182, 218, -198, -25, 215, 6, -22, -100, -22, -177, -139, 216, -120, -97, -103, -38, 178, 70, 217, 64, 193, 105, -154, -141, 34, -48, -38, 287, 147, 44, 89, -60, 30, -284, 272, -44, 85, 171, 60, 111, 257, 25, 4, -120, 118, 162, 109, 32, -88, 144, -84, 91, -76, 55, -80, 143, -86, -151, -3, -35, 90]
12507I0j37QK25j33J7l58J92J49m5k3pM2j56K11j49J8K19j61j00J58j67L43j63
12530G3m3J05j14K7J28l30K78J4k25J94j02M0P0j60P2k75J32N4J03K0j56L98l64
12553f1j27K37J02n0j45l1J09j92L48j01k77p3J16K93j04J6k04K34Nj51M1k1Q8
12576E2j45J20M9m24R5K69r0K5m6L57l71m6J64J56j92L08m05L0R6o9L8j69J40
12599e8J16l7j19R8M1L0q5R3j83K01k0k71j21O03k35OJ67k21j27J08J94j94j21
12622a35l2j4K91rJ34l94K21J18k35J47l96L66nO4l85J18M08l65K10l03L21k37
12644a12p7L59k19J2J05J26l02K03M4Rk95M14k13j69K50j70R7j34K1l1J2J62o
12667H6p2J03L9k18o6L14m43L7L07K3m90N87J5m37Q5K08j16j16J88j39m6J8K68
$$ y = [90, -47, -39, 186, 53, 70, -288, -96, 53, 8, -15, -22, 20, -136, 75, -74, -56, 163, 2, -98, 60, -107, 236, 73, 30, 135, 21, 48, 176, -154, 124, 138, -87, 107, 5, 45, 115, -45, 27, -248, -116, -62, 41, 61, -95, 303, -61, -188, 49, 151, 101, -44, -75, 34, -158, 190, 89, -188, -261, -145, 148, 44, 60, -144, 90, 95, -56, -15, -36, 52, -93, 27, 76, -348, -253, 16, -74, -49, -95, 262, -109, -155, 9, 165, -27, 281, -124, -94, 2, -67, -29, -198, -58, 58, 21, -98, 0, 41, 71, -14, 79, -104, 97, 77, -194, -315, 288, 53, 59, 226, 5, -122, -14, 180, -14, -135, -167, -181, 110, 101, 235, -159, 62, 180, -55, 92, -304, 62, 57, 121, -264, -146, 262, -103, 107, -196, 125, -112, -189, 170, -49, -37, 68, 194, -108, 95, 139, 148, -147, 267, 54, -115, 135, -35, 62, -72, -51, -82, -70, 92, 86, 14, 117, 156, -62, -128, 186, -257, -220, 87, 110, -380, 207, 222, -215, -130, 78, -38, -154, 34, -105, -151, -133, 135]
12690A35j20J05k15J20j4J20pk12J35R3j85J96J36l57p0L69l61K28j33M4l2k26
12712b51J22K36j46J81k68R1P0j87J05o5Mm1J61q4J12r2J46j13p1M2J14q2j14
12735a30K34j23k8m8J49k30Q8L13k06j04PJ80j72rP4J55j92K80q9j35M3r5N0L9
12759E1J35j82J42n8k30j9O2K97k34j17L22k17J15j54J49k08K03J12l4P7j03M8
12781A57m05L72r5o0m5L31l85L78j77L1p2j65L06j25K5J3j14j14K27j75K30N1
12803A89m07J05j2J02J99j1K6o6L0k2r7J07k05J95j38r9K20J54m21P7J90k17j17
12826b18L48j65j20J02kj20J53K37j54q7P0P5j4l6Q2j80Rj71J62J58j90J33j38
12849f6J15l2n3L1M4j22p1L73j82J32r2Q0o11O18k75J25k43J08K15K01l79J62
$$ y = [135, 15, 120, -95, 25, 11, 131, 124, -88, 47, 140, -45, 151, 287, -70, -140, 229, -132, 96, -37, 7, -25, -251, -129, 107, -39, 142, -126, -35, 35, -152, -47, -112, -108, -149, 12, -72, 40, -52, 94, -19, -90, -48, 66, -16, -130, 104, -19, -47, -95, 54, -176, -88, 225, 19, -85, -78, 102, -70, -79, -5, 150, -42, 238, 149, 14, 57, -38, 12, 51, 186, 4, 146, 88, -142, -161, -99, 198, -36, -153, 169, -48, 67, -87, 62, -146, 57, 169, 135, 212, 109, 157, -248, 124, 29, -31, -76, 255, -130, 248, 71, 102, 30, -135, 171, 46, 71, 84, -30, -144, 83, -92, 138, 189, -218, -113, -125, -23, 176, 165, 191, 125, 155, 133, 36, 143, -62, 133, -5, -104, 116, 270, -151, -74, 116, -101, -218, 130, -35, -155, -53, -55, -175, -22, 215, 61, -26, 44, 119, 105, 69, 151, -29, -20, -191, -29, 129, -61, 72, -66, 49, 17, -36, -5, 39, -83, -154, 219, 37, 169, 77, 157, -454, 164, -111, 14, -229, -121, 94, 295, -84, 78]
12871G8J8K02k88K12k45m5q5P5J33j28NM9pmr3K31J11j83O0j25Qk3L46Mm41J99
12897F4J08j83m5N1P5k86qK49o3J05j79P1P1M1k01J03Q8j16J9M0j35L69l13K7
12921d8J34j58M8l2K06j65N4l5m5m2j04J65%J20l19J48K70q1j4k12L45j33q1J47
12945A68l65J45r7Q3r5J09J86n1l27K10q6j0l4O1Q2J44j08N9J58k1k05j32J78
12968E2M0l78K62L14m50L9J60N2j97K82k87k72K02M39l22J3k02K08oJ55r8L3r6
12991e7L20o4m53N56m70J08q0K88Qk15m9Q2M5J41j24j22j04M0K89k52J92m2k7
13014A0l3K95M7n06K8J6M7J11J62o2k1j0j24O4N0j04M2N9Q7j10q8L69m20J18J16
13039A43l96J52J58j82J27L3j49K6L29k29N4m69M52j17r5K19j3M8j17L05m98J84
$$ y = [78, 96, 298, 10, 222, -23, -68, -153, -78, 55, -73, -68, -19, -26, -30, -123, 108, 219, 36, 96, -29, -21, -44, 302, 306, -135, 64, 172, -11, -56, -5, 70, -216, -224, 25, -38, 67, -112, -41, 30, 71, -130, -27, 61, -55, -36, 4, -131, 238, -75, -48, 86, -72, -24, -56, 150, -15, 39, 4, -41, -83, -187, -22, -22, 98, -221, -73, 197, 116, 102, -110, 235, 102, 21, 168, -197, -52, -149, -66, -161, -52, 134, 83, -244, -34, -120, -130, -164, -103, -21, 123, 15, 74, 232, 211, 6, -126, 52, 92, -286, -24, 290, -160, -121, 39, 91, -106, 176, -111, -383, -181, 258, -64, -51, -253, -45, -51, 104, 6, 39, -57, 263, 199, -254, 302, -168, -60, -140, 148, 156, -59, -108, -26, 19, 160, 36, -86, -190, -150, 139, -113, 79, 37, 10, -23, 272, 319, -187, -159, -143, -96, 15, 177, 115, 94, 84, -40, 24, 74, -30, 12, 71, 158, 48, -40, 329, -91, 27, 143, -253, -101, 57, -125, 2, 35, -114, -88, 241, 12, 66, -403, 49, -68, -163, 56, 43, 91, -26, 279, -219, -35]
13061c5m4K46j36Q6q7l16J77K7K7J46k58Q8J43o8l7R0Q1%o4P8r8o4j31J72R1k38
13087a24R6P6j65r5L16q4q7J6r1J50J6O8k2L7J29k32j61J66K58q9j31K27k38n1
13111a5N1j69OK68r3j68J16K43j61k00k25M03k01Q8L03k12n7Q8l9lM9J65k9n8
13135A50qj18j69r0J25M3K50k98J46m7o4J9M5n4R9o8k0J40j8l44L05Lk4J10j81
13160f8K3j24K95j42R4j02n0n4J21K88n44M30J0k85m6J06J09j01P9J87q0j52p
13183a3J93J9j02qk75L2M13l40P3j0M3J05k08J49l74L44K56l75n2J45j56K39J37
13206B35l08J07J23q8j69J12j53K94L8j77j61nl3J96Q6j23j80J61q7J05J72l6
13228A09l72L35l25K25J46K3n8r3K25k19j32L20J02j07k6j85l2kP0n5J9J63j37
$$ y = [-35, -79, 167, 31, 117, 30, -286, -109, -82, -55, 91, -167, -79, 64, -4, -41, 49, 130, 130, 66, 144, 46, -18, -149, 23, 114, -124, -28, 48, -117, -212, 104, 20, -67, -51, -142, 8, 24, 92, 70, 107, 236, 4, -157, 9, 267, 178, 47, 274, 36, -15, 36, -133, -127, 141, 48, -120, -4, 239, 78, -122, -347, 56, -145, -57, 246, 34, -23, 65, 26, 23, 72, 237, 208, 150, 142, 24, -145, -235, -110, -67, 183, -115, 31, -16, -80, -61, -16, -70, 29, -39, -59, 81, 63, -281, 24, 27, 3, 113, -68, -45, -169, 126, -16, 78, -24, -74, -128, -7, 281, -263, 167, 177, -108, -154, -48, 61, -40, 39, 226, 146, -6, -13, 180, 199, 97, 89, -186, -154, 259, -81, -8, -18, 25, 130, -78, 71, -303, 41, 297, -78, -130, 15, -141, 98, 235, -73, 34, 157, 69, -100, 12, -141, 153, 191, 14, -147, -152, -185, 11, 97, -26, -206, -45, -132, -27, 145, 109, -263, 72, -253, -28, 118, 141, 83, -10, 215, -4, -136, 184, 286, 179, 153, -32, -64, -66, 4, -51, -32, 131, -6]
13251fmk36J3M12j01M8j17Kj21L1k3L0R8j32R7K72k28j11K19r4l0J22R4j25j6
13276I4n5j34J10J05o3j63O9J06j6k39K43J09k17J24l3j8M5j86J75r3J36j15K28
13299B12k34Pj07Q7K46m29j13L88J49l22L1J56J11l19J30r3o7N5Pk88K91L97k36
13322E9R5n8k5L61k50j01q2q7k7K26o2L11m12J72M2J0k87L9J62n2k54K44L5N1
13346A10P1J77j09l46K22k49J80j84jM0L12l49K32j45l42L49l2J52k4j28QN4j41
13369a43J53J3k8M0Q8p8j59n5K99j6l70M00j63K73m94L49p4p8K50k70N0r8J48
13392C7p2j85J47Q5R6J60l6m17J18L28k18P4p3J87l30P3j19J50N9l2k48L10j66
13415g2J4l9J57J20k6N4J20k85l59K54L11j30q3J49j15k34M52k73KN8J18k29J31
$$ y = [-6, -10, -246, -233, 179, 78, 126, 9, 11, -110, -79, -102, -72, 26, -106, -9, 263, 35, -76, 143, 49, 19, 141, 235, 110, 94, 39, -95, 15, 120, 57, -106, -37, 69, 53, -186, 57, 166, -51, 73, 40, 22, 67, -119, 56, -37, 99, -16, 212, -22, -15, -122, -35, 211, -218, -331, 57, 206, -116, -85, 71, 182, -137, -7, -100, -167, -112, -105, -393, -102, 295, 59, 154, 96, 71, 432, 182, 81, -1, -88, -115, 111, 49, 360, -52, 120, 162, 172, -115, -76, 86, 34, -220, 24, 59, 110, 181, 358, 249, -97, 125, -124, 56, -128, -129, -89, 223, -126, 106, -39, -381, -32, -64, 88, 64, -64, -56, -2, -143, 10, 23, -5, 35, 123, 45, -114, -169, 130, 114, -256, 144, -19, 254, -240, 109, 35, -43, 207, -63, -13, -111, 37, -35, -220, -73, 12, 108, 268, 232, -185, -67, 261, 43, 117, 44, 231, -99, -26, -145, 5, 64, 32, -216, 94, -72, -58, -97, 60, 180, 154, 208, 328, 43, -316, -62, 249, 119, 36, 185, 70, -164, 288, 15, 17, 75, 193, -36, 95]
13438I5j17k19L37k1L1k2j79N5o1J60q6P1k55M56j57k04L1J11j60R2K84j33r8
13461A1q0J34k42K52n29M63J28m75M31k59L78j89jJ43k11J7o4L13l37l6J53J24
13483A24l98L62O2l40K61l3J64k95N5%J78r4k25K23n4l5o3m8P5M4k55P7K00j37
13507a52J48j5O0N4k17M28j61k93J53J03n8J02p7j56j12K35r9J0J23r0J35R9k27
13530gL23j37O1l44k5L45k14j07K8k16L17j83L48j87J65n4j73J43n8K98m55OO
13553a20J14Lj25K9j30K18K49l60K6j39K94j31J09n4j48K13j1K5J01j32j8r7p4
13576a58Q3k7J44l4Q0n6K33l00j98J70K38l3Qp1j90J36n2r7N8K4K35k55o6Q6R8
13601E6P9k92J13n1J03M5j84P1j56K75j33k84M75j76q8L76k43J92j36J71J9k24
$$ y = [95, -22, -241, 96, 75, 106, 84, -95, -40, -101, 59, -27, 44, -211, 245, 88, -116, -85, 26, -134, -42, 242, 109, 11, -69, 65, -177, 75, -454, 9, 137, -338, 93, -166, 212, 23, 22, 165, -46, -29, -93, 220, -117, -153, 0, 124, -274, 88, 150, -190, 71, 38, 202, -93, -38, -38, 140, 46, -179, 44, -10, -45, -108, -156, -81, -37, -292, -215, -15, -152, -4, -19, 41, 95, -122, 306, 145, -148, 5, 108, 50, 152, 75, -81, -193, 42, -57, -47, 76, -14, 121, 220, -7, 316, 179, 240, -104, -129, 216, 2, -105, -77, -293, 24, -159, 189, 2, 167, 113, -60, 83, 25, 323, -132, -126, -120, -6, -3, -128, -99, -229, -11, 238, -122, -96, -235, 59, -72, 37, -17, -165, 48, 37, 62, 163, 31, 13, -84, -158, -75, -102, 42, 8, 88, 32, 265, -35, -233, -63, 175, 142, 150, 79, -111, 25, -27, -124, -66, -42, 193, -62, -128, -42, 56, 135, -157, -44, -95, 8, 53, -131, -60, -216, 59, -74, -358, 117, -59, -147, 229, -14, 178, 42, 213, 232, 8]
13623HJ64j74p5L41l94J09K08j95r8j1J48j6p5J74n9j10J6J62j74p4J71j45P8
13646b1K73o37K32L82k96m3j03K43j70L50j24p4o7K34k51J23j17l0qL7Q2k9M6
13669C2k89L48l08N7K11j26J93k30L2p2Q5O1j44M1L15l01k51K40K71k66P0J69
13691A38j09j03J99l36L50jl30J09l3J07j16J14K05l66L19j8k72O9M4K9K9j09
13713h1K28j5l50K19J10r0J05R5j41k20o3K24j89J38k4N8r8J62m4P2J50l75j56
13736b85L41O3j66K97l58K22k16J87j26j30L42j66k22K62O3j62Q8P8l26J67L15
13757B68k68K0j60J04M3K2J66J23l06n8r6m8N8RM08q4l19J60j08Q2k69J34J25
13780Fk6N9k03J00K21k48L33l57K48j86M6J03l88K04j7L0J73m4r3L11m65K29o1
$$ y = [8, 172, -2, -77, 264, -130, -21, 187, -8, -106, -117, 31, 15, -60, 114, 55, -55, -39, 123, -51, -125, 46, -99, -21, 252, -385, -153, 229, -67, -110, -213, 30, -140, 210, 86, 12, -55, 179, -72, 51, -66, -96, -104, -67, 15, -14, 32, -257, 91, -217, -160, 51, -75, 118, -112, -80, -152, -67, -6, -150, -109, 206, -95, -346, -106, 165, -101, -31, 138, 29, -74, 125, -211, 139, 138, -192, -83, -116, -9, -125, -11, 194, -172, 147, 129, -143, -74, -30, -1, 28, -81, 147, 132, -218, 1, 111, 21, 126, 221, 80, -140, -203, 21, -168, -30, -54, 4, -94, 68, 24, 96, 246, -129, -285, 56, 119, -47, 250, -108, 114, -102, 85, -41, -171, 171, 5, -217, 45, 108, -54, 34, 112, -214, -47, 268, 0, 20, -140, -36, 7, 29, 195, 318, 12, -46, -142, -190, -132, -123, 285, 201, -118, 42, -66, 16, -253, -119, 6, -20, 39, -164, -64, 157, -91, 242, -115, 133, -53, -7, 96, -292, -88, -105, -75, 98, 54, -39, 272, -193, 36, -25]
13803b5M2J11j49o8m1nK76j08l1j78J04J21k47K30O1J0j47rJ98k0k8k26R9J49
13827A19j94J74q8k8Q7j71R9J67q6j38J0%J65L0k75M0O5l6J43k57K28p7M4kq3
13852f4K78l80L18k05J7K60j72M4j07J3j40J21J17k20J31j52R8r6K76k70M17k17
13874F7l55M43j42J73j77J54k98K66l60K72j58J6J15l2j2k32M17m0Qn8k8O6k94
13897a89L61Rj52p8R9Mr9P5K6k91N5L03k50J50Q0k01j46K60r7J99J91j99k10r3
13921a93M37j06j26j38Q4qJ57j37j6K32k08l7n7K60p0k36R4J18j27J88j9l64K77
13944EJ66l23J77o6m2J82k8J51p1k92K79q5J32m9K4q6l8NPj74K59k59j06K82k78
13969b28J64r4O7n5P1O0K43l42L3J31J04j84K54m97M32j35l58L36J4J30j21k67
$$ y = [-25, 17, 128, -21, -89, -130, -135, 141, 33, 2, -176, -72, 49, -198, 32, 93, 103, -44, -53, 145, 125, 97, -129, -30, 119, -75, 99, 11, -17, 70, -101, -2, 165, 79, -59, -49, -49, 116, 146, -129, -89, -24, -60, 83, -174, 54, -23, 21, 19, -64, 214, -166, 152, -53, -36, 224, 52, 96, -11, 2, -138, -17, 100, -120, 11, -141, -43, -139, 137, -133, 284, 67, -288, 155, 13, 186, 9, 163, -135, 131, -229, 43, -115, -99, 16, -16, -28, -260, 157, 117, 125, 67, 39, 105, -189, 172, 181, 29, -49, 50, 54, -45, 30, 56, -235, -180, 123, -127, 23, 103, -98, -244, 16, -81, 118, 309, 110, -100, -193, 244, 138, 12, -126, -42, -50, 107, -30, -46, 186, -22, -59, -116, 144, 74, -162, -68, 50, -77, 111, 92, -272, 5, 171, -152, 25, -41, -83, 99, 71, 222, 151, -141, 138, 53, 185, 136, 160, 74, 36, 41, 48, -126, 133, -126, -232, 50, -228, -64, -158, -91, -146, -75, -15, 228, -114, -81, 50, 154, -30, 224, -273, 159, 24, -334, 2, 16, 146, 25, -242]
13991b42K40j27J44m5K62k16k21R7K67j30J12kj42k92L25K62l68j00J71L09q8
14012B16l29r6M79j63j04n7J96k89J39j10K86l5k28J65M7k68R8J06j94O6m8K0
14034a03k4M32l64N3n2k9K55j56m2LL67l53K90l50j05L3R8K34m08K03j55K4J03
14057d6K7Q9k78M7K78n8j94N0KJ44k51K51j9P5j64m9K40j53k1J49j80K37k29O3
14081A0J40k5J2k62Q1jQ9k54O05n05P6R8J57j69K15j18J40k08L4r8k7K2P1Nl0
14106E8K3j45q8K22k05K7J02J44l54M54k18k23Q9k8K16j68L43p9j30n6K64j05
14128A43o4N6l6Mj33J14j59l2K07l0O9k60K48k81K88j29P5j05R9J59k96j51K45
14151C1j28O1J6n8O3n2Q2n1n8K16m9k34R1J56n0k7j42M5R9n6p9l8N7J21j10J70
$$ y = [-242, -2, -129, 15, -30, 232, 16, -205, -108, 159, 29, 141, 139, -3, -295, 30, 292, -76, -176, -5, 304, 216, -113, -209, 270, 107, 3, -54, 142, -147, -8, -118, 168, 133, -95, 70, 117, -151, -53, 53, -141, -75, -123, -103, -127, 305, -59, -6, -58, -87, 168, 12, -30, -27, 340, -13, 277, -73, -178, -145, -47, 187, -221, -18, -173, -149, -46, -19, 70, -208, -161, 117, 59, -135, -85, -83, 61, -190, 61, 42, 117, -47, -96, 144, -9, -30, 119, -61, 176, -53, 10, 150, 125, 137, -125, -44, -45, 44, -210, 395, -110, -34, 64, 221, 52, 267, 149, 289, 81, 115, 17, -10, 12, 83, 88, 58, 81, -64, -152, 70, -135, -108, -6, 138, -216, 238, 20, -203, -114, -142, 74, -94, 249, 170, 40, -16, 248, 143, 79, 135, 99, 103, -30, 84, -75, -107, 100, 70, 139, -121, 127, -154, 134, 5, 80, -25, 74, 233, -63, -214, 31, -97, -36, -20, -78, -15, -67, 15, -36, -94, 122, 73, -161, -70, 86, 36, 9, -133, -88, 11, -45, -124, -162, -105, 16, -94, 76]
14177G6n4o6J35q1J14q4J28l90K10J55N4j44q8K07l16J76J39j33k64J27K55j85
14199b9R2l0J50k66L85k96o4J21J72j31k26OK24q0J06k17q9J75m9J09j75K21j82
14222g3J03J00r2l46L40K3k31M37j23k28l6J30L0j39J44J63k55K0J81j49o1k7
14244h9J41L3l59L20n1n06N92j19pk49M31Ok89K10k50J86K7m3q4P0J59j40k35
14267b46J76l9qP3j51J66J48Rj79J35o2J64k40K06J31k56J5R9L5j55L76l63O7
14290A01j21l0P8Q5J84m50J59R5j75j20K40k18K34r2J3J12k08k05L43k43L10N3
14312A45j34r9M9O4j04K52j72j81K01o7R2P3Lj44m5j13L07l00J59J06pp0k00K57
14336G2j12M0J38j79L07l54J54k6j66L5k3L65k94J71l45L90k02q8K24k85L07l00
$$ y = [76, 22, -44, 91, 10, 124, 40, 168, -222, -12, 143, 197, 53, -35, 172, -144, 32, 171, 38, -226, -99, 156, -29, 63, 33, 183, -83, 302, 6, -58, 63, 235, 104, -122, -116, 108, 28, 134, -83, -172, 3, -46, 63, -112, 109, -73, 30, 130, 38, -308, 32, 55, -176, 261, 138, -90, -126, 4, 34, -105, 39, 202, -53, -33, 148, -1, -62, -89, 52, 85, -274, 46, -5, -511, 81, -38, -45, -294, 137, 143, -146, 64, -186, 0, 27, -16, -100, -30, 129, -11, -246, -70, -109, -117, -44, -195, -29, 119, 128, -51, 84, 22, 186, -54, 152, 283, 27, 42, 141, 176, 21, 397, 34, 101, -20, -50, 28, 113, 297, -153, 6, 101, -74, -194, 46, -172, 62, -30, -17, 95, -113, -318, 25, -218, 92, 145, 11, -88, -39, 25, -79, 173, 1, -180, 21, -46, 46, 119, 122, -22, -67, -180, 127, -173, -14, 92, 85, 15, -185, 72, -40, 0, 138, -41, 266, -88, 66, 40, -126, -91, -114, 251, -43, 128, -217, 173, -29, -117, 107, -178, 129, -171]
14358a71L10n2j50M2Rl4J39m0J77l7k28Q2J01q5K1j13J08j37K33k96L81j05j68
14381a3j51Q3M7r1qJ39K74j39o5Kk58K22j3j66J5j38m8L32j53J25J1k90J46P0
14405f7j7p1L24l74M2o4J51P6L8n1J54k05Nj89K08O4j74K92k87L9J38P9J20j25
14429A06q7M0J02k42O6J34J0j89P1q8K65j76J24j26L0j03M00k29k77K62l24M21
14451A90k45N3r6J83oo7Qp2N1J37j29J6J7m8kr3J2K88l98Q8j0J08Q3j13J25J98
14477B78l03P3J60l23J61J2J78l90K97l60J18K45j85o9L04j35k98M18n4j01j22
14498i6K80j23k8L1j32J39j32J97k48q0K06J03k58K51J85j97j56kK5p1K98ok33
14521d7L3K63k27j49J51Jj13K6J09J09j73lk1PO0l6m1J46p8L7l96M11k62J14K09
$$ y = [-171, 139, 87, -63, -21, -12, -46, 93, 53, 230, 193, -35, 47, 148, 63, 84, -29, 79, -58, 175, -121, 260, 155, -13, -164, -81, -34, -125, -133, 6, 280, 141, 76, 78, -180, 42, 29, -137, -122, -260, -308, 24, -129, -4, 7, -283, -137, -67, -84, -155, 169, -205, -163, -227, -76, 0, 38, -13, 141, -64, -59, -248, -40, 24, -150, 142, -145, -106, 32, 111, 231, 106, 19, 59, 161, -81, -15, 119, 129, -60, 11, -77, 188, 12, 136, 10, 40, -63, 337, 108, -169, 93, -231, 190, -55, -2, -98, 85, 79, 12, 20, -52, -1, 136, 7, 23, 40, -8, -10, -103, -91, 197, -201, -113, -123, -15, 68, -45, 80, 278, -25, 48, 208, -115, 46, 58, 236, -154, 143, -217, -99, 146, -39, -108, 196, 61, -237, 181, 127, 26, -96, 184, 61, 33, 64, -68, 71, -61, 136, -112, -192, 14, 117, -141, 110, 295, 98, -58, -60, -35, -106, 192, 186, -47, -14, 249, 22, -127, 24, 25, -88, -62, 47, 156, -17, -20, -41, -34, 26, -10, -51, 95, 17, 54, -342, 69, -193, -79, 130]
14546A30q7j55q0K82j65M7J56J7j38J86j33o0J73q3k15K55j56J55pp1K1K4k43
14569a47J88Jr2M1K03J8k14N2j19K8J07j74n1L98j20j47J06j2j77K9J57J61l09
14592g3j02Q7R6n7J66M9j77Q1l8J06j12Q0J16m09R6J58p0K9j9j71J86P7k63K47
14616H3j12J69l22J06J74n1j35J71o5l5j0J14k94J82r3K20k64j02R1j30K95n7
14638f5q2n5J59m4j28J96l7N4k21L12l36L52M0j72kk51K13q8K85k64L9J78j25
14661d2P5j98J10K09j80N9l2j02N9J03j26K54m6j74j3j00K10j90J93j55rn9K50
14684I6k38J58J15j44o0J22o2j29o8K14r5K0L7J16j80K43j95K23j06j45J96n5
14706F3m7j3j13K54j50Q8l06J94J61k53o2K56Q6j44j11J82k3m38K21J93%J05k41
$$ y = [130, 43, -112, -192, 90, -75, -28, 128, 145, 7, 193, 60, 0, 173, 90, -125, 130, -26, 129, 122, 51, 72, 96, -147, 41, 42, -50, -9, 194, 212, -2, 50, -69, -41, 66, -108, -159, 239, 119, -28, 78, 66, -111, -82, 75, 236, -73, -175, -88, 8, -49, 117, 166, -11, 70, 32, 138, 26, 106, 222, -187, -91, 67, -3, 26, 7, -164, 22, 99, -164, 83, -29, 140, -182, -76, 98, 47, -88, 83, 18, -17, -27, 87, -207, -25, -118, 102, -162, -264, -173, -303, -8, -65, -147, -202, -43, -87, -215, -19, -56, -2, -223, 89, -247, 105, 145, -27, -29, -280, -67, -155, 130, -134, -95, 83, -42, 33, -165, -55, 154, -26, 33, 1, -101, -42, 61, -65, 189, 143, -31, -44, -144, 66, -124, 69, -86, -95, -154, 96, -142, 16, 131, -13, -73, 49, -13, -142, -210, 4, -91, -71, -34, 82, -98, 145, -50, 173, 67, -78, 118, 63, 16, 3, -110, 144, -6, 82, -224, -30, 131, -122, -184, 72, 158, 14, -97, 85, 62, -376, -155, 38, 38, 143, -98]
14729i8m0L51J08l97K64o8j02P0J32j45j9j07k37J32Q0M8Q1j73K22j96J39L3k37
14752a59K80j50J5l43L96J52j01r4k18N34l27k12K47r9J11j59MN7M4K6K6j09N3
14775b6j7J12K20k01J01k02J44J26m61K73p7o0J80J23l93K54k39M00k18k09j01
14796b71J10J13n5l8j3J84j80L59k65J32k82K35j08RP4J77k32J76j7K5jk43L21
14819B10l25J74r8Q2n4J59j36j3m5mM7N9k4j63r2L10p6j93K98l07RM0Q4K1j68
14844b05J17J16j78K61k28k6J99J60l43n4R6J30j44q7L21K9k32L40k22LM5j55
14866e7J23j73J18J30R0k60k48L83k5m6P4R9m5j52k1L2J25l13L04k14J1j01N6
14889a10J42P3o9j9o6o4j35J59P3K8N4k09R0l1n7K24j76n3j02J80J60j42j76K71
$$ y = [-98, -138, 213, 321, -76, 188, 120, 18, 88, 220, 75, 56, -51, -288, -156, -76, -28, 53, -120, 102, -94, 45, 78, -159, 121, -29, -14, -357, 39, 191, 90, -4, -222, 312, -15, -227, 20, -79, 32, -127, -123, -66, -22, 4, 30, -79, -26, -43, 69, 289, 88, 189, -13, 131, 257, -204, 69, -8, -68, 112, 235, -158, 96, -143, 257, 39, -170, -271, -161, -48, -103, -141, -154, 30, -150, 209, -56, 76, -206, 29, -79, -70, 4, 181, -51, 125, 108, 133, 132, -111, 210, -115, 59, -39, 43, -11, 148, 12, -1, -46, -50, -3, 56, 32, -131, -223, 87, 11, -182, 116, -191, -182, -142, -58, -37, -205, -88, 28, -150, 111, -117, -143, 56, 216, -127, -181, -85, 45, -99, -186, 135, 164, -68, 272, 50, 53, 98, -57, 66, -107, 11, 141, 231, -29, -277, 106, 81, 35, 109, 208, 163, 11, -10, 22, 147, -166, 138, -76, -65, -166, -110, 32, 105, 36, 17, -49, -113, -248, -89, -16, 12, 66, -143, -53, -84, -141, 83, -93, -146, -248, -68, 92, -50, -226, 45]
14913D5K4j41J77p8j1l4n7n6J24o3L6j8K41k47J6j18L02L1j17J0J18k32J60Q6
14937A98k85J38o7j33K49j97P3j07J86o2R2j36l7j86J14R8R4l8J0O9Q3k5M7k48
14961g0J45o2M7m7k63L07K5l37L68k2M1j27Q8j20m4m2R1L20l53p1J15K9j13j10
14985b05M47j71L0j69J30OP2k32m8K90k53K42m9j57j66K66j5j81J78j40JL93l08
15008c9J25R0l1n28M11o6O6j3J57m04M73M5k46q8K15j50j20K38l7j58K41k0l15
15031a54J68N1L36m51O7r0J18j49N2J73l80L64q1rp7J09j74J76j88K3K62k45J72
15054G3L1j41J08q4J4K85l57k4NR3p4J47p3o5L2N2N2l8o6L49n31P0K25j9j04n4
15080i4K78j51k28L77nk82K00P9j70k24L75k55j95L52R4N1j77M2N2jk70np6M41
$$ y = [45, 69, -72, 105, 27, 16, -18, -75, -131, -7, -70, -34, -52, 189, -58, -42, -160, 142, 173, 56, 66, 184, -48, 112, 198, -87, 51, -16, -149, 100, -97, -24, -131, 55, -7, 85, -51, -88, -274, -160, -62, 32, -6, 4, 73, 156, 131, 178, -70, 75, 13, 60, 13, -250, 57, 82, -255, 113, 91, 132, 5, 93, -27, -71, -113, -22, 298, -55, -126, -11, 18, -95, -205, 242, 71, 101, -68, 62, 68, 140, -92, -140, 150, -103, 139, 90, -67, -233, 33, 18, -163, 15, -125, -124, 269, -39, 86, 176, 145, -383, 28, -38, 28, 15, 172, -232, 241, 286, 40, -48, 167, 17, -103, 135, 98, -60, 181, 161, -154, 14, 65, 401, -50, 17, -73, 45, -104, -52, 121, -259, 105, 24, 15, -62, 47, -127, 49, -139, -116, 146, -99, 73, 104, -37, 71, -13, 1, 286, -71, -95, -90, 3, -71, 76, 3, -62, -30, 22, 74, 36, -30, 319, -212, -142, 83, 64, -40, -94, 184, 33, -195, 182, 177, -105, 95, 174, 4, -220, 155, -100, -295, 57, 151, 202, 25, 67, 119, 118, -152, -157, -233, 208]
15104B08k92kj1J9M4q5K35k6p7N3J33j58m1M9l8j3L15l24m8J51j37r0L15Ml88
15129b04L77l49Pq1J18J74J25k48O1k4o3K39j93J41j43K79k31nP1k17J86k4k53
15152b57L22j63Q6RK75j32k15M9R6j87K15j59J36j05J65rl47J21NJ67o1K5r0R8
15176D4J35j12r5l5K13j06k4r5kK23r7k36K11j2o3pJ36k00K24k06j24J43l33K75
15200a43K47%k89J1j58K88R5j10N5R6k26J09O4j7L4J1k53M99l18j92J78N5o1j82
15224b07K47k30M3K98l7j54q2l9Q0J10K7m6j4R9j39j3N9k0J91j87L6K4L9j43J06
15249D8q0J86l9l43J47L09j58j43K6n2p9K5M10k32l4J29Jk80Q8N7k38K63k18K52
15273D5o9j1J66l40L23K1j42r7J45j64R9j60J48O1K37m3k03L7q1P3k1Q4k8p6l1
$$ y = [208, -84, -86, -97, -78, -34, -119, 116, 90, 13, 66, 199, 41, 0, 49, 11, -2, 313, -11, -59, 92, -45, -135, 180, 184, -204, 173, -176, -169, -250, -132, 42, 167, -81, -20, -44, -107, 132, -61, 80, -63, 216, -15, -20, 51, -166, 20, -4, -257, 65, -98, -12, -3, 272, 140, -75, -26, 70, -117, 98, -61, 75, -30, 135, 126, -221, -100, -95, 72, 11, 36, -54, 44, 179, 67, -28, -63, 150, 44, 20, -75, -77, 146, 49, -187, 24, 12, -51, -58, 78, -122, 102, -104, -228, -85, -418, -143, 104, 104, -185, -174, -332, -44, 51, -59, -4, 92, -134, -25, 39, 22, 56, 67, -186, 313, -5, -197, -19, 36, -25, -207, 40, -190, -147, 151, 114, -40, -122, -161, -81, 29, 56, 10, -4, 95, -44, -57, 2, -18, 173, -14, 22, 46, 85, -58, 48, -32, 154, 115, -228, -81, 228, 70, -73, -47, -99, -178, -153, 257, 25, -9, 120, 121, -159, -71, -14, -252, 11, -207, 45, -24, -35, 131, -209, 114, 135, -7, -104, 41, -123, -24, -184, -36, 25, 262, 219, 16, 53, -28, 45, 24, 108, 80, 4, -27]
15298b7K96k11J55r8l11K19O1k46J35J3Ol1N6j06Q9OK18m03N6J14QP3J42j59J22
15323A77k45j04K62j86J66j7j30J84n7M4Rk34K21k38K71m8k09K77p8j71P0L3j97
15346b00L33j25o4k39M26p4j58j0j08J04J59k99K04r3P5P2l2j27J75L3j24N9K20
15369B07J30m28M09k44p7J15j61R9k70M15j84n6J2j15J45j10J05m44K81M26j37
15390A18k64q0L14k03K9L19k94K30j69O1K1k39L36j89p3J90L4p9j19k57K95j09
15412a28L79l32K33Kj08O4k14J38l1j66J05O5j86J00J98j09j24KK18q3P5j91p9
15435a72J69J64j43R7l5j30l1L2Q4j47n5K52j26J02j46K59j7l1K7j08J21j28P9
15458A17j72K5j41J8J19P6k69K32j44J38p0O5K32l06J30J62j47r5L2k23R6J8J05
$$ y = [-27, 269, 58, 213, 115, -196, 23, 84, -162, -27, -14, -8, -39, 17, -89, 0, 6, 224, -179, -123, -9, -1, 72, 214, 55, 177, -68, -172, 90, -96, 70, 53, -77, 107, 50, 94, 103, -131, 90, -148, 123, 75, -134, 143, 65, -106, -36, -3, -200, 133, 8, -56, -295, 131, 57, -101, -111, -219, -115, 44, -255, -51, -144, -69, 3, -29, -156, 19, 52, -72, -13, 207, 337, -91, 318, 74, -3, 112, -49, 50, -220, 195, 11, -45, -33, -148, -3, -113, -8, -452, -171, 255, 118, -146, -226, 88, -115, -86, 233, -61, 169, 0, 61, 82, -157, 179, -10, -83, 107, 141, 62, -57, -314, -19, -128, 251, -81, 152, 154, 46, 110, -104, 34, 3, -163, -58, 7, -179, -79, 119, 10, -114, -112, 106, 23, 98, -93, -172, -3, 161, 18, 115, 80, -50, -81, -49, 35, -112, -167, 85, -41, 61, -85, 174, 157, 126, 153, 45, 166, 38, 117, -55, -30, -171, -153, -34, 42, -227, 5, -139, -1, -71, -6, 226, -80, 50, 212, 65, -30, 2, -221, -125, -107, -2]
15481bJ01R3k66k10M20k32J16k02L95j37l1r3J29o6J08m6j74n3p7Q3L9J86%N3
15505A34r7P7j80J24p3Q0j19J72J33k76j22l8O0J23J63k17J3L1J76k16j49K27
15527B6L6j07nP9l31K95j16K06q9K24k75N9jJ13l21R6L3Q4r6R3K83m14J33J02
15551A07Lj04J61m0r7m0P8r8J51j03j45J99J68j88mK36l32L56k82p7l5LK24j65
15575b4k42J86K7K2j05K44j7p1NR4k11J10j65K01J3MJ34k3k99J94j51J65k1m7
15599B3R3p9j16J0J29k44K78l60L13j17K03j85p1l8M02m72L06l7K00k17N4r3l8
15622e6qoK27j19l6J25N7m68L87L2n1J12j09k65K40k9J09L8j44r9J33R2j22P8
15646A18J6j22o3j62J01R2K8j28J40J31j66J97j04j24J48J12k41m6K35k83J87
$$ y = [-2, 99, 192, -74, -284, 136, -96, 20, -182, 213, 76, 45, -48, 81, 15, 123, 77, -97, -150, -227, -144, -105, 81, 81, 134, 37, 114, -66, 58, -15, 65, -54, 118, 251, -25, -147, -185, -125, -2, 161, -56, -43, -12, 164, -52, -201, 26, 62, -45, -50, 29, -302, -7, -123, 83, -6, 218, -57, 2, 1, 114, -207, -111, -78, 6, -90, 3, 286, -128, 5, 107, 110, 6, 167, 127, 30, -10, 68, -30, 121, 18, -127, 72, 240, 52, 48, 284, -48, 308, 26, -51, -86, -83, 141, -24, -266, -80, -53, -31, -136, 108, 91, 20, 25, 119, -92, 18, -147, 54, 67, 71, 205, 182, -117, 77, -74, 91, 70, 23, 116, 37, -79, -69, 60, -184, 94, -266, 47, -70, 133, -52, -123, -161, 241, -231, 75, 38, 238, 21, 75, -18, -56, -64, -70, 157, 38, 2, 127, 184, -284, 103, 135, 84, 196, 87, -178, 62, 33, 142, 180, 36, -63, 70, 162, 40, 118, 134, 12, -51, -213, -112, -20, 8, -120, 20, 151, -15, 182, 78, -46, 102, 214, -27, -73, 162, -121, 66]
15667F6k7j12j27J68K32l15J57j16l4L4K49j8k15K1O8j14J05k08L38l13J85j56
15689a32K06j62J12j99J92j8q3J29N7N4j57n7j48K52K99j82j87J09k14L12j50
15710C3K95n94J17R6K23j42oJ15j38K5k60J85J45k03N1j1J28n6K1J03n0P9K19
15733C75m98L4J91o2k96K16J7n3j47K18K11k22oJ45n4j1P2k13K15j04o6j11J35
15756a4k19J34K22j24kj6J5J46r9K44l71J21J40k27J65j16O1j55l6o9J18J03R7
15779A18j8l40M05l73M51k41J93l34q2M37j19j78L02k41N8J5k39J47RR0O7o6P
15802F8J50k37J22r0J79l15K76J0k35J32P0k33k09M63q7M6L55n54J59m2N0m01
15824c23L78j9J86j74m4o7n8K4P0J76r6l8l6j50K33k05J68J52Lk53J17J27k64
$$ y = [66, 39, -73, -200, -32, 200, -115, 42, -74, -108, -74, 175, 157, -58, -37, 31, -83, 22, -186, 152, -161, 24, -132, 74, -88, 24, -175, 17, -1, -84, 45, 102, 156, -1, -58, -206, 46, 345, 163, -24, 85, -129, 183, 33, 328, -266, -149, -53, 170, 28, 22, 137, -1, 24, -236, -51, 94, -109, -58, -69, 59, 3, 24, 127, 77, 156, 375, -123, -89, 102, 40, -256, -40, -23, -76, -223, -5, 206, -16, -22, 123, 69, 58, 130, -83, 132, 28, -38, -149, -14, -233, -99, 123, -1, -3, -19, -4, 142, 43, 287, -84, 37, 177, -50, 115, -1, 60, -95, -131, -200, -82, 21, 118, 100, -240, 165, -208, 243, 2, 195, -139, -221, 216, 97, -81, 221, -20, 38, 53, -186, -39, -30, 60, 127, 61, 68, 218, -19, 103, 13, 192, -123, 153, 163, -72, 60, 130, -103, -312, 151, 64, 110, 465, -89, 70, 28, 78, -323, 55, 36, 222, 48, 4, -63, -121, -97, -27, 149, 53, 15, -21, -171, 62, -143, 25, 177, 180, -73, 44, 171, -93]
15847i3J6M5j11J21Q4q3J96j86J49l18M3K70j5j36N0N7R1k85J70QJ5n3Qk16L05
15872A32p9r5K31k48K8j15K8O6o0J3N6p6J82r1K91l92L0J87q7J13r8l1j4J65l7
15897I9j98J66k0k27p3J41R3j13J30P0oj03Kl8j6K14l44o0L09L06l57J8j09n0
15921a66L10k41P5Q4P4l7p8N8k2J86m6M4j62q3m4Q5r2m1M4mj5LN8K08l82L65q
15948A73j54J4J36j06j04j09M8M3j9L1K21r8j83J50m6J72k44M7k4j42L29j72R2
15971E5j28j54J62J72J43l17KN1J08j89p0J97m3r1j37L51j74l4p7J11J77k03J50
15994F2O6q4k5K5j14L6L60j50l86M37k57J81k44L40l70J16R4Jk14J41j43l7K59
16017I4k37O4P6J38K08l93n1K8r1K50J7n1j15J17k80K46n0O3n9K6K05l7j38K57
$$ y = [-93, -77, -32, -143, -22, 62, -21, 175, -11, 138, -180, -137, 133, 118, -18, 32, 89, 180, -105, 65, 73, 88, 35, 43, -173, 132, 53, -42, 189, -59, -31, -146, -118, -52, -112, -99, -43, -119, 63, -28, 263, -129, -99, 88, 1, 114, 16, -15, -29, 136, 99, -99, 67, 47, -180, -253, -112, -19, -132, -2, 68, 62, -41, -39, -77, -93, 121, -223, -283, 26, 332, -25, -7, -116, -166, 144, -97, -22, 62, 136, 99, 21, 79, 57, 243, 197, 241, 79, -4, -48, 37, -55, -96, -52, -56, -71, -68, -10, 198, -184, 181, 173, 19, 33, 169, 63, -41, -150, -102, -59, -78, -47, 174, 76, -107, 43, -3, 169, -75, -28, -52, -194, 135, -37, 55, -73, -227, -65, 107, 250, -67, -65, -14, 94, -95, -165, 32, -11, -102, -239, 112, -62, -96, -173, -62, 115, -88, 62, 128, 44, 19, 44, -70, -34, 326, 176, -210, 227, -30, 151, -93, 247, -123, -7, 87, 88, -126, 15, -128, -165, 94, -143, -79, -3, 135, 343, -50, -101, -73, -164, 86, 103, 52, -63, 54, -226, 20, -30, 33, -26, 0, 205, 168, 30, 287]
16041B87o4M6k35J24k46O6O2m8r4K42l80K74P1j86J69j28J85q0j38J21p5j25R5
16064e7K03O7l79L30l41j68N40nm17L13n9k21J14J81O1o3j48K08m08L38l2k81
16086b24O1L68j9k78K95j86O5j8J44k47K8j27J0J54J93k69j24NL6K43k7k66M59
16109B76k36l5Oo9P3K00p8k67L43l11p8N4O3K04j04Q7j13J27j26J3K7j1k40J62
16133c3o1O7k7OL89l47l15K14M23l83j70K78j17N9M6m0l7lR2j19J98n8r0K08l2
16158A48k70R6K60j37r1L2K21k46j25K39J79k44N8K4Jl08K42J48k10K23k69j55
16180a84J79K11J3k33J49L02o89M00j66N9K9l7r4j18J19M1K50k10RL0l70K74J05
16203F9k52J00L0M7j98K9K53j14J04n3l2k49L11j94J0K72j68J18k93J25J76l13
$$ y = [287, 223, 269, 34, 158, -88, -22, 40, -8, -102, 140, -240, 34, 105, -81, 88, -40, 145, 65, -73, 48, -27, -152, -57, 146, 213, -166, 164, -177, -345, 195, 190, -227, 86, 27, -194, -80, 101, 162, 99, -49, 159, -249, 89, 57, -224, -163, 205, 186, -92, 203, 17, 82, 64, 208, -39, -11, -138, -128, 26, 219, -50, -174, -169, -133, 110, 83, -183, 276, 40, 5, 11, -58, 15, 215, 137, -130, 213, -98, -176, -122, -59, 145, 41, 128, 15, 142, 16, 29, 56, 45, -195, -33, -94, -27, -54, -48, 341, -6, -321, -107, 316, -67, -237, 41, -76, -17, 29, -11, -48, -51, 41, -78, 120, 62, -28, 180, 148, -122, -26, 234, 97, 6, 38, 259, 13, -112, 127, 306, 62, 120, 144, 145, -163, 79, 227, 17, 240, -29, -184, -5, 206, 219, -14, 135, 437, -252, 148, -18, 41, 70, 33, -61, -179, -60, -19, 231, 21, 30, 60, -310, -36, 69, -183, -83, -53, -6, -204, -175, 78, -36, 68, 15, -17, -266, 45, -149, -139, 133, -35, 83, -210, -85, 91, -222]
16225b22P6J35K9Q5nj30K36k16o3r2J36M3j48J23J58l18Q4Np1K39J11j80j09Q4
16249a0K43k42km1J09K6l7r7L2m9K41j30J99l92J7M6K15j82o7L34k38R2J08j79
16273dJ18J07m51J31MK12P5j12p3J3j60J90M4o6p1n3K02j21J11J12q2o7n6m5M3
16298AK17n64M69j05J86k11J04l5j52J30j20K05q9O3j26Q0j03l1J65j20K08k97
16320a25K43o6p5J78l13M20l37K83k14O9o4m7J55J03k55N5J11k89J49J98j07l55
16342b83M40J56l55K27j48k80J20L3J91Nj62K0l24K99N3L6Jj39L27m24J98m8n9
16365a16J19j32m1J17J07j30J12k97K10p7P8J72j65P7l3j95K78k0
$$ y = [-222, -146, -11, 18, 103, 98, -32, 204, -12, -75, -167, -31, 12, -136, -13, 145, -173, -89, -84, -155, 84, 195, 15, -94, -10, 233, -9, -11, -52, 57, 83, 46, -51, -19, -68, 173, 43, 242, -150, -133, -87, 128, -54, -121, 213, -25, 67, 175, -4, 114, 221, -230, -99, -95, 117, 192, 80, 7, 20, -140, 50, 94, 28, -43, -96, 106, -15, 96, 208, 126, 59, 3, -42, 1, 218, -346, 123, 18, 204, -7, 97, 62, -90, 40, -80, 125, 36, 99, -27, 53, -50, -81, 84, -36, 172, -125, 118, 52, -23, 155, -158, 262, -75, 208, -6, 63, -1, -48, 107, 210, -45, 10, 121, -168, -19, 179, 72, -283, 157, 313, -42, 185, 37, -243, -123, -90, 101, 106, -56, -36, -360, -61, -8, 28, 29, -110, 217, -207, -9, -57, -116, 3, -129, -170, -53, 54, -76, 36, -261, -51, -128, -50, 122, -43, 34, 1, -194, 84, 64]
16383F4
$$ Imaginary data points
##PAGE= N=2
##DATA TABLE= (X++(I..I)), XYDATA
0@%%%%%%%%%%%%l2O4o4O4o4R6j28J60j92K24k57K89l52M16m81N51o46P51q48R62
32E13j104J264j440J628j822K033k267K537k828L146l493L861m276M731n222N758
48C019o351O999p706Q493r361J0323j1405J2621j3986J5554j7376J9502k2036
61a1710K5120k8965L3909m0548M9995o4583R0356j49412N34185R9659r86244q7046
73e35284L90010N43951J5360k44582l03967K7602R2604o6694P184K92202J19681
84C38067j92986l49592r8374J93269L71056J50350l10695l32179O5728J76200
94A0844O2814j5826L7082j6685p8293p8496p9396J10091K73532J0418k66218j52448
106a82581J49052J43462m6184p3139j5670R4283Q3988j72335k21905J08835L44597
$$ y = [0, 0, 0, 0, 0, 0, 0, 0, 0, 0, 0, 0, 0, -32, 32, -32, 32, -32, 64, -64, 96, -96, 128, -129, 160, -192, 224, -257, 294, -352, 399, -449, 513, -591, 673, -767, 861, -961, 1072, -1195, 1342, -1486, 1660, -1833, 2028, -2248, 2483, -2739, 3019, -3332, 3667, -4039, 4454, -4907, 5416, -5989, 6632, -7354, 8200, -9176, 10326, -11710, 13410, -15555, 18354, -22194, 27801, -36782, 53574, -95838, 438347, 538006, -448238, -535284, -145274, 398677, 414037, 169455, -134512, -106910, -14306, -81000, -73816, 218386, 338067, 145081, -204511, -302885, -109616, 261440, 411790, 101095, -231084, -165356, 10844, 73658, 57832, 94914, 78229, -64, -78560, -157956, -47865, 225667, 236085, -30133, -182581, -33529, 109933, 63749, -9390, -25060, 69223, 153211, -19124, -241029, -132194, 212403]
117B12403P5088k84164k15900M0094K19799J89277r5938k39154k4186J96976N0204
128A24499j72548n3956J34081J23800m2766k31059j32479K14940L19217m5785
138B37944l60445j42489J97256K36947N3572j70788j92301J5120J65803O2432
148A03051p4663o551J7660q4815o1997N6344J20831P5483n6061j73157j02250
159a86125J50227K02646j7299j42676q5019J3493N9475L6852j3730p725O2651
170G2770j3981j67718o9287J68996J96814j4943j96355j52466N0648K02253R3652
181A70383j25997j13155L8379N4460l2988m8604K8396Q2695N5280p5046j62830
192a29027j7539J70145J28184n2533j29948n6985M0717P6448J4856n2023J0776
$$ y = [212403, 287491, 3327, -212573, -172479, 47320, 236597, 140659, -98495, -122681, 74295, 124499, -48049, -102005, 32076, 155876, 113110, -117949, -250428, -35488, 283729, 237944, -122501, -264990, -67734, 169213, 222785, 51997, -140304, -125184, 40619, 103051, 28388, 21837, 39497, -45318, -107315, -50971, 69860, 145343, 89282, -83875, -186125, -35898, 166748, 149449, 6773, -78246, -64753, -5278, 31574, 17844, 10119, 72770, 58789, -108929, -178216, -9220, 187594, 172651, -23704, -176170, -125522, 76731, 170383, 44386, -68769, -30390, 24070, -8918, -57522, -29126, 53569, 108849, 33803, -129027, -146566, 23579, 151763, 99230, -30718, -87703, -46986, 29462, 44318, -7705, 3071]
203C071O1368l8818j19990k6492J15816J18287j584j20892j22098L1014J36040
214C5722N7309m1476l8333k1469m1767j5454M9578O6419L8518m2375j26701o4970
226a44999R7409J40443J5526r4139q7868j2908P6813P6888k5555n6190J2898K1425
238A9743m4666l5896M4163N9738J2303n0537q4221o470J01062O5090n6101o4790
250d0582J2402K7773R485L361j7621m927L2640k788o2546j3725O3660K9732k9327
263G537k7741j8526Q867N0910J3689n3320j3340N5331P078n1271j2250K5850K4076
276A6890J5556k9685o4507P914P9054J3455n3587q929J7617p828O051J9267p608
289C660N23K0630l2158m8674L6962O0352j3106m1267k1240j3584K7483O1635r504
$$ y = [3071, 64439, 25621, -94369, -120861, -5045, 113242, 111658, -9234, -131332, -100318, 35722, 93031, 51555, 13222, -8247, -50014, -65468, -15890, 50529, 89047, 46672, -80029, -144999, -47590, 92853, 108379, 14240, -73628, -86536, -9723, 67165, 41610, -14580, -1682, 19743, -24923, -60819, -16656, 43082, 55385, 4848, -79373, -85843, 15219, 80309, 24208, -40582, -28180, -407, 9078, 12439, -5182, -10109, 22531, 19743, -42803, -56528, 7132, 36864, 7537, -20204, -38730, -29863, 21047, 34736, -18584, -31924, 23407, 30485, -20786, -33036, -7186, 16890, 32446, 2761, -61746, -53832, 25222, 38677, -14910, -23839, -6222, -14050, -7999, 11268, 3660, 4183, 24813, -7345, -56019, -19057, 41295, 28189, -13078, -34318, -47902, -20419, 41216, 31712]
302C1712o7430K96M4055n033j2647J9981J044j5005M385j6665k4299M1487M3195
315D5076m6301m8524K5577K7751m283R136m162k9965J5038L3786k3842k3145L3415
328I557J1212l2056l139J0049j4174J3527K7215l2056l2534L7470K6354k9641
340h216p802K0124n205J894J6297k5203k1505L8760J8345m2437j0762K8606p142
353d246j3288J9806k378j8730J9590J1151l0391K644L8405p852k6807Q651K6j2737
367a6156K4079J5371l9365j7054L3970N362j9700J2298P320j8370O775J4918j7955
380h507Q35L2017j1690l7842J2650K4431j2160m351R564j7815r036K6158K147
393F401k2038J3250J7335j9655n810J8722o571q887K1151j779l1042N297K3637
$$ y = [31712, -35718, -35422, 8633, 3600, -9047, 10934, 11978, -3027, 1358, -15307, -39606, 1881, 45076, -1225, -49749, -24172, 3579, -704, 8432, 4270, -25695, -10657, 23129, -713, -23858, 9557, 20769, -11287, -14426, -4377, -18551, -5024, 22191, -9865, -42399, -4929, 21425, -8216, -16018, 4106, -1099, 795, 17092, -8111, -29616, 9144, 27489, -14948, -25710, 2896, -4246, -17534, 2272, -106, -18836, 754, 11905, -18486, -15842, 22563, 14711, -12096, -3445, -3419, -16156, 7923, 23294, -16071, -33125, 845, 6207, -13493, -1195, 6125, -12245, -5470, 9448, -8507, -7672, 24345, 12655, -25187, -12537, 11894, -266, -4617, 4947, -12868, -21904, 4254, 6401, -15637, -2387, 14948, -4707, -10517, 8205, 1634, -7253, 13898, 12119, -18923, -13626, 10011]
406A0011j1521j0682J3980k990j1488J2846K286j6465J4565K2304k0874j8426
418a6454J8783O605j2527P787M558j8718j063J4071r741o411J9548J739j8397
431a0220M520R925r532O258J7516j2414j8836J1468R008j0489K067N562j2625
444g792j241J2575o006q677J4135M708j4038M080J3710q491q069R951J05o391
458a441O795l78j4144K077R350p163j311J3947k324j4041M009O356l435Q330J1566
473A8193j1538j4942K229L579L631J1834l185k0845l320J1412o33N39J3876J385
487A2215j2919m473j175j467J5961J7731j0412k0833q655l473Q642K6547Q038
500B5727k5299k0039K489O273J3238J8318j170j6559p573n421n344J7914K5111
$$ y = [10011, -1510, -12192, 1788, -1202, -12690, 156, 2442, -14023, 542, 22846, 1972, -16454, 2329, 8934, -3593, 4194, 8752, -9966, -11029, 3042, -6699, -13110, 6438, 8177, -10220, -5700, 4225, -5307, 951, 18467, 6053, -12783, -1315, 7693, -2796, -729, 4833, -7792, -9033, 3542, -2464, -11141, 2994, 7702, -6336, -2256, 11454, 2963, -5106, 4845, 4950, -1441, 5354, 4976, -9168, -7091, 2259, -4904, -6215, 7732, 5408, -8633, -4624, 1732, -1703, 6627, 18193, 6655, -8287, -6058, -2479, 1152, 12986, 9801, -11044, -14364, -2952, -3585, -3046, 10830, 12215, -704, -5177, -6352, -7819, 8142, 25873, 15461, -5372, -14027, -17500, -8858, 17689, 25727, 428, -19611, -17122, -10849, 2389, 20707, 19537, 2978, -4595, -10016, -15360, 2554, 27665]
513B7665m531k1422j5438j3488L401L5192K5714j7711l1414j5002J223K5589L3546
526C3324j655k9278j3674m52k101J4392K2126l932j6890q089j3055q840K6063
539b061L1564m419k1999j7741j3578J4508M1515J0547l1277j9743J728o80R458
552b178J8074m849j4060L466l934j6923Q919K5255L067n114k601k1332j3525K8990
566C255K7503j3916j9245m965p755N188K2713j729j9486N506R993j2427k997J3430
580E068j779l49J7106q254l0840L057K7590L883q258o181j7320l288K9764R778
594A9977k7135q514J7641M947R37N317j6873j6151K3913K0977j7722j4941M865
607b762m896J70J6968m090j6450J3376J1759k3402j0936K2879J3141m61K163j9461
$$ y = [27665, 23134, 1712, -13726, -27214, -23813, 11379, 37093, 19382, -12032, -27034, -25811, -222, 33324, 31669, 2391, -11283, -11735, -13836, 556, 22682, 18750, 1860, -6229, -19284, -28124, -2061, 29503, 25084, 3085, -14656, -28234, -13726, 27789, 38336, 7059, -12684, -10956, -11636, -2178, 15896, 11047, -3013, 453, -3481, -20404, -11485, 13770, 16837, 11723, 9122, -12210, -25735, 3255, 30758, 16842, -2403, -7368, -15123, -9935, 12778, 11049, -8437, -2931, 7062, -5365, -8362, 5068, 3289, 2940, 20046, 11792, -19048, -15991, 11599, 15482, 7224, 1043, -16277, -19565, 10199, 19977, -7158, -15672, 1969, 6916, 7853, 13170, -3703, -19854, 4059, 25036, 7314, -7627, -2762, -7658, -7488, 9480, 5390, -11060, 2316, 14075, -9327, -20263, 2616, 15757, 15296, 17459, -2002]
621b002k9026J5294L7442L096j4924j1181k3894p708L6654K6551j7490j5664n83
634c435j2735j46K8001J0375j2633L95o596k7144N11L2742J3153p086q213k7194
648b0005k1567L1987M3244o891k6564r156o823L315K5336P120j8058Q36P490k0934
662a0670j4323K0093J7480j95Q62j5582k9087Q455L8270J0396j3050q032j5318
675a0701j1142K0201K0907r076p419J902j5934j2629J9573J7216o221m35j442
688D800j9315m574K2332J2248j926J170j5047k5081R694L1103L761j5239q134
701d208j1045m461K1694J4895j3175p934O312n362m926J2709N752o030K510l610
715C121j8297J794K3018L558j5343n804j239M37J3118P851j3539n749J0661K38
$$ y = [-2002, -31028, -15734, 21708, 24804, 9880, -1301, -25195, -32903, 3751, 30302, 12812, -2852, -3435, -16170, -16316, 11685, 22060, 9427, 9822, 3226, -23918, -23407, 9335, 22488, 15402, 7189, -20005, -41572, -9585, 33659, 26768, 204, -8952, -15775, -12460, 12876, 19996, 1938, 2774, 10264, -10670, -24993, -4900, 12580, 12385, 13247, -2335, -31422, -22967, 15303, 25699, 12649, 4617, -10701, -21843, -1642, 19265, 10189, 2770, 4672, -11262, -23891, -4318, 12898, 6677, 6242, 4800, -14515, -19089, 3243, 15491, 13565, 14735, -312, -25393, -15699, 15404, 19165, 3926, -4208, -15253, -19714, 1980, 16875, 3700, -4234, 2078, -3284, -8210, 4499, 10251, 4221, 6731, 3121, -15176, -13382, 9636, 13194, -2149, -7953, -9192, -8755, 4363, 12214, -1325, -7074, 3587, 3825]
729C825o840O651L695q404j083M010p098j953J1084j79r856J903L467l889N036
744C69P600n641m496N006k417m921R067N956j2017p922M738K098K640N461o050
759e29r000O672O949n583K67Q775k052o691M6k306k68J0775K731j3634p612N193
775f267L193L517O422m892j0205M050O674k507K917P839o173j0767P39K900L174
790F14P044k540j5214j590J1448J852l167N419q14q068K930N452l087K467O080
805H826p943r058N861L946l943L032J702r479m06R671j562n152Q431K984q978
820b068N3M870l859J636P840p953j0386P597N800q499R74P684n553m120P872j219
836F69m697R432L555j1904j558Q962m236l525Q947l540j2012N584P810p674j11
$$ y = [3825, -3015, 3636, 7331, -1073, -2156, 1854, -5244, -7197, 3887, 3708, -6148, -4245, -778, -4667, 369, 7969, 2328, -2168, 2838, 421, -4500, 4567, 10523, -1494, -9416, -4678, -2580, 60, 5521, -529, -9529, -2857, 4092, -1491, -1224, 7551, 5499, -1192, -1146, -3452, -3720, 7055, 9786, -3848, -11460, -6267, -3074, 443, 6865, 1973, -8232, -4182, 2492, -15, 2902, 10741, 4568, -6199, -5460, -2560, 614, 7658, 5118, -10096, -11686, -238, 1614, -1553, 3866, 3052, -5016, -2086, 3366, 279, 2746, 8826, 883, -8175, -2314, 1632, -2311, 721, 2423, -7056, -7462, 2209, 647, -4505, 3926, 6910, -2068, -2015, 2855, -1004, 632, 8472, 519, -9867, -2270, 3530, -4969, -3995, 3689, -1864, -5984, 1888, 669, -4028, 5404, 8959, -2945, -4503, 4459, 223, -3302, 5645, 2105, -9907, -4323, 3487, -4187, -4298]
851d298J0391n181q138P607L504n534O589M045j4120k978J3665r91r606N201J167
866A323j0461M171J0401o796l417J0095k856j0066R449P184j0241l81P982q092
880a705o012J1936O8j2419M491P672q750r56J0751m530o130J1107N59j2667N778
895h07J1284r935o256R902k530r453P785L592j0844L018J0606q528n243J1823
909D414O23j0034P511N661j2090L15J2148o866r233R532J194j1065M486Q059r058
924d403k77J1038n728q953J1965N998j1778M65P699p606l359J1074l181j0854
938g900O409M601r998K208J1577o801o779R680O14q567P600P696j1269l914R064
953D221l720o283Q360R05j0825M252O887q929j473J3220j589r768N343L791p388
$$ y = [-4298, 6093, 912, -7226, 381, 3885, -1649, 4940, 8985, -5135, -8113, 5552, 4561, -5045, 156, 1323, -9138, -4967, 5434, -1362, -4779, 5316, 2460, -7606, 1843, 9027, -1214, -1595, 6387, -1705, -7717, 4219, 4287, -8132, -3641, 4031, -4719, -5675, 5076, 546, -5584, 5523, 6082, -6585, -807, 10477, 542, -5714, 4188, 1658, -7795, -10, 3582, -7262, -4244, 6362, -2166, -7409, 4414, 5037, -4997, 2514, 8175, -3915, -3600, 8548, 1682, -7551, 1981, 3175, -7890, -3404, 4655, -4403, -4680, 6358, 630, -8323, 3642, 9640, -2138, -1673, 6026, -1580, -4939, 6135, 2954, -7900, -1491, 3110, -6888, -4680, 6897, 96, -6683, 2997, 3611, -4956, 2644, 10340, -929, -4843, 4221, 501, -5782, 2578, 3483, -7342, -3090, 3797, -5132, -6605, 6615, 5026, -4742, 601, 4392, -2996]
968b996L677Q103q401n817Q038j901q394P279O054q890j087O678n490k817J1840
983E876K275j0338J751M525o597M67Q006l942o001N179j267r246O052J0472n648
998A564n794M015j121j809Q366K197r005O75N417o078l218P617K10n909K533j78
1014e18p262L892J0581l694n865L687O73k884M569K022o235M75N248n575n158
1029f044N829K300m826J724K103m482P34O035k362k559O172m58o839J890M697
1044C914l559j077K911m199k692N637J80o382K324O303j407j291R13m249N15R013
1060F854P2r611k37N203k009k724J487j266L95N843l052r324L845R790O50k764
1076C152j288n592j587R710L203p656j370K142m701j773O201J070j342L160l130
$$ y = [-2996, 681, 8784, 383, -5434, 2604, 703, -7691, -412, 5642, -3248, -4335, 2343, -3147, -5964, 5876, 8151, -2187, -436, 4089, -2508, -2041, 5965, 2023, -3978, 1201, -66, -9312, -3260, 7212, 1564, -4230, -215, -1336, -3145, 5221, 7418, -1587, -912, 4505, -1573, -4791, 2826, 3036, -2873, -340, -518, -7780, -3888, 6693, 2999, -2866, 821, 1494, -1390, 3179, 5201, -1034, -559, 4689, -886, -6044, -215, 2085, -2741, -1017, 1086, -3396, -2662, 3373, 1011, -1548, 4624, 4166, -2673, -783, 3914, 355, -722, 2189, -2010, -4702, 935, 1115, -5267, -2943, 3360, 1953, 662, 1575, -2674, -2159, 6854, 6926, -2685, -2922, 2281, 272, -2452, -965, -2231, -1836, 4007, 955, -8369, -4524, 5266, 5916, 3152, 1864, -3728, -5315, 4395, 7598, -58, -1428, 714, -3987, -5760, 441, 1511, 169, 3329, 199]
1091A99q143M397R847j667k273K402m915o948N141N748j249Q50j601j0744j709
1106a0665J3339M658o657q32N44m207L260O175m906j823R133k762j2761l74P706
1121a72K458K998l36j3381n163J5173Q281q466k246L212l823K58N375m070k567
1136b469R489n54j4588j210R977R03j60M089p406q676R315Q224n567M06M930q006
1152a303n772Q945K855n414K598K05j0213K054J1430l935p383P571L214q037J003
1167b182N227l269K710O823j0275j0740J1540R458q559m874K423l752L170J0275
1181G975o448j1340Q492R764p378l409M907k395p25P205n695j0962Q734J0078
1195H803r526o698O146N30j157O912j904r752N392Q877p683l149R044j713q794
$$ y = [199, -7944, -3547, 6300, 4633, 2360, 4762, -153, -7101, -1960, 3788, 2539, 3389, 1788, -8956, -10665, 2674, 7332, 675, -157, 387, -3820, -560, 5615, 709, -1114, 8019, 5257, -7504, -7878, -172, 2286, 5284, 4948, -8433, -13596, 1577, 9858, 1392, -854, 2358, -1465, -1207, 4168, 98, -2469, 7020, 6466, -8122, -9332, 645, 1548, 1388, 5477, -1929, -10605, -1290, 6934, 1367, 1773, 6703, -1303, -7075, 1870, 4725, -689, 1909, 2114, -8099, -6045, 5385, 1450, -5933, 1638, 4852, -3185, -2182, 3045, -224, 2486, 9309, -966, -11706, -166, 9292, 733, -4141, -1718, -5470, -2300, 7975, 1527, -9813, -1321, 8443, 1065, -2344, 2563, 168, -557, 6648, 953, -10009, -1275, 8803, -723, -7421, -1275, -745, -1902, 5010, 3106, -6646, -1254, 7623, -60, -3209, 5835, 4122, -4672]
1210d672L654K560n679L895N563q726m513J0319J226p779M074O167n684j012L354
1225B747n368j324J1995m55j4977o07R123j8r93K493n962l369J0157J748j0021
1240d831L153J0212m692p074J726k50j58Q989j234j4163p00J1524l36m117L256
1255A305q99m450N148K369o588L087Q755n475r903L981M755k120K155m28p920
1270f228J015Q588k466n646O564L878o642j509L473j060K103M583o306q171N883
1285a941O620m967k439K879j913n45M177k530l339P440M224q848m136O178K303
1300C163o48J83m721m254O357L943o877j951O398K61l968J470J89M3N159M13q337
1317c177j844Q092J189m682p38o17j584L556J735n435K00O826r82n642J348L896
$$ y = [-4672, -1018, 1542, -4137, -242, 5321, -3405, -7918, 2401, 3627, -4152, -78, 6089, 405, -607, 2747, -2621, -3945, 8050, 7595, -7382, -7989, 1134, 1116, 123, 2616, -3346, -6715, 3442, 5190, -4831, -1678, 8534, 3842, -3232, -1506, -1756, -1914, 7075, 5841, -8322, -9022, 2502, 2166, -1951, 1305, 406, -4044, 1104, 3473, -3115, -28, 8727, 3252, -6651, -2670, 2085, -35, 2120, 1692, -6228, -5213, 3375, 909, -4737, 1827, 5705, -937, -2446, 1027, -33, 2070, 6653, 347, -7824, -1941, 4679, -288, -2727, 152, -1761, -2306, 1871, -659, -3998, 3442, 7666, -1182, -5318, 860, 3163, 2515, 2698, -2023, -6277, 80, 4023, -2854, -4805, 1593, 1854, -2114, -644, -455, -412, 4747, 5160, -3177, -5021, 3071, 4260, -422, -1160, -1777, -3361, 195, 1930, -3505, -3305, 3521, 2539, -3103, -1755, 2141]
1333B141M20J234k064o038J784O918k016o323J708K920k150J53J101j774J900
1348h6M486l849m669M386M797k836k088k88k539J759M069l670n016M934L472m613
1364a751j676L583P66O82K062m346l637O489M049o473l038L586k70j515J959k072
1380a602k382N397K106p093m74O925K55k704J199j698k572M844K111o760j565
1395d013N980j017m238J832J702k109L230R31o036J083P793j397o018J785K748
1410B256k921J052J559m594p04O357k321o474M333M718l541n69K676l127M1O537
1426E278k140p565L572M945m707k396L634j911j296M675j849n686M754O461n657
1441A12l409N210J3k631L274n32n869L037N056o014l790O599N84m410K409J404
$$ y = [2141, 2561, 3795, 1731, -4307, -2523, 4395, 2379, -3944, -2236, 684, -1466, -1313, -212, -1986, -86, 4400, 551, -4118, 268, 5065, 2229, 141, -147, -2686, -927, 3142, -528, -5544, -610, 2862, -1751, -3427, 156, 922, 1604, 3666, -680, -4317, 2172, 6221, -252, -3290, 296, 26, -1489, 470, -1602, -3984, 1413, 3519, -3574, -4048, 2877, 3132, 428, 1627, -71, -2643, 2201, 4312, -2448, -4013, 1967, 950, -3288, -1456, 246, -1863, 1367, 2298, -3738, -2655, 5138, 3741, -2277, -492, 2256, -665, 387, 1946, -2648, -3352, 3005, 684, -5790, -1457, 3261, -280, -849, 1827, -1300, -1259, 5278, 3138, -4427, -855, 4090, -617, -3013, 621, -1290, -2586, 2089, 240, -5446, -692, 5769, 112, -3297, 1913, 1926, -705, 2569, 2037, -3832, -795, 4261, -1753, -5543, 1056, 1640, -2770, -361, 1043]
1457A043l952K977N533n386m234O439J344n341J107K756m471Q67M598n341l479
1472e540P229J901p000R57N354k814n68M257l116m012N962J548p081O16N257l289
1488c39k947L981j328l141N174K122o777P62O728k134m025L517Ml775L569J682
1504C073o231l71O899k603n459L708K721l320J992K569m889j84O638j933n284
1519b674L264K588m868L00L280l802j323N214j127n421L588M292l784p95L698
1534B430k227j709M509r53m879K924L280m840k268M512m89k419L085j91m102L134
1550b03M234m021j816M154m16l346K012J199l924J672K932m343k267M474J204
1565A545l000J341J171k764J358L740l252j529L884r7m484J094K467k235m32K291
$$ y = [1043, -2909, 68, 5601, 215, -4019, 2420, 3764, -1577, -470, 2286, -2185, -1318, 3280, -2061, -5540, 1689, 3590, -3410, -2453, 2901, 87, -481, 3776, 660, -3352, 2610, 4158, -2923, -2307, 2950, -339, -3286, 695, -633, -3774, 1400, 3522, -3255, -2493, 4235, 2101, -1924, 1593, 1597, -2178, 1391, 3073, -3158, -3529, 3370, 767, -4692, -984, 1737, -1583, 409, 2978, -1911, -2095, 4543, 2610, -2674, 590, 3178, -1690, -1390, 1890, -1912, -3235, 1979, 852, -4569, -981, 3311, -473, -1268, 2430, 203, -1506, 3003, 2050, -2829, 95, 3375, -1465, -3733, 779, 290, -2129, 956, 765, -3337, -203, 4031, 10, -1806, 2348, 1932, -1414, 598, 1797, -2127, -455, 2477, -1866, -4133, 341, 1545, -1455, -114, 1057, -1707, -349, 3391, 139, -1390, 2494, 2397, -2087, -993, 1474, -761, -1193, 1098]
1581A098k570j833M156Q49l405J245L079k608n34K528j445j380L015n44m688J190
1597a847K989j583r58J691j285j361L313O75l206J567L009k237j450K079p23j598
1613i25K182k71l349P08K888j792j151K757r82j731J956J755k412Q49J921k282
1629A21j245K295l04k619J279J113k418P85K148k146j194L637K01k864J329J930
1645B048j687K18J361k833j103L707k88l836N85K047j710P10K507k323j638L911
1661A676O74l195R90J839k238j2K603k718k598L532J197l754K17K364k151O24
1677i50L566j705k830K622J389k627J035K205l455j313L826j170l627K461J822
1692A249k725L78K528k386r51M782m4m005J113J721k591Q73L203l672l179L911
$$ y = [1098, -1472, -3305, 851, 1700, -1705, -460, 2619, 11, -523, 2005, 560, -820, 2195, 1651, -3037, -1847, 1142, -441, -1399, 292, -993, -2354, 959, 1634, -1572, -5, 3004, 767, -683, 1396, 673, -925, 1257, 986, -2363, -1655, 1233, -559, -1710, 1047, 65, -1666, 290, 2045, -367, 482, 2403, 121, -1124, 1171, 867, -1752, -473, 640, -1778, -993, 1155, -991, -2185, 1452, 1653, -1211, 118, 2048, 361, 579, 1940, -893, -1996, 1711, 1423, -2413, -1828, 219, -1491, -781, 1726, -597, -2235, 1676, 2350, -845, 145, 1984, -254, -266, 2337, -381, -2979, 553, 1750, -2004, -1787, 577, -1574, -950, 2616, 911, -1919, 703, 2092, -535, 500, 2705, -750, -2063, 1763, 593, -3034, -573, 1249, -1476, -1098, 1430, -956, -1907, 2875, 2831, -1174, -61, 1660, -931, -58, 3145, -527, -3706, 205]
1708B05R45l475J340K250k753K7L903j950k873M436J438l886j82K172k796k00
1724a399M387k304m712K955K305l060J222K946l232j406M788q6m088K175K592
1739C083l786o11L322k921j901L928K79m374J429K946k850P41L962k255l924M114
1755A182J927l892P40K491l396j174L560j155l756L256K161m008L56L502k030
1770b36j234M082m28m653K195L306l332o65K886k996k182L894N54l956J791L172
1786B198l339p09M105j202k447K883J405m510N35L359k670j249L139j417l783
1801c702L163K494l212l5L314k458j384M187Rl758J725K419l710l47L180k010
1817a25k286L161j68l659J661L567k408q73L001j300k353L398J267m036M83K654
$$ y = [205, 1150, -2325, -985, 1265, -1488, -1461, 2442, 492, -2381, 2055, 3493, -393, -575, 1597, -1199, -1399, 2988, 684, -4028, -1073, 1232, -1828, -606, 2340, -892, -2298, 2490, 2404, -1684, 491, 3083, -703, -1314, 2008, -913, -2814, 1114, 1393, -2981, -1552, 1394, -1456, -715, 3247, 992, -2932, 1182, 3109, -783, -43, 2448, -948, -2122, 1438, 283, -3473, -217, 1944, -2064, -1708, 1794, -236, -1470, 2612, 2184, -2469, -274, 3032, -300, -965, 1921, -1075, -3257, 637, 1191, -2765, -974, 2198, -1141, -1850, 2255, 1053, -1394, 1489, 2894, -1616, -1081, 2278, -392, -1641, 1498, 81, -3702, -539, 1955, -1257, -1292, 2022, -436, -1820, 2367, 2376, -1382, 343, 2762, -948, -1295, 1885, -125, -2411, 750, 582, -3077, -1416, 2151, -257, -1130, 1871, 571, -1782, 1616, 2883, -1153, -670, 1984]
1833A984k550j403L066p21k901K428J417l163L80L647j597j456K528o26k365K177
1849H45J497l036o88K313j752j551K949K61l082J232K505k287q8K792p45j853
1865f88J983K70k858R11K316k415j305K212q00j846K244R43k379M84K264j363
1881b7n72K540p41k153J640J117l238K68K573j755j350J682k28j718J908J518
1897A464k325J54K407j380r65K331m15k451J291J019k307r9J891j384j156K073
1913A48jj550J540J799k151k54K321j299j244J878Q8k293J13J351j594o7K039
1930H24j549j256K362R13k331J256J991k233m63K000j057j871K279L14k607K07
1946a221J826j812l88K524p66j698K157J170k274P10J817j656j201K057m56k508
$$ y = [1984, -566, -1969, 1097, 376, -2525, -97, 1320, -1843, -1463, 2184, 587, -869, 1659, 1033, -1332, 845, 2342, -694, -1382, 931, -821, -2372, 577, 838, -2244, -1012, 1493, -794, -882, 1910, 1165, -688, 1295, 1565, -1293, -382, 1934, -481, -1786, 426, -374, -2220, 24, 967, -1412, -928, 1336, -27, -599, 1941, 1200, -953, 687, 1804, -1434, -1166, 1407, -348, -1698, -16, -244, -1962, -54, 1464, -861, -707, 1700, 320, -645, 1686, 1271, -1180, 111, 1130, -1177, -1276, 615, -769, -1925, 148, 147, -1403, 137, 1936, -215, -469, 1852, 553, -691, 1187, 1275, -1018, -905, 446, -1148, -1215, 824, -725, -1981, 381, 1294, -1037, 219, 2210, -23, -486, 1514, 457, -1414, 865, 1179, -1428, -1221, 605, -1207, -1595, 929, 163, -1535, 622, 1792, -482, 228, 2045, 389, -812, 1245, 789, -1719]
1962a719J920J015l247L66K588j471j196K774J66k463J462J731k173M6K437k011
1978B25j969K339K07k880J328J795k612k16K851n84k135K447J354k931O40K151
1994B010j827q24K563j129k800J956J448l215K71K806j778j601L249j50k612K227
2010E94J722k759j25K593j756j817K353p2l177J619K333k752n30L182j109k049
2026a750L035N59k934J090K738k978j366L075p29k941K352J011k899J26L272j897
2042b36j586L060Q1k929J929K244k958k94K870j877k344K444N59l278J381K500
2058A566k543q39K854n84j981K577J131l234P50L182k507k119K869n31k840K096
2074a53J500l412M27L067j396j776K816J23k348J789J885l162n22L032j177k482
$$ y = [-1719, 201, 1216, -2031, -1665, 923, -548, -1744, 1030, 1196, -1267, 195, 1926, -247, -201, 2236, 225, -1744, 595, 802, -2078, -750, 1045, -1567, -1783, 1068, 484, -1651, 796, 2150, -781, -141, 2010, 183, -641, 1922, 793, -2007, -51, 1397, -1818, -1547, 1259, -519, -2120, 1129, 979, -1633, 594, 2316, -443, -568, 2025, 269, -1548, 805, 733, -2444, -825, 1508, -1244, -1774, 1408, 299, -1750, 1285, 1844, -1090, 0, 2738, -240, -1606, 1469, 740, -2201, 151, 1162, -1737, -1611, 1661, -236, -1822, 1238, 1319, -1610, 319, 2563, -395, -689, 2181, 304, -2040, 404, 963, -2315, -934, 1566, -977, -1816, 1038, 454, -1527, 1050, 2181, -1053, -303, 2879, 372, -1747, 1122, 591, -2249, -153, 1347, -2065, -1638, 1429, 33, -1743, 1073, 1196, -1152, 637, 2522, -640, -1162, 1870, 693, -1789]
2090a789K261J39k792J340K127k415p24L191o68k082J944J462k693M28K235j947
2106A7j661K518j91k527J624J050k585J34K899j355j331K425L04k273J243J965
2122B256k208r96K452j053j934J783K27k441Q31K379k002r18K515k20j588K089
2138A172J91k058M88K079j784j490K045m38j716J507O77k049J85K087r83j339
2154a426K324M54j779J030J119k460J23J968j183j502J841l11j867R34J880j786
2170f41m34K002n76j100J787M79k225P22J416j517p45J479p42j606J768M17k020
2187a536P28J893r99n76J564j017p90J857N06k247N4J580j359n64J612r36j253
2204a483J170J019j750L27J856j010j92J339m44j750J435P55j714l75J547j238
$$ y = [-1789, 472, 611, -2181, -841, 1286, -1129, -1853, 1338, 670, -1412, 532, 1994, -699, -271, 1964, 17, -1644, 874, 683, -1844, -220, 830, -1755, -1621, 1278, -77, -1408, 1017, 1321, -952, 291, 2256, 48, -948, 1504, 451, -1483, 300, 527, -1914, -1083, 1296, -706, -1624, 891, 671, -917, 1172, 1363, -695, -207, 1872, 88, -1402, 643, 205, -1511, -4, 673, -1376, -1191, 896, -87, -1426, 898, 1352, -427, 603, 1722, -738, -615, 1353, 170, -1332, 509, 198, -1669, -735, 1145, -641, -1075, 927, 351, -749, 1038, 1517, -708, 14, 1430, -87, -832, 647, -95, -1701, 67, 484, -1536, -808, 1085, 86, -490, 1074, 57, -733, 1124, 1630, -617, -563, 1017, -342, -906, 706, -230, -1483, -313, 706, -1044, -717, 1139, 129, -63, 1276, 832, -918, 517, 1272, -442, -817, 730, -508]
2220e08j002J879q8j815J167J224j418K39J695j114j128K339r6k103N13J181j655
2237f90k16J733j326j287K135N92k148N78J412j135L49J667j306j696J725R94
2253A381j861j11J138j382o50K162p86j409J746R64j840J68J821j146r44K148
2269A399k44k400J085J439k121p4J696j322j190J963M67j878O87J594j701J55
2285d45K332j161j931K170M16k209L78J358j719m42K198q84k062J880J727k079
2301d73O9J633j311p57K566m83k574J084J363j957k42J959j471j161K678j76k507
2318a760J726J824j691l26J819j263j605K077M46k638J010J257j937n53K369m15
2334C40j933J832J106k179O07K197j848p86J997m19k403J466J149k046j1J956
$$ y = [-508, -1510, 369, 281, -1534, -367, 857, -561, -322, 1373, 259, -869, 1470, 1374, -729, -216, 965, -690, -906, 827, -499, -1786, 349, 941, -1207, -629, 783, -352, -3, 1664, 358, -1338, 387, 1381, -480, -591, 547, -835, -1485, 677, -109, -1518, 228, 1192, -648, -480, 1341, 195, -749, 1399, 1155, -1245, -160, 1279, -842, -916, 780, -542, -1732, 231, 698, -1180, -493, 1101, -600, -445, 1887, 726, -1205, 965, 1381, -828, -450, 908, -811, -1253, 945, 61, -2001, -121, 1606, -473, -404, 1229, -82, -839, 1727, 1244, -1330, -246, 1117, -840, -1082, 877, -594, -1755, 923, 747, -1760, -34, 1790, 99, -227, 1592, 329, -1276, 801, 1247, -1391, -381, 876, -1061, -1614, 755, 340, -1593, 239, 1345, -834, -227, 1970, 122, -664, 1333, 914, -1489, -23, 1126, -920, -931, 1025]
2350A025j867j091K780K67k186O70J927j450k59J744r93j813J882Q02l062O44
2366i80J956j424q91K125q77j648K389Q83k215nK012j137j180K112n49j893J569
2383B47Q09k307M9J902p11j541J931L84j837J390J101j920J63J808r38j604J534
2400D60P79k201M7J478j445k84K088q35j913K033J227j878K68J538j391m59J588
2417A100n49j672J144R53k103L2J468j085j67J786k62k112J408J510j381k31J258
2434A097n22j364J274o4j670P56J233j561m32J741k42r71J167L87j444Q90J095
2451A370j653l57J759o62j674J144M56j365O48R14j553k18K237k24j524Q65Q13
2468I76p63O1Q81j473n23J699l22j960R10R14j130K27J125j144J7J347j77j314
$$ y = [1025, -842, -1933, 847, 1114, -1072, -402, 1525, 75, -184, 1560, 567, -1246, 636, 1438, -1624, -980, 976, -448, -1339, 786, -91, -1739, 650, 1533, -682, -687, 1325, 188, -992, 1120, 571, -1322, 247, 1056, -1251, -1202, 700, -11, -1552, 379, 763, -1074, 316, 1417, -503, -340, 1468, 530, -1074, 460, 1239, -962, -915, 563, -882, -1166, 922, 87, -1826, 207, 1434, -444, -176, 1362, -29, -488, 1100, 551, -1121, 23, 976, -1127, -1095, 373, -712, -879, 907, 645, -1467, -59, 1451, 70, -161, 1097, 575, -789, 485, 421, -1249, -493, 740, -821, -1253, 488, 246, -725, 442, 829, -615, 275, 1370, -283, -640, 1119, 457, -1217, -73, 383, -982, -334, 580, -973, -1191, 1046, 822, -702, 163, 976, 213, 274, 1155, -318, -841, 858, 536, -1424, -514, 400, -730, -503, 622, -522, -505, 842, 665, -649]
2486f49P94J150j064m24R45q85n22J128m21j538P79J628j243n18J453l40p36J222
2504G59J4j394Q92J124j675m37J206l20r81M36M13j271R26J348j494n63J704L
2522F90j051R23L47j401N93J004j527q82K029j44j811P39R40j118L81J101q39
2539b6r29K142J0j957Q67Q50j058m63J281j285p98J726n7j424L95J591j245l50
2557g30J439l49r39J624K75k432P77J647j530q29J383l97j204J537N38j831J85
2574h36K198j216j095J894j40j431J064N03j886J78K234j463j510J614L05j261
2590h48N67J118j352k13K115j050j509K084J69j902J86J533j568m0J529o44j937
2607a762J748J084k033N2K049q76o72J514n34j413J482P16k081l63J708o60j067
$$ y = [-649, 145, 1295, 231, -193, 752, -133, -655, 473, 52, -1486, -707, 921, -322, -840, 613, 273, -463, 759, 773, -621, 271, 1395, -280, -717, 489, 169, -812, -376, 37, -1234, -308, 1040, -454, -1017, 687, 690, -361, 562, 909, -492, 101, 1105, -422, -1304, 725, 581, -1230, -491, 449, -669, -288, 813, -26, -955, 1187, 1197, -760, 107, 957, -101, -564, 717, -568, -1366, 360, 303, -1121, -726, 865, -380, -730, 709, 360, -579, 1045, 1320, -1112, -335, 1312, -218, -1047, 336, -61, -1265, 272, 810, -1021, -836, 1362, 146, -949, 945, 805, -626, 438, 941, -945, -767, 1467, 4, -1506, 108, 413, -848, -281, 837, -515, -728, 1387, 337, -1172, 912, 1081, -821, -635, 898, -670, -710, 819, 175, -1762, -14, 1070, -963, -911, 1138, 262, -410, 1104, 570, -843, 639, 1355, -726, -1089, 619, -41, -1108]
2624a108J262m5j385J176J382j758n01K432p29j432J246M40j940R31J403k101
2640g27n22J873l57j896J404J229j648J96J545j012p09J874k68k021J139J030
2656A130j583k8J015j049m31J523k93j830J145J594j165p55J662m86j058J494
2672H85r5j988P34J235j174r59J507l5j010J211J35j169M51J853j383r13J534
2689H19J07j399Q14L95j479P6J445j107q23J585p0j051K22J321r66k36J288n32
2707D09j026J339K13j590L8J317j125l17J349q58p89J452K23j432L69J448o32
2724C88n63J048n26j041J152N9j237NJ284p09p11Q51o5n57Q37M07j053K47J269
2743A085o48r82R67k81q66N87Q86j465k97J492p64p53J157L50r16N35P49j224
$$ y = [-1108, 154, 109, -1276, -100, 1282, -476, -977, 1455, 726, -706, 540, 980, -960, -29, 1374, -727, -1249, 624, 267, -1629, -225, 1004, -644, -448, 1097, 85, -624, 1250, 982, -1039, 100, 1130, -453, -481, 534, -515, -946, 577, 284, -1546, -401, 1193, 28, -727, 935, 449, -609, 885, 790, -1198, -464, 771, -403, -1362, 145, 110, -900, 311, 446, -723, -272, 1581, 198, -715, 819, 926, -473, 341, 736, -743, -667, 778, -329, -1152, 433, 363, -688, -466, 855, -111, -347, 941, 409, -617, 722, 935, -655, -617, 700, -425, -742, 607, -251, -1040, 412, 635, -797, -428, 1020, 388, -175, 873, 347, -694, 458, 517, -720, -715, 569, -140, -851, 0, -65, -622, 215, 622, -431, -184, 1085, 437, -545, 422, 141, -725, -138, 748, -717, -1014, 478, -286, -1039, 118, 468, -448, 87, 836, -388]
2761c88L41J109o58j016J142l9j294L90Q06o95m87J377p07r38J392O11j067o2
2779a83J108p08n71J090m00j122R36M86j492J93P15k55k31R58k82q45Q79Q52j219
2798i1j5Q38o08m46J058l67j200O73N86j267L00J241q11o92J223L28j096N75R04
2817A133j400k6J175q17j198J131P08j628O81P52j048m19J757m04j354J273O80
2834I96r74j36R77r05n83J401o34j247R70Q16j454j8J364q27m92J544j05j217
2852e24N70R70j280n3J217n41j452J428N5j272P42P14j193j94J684n18j114J144
2870C83M58j200L30J284j406o77J536m91j229Q57N38j200M12J203j092l43J321
2887F84J46j423Q25P47j530L21J089r73j152J706J35j801O79J085j040J41J232
$$ y = [-388, -47, 1062, 404, -612, 530, 491, -803, -413, 393, -302, -789, 588, -119, -1057, 335, 946, -121, -183, 925, 217, -354, 736, 336, -786, 150, 636, -856, -663, 52, -203, -434, 524, 242, -603, 276, 1128, -91, -106, 732, 124, -322, 736, 369, -831, -158, 428, -839, -539, 702, -109, -801, 422, 750, -346, 229, 1133, -267, -293, 882, 65, -1133, -2, 706, -922, -241, 511, -537, -956, 801, 397, -957, 316, 996, 22, -114, 863, -42, -625, 776, 142, -1105, -135, 681, -773, -791, 573, -254, -746, 798, 693, -524, 46, 1016, -264, -317, 900, 359, -1093, 335, 390, -882, -140, 574, -619, -813, 871, 353, -761, 383, 841, -359, -29, 1255, -151, -828, 708, 217, -1012, -155, 383, -817, -405, 798, -294, -637, 684, 830, -593, 232, 979, -551, -230, 859, -114, -1266, 440, 575, -1226, -547, 538, -502, -361, 871]
2904H71n85j199J543K75j316K07J372j374m26J484o66j198Q21N99j288K05J195
2921E20p01m96J521j21j515Q21R44j255l38J229o27j103J149L97j517M84R99p14
2939c23k89J391m87j081J047N32j204M02R24j142l73J186k46j322Q42P27j279
2956f95Q5J379j013p25J876k06r49L61O50r98j69J053o39q57J058J33j345O07
2974c94J010r97l0J001m34r89J237O30j286J2R66j045l95J353n66j232J194L63
2992C98q33k23J281q91m62J311k28p43L64Q06q23o9P85r53q08J034L29p90K63
3011b52O03r32J3J319n12p63J026M50j484O55M67q90j00J012m98j192J080L98
3029D00q29K24P60p11j30J130m69o44P08L14j008J6O28q51r8R28n14q01O67P43
$$ y = [871, 286, -913, 630, 905, -411, -204, 1168, -206, -632, 852, 186, -1012, -191, 408, -880, -675, 520, -181, -677, 844, 723, -792, 29, 973, -282, -620, 609, -18, -1121, 28, 425, -1092, -608, 391, -323, -612, 779, 292, -789, 258, 790, -414, -12, 912, -230, -603, 583, 337, -985, -143, 584, -695, -610, 769, -244, -969, 907, 701, -248, 113, 763, -235, -404, 649, 10, -847, 211, 344, -1001, -394, 616, -381, -411, 590, 156, -833, 404, 1034, -252, -240, 726, -319, -714, 639, 73, -1159, 35, 398, -435, -658, 623, -268, -730, 581, 353, -390, -26, 780, -43, -112, 673, -280, -1088, -54, 275, -515, -252, 351, -581, -568, 751, 239, -524, 502, 952, -532, 123, 590, -300, -400, 612, 114, -1078, 2, 400, -429, -205, 555, -156, -286, 844, 375, -269, 439, 753, -255, -239, 389, -462, -560, 368, -146, -947, -280, 463]
3049D63q66L17O98p61j28P62p1o20J15P59j086L1P79p09o09Q23J11n48O34J84
3069B78k99l39J234p58n18O24L47j209O52O15r60m12J086k95p69O62L97q34P04
3088B06L35m83m26J041k11r94Q78M4p97J02P35n49p09J116p9r07N39Q70j003J75
3108a17P90m93p17J062j74j020P95N32j080k52J030l95n20P85J9q94P03O64n19
3127A99n12R32k25r61R33O9j068K29Q75q97l47J148l75n33P92J62q30M58P58r33
3147a26k08J165n64r91O60P72j154k44J060m59q26J398j14q73N91Q62j203R9R18
3166G63n90q28R75K54j428M60J008j029l37J282m50p50Q74N29j153L73J279j169
3184F3n57J110n83o78N11N95j211K69R80m67o68J100k90r12R63N99q59NQ31o22
$$ y = [463, -403, -86, 612, -149, -277, 485, 414, -206, -91, 668, -418, -387, 392, -317, -926, -103, 8, -540, 94, 278, -21, -360, 874, 116, -402, 222, 569, -640, 12, 627, -333, -745, 341, 46, -723, -61, 336, -498, 206, 541, 58, -368, 673, 462, -532, 346, 390, -407, -305, 430, -119, -828, 288, 209, -698, -159, 711, -292, -117, 673, 180, -537, 525, 351, -669, 126, 658, -422, -674, 356, -39, -559, 226, 245, -649, 54, 718, 199, -313, 619, 394, -567, 366, 435, -633, -404, 471, -426, -773, 375, 0, -533, 259, 421, -409, 49, 807, -126, -334, 831, 267, -724, -64, 708, -446, -690, 370, -89, -915, 483, 369, -504, 87, 949, -254, -155, 763, 173, -655, 320, 574, -854, -394, 614, -415, -752, 530, 80, -670, 204, 733, -420, -47, 1232, 63, -494, 616, 33, -645, -134, 461, -750, -481, 499, 32, -636, 464, 174, -738, 225, 824, -35, -30, 801, 179]
3204A79o97P52K16j064K27J011r89k07J009j96r61R93O05j306N53O39o15l73P13
3223D89p2j276Q53N03j229O7R55n51n70J201o9r00P17R23j101k24J178o04j005
3242g15J143J6j223O73M05m86m36J044n10n46R07L65r74J29J145q57o27J044m16
3261H1n24M81M16j032R8P46l79m85Q88J32q69P55M64q22qP68r11l59P19O4r92
3282g69M86N04p07l25R39m2l80N35N54j169L87P44p06l68N79m5q61P30J71r02
3302f45K64P68o33m41J217j24r22O99P87j203l3R22o78m33N34J47p99L06N92p76
3322d51O8R62m41m29P96j8j075M73P53q13K3O96o36m16N34L00q66J69Q90p51j79
3343d11Q74l41k14M09J65p27L00N18p13m8O31j39j083Q98j63n53N09P11q36j67
$$ y = [179, -518, 234, 450, -614, -387, 624, -365, -572, 437, 241, -720, 273, 878, -428, 125, 764, 149, -224, 489, 417, -859, -6, 497, -732, -665, 290, -261, -831, 370, 301, -599, 118, 1041, -60, -284, 894, 290, -715, 428, 444, -779, -106, 299, -187, -623, 421, -89, -635, 272, 637, -337, -208, 937, 80, -547, 497, 81, -443, 38, 454, -578, -480, 266, -113, -598, 290, 422, -447, 308, 772, -50, -58, 710, -201, -560, 159, 223, -769, -283, 221, -486, -811, 128, 86, -294, 241, 795, -374, 13, 757, 51, -317, 262, 217, -644, 86, 257, -645, -381, 387, -246, -687, 530, 406, -516, 183, 970, -233, -266, 656, -22, -455, 79, 226, -573, -267, 325, -451, -383, 579, 138, -291, 505, 487, -588, -115, 638, -175, -152, 544, -92, -508, 26, 326, -540, -371, 519, -232, -411, 463, 122, -92, 317, 482, -245, 55, 573, -140, -188, 443, 304, -779, 119, -44, -597, -88, 623, -213, -380]
3363c80Q94j42p14O74M62r53p0O28n90m20O54o8p30O23O01r01K90Q69n06n65Q53
3384E09J20r84K76P03q50q9P81o03n60Q47lo39J50Q30n85l25J032k58q02P82M45
3405G77j060J93O34p83l76P65l40l88O48K84r37L28J061q64l77J029m7j176Q93
3424B64J95q64l03J184q79m34J043L26j128O22O46q57Q5P57m67o12Q47K91j187
3443d71K51P81r73r1Q46j6q03M09M40r01K87R91q92k44J165k66j001P15K79r68
3463d62J14Q05p28m73P18K83p70P23N00r15k4J059n90o04O96K13j187L46R25j102
3483d73j17Q25k35o88O69L40r79O50R18j001k88J223m91q42M31N42j020L50N24
3502C38m81p16J001Q4q16P45M00r06p2J344n46o96O58J25j043L83M08m82k55P42
$$ y = [-380, 514, 372, -342, 332, 794, -159, -229, 399, -191, -611, 43, -25, -755, -132, 469, -432, -142, 727, 221, -344, 509, 629, -355, -79, 624, -226, -315, 466, -137, -697, 150, 147, -492, -342, 488, -97, -422, 610, 352, -450, 332, 777, -283, -90, 544, -239, -615, 150, -190, -578, 70, 354, -583, -255, 806, -58, -435, 594, 547, -629, 264, 459, -405, -708, 476, -403, -837, 206, 532, -596, 26, 672, -185, -100, 657, 190, -422, 425, 716, -471, -220, 561, -412, -503, 343, 327, -476, -67, 373, -528, -241, 750, -142, -386, 779, 513, -488, 227, 506, -462, -348, 457, -271, -744, -26, 257, -513, 210, 710, -205, -229, 830, 240, -364, 332, 545, -642, -296, 629, -473, -590, 235, 0, -688, -19, 321, -658, -8, 910, -91, -379, 844, 353, -489, -58, 484, -536, -186, 338, -143, -859, 142, 226, -590, 155, 555, -351, -423, 921, 375, -321, 337, 462, -581, -198, 210, -272, -527, 215]
3522B15j42o45P01K39q22M22J010j238k14R19K16j169M74N14r09O7Q03q05m58
3541h22J169j38o10M89N44q98l5J058m46p08N88K94j019L81N65q15k91J126n11
3560g9o53Q37K88m97L10L67p10k33J014k71j104O05M96j069J45Q52p37j74O86
3579G3Q2n35M27M88p71L59O42m33p95P39J28r60N95K49r58J56Q92n98k50O37L63
3600E30p06K90M33n21j66J106p85n92R15k45n49J01O53r17j56P36q2n27N95M87
3620F00r78L13P74o32l98O77j53p12O27m4o37K98P12p51k82R82r2q07R09Kq02
3641c94K72P00o34m10P10j54o94M48L08n98J08P82m66n57P14O10j054K83O29o38
3661c5j77P01m79m55M73K38r83M72O69o39l71J172k71p29P05J56q41L81N72m30
$$ y = [215, 73, -572, 129, 368, -454, -32, 978, -260, -474, 445, 661, -508, -34, 480, -429, -362, 441, -364, -822, 347, 209, -401, 88, 632, -266, -301, 757, 311, -397, 191, 485, -534, -153, 412, -403, -694, 432, -79, -732, 105, 393, -104, 206, 573, -137, -370, 644, 373, -731, -126, 370, -699, -554, 298, -439, -613, 73, 155, -380, 47, 535, -236, 123, 765, 332, -463, 276, 404, -556, 39, 288, -670, -514, 378, -220, -470, 167, 530, -176, 114, 547, 26, -140, 966, 181, -411, 504, 259, -290, -189, 464, -453, -609, 127, 45, -482, 113, 600, -378, -65, 709, 77, -321, 356, 203, -509, 118, 74, -563, -265, 447, -304, -586, 396, 304, -503, 406, 408, -394, -122, 578, -56, -466, 244, 90, -604, -156, 152, -446, -338, 444, -22, -579, 135, 745, -309, -26, 603, -35, -212, 489, 10, -445, 28, 266, -717, -245, 424, -215, -586, 586, 315, -414, 291, 447, -394, -13, 559, 129]
3681A29m03O60l04o91N01M72q16J84Q45p11j78P15l3p75N83N70q57l12R55n57
3701b3m77R92j55j014M81N62q94J73J046m51p27Q27L58j117L82N18p43l73R85
3720C50n16o74R99L60j242J69P93k30l90R13j73n61O34N03j089l16J011o88m69
3739f16Q97k35o35N88M66q53m1Q15K6q35Q11L81j194N96L06r44j04J140n17p21
3759f69P70K17j032O82N22q46M0R21k39q41Q72J50j052K46O98p90k80P77q7r27
3779h68N23Q15q84J84J146r66l32R38N8j192O66O67j072j49J068n85q30Q74M49
3798E10r17Q6R00q88r7J176n23o90P61J94q04n4P69n46l70P39j66j149J022N07
3818D60p87J07J036o02o43R56o5j086O62L83q15j4R51q38n51J093J84j042K60
$$ y = [129, -274, 386, 82, -609, -108, 364, -452, -268, 577, -134, -312, 403, 370, -405, 178, 748, -109, -421, 534, -23, -500, 492, 337, -677, -196, 366, -528, -355, 691, 240, -487, 340, 698, -419, -37, 481, -262, -635, 350, -166, -840, 159, 519, -723, -554, 239, 9, -381, 532, 359, -202, 432, 935, -154, -470, 541, -147, -616, 281, 46, -589, -1, 465, -388, -429, 386, 412, -423, 388, 769, -425, 171, 477, -467, -571, 569, 52, -669, 101, 318, -714, -32, 490, -356, -316, 605, 366, -475, 397, 547, -505, -259, 439, -351, -631, 146, 59, -868, -345, 470, -414, -230, 916, -50, -382, 556, 614, -578, 88, 755, -317, -466, 602, 17, -813, 61, 510, -407, -321, 579, -309, -406, 770, 247, -443, 318, 512, -292, -346, 423, -123, -493, 246, 80, -1069, -47, 460, -327, -220, 816, 214, -429, 527, 462, -624, 38, 421, -394, -408, 543, -295, -846, 247, 431, -611, -351]
3837c51Q43p24k24J135n43o10P63L15p67j27O48n67k00Q01k07r25P45N68j207
3856f34L50O70n24k11Q09l24m95N71L65j001n0J074o85p52R68K70r03N35N96q88
3876b59K46Q07n58m56M10L52j247P60M75j061j79J158o50m63O12K01m19J37O65
3895E31o70p4R54n09o75O31M49q73l23R23p84J5M97j45n54P26M00n83l62J100
3915F74m93k71N32l52r49Q91K77p51j73Q29m57k32Q06R5p32K50Q98r27k5P76l04
3936C62q50O30M6o44K85N36p61p2P87j85q51R34K86q59J84Q36q83N7M52o2o36
3957d08L50M54j011J17R95n47p19J269l24o34Q15M66r33j19R88p61l39N51J07
3976C17q55M42P83j251Q6P71k28o96R00M01j036L78P07q93k93P54k07m69M16K48
$$ y = [-351, 492, -232, -456, 679, 136, -474, 289, 604, -163, -290, 358, -209, -409, 392, 185, -740, 5, 573, -634, -284, 386, -138, -349, 460, 136, -359, 212, 577, -424, -474, 600, -85, -837, 131, 401, -502, 33, 629, -259, -13, 794, 236, -220, 190, 542, -705, 55, 530, -531, -710, 448, -202, -665, -53, 148, -271, -134, 531, -139, -213, 741, 232, -443, 188, 637, -236, -559, 364, -420, -405, 92, -53, -607, 119, 519, -64, -426, 674, 181, -90, 442, 90, -859, 32, 309, -442, -615, 214, -243, -475, 331, 426, -306, -56, 842, -85, -110, 666, 362, -488, 142, 188, -456, -171, 365, -396, -468, 319, 134, -717, 217, 503, -356, -172, 664, -219, -162, 290, 228, -408, -58, 396, -615, -498, 497, -50, -769, 500, 176, -458, 357, 823, -110, -229, 759, -2, -341, 210, 317, -538, -96, 687, -564, -478, 293, 65, -631, 269, 670, -366, 12, 719, -174, -467, 287, 80, -389, 27, 275]
3996B75j030N90M43n95j95R77j31p49P03M30q98K09N99p02l35Q28j14r18O76J25
4016A88m27k05Q90m27m81P36J44j003K33Q92n36k29Q78n07o33O22J96j237L61
4035e45J039p62k46P86k46l84R45O9j041K04O88m47l28M59k7j060P93N43r69k4
4055e53R17m77l80J110l41o23N49M77r05k75J016k83r30Q14O2o89J17P73n56p9
4075b56O00Np36Q80K8o08J51N79n78m37N89l22p46O81M45r00N84L33m07m84R53
4096C54J49o73L33N37r60M9O69m34n70Q33L4j126O38O82q02m5P05l13n51P89L06
4117F04q55J8Q82m51o67R84l97p18N32L74r66M79N17m28m76J083l16m52Q74O0
4137F81q25q2O03n50m34Q06J13o33OQ14p60l14J086l23n48R33r4p50L07O71j028
$$ y = [275, -755, -165, 278, -317, -512, 465, 334, -415, 288, 718, -180, 29, 628, -74, -409, 419, 305, -613, 63, 188, -239, -444, 446, 19, -462, 274, 418, -585, -352, 540, 4, -225, 653, 146, -487, 135, 331, -906, -545, 494, -268, -514, 272, 26, -358, 587, 656, -385, -181, 507, 60, -268, 191, 164, -896, -103, 440, -529, -553, 364, -113, -493, 617, 276, -347, 202, 679, -226, -501, 515, 232, -698, 116, 178, -511, -394, 379, -177, -256, 344, 349, -387, 493, 521, -87, 64, 643, 65, -372, 217, -105, -851, -170, 275, -625, -41, 292, -115, -599, 354, 503, -170, 163, 700, -260, -211, 458, 24, -546, 287, 321, -805, -167, 515, -287, -332, 373, 60, -491, 298, 604, -251, -233, 649, 198, -469, 515, 118, -600, -68, 306, -660, -181, 336, -92, -568, 515, 199, -253, 621, 681, -144, -226, 377, -173, -607, 199, 312, -321, -315, 499, -261, -575, 511, 188, -360, 573, 479, -271, 36, 707, -321]
4158c21q1N25j05q33Q56N3n06J19P71m56m59Q66k05o05Q31l8o89J42Q20j044J37
4179b22O28j48q27N34N15p24N4N85l87l17P47l8o08L23N55q27k79Q63p20j10L41
4200f2P6n83J86R04r00J93P14k15l42K31M2p96L47N62m33n28P12j71n26P73L7
4221B21n03K59N17n87l0N90l3j054O67L25p39L41K46o06k39R81l57m24M21L84
4241C80o76J1P80m84k27M07L25r66M29L45m73k78P45o97k99O33M11p24M93M69
4261F04n98o3N36k87o68O57J14n34j98J199r99k23O30l0o55P43J77l38l1Q00p12
4282A24l84L69K15q39M61N40j044K14P32p04j71P89K22j184M67Q24p86mJ014m89
4302C66o72M46J81o66P8O75q15j00Q68l41n72R90r1r30N47L16j48l08O08j00r31
$$ y = [-321, -402, 123, 18, -815, 41, 94, -412, -293, 478, 22, -437, 429, 224, -381, 450, 412, -277, -135, 685, -359, -222, 406, 258, -569, -35, 480, -244, -190, 395, 8, -309, 438, 400, -208, 115, 670, -157, -436, 427, -293, -403, -62, 14, -569, -383, 521, -379, -186, 528, 313, -29, 202, 244, -552, -205, 357, -76, -604, 108, -63, -589, 184, 221, -282, -23, 494, -93, -123, 467, 434, -620, 47, 372, -367, -26, 220, -386, -625, 356, -1, -425, -4, 380, -296, -285, 495, 11, -216, 191, 516, -450, -21, 324, -149, -427, 318, -379, -678, -45, 366, -358, 135, 604, 6, -57, 479, 192, -476, 181, 295, -239, -437, 762, -237, -460, 170, 140, -515, 228, 405, 67, 36, 836, 124, -260, 109, 324, -515, -54, 486, -558, -344, 388, -316, -487, 302, 524, -660, -193, 631, -155, -159, 855, 366, -306, 140, 321, -345, -267, 408, -407, -507, 361, 20, -552, 438, 347, -583, -36, 280, 132, -176, 432, 332, -599]
4323e99O55J04o53J63Q01o65j59N61l6m18J59O19m85k88P90n41n59P52L3p94M72
4344h8M26p29N5P79m60p27J025K43r75K25Q00m80j48M92l13n91M19M09o44O2M21
4365B01n35n6P70K08r40N82L99j019J43Q33n29m80O58K0p36L80K81n17j38R24
4385D49m84l94N40J5l26K28M80o50j38Q40k71o44M24Q8n22R7N43m83o0M24Q4p48
4407e08M85N66o50K04L83p24l53Q36j18n38Q0N89n79P0O55o16r5P57j0p40L85
4428G9N79n71j27N24l89o75O27M71q88J15P49p90j96Q72l78m25N05L92n16j07
4448a49O60m97m75O40Qp27L10N40o80N6P78q25l9O25L99j184O62L34l19k38N62
4469D41n75m40P67r0q12M11O72p63K23N32l37k95O95k54k37N2N45n69k09L14r0
$$ y = [-599, 56, 160, -493, -330, 471, -194, -353, 208, 172, -246, -87, 532, 47, -241, 549, 8, -551, 201, 234, -560, -88, 338, -391, -336, 443, -17, -744, 281, 524, -451, -226, 574, 94, -54, 438, 125, -466, -47, 362, -282, -220, 201, -334, -390, 380, 588, -352, 230, 629, -390, -247, 586, 57, -423, 235, 255, -481, -101, 180, -337, -475, 449, -35, -429, 111, 126, -200, 28, 508, -142, -280, 560, 289, -355, 69, 157, -365, -268, 275, -208, -268, 156, 240, -508, -23, 543, -107, 97, 480, -244, -597, 239, 121, -417, -337, 252, -327, -257, 398, -218, -313, 444, 434, -306, 79, 658, 87, -40, 484, 95, -580, 47, 518, -370, -255, 494, -296, -492, 380, 2, -423, 82, 474, -42, -149, 511, 14, -461, 179, 187, -540, -230, 310, -370, -314, 464, -361, -400, 225, 624, -560, 102, 436, 117, -121, 441, -134, -574, 193, 103, -709, -298, 374, -389, -166, 366, 29, -266, 429, 175, -62, -10, 535, -34, -243, 71, -19]
4490a9l03J87M33p63L29M54l40l47R03j86p56P75P4p36J93L45n14l2J99K24p02
4511e82M66M68o24K48O50p04j38M46L67q26J61O53r41p0Q48m25n81O82K57p85
4531d30K55M17l86J8O08n54k77N57K72q37P7O50m45q9P41n22n59N82L6l54PL87
4553A54k95m8N54J29p19L42J95q15K17O34m58m64O37M3l90K11M74q41R5J042m67
4574B30p61Q46M7p25K87M18m39k17P42m79m78O41M1o22K56O29n48J2O19k42k59
4595bJ54J75m79j81N92l93m18Q05k32p32N01P67j164L36P43m47j02K81K57r41
4615d80N58M3m66m3P78k08o50M48L55o66K88N40o96O5M72q1m35L78j36l63J58
4636a41O47q61j33M75K06o76L48L86n28M70N31n45m39O30j83n70K56N12o87k12
$$ y = [-19, -322, -135, 298, -465, -136, 318, -22, -369, 534, 348, -408, 367, 441, -295, -102, 243, -271, -303, -104, 120, -582, -116, 352, -272, -24, 626, -78, -216, 230, 597, -229, -68, 585, -356, -426, 422, -3, -584, 98, 355, -430, -175, 242, -144, -126, 482, -72, -349, 208, 480, -357, -280, 370, -75, -164, 577, 55, -504, 78, 114, -240, -233, 154, -141, -189, 365, 494, -225, 117, 312, -503, -286, 348, -110, -574, 63, 106, -284, -73, 401, -440, -345, 697, 230, -531, 315, 362, -363, -76, 342, -97, -314, 428, -51, -529, 112, 153, -469, -213, 416, -132, -120, 499, 257, -2, 152, 327, -152, -333, 259, -134, -552, 253, 21, -711, -210, 557, -607, -271, 472, 25, -77, 204, 461, -480, 78, 121, -345, -388, 390, 182, -468, -20, 335, -331, -43, 497, -199, -134, 338, 257, -178, 200, 64, -299, -141, 506, -355, -488, -13, 193, -483, -135, 251, -277, 193, 724, 179, -260, 370, 187, -383, -127, 385, -302, -514]
4656e14R58n16n57J179q3o80J86M61o92P7O35j84p45O23L32q83n4P15m55j10L79
4677G2K9m98N16K13n32m4Q40o48k05Q64l85l69K3M38n48j8O34m51j74M42j77n23
4699e01L72O90n93j11O27l05o03Q04J6n55K40K76j018M80L38p8l77N62K68r68
4719d36N07P00o54l75O89k88o46M91K71n60q8N43k89m45Q07K6r51P15O51p13N7
4740A2M59n03m03N60R6n80J92N00n06j10N58j31m40O24O1o54M42J75m55NL28N3
4762B83q19N74L1k75r0N11m67o9N96j17o39O42J48n20J99M77l55j68J90k52l52
4783d72K31P16q08K17L51k94k47P12m13j91L53K92m34j93P33q23N6K76J93n28
4803b73J13L68m12J09M95l52l95O00J63p89L51L33p58K01N17M1p21P02o2n28J78
$$ y = [-514, 444, -72, -629, 550, 467, -213, -27, 434, -258, -181, 454, 270, -475, 148, 480, -403, -457, 258, -197, -307, 72, 101, -397, 119, 332, -200, -244, 596, -52, -257, 607, 222, -147, -124, 314, -234, -252, 382, -69, -243, 199, 22, -501, -129, 561, -32, -143, 484, 179, -424, 380, 396, -159, 81, 357, -661, -181, 157, 79, -298, 264, 532, -436, 71, 771, 117, -258, 431, 143, -503, -12, 259, -301, -389, 154, -135, -580, 227, 253, -698, 17, 668, -45, 12, 471, -32, -435, 125, 221, -359, -167, 333, -173, -283, 275, 144, -296, 328, 389, -265, 177, 352, -103, -98, 230, 283, -536, 38, 69, -206, -296, 215, -252, -321, 275, 158, -481, 161, 309, -211, -12, 465, 110, -58, 132, -120, -472, -241, 475, -333, -116, 235, -59, -306, 406, -7, -198, 155, 447, 13, -180, 553, -270, -214, 62, 255, -273, -160, 208, -204, -95, 400, 48, -347, 253, 416, -373, -22, 311, -447, -246, 271, 312, -409, 293, 231, -297, -119]
4824a19N52o22p2Q13m88k95L16K86l70k2N96q68k52Q31k18k58J32L10m73J11M36
4845C26l19l28N77P3m23J81M65q36K2O48m92k83K23L41n48K16N47n58k37Q63r2
4866C66n70M83N5m10Q7L80k15l16L69l42l89M58M03o96m3O35m02l27Q39k33m79
4887c47M99L34m97r1J61q2l45N32J79n27K94M33p05r0Q78m88m05M53J69n21J18
4908d8K70n89j12P17j85l79L58M14n79O2J87k2m37P48q5l85J29L07m76l76Q76
$$ y = [-119, 433, -189, -261, 552, 64, -231, 85, 371, 1, -21, 575, -293, -545, 286, 68, -190, -58, 252, -221, -110, 326, 7, -321, 256, 329, -94, 87, 552, -284, -262, 386, -106, -389, -166, 175, -373, -157, 390, -168, -405, 458, 366, -204, 279, 334, -76, 11, 391, 176, -140, 229, -113, -502, -44, 359, -337, -380, 255, -147, -474, 365, 132, -347, 152, 486, -11, -102, 59, -23, -368, 164, 343, -184, 110, 543, -162, -252, 626, 138, -267, 186, 355, -166, -48, 222, -367, -479, 238, 53, -326, 32, 446, -133, -71, 116, 94, -343, 405, 320, -65, 64, 371, -105, -481, 395]
$$ [...]
16383a69
##END NTUPLES=NMR FID
##END=
