##TITLE=abcd
##JCAMPDX= 6.0         $$ Bruker NMR JCAMP-DX V2.0
##DATA TYPE= NMR FID
##DATA CLASS= NTUPLES
##ORIGIN= UXNMR, Bruker Analytische Messtechnik GmbH
##OWNER= root
$$ XWIN-NMR		Version 3.5
$$ Tue Jul 22 17:52:50 2025 Russian Standard Time (UT+4h)  servis@DPX200
##.OBSERVE FREQUENCY= 200.131235884673
##.OBSERVE NUCLEUS= ^1H
##.DELAY= (6, 6)
##.ACQUISITION MODE= SIMULTANEOUS
##.ACQUISITION SCHEME= undefined
##.AVERAGES= 32
##.DIGITISER RES= 18
##SPECTROMETER/DATA SYSTEM= spect
##.PULSE SEQUENCE= zg
##.SOLVENT NAME= CDCl3
##.SHIFT REFERENCE= (INTERNAL, CDCl3, 0, 16.5164)
##AUDIT TRAIL= $$ (NUMBER, WHEN, WHO, WHERE, WHAT)
$$ ##TITLE= Audit trail, XWIN-NMR		Version 3.5
$$ ##JCAMPDX= 5.01
$$ ##ORIGIN= Bruker BioSpin GmbH
$$ ##OWNER= servis
$$ F:\spectra/data/av/nmr/H1/1/audita.txt
$$ ##AUDIT TRAIL=  $$ (NUMBER, WHEN, WHO, WHERE, WHAT)
(   1,<2025-07-22 17:52:25.68 +0400>,<servis>,<DPX200>,
      <created by zg, POWCHK disabled, PULCHK disabled
       configuration hash MD5:
       00 E9 B6 7A A2 85 ED C7 34 08 36 98 17 FE 4E 26
       data hash MD5: 32K
       81 97 A2 5F 0C CD 67 8B EE D2 BA 7F B1 CE 1F 31>)
$$ ##END=
$$ 
$$ hash MD5
$$ 07 3B 99 89 9F 75 A8 32 9B C7 45 63 0E 2C C5 8B
##$RELAX= 
##$RELAX= 
##$RELAX= 
##$RELAX= 
##$RELAX= 
##$RELAX= 
##$RELAX= 
##$RELAX= 
$$ Bruker specific parameters
$$ --------------------------
##$DU= <F:\spectra>
##$EXPNO= 1
##$NAME= <H1>
##$PROCNO= 1
##$TYPE= <nmr>
##$USER= <av>
##$AMP= (0..31)
100 100 100 100 100 100 100 100 100 100 100 100 100 100 100 100 100 100 
100 100 100 100 100 100 100 100 100 100 100 100 100 100 
##$AQSEQ= 0
##$AQ_mod= 1
##$AUNM= <au_zg>
##$AUTOPOS= <>
##$BF1= 200.13
##$BF2= 200.13
##$BF3= 200.13
##$BF4= 200.13
##$BF5= 500.13
##$BF6= 500.13
##$BF7= 500.13
##$BF8= 500.13
##$BYTORDA= 1
##$CFDGTYP= 0
##$CFRGTYP= 5
##$CHEMSTR= <none>
##$CNST= (0..31)
1 1 145 1 1 1 1 1 1 1 1 1 1 1 1 1 1 1 1 1 1 1 1 1 1 1 1 1 1 1 1 1 
##$CPDPRG= <>
##$CPDPRG1= <>
##$CPDPRG2= <>
##$CPDPRG3= <>
##$CPDPRG4= <mlev>
##$CPDPRG5= <mlev>
##$CPDPRG6= <mlev>
##$CPDPRG7= <mlev>
##$CPDPRG8= <mlev>
##$CPDPRGB= <>
##$CPDPRGT= <>
##$D= (0..31)
0 2 0 0 0 0 0 0 0 0.06 0 0 0 0 0 0 0.0002 0 0 0 0 0 0 0 0 0 0 0 0 0 0 
0 
##$DATE= 1753192345
##$DBL= (0..7)
120 120 120 120 120 120 120 120 
##$DBP= (0..7)
150 150 150 150 150 150 150 150 
##$DBP07= 0
##$DBPNAM0= <>
##$DBPNAM1= <>
##$DBPNAM2= <>
##$DBPNAM3= <>
##$DBPNAM4= <>
##$DBPNAM5= <>
##$DBPNAM6= <>
##$DBPNAM7= <>
##$DBPOAL= (0..7)
0.5 0.5 0.5 0.5 0.5 0.5 0.5 0.5 
##$DBPOFFS= (0..7)
0 0 0 0 0 0 0 0 
##$DE= 6
##$DECBNUC= <off>
##$DECIM= 32
##$DECNUC= <off>
##$DECSTAT= 4
##$DIGMOD= 1
##$DIGTYP= 9
##$DL= (0..7)
0 120 120 120 120 120 120 120 
##$DP= (0..7)
150 150 150 150 150 150 150 150 
##$DP07= 0
##$DPNAME0= <>
##$DPNAME1= <>
##$DPNAME2= <>
##$DPNAME3= <>
##$DPNAME4= <>
##$DPNAME5= <>
##$DPNAME6= <>
##$DPNAME7= <>
##$DPOAL= (0..7)
0.5 0.5 0.5 0.5 0.5 0.5 0.5 0.5 
##$DPOFFS= (0..7)
0 0 0 0 0 0 0 0 
##$DQDMODE= 0
##$DR= 18
##$DS= 0
##$DSLIST= <SSSSSSSSSSSSSSS>
##$DSPFIRM= 0
$$ [...]
##$SUBNAM0= <"">
##$SUBNAM1= <"">
##$SUBNAM2= <"">
##$SUBNAM3= <"">
##$SUBNAM4= <"">
##$SUBNAM5= <"">
##$SUBNAM6= <"">
##$SUBNAM7= <"">
##$SUBNAM8= <"">
##$SUBNAM9= <"">
##$SW= 20.6817932712277
##$SWIBOX= (0..15)
0 0 3 0 0 0 0 0 0 0 0 0 0 0 0 0 
##$SW_h= 4139.07284768212
##$TD= 32768
##$TD0= 1
##$TE= 0
##$TE2= 300
##$TE3= 300
##$TEG= 300
##$TL= (0..7)
0 120 120 120 120 120 120 120 
##$TP= (0..7)
150 150 150 150 150 150 150 150 
##$TP07= 0
##$TPNAME0= <>
##$TPNAME1= <>
##$TPNAME2= <>
##$TPNAME3= <>
##$TPNAME4= <>
##$TPNAME5= <>
##$TPNAME6= <>
##$TPNAME7= <>
##$TPOAL= (0..7)
0.5 0.5 0.5 0.5 0.5 0.5 0.5 0.5 
##$TPOFFS= (0..7)
0 0 0 0 0 0 0 0 
##$TUNHIN= 0
##$TUNHOUT= 0
##$TUNXOUT= 0
##$USERA1= <user>
##$USERA2= <user>
##$USERA3= <user>
##$USERA4= <user>
##$USERA5= <user>
##$V9= 5
##$VALIST= <valist>
##$VCLIST= <CCCCCCCCCCCCCCC>
##$VD= 0
##$VDLIST= <DDDDDDDDDDDDDDD>
##$VPLIST= <PPPPPPPPPPPPPPP>
##$VTLIST= <TTTTTTTTTTTTTTT>
##$WBST= 1024
##$WBSW= 30
##$XGAIN= (0..3)
0 0 0 0 
##$XL= 0
##$YL= 0
##$YMAX_a= 319032
##$YMIN_a= -261499
##$ZGOPTNS= <>
##$ZL1= 120
##$ZL2= 120
##$ZL3= 120
##$ZL4= 120
##$ABSF1= 10
##$ABSF2= 0
##$ABSG= 5
##$ABSL= 3
##$ALPHA= 0
##$AQORDER= 0
##$ASSFAC= 0
##$ASSFACI= 0
##$ASSFACX= 0
##$ASSWID= 0
##$AUNMP= <proc_1d>
##$AZFE= 0.1
##$AZFW= 0.1
##$BCFW= 1
##$BC_mod= 2
##$BYTORDP= 0
##$COROFFS= 0
##$CY= 19
##$DATMOD= 1
##$DC= 2
##$DFILT= <>
##$DTYPP= 0
##$F1P= 11.0000007629395
##$F2P= -0.999999237060547
##$FCOR= 0.5
##$FTSIZE= 0
##$FT_mod= 4
##$GAMMA= 1
##$GB= 1
##$INTBC= 1
##$INTSCL= 1
##$ISEN= 128
##$LB= 0.05
##$LEV0= 0
##$LPBIN= 0
##$MAXI= 10000
##$MC2= 0
##$MEAN= 0
##$ME_mod= 0
##$MI= 0
##$NCOEF= 0
##$NC_proc= 0
##$NLEV= 6
##$NOISF1= 0
##$NOISF2= 0
##$NSP= 1
##$NTH_PI= 0
##$NZP= 0
##$OFFSET= 16.51637
##$PC= 1
##$PHC0= -275.1915
##$PHC1= 4.101552
##$PH_mod= 0
##$PKNL= yes
##$PPARMOD= 0
##$PSCAL= 4
##$PSIGN= 0
##$REVERSE= no
##$SF= 200.13
##$SI= 16384
##$SIGF1= 0
##$SIGF2= 0
##$SINO= 400
##$SIOLD= 16384
##$SREGLST= <1H.CDCl3>
##$SSB= 0
##$STSI= 0
##$STSR= 0
##$SW_p= 4139.07284768211
##$SYMM= 0
##$S_DEV= 0
##$TDeff= 0
##$TDoff= 0
##$TI= <>
##$TILT= no
##$TM1= 0
##$TM2= 0
##$TOPLEV= 0
##$USERP1= <user>
##$USERP2= <user>
##$USERP3= <user>
##$USERP4= <user>
##$USERP5= <user>
##$WDW= 1
##$XDIM= 8192
##$YMAX_p= 0
##$YMIN_p= 0
$$ End of Bruker specific parameters
$$ ---------------------------------
##NTUPLES= NMR FID
##VAR_NAME=  TIME,          FID/REAL,        FID/IMAG
##SYMBOL=    X,             R,               I
##VAR_TYPE=  INDEPENDENT,   DEPENDENT,       DEPENDENT
##VAR_FORM=  AFFN,          ASDF,            ASDF
##VAR_DIM=   16384,         16384,           16384
##UNITS=     SECONDS,       ARBITRARY UNITS, ARBITRARY UNITS
##FACTOR=    0.0002416,     1,               1
##FIRST=     0,             0,               0
##LAST=      3.9581328,     0,               0
##MIN=       0,             -261499,         0
##MAX=       3.9581328,     319032,          0
$$ Real data points
##PAGE= N=1
##DATA TABLE= (X++(R..R)), XYDATA
$$ [...]
$$ plain form
10108 77 -113 58 6 121 68 -41 -105 60 -204 24 3 2 37 -101 144 -16 -250 -16 -190 -118 -57 165 -198
10131 -198 161 118 -61 -118 -76 102 -149 26 -149 -106 -225 -122 -143 -136 -1 -44 259 -145 31 148 -23 -21 41
10154 41 -202 -25 100 24 -4 -10 -7 -60 -2 21 -132 -66 -263 -13 -41 -2 43 65 194 44 -68 136 -158 -65 -162
10179 -162 -85 199 -32 -201 -190 -102 76 -135 -54 240 -33 74 126 -123 -73 92 -294 -55 -113 93 -91 31
10201 31 -95 -20 41 63 80 -147 121 -82 -73 144 -35 141 -13 22 -3 23 -122 84 -315 -179 -90 -353 -127
10224 -127 44 -36 -43 0 -210 53 -7 12 -65 -85 0 291 -74 155 22 117 114 -6 -127 -33 18 -41 -187 -196 -40
10249 -40 -30 64 22 -31 -96 -92 59 31 -25 42 143 237 19 39 118 -47 87 -130 -102 82 97 -50 -52 130 -300 -221
10275 -221 -480 -179 -146 -143 -1 87 178 -258 38 -203 45 -129 -33 19 86 -2 -76 -35 -215 30 -182 5 -182
$$ packed form
10108G7j90J71n2J15n3j09o4J65k64K28k1jL5j38K45j60k34K34j74P2O1K22l63
10131a98L59m3j79n7M2J78k51J75j75M3j19J03k1PJ35m3L03m04J76J17j71KO2
10154D1k43J77J25p6k8oLn3N8K3j53O6j97K50k8L9M5K2J29j50j12K04k94R3r7
10179a62P7K84k31j69J1Q8J78k11Q1K94k73J07N2k49N0J65l86K39n8K06j84J22
10201C1j26P5O1K2J7k27K68k03RK17j79J76j54L5k5K6j45K06l99J36Q9k63K26
10224a27J71q0pM3k10K63o0J9p7k0Q5K91l65K29j33R5lj20j21R4N1n9j46rJ56
10249d0J0R4m2n3o5MJ51k8n6O7J01R4k18K0P9j65J34k17K8J84J5j47kJ82m30P9
10275b21k59L01L3LJ42Q8R1m36K96k41K48j74R6N2O7q8p4M1j80K45k12J87j87
$$ plain form
10298 -182 66 -99 -96 35 72 30 -25 1 -43 -179 -61 -171 -117 -115 153 41 -139 -235 -42 -18 175 -71 -4 17
10322 17 6 -169 -233 -212 96 211 3 60 -261 113 27 -65 -77 239 244 -182 148 -116 102 111 163 -132 -115 210
10346 210 95 -51 139 -21 138 150 41 105 -39 153 -42 102 -51 -26 70 -61 118 67 -44 -53 -83 -132 44
10369 44 -38 2 -31 43 -286 -245 -31 -165 -135 -23 226 100 40 0 168 -53 -234 100 101 77 -214 -5 60 27
10393 27 133 -4 115 104 38 -146 77 20 -29 -6 -172 -352 -89 121 -11 166 119 158 102 52 128 186 -71 262
10417 262 -211 -14 -29 -415 -104 107 156 -225 -176 30 -91 -59 129 -68 -156 79 -93 175 -72 158 -109
10438 -109 -8 -113 -166 -16 60 80 -160 99 -14 -93 260 -61 238 140 -91 199 121 107 155 -80 -94 152 -43
10461 -43 139 100 120 7 357 -32 -72 -179 31 78 -96 37 -32 149 -218 41 -123 -27 247 11 -35 308
$$ packed form
10298a82K48j65LJ31L7m2n5K6m4j36J18j10N4KK68j12j80r6J93K4J93k46O7K1
10322A7j1j75o4K1L08J15k08N7l21L74q6r2j2L16Nm26L30k64K18RN2k95J7L25
10346B10j15j46J90j60J59J2j09O4j44J92j95J44j53K5R6j31J79n1j11rl0m9J76
10369D4q2M0l3P4l29M1K14j34L0J12K49j26o0m0J68k21j81L34Jk4k91K09O5l3
10393B7J06j37J19j1o6j84K23n7m9K3j66j80K63K10j32J77m7L9n6n0P6N8k57L33
10417B62m73J97j5l86L11K11M9l81M9K06j21L2J88j97q8K35j72K68k47K30k67
10438a09J01j05n3J50P6K0k40K59j13p9L53l21K99r8k31K90p8j4M8k35j4K46j95
10461d3J82l9K0j13L50l89m0j07K10M7j74J33o9J81l67K59j64R6K74k36m6L43
$$ plain form
10483 308 -112 -120 42 145 -136 74 -153 58 109 238 91 -87 -69 211 -20 62 -101 -168 57 -135 297 95
10505 95 -110 29 85 -145 205 93 65 144 214 43 -1 185 -83 6 25 -225 95 44 18 -56 218 -28 0 28
10529 28 143 -28 -21 -66 146 179 49 -154 -110 -91 6 -41 10 -84 96 -187 -48 95 135 56 -6 85 -14 -16 36 133
10555 133 113 -64 -92 84 -8 -65 -87 -50 -156 171 34 -13 -57 82 50 -93 -51 -135 -11 -180 78 -79 -26 41
10579 41 99 17 131 -59 -1 -124 -127 -168 63 176 177 86 -147 -146 -67 115 -68 121 -106 -95 -160 -275 15 -175 -102
10604 -102 111 61 -52 61 42 46 26 -184 124 -62 14 164 44 14 261 -115 -88 -44 84 169 88 -67 131
10627 131 125 119 -86 12 20 -30 296 -1 16 -179 -236 -47 -51 -88 183 -197 -25 145 110 213 39 166 -2 5 117
10652 117 -30 63 106 50 -262 -135 -221 -10 -12 -201 -46 -67 65 286 -125 24 -11 -50 -4 -110 -185 216 29
$$ packed form
10483C08m20qJ62J03k81K10k27K11N1J29j47j78J8K80k31Q2j63o7K25j92M32k02
10505I5k05J39N6k30L50j12k8P9P0j71m4J86k68Q9J9k50L20n1k6p4K74k46K8K8
10529B8J15j71Pm5K12L3j30k03M4J9R7m7N1r4J80k83J39J43M0p9o2R1r9kN2R7
10555A33k0j77k8J76r2n7k2L7j06L27j37m7m4J39l2j43M2q4J24j69K58j57N3O7
10579D1N8q2J14j90N8j23lm1K31J13Jr1k33JP9J82j83J89k27J1o5j15K90j90P3
10604a02K13n0j13J13j9Mk0k10L08j86P6J50j20l0K47l76K7M4J28Q5q1j55J98
10627A31ook05R8Qn0L26k97J7j95n7J89ml7K71l80J72J70l5J03j74J27j68PJ12
10652A17j47R3M3n6l12J27q6K11kj89J55k1J32K21m11J49l5l9M6j06p5M01j87
$$ plain form
10675 29 20 -90 146 -34 41 -57 -5 211 -136 229 -41 -6 -157 113 -80 -68 -161 -244 -224 -4 100 -165 -13
10698 -13 -237 -9 56 -127 128 147 74 95 -47 -41 228 20 -35 147 -10 -28 128 -127 -36 -200 -34 -242 109
10721 109 -84 63 -192 -213 25 -200 148 25 -103 -210 -72 160 71 71 5 91 43 -53 79 -132 -3 50 69
10744 69 15 -32 -29 185 128 -30 -24 -53 -203 5 45 27 27 34 -152 5 -37 -92 -18 26 144 -42 -89 -68 -199 -5 37
10771 37 -218 -43 180 123 -145 -36 73 87 -47 65 49 -151 120 11 -223 -102 -88 -54 -126 247 231 -39
10793 -39 -170 -34 -7 -118 -35 -38 -44 111 185 -80 -137 -9 165 -87 -57 -98 106 69 -144 -67 90 90 -90 -194 -154
10818 -154 73 -86 -19 130 -47 -51 -109 -136 -156 55 344 -9 80 80 83 53 -171 -167 88 -87 -97 -3 13 123 -26
10843 -26 -58 -81 -195 -229 19 -99 74 33 -222 -43 -53 -12 110 -97 242 28 -53 75 -93 -196 334 -36
$$ packed form
10675B9rj10K36j80P5r8N2K16l47L65k70L5j51K70j93J2r3q3K0K20J04k65J52
10698a3k24K28O5j83K55J9p3K1j42OK69k08n5J82j57j8J56k55R1j64J66k08L51
10721A09j93J47k55k1K38k25L48j23j28j07J38K32q9%o6Q6m8r6J32k11J29N3J9
10744F9n4m7LK14n7j58Ok9j50K08M0j8%Pj86J57m2n5P4M4J18j86m7K1j31J94M2
10771C7k55J75K23n7k68J09J09J4j34J12j6k00K71j09k34J21J4L4p2L73j6k70
10793c9j31J36K7j11Q3loJ55P4k65n7J28J74k52L0m1K04l7k13P7J57%j80j04M0
10818a54K27j59O7J49j77mn8k7k0K11K89l53Q9%Ll0k24MK55j75j0R4J6J10j49
10843b6l2k3j14l4K48j18J73m1k55J79j0M1J22k07L39k14q1J28j68j03N30l70
$$ plain form
10865 -36 45 -10 -268 61 197 194 30 86 -244 -157 -29 -128 -113 -180 286 33 43 -63 68 62 39 77 70 77 -26 -4
10891 -4 -132 -27 4 134 -163 -113 -68 -57 -149 7 63 85 -203 57 -90 192 89 -220 165 -63 -155 -1 80
10914 80 -145 -36 115 -42 3 -11 -134 12 -67 134 -135 165 -216 128 3 -252 -172 -57 -106 -9 -12 -114 -69
10937 -69 -34 196 123 14 -47 -8 176 -27 -97 75 137 -99 -65 -141 -79 -12 -133 -103 -27 -114 -18 -157 -87 -144 -50 -136
10963 -136 60 -188 -59 -254 25 221 181 -271 87 121 -17 35 -113 14 58 -48 43 205 58 -19 191 -3
10985 -3 182 -199 135 -168 -93 51 105 65 23 61 111 100 -95 -50 110 -187 33 86 -128 38 -38 -189 -210 133
11009 133 5 -137 52 171 -176 -37 -194 4 -8 -15 -115 -167 102 6 -112 -217 -250 215 160 338 -124 -124 -6
11032 -6 -145 41 -126 153 180 -103 -9 -75 19 12 -34 -83 111 178 -54 119 120 64 -324 21 102 -59 -88 23 4
$$ packed form
10865c6Q1n5k58L29J36lj64N6l30Q7J28r9J5o7M66k53J0j06J31ok3L8pPj03K2
10891dj28J05L1J30k97N0M5J1r2J56N6K2k88K60j47K82j03l09L85k28r2J54Q1
10914H0k25J09J51j57M5j4j23J46p9K01k69L00l81L44j25k55Q0J15m9R7lj02M5
10937f9L5K30p3j09o1L9J84k03p0J72O2k36L4p6O2O7j21L0P6q7R6j39P0n7R4q6
10963a36J96k48J29j95K79J96m0m52L58L4j38N2j48J27M4j06R1J62j47p7K10j94
10985cJ85l81L34l03P5J44N4m0m2L8N0j1j95M5J60k97K20N3k14J66p6j51k1L43
11009A33j28j42J89J19l47J39j57J98j2pj00n2K69r6j18j05l3M65n5J78m62%J18
11032fj39J86j67K79K7k83R4o6R4pm6m9J94O7k32J73Jn6l88L45Q1j61k9J11j9
$$ plain form
11057 4 -40 41 -288 -122 -31 34 -97 164 -27 -149 179 -40 128 -56 160 31 -171 -296 71 -117 -155 -11
11079 -11 21 67 -298 28 71 9 -6 127 66 165 -14 -156 -29 -179 20 43 30 -249 -174 -5 58 91 -126 -76
11103 -76 72 302 108 146 64 79 174 9 -13 111 301 46 -17 -25 -34 26 35 -60 11 -30 9 214 -108 -139 -207 -160 -12
11130 -12 0 126 -89 -56 -129 48 -10 -30 -84 -62 -34 -88 -78 21 151 -52 -65 -111 -29 -186 -44 -288 267 -131 -171
11155 -171 24 68 -53 43 91 -1 136 55 -24 65 87 97 -7 47 108 -85 -169 -109 306 -7 66 80 -138 -62 28
11180 28 -93 -29 96 132 85 -35 -82 141 -44 -231 -215 -62 -132 112 -24 19 30 8 -95 -66 9 -102 -29 179
11204 179 -179 13 137 -57 -104 167 12 -100 106 10 -84 -22 -277 -232 -167 185 -75 -10 -115 -287 -183 1
11226 1 -103 -75 115 -106 95 -230 -160 -152 -143 -56 -100 24 2 -247 -67 127 235 -119 -138 -60 214 98 -79 -87 -28
$$ packed form
11057Dm4Q1l29J66R1O5j31K61j91j22L28k19J68j84K16j29k02j25L67j88l8J44
11079a1L2M6l65L26M3o2j5J33o1R9j79j42J27j50J99K3j3k79P5J69O3L3k17N0
11103g6J48K30j94L8q2J5R5j65k2J24J90k55o3qrO0Rr5P1m1L9K05l22l1o8M7J48
11130a2J2J26k15L3p3J77n8k0n4K2K8n4J0R9J30k03j3m6Q2j57J42k44N55l98m0
11155a71J95M4j21R6M8r2J37q1p9Q9K2J0j04N4O1j93q4O0M15l13P3J4k18P6R0
11180B8j21O4J25L6m7j20m7K23j85j87J6J53p0K44j36M3J1k2j03K9P5j11P3K08
11204A79l58J92J24j94m7K71j55j12K06r6r4O2k55M5O5L52k60O5j05j72J04J84
11226Aj04K8J90k21K01l25P0QRQ7m4J24k2k49J80J94J08l54j9P8K74j16j77qN9
$$ plain form
11251 -28 -187 31 107 60 138 50 76 -182 27 -9 4 -131 91 43 39 -62 73 72 -127 -28 164 334 196 43
11275 43 -87 -194 -29 -6 -142 145 111 -61 30 -118 -88 23 145 -154 143 18 96 -121 -85 143 72 46 -121
11298 -121 136 83 -34 -186 -95 147 144 74 108 -68 120 125 110 96 -113 -176 50 -94 -133 -160 299 -78 -161 -124 -133
11323 -133 -137 -43 -23 -118 58 229 -9 -36 68 63 -85 -76 -70 189 251 -108 229 262 -130 -80 -122 204 -164 144 -50
11348 -50 -32 -60 -17 53 252 -48 213 120 -121 -115 42 82 230 -43 45 -82 -125 35 45 63 -164 148 23 -1
11372 -1 -175 -168 -147 81 -29 33 148 -37 -211 -100 106 -102 59 -128 102 68 -103 -197 -57 -35 -75 -27 -152
11395 -152 38 132 -2 -174 -236 59 -88 75 101 -169 -14 -280 276 56 141 154 -119 87 321 181 76
11416 76 -53 18 -91 -124 -101 159 249 16 66 -121 -43 13 -51 -72 120 81 110 -64 -32 59 -38 147 -5 1 203
$$ packed form
11251b8j59K18P6m7P8q8K6k58K09l6J3j35K22m8mj01J35jj99R9J92J70j38j53
11275D3j30j07J65K3j36K87l4j72R1j48L0J11J22k99K97j25P8k17L6K28p1k6j67
11298a21K57n3j17j52R1K42lp0L4j76J88Nj5j4k09o3K26j44l9k7M59l77q3L7r
11323a33mR4K0r5J76J71k38k7J04nj48ROK59O2l59L37L3l92N0m2L26l68L08j94
11348e0J8k8M3P0J99l00K61r3k41OJ57M0J48k73Q8j27m3J60J0J8k27L12j25k4
11372aj74PK1K28j10O2J15j85j74J11K06k08J61j87K30l4j71r4J40K2m0M8j25
11395a52J90R4j34j72o2K95j47J63K6k70J55k66N56k20Q5J3k73K06K34j40j05
11416G6j29P1j09l3K3K60R0k33N0j87P8N6o4k1J92l9K9j74L2R1r7J85j52OK02
$$ plain form
11441 203 -16 59 -48 -171 -260 -112 -172 306 -15 105 45 20 -45 73 -84 -99 -152 -104 -62 58 -225 -59 -125
11464 -125 -17 -192 -26 246 -73 -90 -5 47 28 109 -36 61 199 -147 68 207 115 -117 33 28 179 -124 113
11487 113 -131 -35 36 -78 -46 -80 -3 107 196 125 53 0 -192 -215 63 36 56 -212 -88 -195 -71 31 69 -131
11511 -131 32 -2 -76 -87 180 0 190 206 -105 -220 34 191 -8 28 27 -8 156 237 172 -229 49 34 -98
11534 -98 -62 -96 19 135 -45 19 -176 -26 147 -92 54 -129 -117 93 71 -348 211 21 3 -35 -108 405 -136
11557 -136 -84 135 28 122 -33 6 -99 34 -125 -19 152 198 11 -35 354 -146 -231 -223 155 -85 -321 -123
11579 -123 -83 -6 22 -21 -353 -199 104 115 19 7 -41 35 -288 -91 69 -185 182 197 180 5 -249 -29 -43 -76
11603 -76 -57 47 -139 -168 51 136 -22 197 109 191 62 -20 -104 138 -40 38 116 -204 29 -77 168 -3 35
$$ packed form
11441B03k19P5j07j23q9J48o0M78l21J20o0k5o5J18j57j5n3M8M2J20k83J66o6
11464a25J08j75J66K72l19j7Q5N2j9Q1j45R7J38l46K15J39r2k32J50nJ51l03K37
11487A13k44R6P1j14L2l4P7J10Q9p1p2n3j92k3K78k7K0k68J24j07J24J02L8k00
11511a31J63l4p4j1K67j80J90J6l11j15K54J57j99L6jl5J64Q1o5m01K78j5j32
11534i8L6l4J15J16j80O4j95J50J73k39J46j83J2K10k2m19N59j90j8l8p3N13n41
11557a36N2K19j07R4j55L9j05J33j59J06J71M6j87m6L89n00q5QL78k40k36J98
11579a23M0P7K8m3l32J54L03J1r6j2m8P6l23J97J60k54L67J5j7j75k54K20j4l3
11603g6J9J04j86k9K19Q5j58K19q8Q2j29q2q4K42j78P8P8l20K33j06K45j71L8
$$ plain form
11626 35 -247 -113 193 80 80 -247 -328 -93 -7 120 -39 171 125 -25 -44 -59 -44 -209 174 -252 147 -34 -82
11649 -82 -182 -63 2 6 198 -106 193 -125 139 -61 -111 -247 -38 -221 89 -63 -146 84 63 -8 -64 -36 -6
11672 -6 -18 65 16 -147 7 -190 100 -83 -61 124 14 -120 104 -135 -59 -118 -272 15 -138 24 -64 33 108
11695 108 -24 -113 200 14 -64 -93 -24 3 112 13 -91 -56 -167 -95 61 74 -208 40 69 7 90 -192 246 87
11719 87 233 35 -183 85 -177 -194 -44 -66 -113 4 -138 74 -8 -121 -133 -196 -177 127 -5 18 2 135 57
11742 57 -111 31 21 157 -4 -167 143 24 69 195 -30 354 -92 -101 -43 -242 30 308 -10 -120 95 108
11764 108 -35 -127 152 154 128 171 35 -16 -56 59 173 -121 -96 -175 57 -24 -41 39 -141 -125 156 168 139 -46 32
11789 32 130 -114 22 -41 80 -89 -273 271 -265 -166 117 -43 -15 -212 -36 96 199 179 210 21 -101 52
$$ packed form
11626C5k82J34L06j13%l27q1K35Q6J27j59K10m6j50j9j5J5j65L83m26L99j81m8
11649h2j00J19O5MJ92l04K99l18K64k00n0j36K09j83L10j52q3K30k1p1n6K8L0
11672fj2Q3m9j63J54j97K90j83K2J85j10j34K24k39P6n9j54K87j53J62q8R7P5
11695A08j32q9L13j86p8k9O9K7J09r9j04L5j11P2J56J3k82K48K9o2Q3k82M38j59
11719H7J46j98k18K68k62j7J50k2m7J17j42K12q2j13j2o3J9L04j32K3j6J33p8
11742E7j68J42j0J36j61j63L10j19M5J26k25L84m46rN8j99K72K78l18j10K15J3
11764A08j43r2K79Kk6M3j36n1m0J15J14k94K5p9K32q1j7Q0j80J6K81J2k9j85P8
11789C2R8k44J36o3J21j69j84N44n36R9K83j60K8j97J76J32J03k0L1j89j22J53
$$ plain form
11811 52 79 -147 -196 -7 37 159 -132 -192 -36 19 146 -56 -189 -20 161 184 -56 18 -44 -75 -349 -86 62
11834 62 -203 168 372 -109 56 -184 -90 67 -267 -21 0 15 23 -58 14 76 -304 132 -46 -54 123 -118 81
11857 81 23 238 282 -21 -119 113 -33 -21 142 -35 30 16 -63 78 -44 -33 -43 -54 4 132 -127 312 -50 -158
11881 -158 218 -212 -59 64 -327 -68 287 -12 -34 -120 25 256 84 31 133 160 148 -107 -116 -113 76 208 85
11904 85 -38 6 -118 -91 -205 -41 -331 -124 -13 46 18 -229 -57 -185 229 125 143 -151 -50 112 -108 -176
11926 -176 79 140 52 -45 -64 191 95 194 93 33 17 -81 337 -49 -34 -133 -32 -118 -97 -122 -19 -31 167 -38 74
11951 74 -163 -108 5 0 48 -203 -80 -114 23 -2 -170 -110 58 -86 58 85 51 100 14 -46 43 134 -70 70 259
11976 259 -36 29 -71 -35 -20 141 65 1 -60 235 135 245 -94 30 32 -43 -31 -11 157 9 -122 18 121
$$ packed form
11811E2K7k26m9J89M4J22k91o0J56N5J27k02j33J69J81K3k40P4o2l1k74K63J48
11834F2k65L71K04m81J65k40R4J57l34K46K1J5Qq1P2O2l80M36j78qJ77k41J99
11857H1n8K15M4l03r8K32j46J2J63j77O5j4p9J41j22J1j0j1N8J28k59M39l62j08
11881a58L76m30J53J23l91K59L55k99k2q6J45K31j72n3J02K7j2k55rLJ89J32j23
11904H5j23M4j24K7j14J64k90K07J11N9k8k47J72j28M14j04J8k94J01J62k20o8
11926a76K55O1q8r7j9K55r6R9j01o0j6r8M18l86J5r9J01q6K1k5J03j2J98k05J12
11951G4k37N5J13nM8k51J23l4J37k5j68O0J68j44J44K7l4M9q6o0Q9R1k04J40J89
11976B59k95O5j00L6J5J61p6o4o1K95j00J10l39J24Kp5J2K0J68j48j31J40J03
$$ plain form
11999 121 17 -72 -95 -59 -59 146 -1 -53 156 22 -91 37 -112 271 23 47 92 -59 93 -117 8 -470
12021 -470 221 63 -197 111 -9 134 73 52 209 106 -26 28 223 96 -30 21 -37 -128 149 120 95 59 152
12044 152 78 155 -49 75 23 -38 -240 -157 -194 -23 -53 -54 -124 -267 -11 -29 60 206 33 11 -117 7 54 73 -333
12069 -333 -76 55 -41 91 -129 3 85 -56 103 143 -302 66 61 310 188 77 -35 118 98 -50 5 -35
12091 -35 -62 -128 17 7 -122 -39 -127 -85 170 -12 -74 -128 -124 -63 -166 21 -144 -225 -203 -37 29 -107 -3 -122 70
12116 70 -128 83 -15 -201 -219 192 89 276 95 24 -35 245 144 -162 47 -165 -65 -55 -71 -169 70 51 -27
12139 -27 -305 -194 -360 151 -43 108 369 -94 -1 -164 101 184 -94 132 -195 -11 1 -132 -59 -14 -106 -12
12161 -12 61 62 -140 83 58 80 108 70 -1 237 77 -47 -71 -44 -15 -154 -245 -86 8 -229 127 16 -121 179
$$ packed form
11999A21j04q9k3L6%K05j47n2K09j34j13J28j49L83k48K4M5j51J52k10J25m78
12021d70O91j58k60L08j20J43o1k1J57j03j32N4J95j27j26N1n8r1K77k9k5l6R3
12044A52p4P7k04J24n2o1k02Q3l7J71l0jp0j43K56j8Q9J46j73k2j28J24M7J9m06
12069c33K57J31r6J32k20J32Q2j41J59M0m45L68nK49j22j11j12J53k0j48N5m0
12091c5k7o6J45j0j29Q3q8M2K55j82o2n4MO1j03J87j65q1K2J66O6j36J04j19J92
12116G0j98K11r8j86j8M11j03J87j81p1n9K80j01l06K09k12J00J0j6r8K39j9p8
12139b7k78J11j66N11j94J51K61m63R3j63K65Q3k78K26l27J84J2j33P3M5r2R4
12161a2P3Jk02K23k5K2K8l8p1K38j60j24k4K7K9j39r1J59R4k37L56j11j37L00
$$ plain form
12185 179 80 129 -100 54 -303 11 -118 -12 -125 -38 81 0 -89 23 -219 -7 -139 -106 -44 235 -80 88
12207 88 51 -20 -172 -128 34 105 -3 -38 408 4 -156 -175 -86 -40 -127 -18 34 -124 66 82 -148 76 -26 -100
12231 -100 -82 -239 -225 19 10 -433 -118 96 -15 67 -90 -107 -16 -169 -162 124 167 -47 -77 -14 -73 7 168 -53
12255 -53 -142 -107 29 -232 -112 178 152 73 -12 0 94 -32 -211 50 -209 -137 -245 -163 -92 216 -90 91 -121
12278 -121 -132 -42 237 123 -93 -32 -184 36 -177 -59 53 231 -53 2 110 212 -258 93 -9 -165 -117
12299 -117 -58 62 -66 -110 193 -37 -5 -33 -13 54 66 214 -43 101 -138 -180 124 128 9 -19 66 77 -148 -136
12323 -136 -182 5 6 -4 -31 -96 -12 -230 -47 -23 -187 6 -196 65 -109 224 38 -72 48 105 -87 17 40
12346 40 -1 21 -134 -104 -7 -63 3 -107 11 87 -242 -238 -87 28 25 181 146 8 -83 61 -8 -45 -69 37 13 370
$$ packed form
12185A79r9M9k29J54l57L14j29J06j13Q7J19q1q9J12k42K12j32L3O2K79l15J68
12207H8l7p1j52M4J62P1j08l5M46m04j60j9Q9M6q7J09N2j58J90J6k30K24j02p4
12231a00J8j57J4K44rm43L15K14j11Q2j57j7R1j53PK86M3k14l0O3n9Q0J61k21
12255e3q9L5J36k61J20K90k6p9q5J2R4j26j79K61k59P2j08Q2P1L08l06J81k12
12278a21j1R0K79j14k16O1j52K20k13J18J12J78k84N5J08J02m70L51j02j56M8
12299a17N9J20j28m4L03k30L2k8K0O7J2J48k57J44k39m2L04Mj19k8Q5J1k25J2
12323a36m6J87Jj0k7o5Q4k18J83K4j64J93k02K61j74L33j86j10J20N7j92J04K3
12346D0m1K2j55L0R7n6O6j10J18P6l29MJ51J15lJ56l5j38r1J44o9l7k4J06k4L57
$$ plain form
12372 370 126 23 -164 -19 71 19 -1 -72 125 84 193 -1 101 102 132 -20 132 -76 -46 214 -29 12 -77
12395 -77 -30 -81 218 -157 37 18 67 250 -21 -5 -167 14 45 324 -94 35 5 -17 349 -388 84 -28 58
12418 58 159 -114 224 -56 230 -115 88 -4 38 40 -324 370 -103 60 -78 -46 -200 76 -29 -53 84 6
12440 6 184 -71 78 15 -76 153 96 -214 198 -78 -5 130 -27 -26 -98 -97 45 157 -105 53 43 307 109 187
12464 187 -79 -73 -7 86 120 116 -17 -136 136 -12 126 -161 138 56 324 47 62 71 84 222 19 0 159 205
12488 205 -22 -410 -359 -115 -158 145 -183 133 144 -22 -206 -54 96 -212 28 -82 -128 17 26 193 150 34
12510 34 -73 -197 -81 -12 115 -102 37 28 4 168 -36 118 -137 100 26 -13 185 13 -185 -281 162 -78
12532 -78 27 -36 -81 51 -103 112 100 3 134 -47 26 24 7 -73 52 -74 151 -51 81 94 -161 -58 185
$$ packed form
12372C70k44j03j87J45R0n2k0p1J97m1J09j94J02JL0j52J52k08L0K60k43M1q9
12395g7M7n1K99l75J94j9M9J83k71J6j62J81L1K79m18J29l0k2L66p37M72j12Q6
12418E8J01k73L38k80K86l45K03r2M2Kl64O94m73J63j38L2j54K76j05k4J37p8
12440FJ78k55J49o3r1K29n7l10M12k76P3J35j57Jp2JJ42J12k62J58j0K64j98P8
12464A87k66OO6R3L4mj33j19K72j48J38k87K99q2K68k77J5RJ3J38k03j9J59M6
12488B05k27l88N1K44m3L03l28L16J1j66j84J52J50l08K40j10m6J45RJ67m3j16
12510C4j07j24J16O9J27k17J39rk4J64k04J54k55K37p4l9J98j72j98r6M43k40
12532g8J05o3m5J32j54K15j2r7J31j81P3kj7q0J25j26K25k02J32J3k55J03K43
$$ plain form
12555 185 28 17 -5 -111 104 -58 243 118 149 236 -122 83 -240 -87 58 -126 73 70 3 67 63 -71 151
12578 151 81 100 -56 -55 24 94 -81 -11 135 -121 101 27 -173 -65 -225 139 -269 3 201 -50 23 -86 -95
12601 -95 157 -29 -84 -106 24 -21 -208 90 183 173 -1 -130 -46 -14 10 46 -91 50 124 -178 97 4 -36 -100
12625 -100 32 -288 157 56 150 -136 153 -63 169 -89 -35 -49 90 -139 0 125 -29 -149 -130 20 -221
12646 -221 50 69 56 130 188 98 40 117 136 69 64 73 -11 66 -1 -169 268 7 14 148 -21 63 108 25 -3 97 402
12673 402 11 -98 -106 -213 276 -7 -155 -202 163 -233 -88 -92 -82 61 -16 96 -198 -166 155 43 -43 -143 -76
12696 -76 106 72 -160 -129 -1 412 104 -82 60 -130 137 -183 188 -103 -39 169 88 -117 219 -42 41 -271
12718 -271 -49 17 -81 100 120 -2 -84 210 136 153 -98 139 -186 112 120 -147 -151 -134 -172 -275 -233 -112 0 -111
$$ packed form
12555A85j57j1k2j06K15j62L01j25L1Q7l58K05l23J53J45j84J99lo7O4mj34K22
12578A51p0J9j56JP9P0j75P0J46k56K22p4k00J08j60L64m08K72J98k51P3j09r
12601i5K52j86n5k2J30m5j87K98R3j0j74j29Q4L2K4L6j37J41P4l02K75r3m0o4
12625a00J32l20M45j01R4k86K89k16K32k58N4j4J39k29J39J25j54j20J9J50k41
12646b21K71J9j3P4N8r0n8P7J9o7nRq4P7o7j68M37k61PJ34j69Q4M5q3k8J00L05
12673D02l91j09qj07M89k83j48m7L65l96J45mJ0J43p7J12k94L2L21j12q6j00O7
12696g6J82l4k32L1J28M13l08j86J42j90K67l20L71k91O4K08q1k05L36k61Q3l12
12718b71K22O6r8J81K0j22q2K94p4J7k51K37l25K98Qk67mJ7l8j03M2J21J12j11
$$ plain form
12742 -111 -123 -284 -125 308 17 22 177 -158 -55 163 9 -164 142 24 -42 80 -42 -6 96 -146 46
12763 46 -134 278 116 173 -126 -95 24 -142 -214 -130 -18 175 32 -173 133 187 70 101 152 -18 -90 -99 -131 -60
12787 -60 74 59 22 -155 98 373 -215 60 -52 148 35 -79 -83 -240 137 -119 -156 -143 279 51 -56 -152
12809 -152 28 171 5 -79 -50 139 213 33 173 -169 3 -243 39 -148 -315 38 -183 42 273 -111 117
12830 117 13 -16 73 71 -232 90 -71 -115 -10 -48 67 218 -66 202 -15 -29 -201 -191 59 90 -111 499 147
12853 147 -56 148 128 -56 6 -208 -100 -39 -19 -131 76 133 30 141 -123 -81 172 -198 49 -84 -133 106
12875 106 -215 122 -99 150 36 88 -193 3 -11 52 -166 163 6 -194 -243 -91 -200 74 -136 248 -10
12896 -10 -191 42 -202 7 -51 29 87 41 6 -20 -39 143 -49 6 14 149 -1 -54 -204 243 20 -151 -164 1
$$ packed form
12742a11j2j61J59M33k91NJ55l35J03K18j54j73L06j18o6J22j22L6J02k42J92
12763D6j80M12j62N7k99L1J19j66p2Q4J12J93j43k05L06N4j17L1N1j70p2rl2P1
12787f0J34j5l7j77K53K75n88K75j12K00j13j14mj57L77k56l7J3M22k28j07r6
12809a52J80J43j66q4K9J89P4j80J40l42J72k46K82j87j67L53k21K25K31l84K28
12830A17j04k9Q9kl03L22j61m4J05l8J15J51k84K68k17j4j72J0K50L1k01O10l52
12853A47k03K04k0j84O2k14J08O1K0j12K07N7j03J11k64M2K53l70K47j33m9K39
12875A06l21L37k21K49j14N2k81J96j4O3k18L29j57k00m9J52j09K74k10L84k58
12896a0j81K33k44K09n8Q0N8m6l5k6j9J82j92N5QJ35j50n3j50M47k23j71j3J65
$$ plain form
12920 1 74 -35 189 -67 -6 84 128 6 79 -64 -4 -53 26 -11 -112 20 220 31 -56 72 -229 -41 73 -81
12944 -81 98 -4 163 108 35 -105 17 137 -301 10 -109 76 -227 -81 80 -132 12 -166 70 43 10
12965 10 -35 89 -223 114 61 13 -51 -28 -3 -252 -164 6 203 -155 242 177 -35 -243 128 12 140 190 110
12988 110 119 -29 153 14 64 99 63 130 70 35 159 -109 -102 -12 -186 -190 -130 125 53 238 -64 198 15 -148 78
13013 78 114 279 -76 -171 24 -270 90 7 181 21 35 150 -37 275 -5 -105 292 -22 181 130 165 71
13035 71 -148 54 49 -19 147 87 -65 -3 238 52 101 190 -153 -143 235 -35 -118 -72 75 150 -21 8 107 -79
13059 -79 8 62 -57 34 9 45 -70 -45 -140 20 -70 -299 28 -148 121 84 -37 81 84 104 197 -37 122 -18
13083 -18 121 60 57 -293 -166 139 -19 -81 89 -124 9 98 185 -198 -81 25 -3 101 -326 116 -26 -53 -43
$$ packed form
12920AP3j09K24k56O1R0M4j22P3j43O0m9P9l7j01J32K00j89q7J28l01J88J14j54
12944h1J79j02J67n5p3j40J22J20m38L11j19J85l03J46J61k12J44j78K36k7l3
12965A0m5J24l12L37n3m8o4K3K5k49Q8J70J97l58L97o5k12k08L71j16J28N0q0
12988A10Rj48J82j39N0L5l6O7o0l5J24k68PR0j74mO0K55p2J85l02K62j83j63K26
13013G8L6J65l55r5J95k94L60q3J74j60J4J15j87L12k80j00L97l14K03n1L5r4
13035G1k19K02no8J66o0j52O2K41j86M9Q9l43J0L78k70q3M6J47P5j71K9R9j86
13059g9Q7N4j19R1k5L6j15K5r5J60r0k29L27j76K69l7j21J18LK0R3k34J59j40
13083a8J39o1ll50J27L05j58o2J70k13J33Q9Q7l83J17J06k8J04m27M42j42k7J0
$$ plain form
13106 -43 91 -70 -190 -245 -341 82 -249 58 -85 -116 -66 -28 140 -77 294 79 94 117 -233 150 223 33 231
13129 231 -6 -250 -194 -37 -138 -22 -62 123 -73 58 266 -39 -39 47 32 -170 186 -19 -45 -16 -103 -103 -22 -98
13153 -98 143 96 112 77 -24 -241 -93 -68 334 -220 -94 -23 -105 106 -183 -83 98 57 -60 -13 45 153 -38
13176 -38 -39 220 -182 55 -62 -92 -77 241 203 87 -109 -140 252 154 152 -77 -227 -152 47 64 155 -73 35 -165
13200 -165 25 -76 -173 1 -8 -170 -196 157 -111 138 7 -7 51 -354 36 137 243 51 -81 -133 -145 -45
13222 -45 -17 35 46 187 21 187 -93 98 35 -169 14 238 -17 -65 -86 189 -291 22 250 -45 156 -126
13244 -126 -150 16 54 -176 -171 157 9 -80 27 6 -12 -82 103 -273 56 18 233 -33 -110 -128 -116 -185 -238 79
13268 79 -82 -83 231 -54 -98 -16 72 -83 -142 124 -31 -98 -226 -235 17 -1 -146 -19 -27 -159 -315 233 59 -261
$$ packed form
13106d3J34j61j20n5r6M23l31L07j43l1N0L8J68k17L71k15J5K3l50L83P3j90J98
13129B31k37k44N6J57j01J16m0J85j96J31K08l05%Q6j5k02L56k05k6K9q7%Q1p6
13153i8K41m7J6l5j01k17J48K5M02n54J26P1q2K11k89J00J81m1j17M7N8J08j91
13176c8jK59m02K37j17l0J5L18l8j16j96l1L92r8kk29j50P5J99J7R1k28J08k00
13200a65J90j01r7J74rj62k6L53k68K49j31j4N8m05L90J01J06j92j32n2j2J00
13222d5K8N2J1J41j66J66k80J91o3k04J83K24k55m8k1K75m80L13K28k95K01k82
13244a26k4J66L8k30NL28j48q9J07k1j8p0J85l76L29l8K15k66p7j8J2o9n3L17
13268G9j61jL14k85m4Q2Q8j55n9K66j55o7j28rK52j8j45J27qj32j56N48j74l20
$$ plain form
13292 -261 -9 124 41 41 9 -182 -157 -126 -214 -135 -74 -104 -78 -16 -25 -208 17 -39 110 176 -119 242 100 197 173 43
13318 43 6 -175 -134 -249 -108 101 111 -186 -60 143 39 240 28 231 -58 -92 -10 -75 -111 -15 4 -20 184
13341 184 64 -8 104 -7 -196 -87 21 -51 58 198 -194 122 28 -224 16 -109 145 -168 -74 16 121
13362 121 33 -77 72 -47 21 -146 -214 -398 220 -104 -61 204 29 101 -33 37 -15 -14 59 50 17 -78 121 199 45
13387 45 3 116 -63 80 115 -23 -1 89 10 -36 13 90 113 -32 -25 29 -20 52 -54 -129 80 128 -116 8 -120
13412 -120 149 15 110 -43 -298 -88 83 -4 -204 -23 -164 -124 1 8 -250 108 -35 -141 -127 -149 -24 -272
13434 -272 -11 -50 -37 -28 -72 91 161 223 66 -276 -63 119 149 -66 -38 -112 -63 -40 -386 -80 -107 103 41 -38 -136
13459 -136 71 -171 63 -74 -202 -36 97 -15 -184 197 46 9 0 105 -43 33 -116 60 168 48 53 -296
$$ packed form
13292b61K52J33q3%l2j91K5L1q8P9O1l0K6O2rj83K25n6J49O6k95L61j42R7k4j30
13318D3l7j81M1j15J41K09J0k97J26K03j04K01k12K03k89l4Q2o5l6R6J9k4K04
13341A84j20p2J12j11j89J09J08p2J09J40l92L16r4k52K40j25K54l13R4R0J05
13362A21q8j10J49j19O8j67o8j84O18l24M3K65j75P2j34P0n2JP3rl3r5J99P8j54
13387D5m2J13j79J43L5j38K2R0p9m6M9P7K3j45PN4m9P2j06p5K09M8k44J24j28
13412a20K69j34R5j53k55K10J71q7k00J81j41M0J25Pk58L58j43j06J4k2J25k48
13434b72K61l9J3Rm4J63P0O2j57l42K13J82L0k15K8p4M9K3l46L06k7K10o2p9r8
13459a36K07k42K34j37j28J66J33j12j69L81j51l7rJ05j48P6j49J76J08j20Nl49
$$ plain form
13481 -296 -50 -89 43 127 141 -9 -58 -139 -36 -173 77 95 95 -1 128 4 -122 137 26 75 62 -233 15
13504 15 -115 152 -182 3 87 -67 -12 -101 -87 49 -21 -155 34 178 -136 -27 167 4 109 129 -128 75
13526 75 26 -331 -86 157 -30 -49 90 34 234 24 -258 -23 -228 -54 -144 3 -288 -82 45 105 33 10
13548 10 255 -78 -11 -9 -118 10 12 188 8 -86 293 226 -1 -252 -40 70 -51 -103 -397 -68 109 -56 39
13571 39 87 131 -55 106 -20 25 -150 -54 12 67 95 213 83 -138 -165 9 156 -86 -138 -30 -99 -37 33 170
13595 170 1 -82 -162 125 16 113 32 -20 -51 35 16 -30 -2 -96 82 -161 -39 -132 -243 -204 180 261 191 28 -266
13620 -266 -27 30 130 -139 5 -107 276 31 -102 -39 -19 102 -240 104 -63 -27 23 -12 -161 49 -86 -54
13642 -54 -121 -249 48 -32 195 136 -81 -96 126 48 -85 -34 -396 -59 -248 -13 -6 -143 95 52 47 99 -85 52
$$ packed form
13481b96K46l9J32Q4J4j50m9q1J03j37K50J8%r6J29j24j26K59j11M9j3k95K48
13504A5j30K67l34J85Q4j54N5q9J4J36p0j34J89J44l14J09J94j63J05K0k57K03
13526G5m9l57K45K43j87j9J39n6K00k10k82K35k05J74r0J47k91K06J27O0p2k3
13548A0K45l33O7Kj09J28KJ76j80r4L79o7k27k51K12J10j21n2k94L29J77j65R5
13571C9M8M4j86J61j26M5j75R6O6N5K8J18j30k21k7J74J47k42n2J08o9O2P0J37
13595A70j69q3q0K87j09R7q1n2l1Q6j9m6K8r4J78k43J22r3j11L9L84Q1p0j63k94
13620b66K39N7J00k69J44j12L83k45j33O3K0J21l42L44j67L6N0l5j49K10j35L2
13642e4o7j28K97q0K27n9k17j5K22p8j33N1l62L37j89K35Pj37K38m3nN2j84J37
$$ plain form
13666 52 -72 -25 174 71 102 18 -47 49 64 161 100 -32 -87 -83 -219 -15 -137 96 158 112 -9 8 -258 141 -2
13691 -2 -195 136 -295 -29 44 23 -132 -221 -183 -43 12 -58 10 12 11 -59 -200 -236 -65 -159 -107 -178 111 120 -16 -85 -246
13718 -246 -247 -49 192 83 1 -126 190 -209 115 -152 11 26 -41 -31 24 107 238 6 106 113 -175 -135 155
13741 155 -124 171 -41 -33 -12 -67 -37 -248 -134 69 210 -109 -32 53 -56 -21 45 76 48 13 -28 -169 -184 -21
13765 -21 -101 -6 -186 166 -152 114 42 -80 116 -64 42 -229 68 -37 -35 -258 -62 -118 -30 25 -76 234 -22
13788 -22 -34 -118 -297 -84 144 -176 121 -20 -83 -33 275 -191 -75 -71 -57 -38 167 -165 -27 -76 -140 -11 -29 49
13812 49 -19 58 100 -95 132 -41 -51 41 -35 45 -72 64 194 -98 143 -130 -104 -57 77 -113 -140 -151 118 24
13836 24 186 71 -78 -235 82 80 -114 -171 118 79 -14 -93 -57 131 -159 -27 318 73 172 59 309 274 -203
$$ packed form
13666E2j24M7J99j03L1q4o5R6J5R7o1j32n5Mj36K04j22K33O2m6j21J7k66L99j43
13691bj93L31m31K66P3k1j55q9L8J40N5p0O8Kjp0j41l6J71r4N2p1K89Rj36o9j61
13718b46jJ98K41j09q2j27L16l99L24k67J63J5o7J0N5Q3J31k32J00Pk88M0K90
13741A55k79K95k12QK1n5L0k11J14K03J41l19P7Q5j09L5O6L1k8l5m1j41j5J63
13765b1q0R5j80L52l18K66p2j22J96j80J06k71K97j05Kk23J96n6Q8N5j01L10k56
13788b2j2q4j79K13K28l20K97j41o3N0L08m66J16MJ4J9K05l32J38m9o4J29j8P8
13812D9o8P7M2j95K27j73j0R2p6Q0j17J36J30k92K41k73K6M7J34j90k7j1K69r4
13836B4J62j15j49j57L17kj94n7K89l9r3p9L6J88k90J32L45k45R9j13K50l5m77
$$ plain form
13859 -203 -144 84 429 -34 -251 180 390 -137 40 13 207 -258 -30 -17 140 -28 -57 -70 -78 27 92 -158
13881 -158 -207 77 107 40 126 53 -62 171 46 -1 -44 60 141 -125 170 -97 -166 -151 57 -19 -13 334 -40 -4
13905 -4 9 -109 139 -125 57 125 -176 46 -314 2 -154 33 -88 182 28 -37 -7 59 72 -108 -120 277 78
13928 78 -168 -175 -249 -194 44 19 165 -177 -88 -52 -167 -14 83 65 175 -98 10 332 -56 -100 49 84 69 84
13952 84 -190 110 123 116 3 51 33 -43 126 219 105 174 24 55 203 -240 -46 -14 -65 14 41 6 -145 -118 193
13977 193 -169 163 139 -28 -29 -78 -137 -65 185 -254 75 121 27 -139 52 100 -5 -163 -16 -130 -129 -31 -32 -81 31
14002 31 -101 -70 112 -115 153 263 27 -70 27 216 -259 93 0 -216 15 -37 40 -146 19 69 -164 -182 37
14025 37 15 -108 43 -25 37 97 -123 -24 -196 -62 -94 -3 -68 125 27 61 355 50 175 -244 -266 7 -192 -65
$$ packed form
13859b03N9K28L45m63k17M31K10n27J77k7J94m65K28J3J57j68k9j3qJ05O5k50
13881a58m9K84L0o7Q6p3j15K33j25m7m3J04Q1k66K95k67o9J5K08p6OL47l74L6
13905dJ3j18K48k64J82O8l01K22l60L16j56J87j21K70j54o5L0O6J3j80j2L97j99
13928G8k46pp4N5K38k5J46l42Q9L6j15J53R7j8J10k73J08L22l88m4J49L5j5J5
13952H4k74L00J3pj13M8j8p6J69R3j14O9j50L1J48m43J94L2n1P9K7l5j51K7L11
13977A93l62L32k4j67jm9n9P2K50m39L29M6r4j66J91M8j05j58J47j14JR8jm9J12
14002C1j32L1J82k27K68J10k36r7R7J89m75L52r3k16K31n2P7j86J65N0k33j8K19
14025C7k2j23J51o8O2O0k20R9j72J34l2R1o5J93r8L4K94l05J25m19k2K73j99J27
$$ plain form
14049 -65 -186 -77 13 12 174 138 -201 50 5 39 -52 27 -71 -281 -4 237 -5 23 -119 228 -214 81 -36
14072 -36 177 -11 -182 181 -207 28 -152 -98 79 241 -18 -187 -100 163 -234 26 -36 -139 -70 -172 242
14093 242 111 -119 -37 147 -201 -104 -113 266 37 -30 -65 -152 -117 -58 139 -59 342 54 180 -6 10 -74 -69 -7
14117 -7 157 -340 175 -36 41 -15 82 -206 -344 -107 -72 -199 -25 138 77 -38 -84 -143 -79 -39 -27 58 106 -10
14141 -10 -143 -242 121 13 190 -182 18 -11 -31 216 85 -97 -49 264 -84 -29 15 81 22 -179 48 -2 21
14164 21 191 5 -32 -9 -12 -70 -100 -52 -148 -18 -241 27 125 113 77 172 -38 -41 55 -92 34 124 33 66 187 189 -83
14191 -83 106 -24 -158 -40 -54 -54 87 -121 -184 140 68 16 -20 -82 -104 55 125 -164 110 -25 -16 64 -56 -46 49
14216 49 -40 56 -61 0 -140 2 213 285 191 -109 153 -68 131 -317 119 55 124 -30 63 0 30 28 -158 68
$$ packed form
14049f5j21J09R0jJ62l6l39K51m5L4r1P9r8k10K77K41k42K8j42L47m42K95j17
14072c6K13j88j71L63l88K35j80N4J77J62k59j69Q7K63l97K60o2j03O9j02M14
14093B42j31k30Q2J84l48R7rL79k29o7l5q7L5N9J97j98M01k88J26j86J6q4NO2
14117gJ64m97N15k11P7n6R7k88j38K37L5j27J74J63o1j15m6n9O4M0J2Q5M8j16
14141a0j33r9L63j08J77l72K00k9k0K47j31j82M8L13l48N5M4O6n9k01K27n0K3
14164B1J70j86l7K3ln8l0M8r6J30k23K68R8j2l6R5k10lR6j47J26R0r1L3J21Kk72
14191h3J89j30j34J18j4%J41k08o3L24p2n2l6o2k2J59P0k89K74j35RQ0j20J0R5
14216D9q9R6j17O1j40J42K11P2r4l00K62k21J99m48M36o4O9j54R3o3L0kj86K26
$$ plain form
14240 68 85 273 -55 -25 60 -155 -98 -142 -117 -240 -53 -86 -52 -210 144 -150 186 72 -123 -97 178 39 53
14263 53 85 77 -59 -167 -77 60 120 25 126 -135 -42 105 -96 112 87 113 -43 -146 -45 18 312 -124 49
14286 49 -4 -63 -144 -119 -90 269 150 -32 117 33 -221 -111 197 -54 61 -97 -5 28 -263 220 -86 -80 103
14309 103 -85 76 18 -73 -3 116 59 -113 -212 -244 118 103 178 141 -207 -20 222 -49 30 26 30 276 -108 -131 -5
14334 -5 93 -33 58 171 -139 -81 -267 -19 -62 -32 -29 107 183 -98 -27 -80 -165 -5 68 -265 -43 210 -18 -205
14358 -205 -56 -102 -149 -8 4 184 -34 87 30 5 -46 114 58 -196 -87 165 25 179 -347 -117 157 47
14380 47 -1 -192 -18 169 -104 -73 -117 -65 37 -81 6 151 -146 -40 64 49 -160 48 -27 230 40 26 11
14403 11 -54 -67 -44 -2 91 135 -95 222 180 50 -78 -132 111 -79 -136 -382 109 281 -55 12 -59 -39 -112 6
$$ packed form
14240F8J7J88l28L0Q5k15N7m4K5j23J87l3L4j58L54k94L36j14j95K6K75j39J4
14263E3L2qj36j08R0J37O0r5J01k61R3J47k01K08k5K6j56j03J01O3K94m36J73
14286D9n3n9q1K5K9L59j19j82J49q4k54J10L08k51J15j58R2L3k91M83l06OJ83
14309A03j88J61n8r1P0J19n7j72r9l2L62j5P5l7l48J87K42k71P9mMK46l84k3J26
14334eR8j26R1J13l10N8j86K48m3L0LJ36P6k81P1n3q5J60P3l33K22K53k28j87
14358b05J49m6m7J41J2J80k18J21n7k5n1J60n6k54J09K52j40J54n26K30K74j10
14380D7m8j91J74J87k73L1m4N2J02j18Q7J45k97J06J04j5k09K08p5K57j90j4j5
14403A1o5j3K3M2R3M4k30L17m2j30j28n4K43j90n7k46M91J72l36O7p1K0p3J18
$$ plain form
14427 6 178 46 -48 60 -188 56 -148 33 -134 -95 -71 -161 98 -128 42 -13 133 -252 -110 -58 56 166
14449 166 -96 -132 144 -13 -30 229 -51 120 16 -74 168 -97 -7 188 52 -335 140 123 -91 -5 -85 -29
14471 -29 -218 33 152 -315 -55 100 168 -102 146 -97 41 74 27 -122 -247 185 53 -2 30 57 157 -138
14493 -138 94 79 -94 108 0 -22 -149 115 -165 4 78 -74 -74 -34 -242 -48 -207 135 -134 -45 -130 -8
14515 -8 -66 117 110 -50 -92 102 -13 22 -12 112 67 -305 41 11 132 -2 117 52 105 -39 -31 -186 -149 -280 -80
14540 -80 -109 -8 21 32 -23 100 126 -247 85 -12 55 -183 -53 177 -76 -37 -31 21 -16 -27 27 -16 -96 105 -11
14565 -11 2 -170 -33 28 -102 -30 59 99 -106 90 40 126 -60 229 -19 115 16 -41 -80 120 221 -126 29
14588 29 47 109 -19 -86 -139 252 50 -21 -130 206 -99 -100 178 279 87 -114 -233 -12 -66 168 -36 -56 -21
$$ packed form
14427FJ72j32r4J08k48K44k04J81j67L9K4r0K59k26J70n5J46l85J42N2J14J10
14449A66k62l6K76j57j7K59k80J71j04r0K42k65R0J95j36l87M75j7k14Q6q0N6
14471b9j89K51J19m67K60J55O8k70K48k43J38L3m7j49j25M32j32n5L2K7J00k95
14493a38K32j5j73K02j08k2j27K64k80J69P4j52%M0k08J94j59L42k69Q9q5J22
14515hn8J83pj60m2J94j15L5l4J24m5l72L46l0J21j34J19o5N3j44Qj55L7j31K00
14540h0k9J01K9J1n5J23K6l73L32r7O7k38J30K30k53L9ON2l7j1N4m3q0K01j16
14565a1J3j72J37O1j30P2Q9M0k05J96n0Q6j86K89k48J34r9n7l9K00J01l47J55
14588B9J8O2j28o7n3L91k02p1j09L36l05jK78J01j92k01j19K21n4K34k04k0L5
$$ plain form
14611 -21 50 -106 66 -9 131 6 -23 -135 135 76 74 -25 -23 2 198 -22 83 -14 -255 164 -127 153 -43 171
14635 171 -75 198 66 376 -161 1 -115 20 19 50 142 -156 119 157 -53 -131 -3 57 77 168 96 -347 -183
14658 -183 -29 -122 136 -85 -54 171 -166 -117 155 -30 -59 -76 0 -70 9 -142 -85 -39 -34 117 217 110 83 -144
14682 -144 -105 -37 -43 18 147 322 225 -25 -81 -20 98 -19 -119 -311 23 11 -90 119 -29 27 -138 24 18 69
14706 69 -37 27 70 18 -217 -99 -49 -67 -89 26 32 103 -4 -19 163 159 98 242 63 2 257 -58 43 -116 -140
14731 -140 397 -114 -290 49 -73 -131 21 -182 -13 -28 59 -264 -29 -35 -202 -75 -41 -92 26 -56 -55 48 -58
14754 -58 27 104 -187 -78 91 -18 146 -24 144 -89 208 107 126 287 -17 -60 -40 -144 56 98 182 -4
14776 -4 -45 76 155 56 132 -57 153 80 330 63 0 76 -73 126 -149 107 -96 -224 -15 -59 -205 174 84
$$ packed form
14611b1P1j56J72p5J40j25k9j12K70n9kr9KK5J96k20J05r7k41M19k91K80j96K14
14635A71k46K73j32L10n37J62j16J35jL1R2k98K75L8k10p8J28O0K0R1p2m43J64
14658a83J54r3K58k21L1K25l37M9K72j85k9j7P6p0P9j51N7M6NJ51J00j07k7k27
14682a44L9O8oO1J29J75r7k50n6O1J18j17j00j92L34j2j01K09j48N6j65J62oN1
14706F9j06O4M3n2k35J18N0j8k2J15OP1j07j5J82mo1J44j79o1K55l15J01j59k4
14731a40N37n11j76L39j22n8J52k03J69j5Q7l23K35oj67J27L4n1J18q2JJ03j06
14754e8Q5P7k91J09J69j09J64j70J68k33K97j01J9J61l04m3K0j04K00M2Q4j86
14776dm1J21P9r9P6j89K10p3K50k67o3P6j49J99k75K56k03j28K09m4j46L79r0
$$ plain form
14799 84 -167 -158 -152 144 5 -53 -87 -91 235 -194 -118 445 15 -180 116 -145 -35 1 -78 88 469 -86 -108 96
14823 96 93 163 12 264 4 81 -81 -63 -62 106 143 88 58 -157 -5 -76 60 -60 113 -103 -69 14 -141 55
14847 55 143 52 -120 -293 215 -83 -10 -53 39 85 252 -330 17 207 -16 -65 30 180 -107 -106 48 49 241 107
14871 107 -207 17 -321 58 182 -125 -142 -19 111 147 1 207 64 25 71 107 78 -223 22 -51 -126 8
14893 8 129 299 10 90 -236 83 141 52 -357 -59 -73 -82 -127 198 62 -60 -32 13 -16 -362 238 8 -180 -32
14917 -32 -20 -27 8 111 51 -233 254 39 43 -126 -31 -264 175 151 -247 -136 -13 309 56 20 40 -31 -58 125
14941 125 -155 313 -26 77 -288 -34 8 131 22 -75 -31 83 189 117 194 -8 54 11 -210 -116 152 319
14963 319 176 -174 -34 -25 -221 -196 83 -178 -178 -62 -230 36 170 69 90 -120 -44 -52 205 13 -48 -228 58
$$ packed form
14799H4k51ROK96j39n8l4mL26m29P6N63m30j95K96k61J10L6p9J66L81n55k2K04
14823I6lP0j51K52k60P7j62J8JJ68L7n5l0k15J52p1J36j20J73k16L4Q3j55J96
14847E5Q8r1j72j73N08k98P3m3R2M6J67n82L47J90k23m9R5J50k87JJ54JJ92j34
14871A07l14K24l38L79J24l07j7J23J30L6j46K06j43l9M6L6k9l01K45p3p5J34
14893HJ21J70k89Q0l26L19N8q9m09K98j4rm5L25j36j22K8M5k9l46O00k30j88J48
14917c2J2pL5J03o0k84M87k15Mj69R5k33M39k4l98J11J23L22k53l6K0p1k7J83
14941A25k80M68l39J03l65K54M2J23j09r7M4J14J06p2P7k02O2m3k21R4K68J67
14963C19j43l50J40Rj96K5K79k61%J16j68K66J34j01K1k10P6qK57j92o1j80K86
$$ plain form
14986 58 -130 -142 -160 6 104 117 -31 38 306 38 -89 -221 147 221 -166 13 14 -82 182 77 -96 122 229
15009 229 245 -95 -6 -68 -21 12 -92 -216 26 48 -166 123 183 -217 -39 -115 10 -168 -71 10 158 -142 -238
15032 -238 -99 -218 -245 92 62 46 9 -26 67 -95 1 -108 7 35 -24 -287 -5 -51 -134 -49 -103 -49 35 99 -40
15057 -40 135 229 -72 -79 19 71 -146 115 -197 -213 47 117 -60 -7 27 75 18 -136 63 -94 371 8 -69 61
15081 61 119 104 -84 326 39 113 -117 206 106 -11 16 99 33 -120 -166 -236 17 -181 -22 171 18 -168 -300
15104 -300 -27 40 -66 -121 -64 11 -72 -189 -130 -42 -234 133 69 81 139 25 -47 4 -118 -272 -41 -117 230 -115
15128 -115 67 -82 -128 -152 -54 16 20 -101 -337 26 -8 24 164 57 -245 371 -94 -69 93 92 106 18 -141 74
15152 74 -190 48 91 20 -22 -128 -3 104 138 -61 -69 23 51 31 2 -82 67 107 -156 -144 -40 -21 4 -242 238
$$ packed form
14986E8j88j2j8J66R8J3j48O9K68k68j27j32L68P4l87J79Jr6K64j05j73K18J07
15009B29J6l40Q9o2M7L3j04j24K42K2k14K89O0m00J78p6J25j78R7Q1J48l00r6
15032b38J39j19k7L37l0j6l7l5R3j62R6j09J15K8n9k63K82m6q3Q5n4N4Q4O4j39
15057d0J75R4l01pR8N2k17K61l12j6K60P0j77N3L4M8n7j54J99j57M65l63p7J30
15081F1N8j5j88M10k87P4k30L23j00j17K7Q3o6j53m6p0K53j98J59J93j53j86j32
15104c00K73O7j06n5N7P5q3j17N9Q8j92L67o4J2N8j14p2N1j22j54K31p6L47l45
15128a15J82j49m6k4R8P0Mj21k36L63l4L2J40j07l02O16m65K5J62jJ4q8j59K15
15152G4k64K38M3p1m2j06J25J07L4j99qR2K8k0k9q4J49M0k63J2J04J9K5k46M80
$$ plain form
15177 238 -18 -1 -53 -36 277 -124 1 -216 103 -158 128 -69 -12 83 -22 0 -68 80 -24 264 43 280
15199 280 88 -173 88 101 -56 -75 121 50 223 -45 93 -26 134 0 -148 116 -92 82 -177 69 -42
15220 -42 161 -261 -302 86 -212 76 -56 -163 -24 84 -16 18 75 186 -29 -72 -37 -45 78 -160 -39 228
15242 228 -45 -46 -116 -92 -96 -167 214 -50 -269 -119 192 -126 5 8 -64 108 -86 181 -215 -69 38 -95 -184
15265 -184 -232 -57 -210 -42 -32 -9 -43 -132 -25 -80 74 -97 -44 -18 142 -88 -14 -110 163 -22 -222 -34 -245
15288 -245 -85 -106 -54 23 165 259 -8 -32 -119 -38 17 -8 -139 -209 49 221 50 121 63 117 63 67 -85 41 129
15313 129 -2 2 -228 82 279 156 -146 33 -26 -208 248 86 -59 -2 5 158 82 -47 79 127 -38 145
15335 145 83 -350 -28 -168 -214 -131 -16 76 -141 -21 289 117 -79 24 14 -63 197 -246 142 49 40 -18 -78
$$ packed form
15177B38k56J7n2J7L13m01J25k17L19k61K86j97N7R5j05K2o8J48j04K88k21K37
15199B80j92k61K61J3j57j9J96p1J73k68J38j19J60j34j48K64k08J74k59K46j11
15220d2K03m22m1L88k98K88j32j07J39J08j00L4N7J11k15m3L5qJ23k38J21K67
15242B28k73jp0K4mp1L81k64k19J50L11l18J31Lp2J72j94K67l96J46J07j33q9
15265a84m8J75j53J68J0K3l4q9J07n5J54j71N3K6J60k30P4r6K73j85k00J88k11
15288b45J60k1N2P7J42R4k67k4q7Q1N5k5j31p0K58J72j71P1n8N4n4Mj52J26Q8
15313A29j31Mk30L10J97j23l02J79n9j82M56j62j45N7PJ53p6j29J26M8j65J83
15335A45o2m33L22j40m6Q3J15R2k17J20L10j72j96J03j0p7K60m43L88r3rn8o0
$$ plain form
15358 -78 87 -25 12 -197 -77 -111 0 -115 -12 -46 33 -306 158 58 53 88 -138 -187 -19 139 59 144 -123
15381 -123 -175 14 92 -65 73 -158 91 20 -59 -96 193 -99 -5 -162 -190 206 255 -220 20 97 199 147 -127
15404 -127 47 -27 176 -84 -209 66 -252 16 2 70 76 46 2 -122 81 36 -65 -139 -21 -34 164 -5 -153
15427 -153 -55 -225 10 -73 31 -105 58 97 -16 205 -60 -12 44 196 21 12 8 150 -52 -64 -65 121 159 -234
15451 -234 82 -87 24 -286 -300 59 65 91 -82 -276 -101 -51 -97 335 177 241 94 -6 -211 -52 -240 -240 21
15474 21 -135 -153 150 18 -137 -1 22 -3 2 -240 -38 10 96 -244 158 -27 290 -1 245 35 64 144 -19
15497 -19 203 -123 -69 40 117 39 -102 95 -126 -10 223 30 215 -5 128 -260 156 51 -64 62 -1
15518 -1 -230 34 -95 -116 8 -6 -17 -145 8 -40 61 -121 35 5 56 134 -120 193 24 -93 63 35 54
$$ packed form
15358g8J65j12L7k09J20l4J11j15J03l4P9l39M64j00nL5k26m9J68J58q0Q5k67
15381a23n2J89P8j57J38k31K49p1p9l7K89k92R4j57k8L96M9m75K40P7J02n2k74
15404a27J74p4K03k60j25K75l18K68j4O8Ol0m4j24K03m5j01p4J18j3J98j69j48
15427a53R8j70K35q3J04j36J63L9j13K21k65M8N6J52j75rmJ42k02j2jJ86L8l93
15451b34L16j69J11l10j4L59OK6j73j94J75N0m6M32j58O4j47j00k05J59j88%K61
15474B1j56j8L03j32j55J36K3k5Nk42K02M8Q6l40M02j85L17k91K46k10K9Q0j63
15497a9K22l26N4J09P7p8j41J97k21J16K33j93J85k20J33l88M16j05j15J26o3
15518ak29K64j29k1J24j4j1j28J53m8J01j82J56l0N1P8k54L13j69j17J56k8J9
$$ plain form
15541 54 108 132 267 -72 28 138 265 154 -24 -31 -178 106 -50 -207 131 -145 -180 -118 -14 -147 45 38 25
15564 25 -45 100 152 -59 -49 -173 -139 -22 78 -77 -98 -171 58 49 -212 29 -30 -97 -148 -78 -4 -79 142 -129 110
15589 110 81 -201 -13 33 146 92 -81 139 -30 13 -170 54 -124 90 -215 -11 48 -182 -146 65 62 62 52
15612 52 -12 -54 -159 163 -142 -192 -73 -106 -106 0 78 28 -201 -110 68 202 -164 -192 -176 7 -179 259 -4 323
15636 323 -225 8 103 -21 80 168 -113 -113 -67 -157 44 -62 -36 -26 -135 -232 -58 167 236 23 -64 -37 173 118
15660 118 34 307 0 106 -76 -231 10 -118 -254 -57 113 -118 18 85 175 158 79 199 48 0 47 -18
15682 -18 65 104 113 82 168 147 -55 54 94 220 -18 74 256 -22 42 60 108 -15 -84 -36 47 193 -94 128 128 -23
15708 -23 208 -116 73 28 3 312 51 147 -166 89 -176 68 158 -167 -5 40 51 -42 30 10 -1 136 466
$$ packed form
15541E4N4K4J35l39J00J10J27j11j78pj47K84j56j57L38k76l5O2J04j33J92pj3
15564B5p0J45N2k11J0j24L4J17J00j55k1p3K29rk61K41n9o7n1P0P4p5K21k71K39
15589A10k9k82J88M6J13n4j73K20j69M3j83K24j78K14l05K04N9k30L6K11l%j0
15612E2o4m2j05L22l05n0J19l3%J06P8n0k29R1J78J34l66k8J6J83j86M38k63L27
15636C23n48K33R5j24J01Q8k81%M6r0K01j06K6J0j09r7J74K25O9k13q7K7K10n5
15660A18q4K73l07J06j82j55K41j28j36J97J70k31J36O7R0j7p9J20j51m8M7o5
15682a8Q3L9Rl1Q6k1k02J09M0J26k38R2J82k78O4J8M8j23o9M8Q3J46k87K22%j51
15708b3K31l24J89m5k5L09k61R6l13K55k65K44R0l25J62M5J1r3P2k0j1J37L30
$$ plain form
15731 466 125 110 225 117 -95 -73 -73 -62 -125 -46 -285 20 -93 -66 42 139 -138 -199 -129 -61 65 80 26 80 -55
15756 -55 -265 20 59 30 69 -86 297 89 -52 -55 93 13 32 180 -163 121 -272 -27 12 165 2 122 20
15779 20 -150 7 -78 258 -219 30 -19 -5 106 -106 -231 170 -34 -111 206 40 -50 -7 4 -21 10 -258 61
15802 61 43 -123 -156 188 15 -130 55 121 -30 8 -158 148 -81 -260 -142 -106 -94 -148 122 219 -125 -155 234
15825 234 -51 14 -35 208 141 105 -14 -148 93 -100 200 -10 248 -21 85 -124 -39 -13 154 -60 -100 -121
15847 -121 -209 -54 128 -168 0 165 -229 21 -8 -25 -221 104 -6 -52 -89 166 -7 -42 -36 160 106 2 187
15870 187 -85 -164 7 -23 -30 -111 -125 -113 196 57 98 288 125 145 94 90 -112 -93 113 242 -111 27 23 -104 17
15895 17 22 -130 -79 55 -47 -39 43 -1 -37 280 100 205 -62 -159 -120 -57 -71 309 190 64 -36 227 -24 389
$$ packed form
15731D66l41j5J15j08k12K2%J1o3P9k39L05j13K7J08R7k77o1P0O8J26J5n4N4j35
15756e5k10K85L9k9L9j55L83k08j41lJ48q0J9J48l43K84l93K45L9J53j63J20j02
15779B0j70J57q5L36m77K49m9J4J11k12j25M01k04p7L17j66r0M3J1k5L1k68L19
15802F1j8j66l3L44j73j45J85O6j51L8j66L06k29j79J18L6J2n4K70R7l44l0L89
15825B34k85O5m9K43o7l6j19j34K41j93L00k10K58k69J06k09Q5K6J67k14m0k1
15847a21q8J55J82k96J68J65l94K50k9j7j96L25j10m6l7K55j73l5OJ96n4j04J85
15870A87k72p9J71l0pq1j4J2L09j39M1J90j63K0n1mk02J9K06J29l53J38mj27J21
15895A7Nj52N1J34j02QQ2m4l6L17j80J05k67r7L9O3j4L80j19j26j00K63k51M13
$$ plain form
15919 389 116 -21 -5 -199 -193 -120 142 -148 100 16 177 51 45 -106 167 4 -255 182 23 -104 -234 107
15941 107 172 93 -59 -128 -93 97 -99 111 26 -81 -282 -35 -62 -72 -51 245 -15 -295 35 58 -112 -309 -182
15964 -182 -13 50 67 13 -76 112 66 9 -10 24 7 -282 39 278 206 -123 31 -108 -253 -7 72 5 -81 -75 147
15989 147 -52 -78 186 -306 138 -161 -136 44 -1 56 -128 -69 -125 -195 -36 53 150 -79 6 -112 27 -72 113
16012 113 154 20 28 -93 -234 49 61 -140 119 -10 3 53 142 -17 18 84 248 134 89 -95 -83 23 201
16035 201 26 156 129 5 -12 -182 -41 -95 175 -208 183 -36 40 199 41 60 -115 99 17 -109 -305 -181
16057 -181 -161 -201 159 28 41 -63 186 -12 -162 -5 -42 30 185 85 -299 135 -51 1 142 -71 -113 -116 -55
16080 -55 20 -307 -2 -18 1 -86 -43 -186 73 94 82 29 -5 -11 -87 -203 96 -2 -117 77 188 -8 40 -55 70
$$ packed form
15919C89k73j37J6j94OP3K62k90K48q4J61j26oj51K73j63k59M37j59j27j30L41
15941A07O5p9j52o9L5J90j96K10q5j07k01K47k7j0K1K96k60k80L30K3j70j97J27
15964a82J69O3J7n4q9J88m6n7j9L4j7k89L21K39p2l29J54j39j45K46P9o7q6OK22
15989A47j99k6K64m92M44k99K5J80m5N7j84N9n6p0J59Q9R7k29Q5j18J39r9J85
16012A13M1j34Qj21j41K83J2k01K59j29J3N0Q9j59L5O6J64j14m5j84J2J06J78
16035B01j75J30k7j24j7j70J41n4K70l83L91k19P6J59j58J9j75K14q2j26j96J24
16057a81K0m0L60j31J3j04K49j98j50J57l7P2J55j00l84M34j86N2J41k13m2lO1
16080e5P5l27L05j6J9q7M3j43K59K1j2n3l4op6j16K99r8j15J94J11j96M8r5J25
$$ plain form
16105 70 63 -133 5 -93 143 149 -164 74 40 3 66 61 14 -56 12 241 -11 -112 36 -32 187 -107 -66 163 -135
16130 -135 -50 189 -181 98 -39 104 168 157 37 -100 85 -108 27 -288 19 -64 -130 -114 -61 -41 90 -120
16152 -120 -44 -218 -217 203 -79 216 -24 -3 -73 -206 -124 58 -9 -97 155 250 34 184 138 274 -82 -20 -105 -40
16176 -40 -41 100 -172 -73 -127 -191 -15 -103 45 52 -173 -49 -170 -121 165 -164 -53 -9 66 25 -310 50 -274 -21
16200 -21 -41 -165 96 57 53 18 -176 -38 316 102 -69 65 -334 12 17 -151 -28 19 -227 10 274 -29 -180
16223 -180 -71 -140 -67 296 -57 2 152 -15 -252 53 28 -192 -158 105 8 52 -49 -30 72 -184 -67 -110 -174
16246 -174 -13 -31 -55 -50 -59 29 -258 181 -235 -114 -21 -87 -137 -10 -142 -3 40 -87 -85 -59 77 125 -78 323 -97
16271 -97 36 69 -10 -344 191 -109 33 -106 -77 -120 130 -108 205 -43 15 93 -92 -247 -232 26 -99 36
$$ packed form
16105G0pj96J38r8K36Ol13K38l4l7O3nm7p0O8K29k52j01J48o8K19k94M1K29k98
16130a35Q5K39l70K79j37J43O4j1j20j37J85j93J35l15L07q3o6J6N3K0J31k10
16152a20P6j74JM20k82K95k40K1p0j33Q2J82o7q8K52R5k16J50m6J36l56O2q5O5
16176d0jJ41k72R9n4o4J76q8J48Pk25J24j21M9K86l29J11M4P5m1l35L60l24K53
16200b1k0j24K61l9ml5j94J38L54k14j71J34l99L46Nj68J23M7k46K37K64l03j51
16223a80J09o9P3L63l53N9J50j67k37L05k5k20L4K63r7M4j01J9J02k56J17m3o4
16246a74J61j8k4NrQ8k87M39m16J21R3o6n0J27j32J39M3j27KK6J36M8k03M01m20
16271i7J33L3p9l34N35l00J42j39K9m3K50k38L13k48N8P8j85j55J5K58j25J35
$$ plain form
16293 36 131 130 -82 -48 -228 148 -15 38 -15 -28 58 -48 19 -35 -163 51 61 -257 97 260 79 8 -209 -333
16317 -333 -138 -109 -202 -121 -16 123 110 -139 51 37 -25 -136 28 -68 89 -43 3 -92 115 -175 -45 48 7
16340 7 34 109 -242 -85 -129 -106 81 69 -63 18 -99 -97 -106 -31 133 -9 261 -77 92 -86 130 135 -32 188 132
16365 132 128 247 5 39 155 96 -60 210 -68 -127 -241 182 114 62 77 -54 11 -40
$$ packed form
16293C6R5jk12L4j80L76j63N3n3j3Q6j06O7n4j28K14J0l18L54J63j81p1k17j24
16317c33J95K9r3Q1J05J39j3k49J90j4o2j11J64r6J57j32M6r5K07k90J30R3m1
16340GK7P5l51J57m4K3J87j2j32Q1j17KrP5J64j42K70l38J69j78K16Nj67K20n6
16365A32mJ19k42L4J16n9j56K70k78n9j14M23o8n2J5j31O5n1
16383d0
$$ Imaginary data points
##PAGE= N=2
##DATA TABLE= (X++(I..I)), XYDATA
$$ plain form
0 0 0 0 0 0 0 0 0 0 0 0 0 0 0 0 0 0 -32 32 -32 32 -32 33 -64 64 -64 96 -96 128 -128 160 -172 193 -224 256 -288
35 -288 321 -353 410 -449 507 -557 619 -686 763 -841 928 -1024 1128 -1239 1367 -1508 1659
52 1659 -1831 2023 -2234 2484 -2751 3074 -3450 3895 -4433 5097 -5943 7064 -8613 10911
66 10911 -14667 21780 -40132 200012 229726 -206875 -261499 -67463 157335 119681 2197
77 2197 -58144 19820 28450 -76329 -136450 -14836 137506 133697 -17955 -117964 -80353 54603
89 54603 85910 -2353 -61146 9886 75109 5576 -96083 -85970 17215 85781 26731 -64704
101 -64704 -58392 46604 74051 -28157 -86719 56 118185 91291 -54132 -128394 -32339
112 -32339 113173 93632 -61172 -129844 -26600 97666 81029 -31038 -98937 -40952 68090
$$ packed form
0@%%%%%%%%%%%%%%%%l2O4o4O4o4O5r7J28j28J60j92K24k56K88l32L65m17M80n44
35b88O09o74P63q59R56j064J176j305J449j604J769j952K152k367K606k875L167
52A659l490L854m257M718n235N825o524P345q328R530j1040J3007j5677J9524
66A0911k5578L6447o1912K40144K9714m36601n4624J94036K24798l7654j17484
77B197o0341P7964Q630j04779o0121J21614J52342l809j51652j00009L7611J34956
89E4603L1307q8263n8793P1032O5223o9533j01659J0113J03185O8566n9050r1435
101f4704O312J04996K7447j02208n8562Q6775J18129k6894j45423p4262R6055
112c2339J45512j9541j54804o8672J03244J24266j6637j12067o7899N7985J09042
$$ plain form
123 68090 82647 1664 -48992 -3698 39342 2552 -52238 -35873 45996 76194 -8383 -104683
135 -104683 -74446 47603 88263 12141 -60040 -41578 27251 52302 12472 -30923 -11611 27834
147 27834 9522 -33270 -21056 35503 45143 -19138 -82622 -61339 42895 106697 45224 -62925
159 -62925 -84968 -9847 56464 53831 6853 -18866 2044 13291 -27283 -60137 -10816 65147
171 65147 60777 -16642 -72475 -47679 17692 44689 14239 -10724 13605 31085 -4322 -46270
183 -46270 -36288 15416 55742 43949 -15715 -60758 -41146 3128 16796 12323 19976 22259 -2958
196 -2958 -36982 -43354 2006 64545 65274 -8514 -64503 -38131 18587 36112 10546 -22441 -24122
209 -24122 3511 15541 -9003 -20742 6600 24885 8031 -10249 -6393 9145 20687 10765
$$ packed form
123F8090J4557q0983n0656M5294M3040l6790n4790J6365Q1869L0198q4577r6300
135a04683L0237J22049M0660p6122p2181J8462O8829K5051l9830m3395J9312L9445
147B7834j8312m2792J2214N6559R640o4281o3484K1283J04234O3802o1473j08149
159f2925k2043P5121O6311k633m6978k5719K0910J1247m0574l2854M9321P5963
171F5147m370p7419n5833K4796O5371K6997l0450k4963K4329J7480l5407m1948
183d6270R982N1704M0326j1793n9664m5043J9612M4274J3668m473P653K283k5217
196b958l4024o372M5360O2539P29p3788n5989K6372N6718J7525k5566l2987j681
209b4122K7633J2030k4544j1739K7342J8285j6854j8280L856J5538J1542r922
$$ plain form
221 10765 -19874 -26799 5095 26858 7330 -21215 -26560 -11768 11829 19219 -552 -11780 5118
234 5118 13479 -4150 -8057 13784 20781 2908 -15941 -19532 -3914 17334 11436 -18761 -27190
247 -27190 -3526 15038 11729 1017 -6679 -4584 11802 17817 172 -9646 2817 10876 579
260 579 -9232 -10883 -7826 265 380 -9550 -5951 11463 12247 -6875 -12499 2764 18522 21502 7382
275 7382 -13326 -16877 -1879 5394 362 -129 -686 -9479 -14021 -8249 -669 9482 19030 11318 -8171
290 -8171 -11974 2299 14034 14410 3593 -11148 -12497 -972 140 -9412 -7150 2258 1703 -3352
304 -3352 -1436 1807 5064 8626 5875 1 4124 9252 1285 -8325 -8200 -5034 -930 4225 -910
319 -910 -13313 -11716 1851 8144 6176 5106 3056 1616 4290 2953 -1884 2666 8955 -759 -13539
$$ packed form
221A0765l0639o925L1894K1763j9528k8545n345J4792K3597P390j9771j1228J6898
234E118Q361j7629l907K1841O997j7873j8849l591J5618K1248n898l0197q429
247b7190K3664J8564l309j0712p696K095J6386O015j7645r818J2463Q059j0297
260E79r811j651L057Q091J15r930L599J7414P84j9122n624J5263J5758K980j4120
275G382k0708l551J4998P273n032m91n57q793m542N772P580J0151R548p712j9489
290h171l803J4273J1735L76j0817j4741j349J1525J112r552K262R408n55n055
304c352J916L243L257L562k751n874M123N128p967r610J25L166M104N155n135
319i10j2403J597J3567O293j968j070k050j440K674j337m837M550O289r714j2780
$$ plain form
334 -13539 -10927 -2592 2 1010 -978 -5448 -1688 5888 4274 367 5092 7903 3571 2364 1125
349 1125 -5763 -5654 2000 113 -7679 -5329 -116 -2663 -3838 -1137 995 6743 11435 2858 -6825
364 -6825 -498 8614 4967 -697 -1358 -5069 -7080 -2377 -2146 -5192 -199 3334 -2512 -4094 2555 5266
380 5266 4746 7106 3563 -4166 -945 5464 652 -6005 -3348 -1435 -3386 -1966 -3036 -6499 -243
395 -243 7320 2491 -2322 3885 5882 -165 122 3549 1816 1142 2119 -4845 -9987 -3876 1688 -52
411 -52 197 104 -4389 -3391 4639 4706 1026 5451 7806 -19 -4305 -1455 18 252 1736 -2456 -7351
428 -7351 -2774 792 -3620 -3745 2636 3864 1857 4000 3127 -781 794 3197 484 -87 3216 -38
444 -38 -5608 -5420 -4756 -4643 478 5222 790 -2517 1351 2036 -396 1255 4816 5792 6441 2422 -7678
$$ packed form
334a3539K612Q335K594J008j988m470L760P576j614l907M725K811m332j207j239
349A125o888J09P654j887p792K350N213k547j175K701K132N748M692q577r683
364f825O327R112l647n664o61l711k011M703K31l046M993L533n846j582O649K711
380E266n20K360l543p729L221O409m812o657K657J913j951J420j070l463O256
395b43P563m829m813O207J997o047K87L427j733o74R77o964n142O111N564j740
411e2K49r3m493R98Q030O7l680M425K355p825m286K850J473K34J484m192m895
428g351M577L566m412j25O381J228k007K143q73l908J575K403k713n71L303l254
444c8n570J88O64J13N121M744m432l307L868O85k432J651L561R76O49m019j0100
$$ plain form
461 -7678 -10600 -2583 2400 964 787 -1004 -6807 -7211 -1010 2814 4947 9049 6849 -99 -2822 -2560
477 -2560 -1276 3035 6856 1093 -7170 -7769 -5875 -4427 1089 4142 -94 -2393 1627 4274 4579 4609
493 4609 451 -3685 1544 7346 3128 -4052 -6481 -7649 -6675 -856 2015 421 1578 3221 -1005
508 -1005 -3908 -97 4275 8247 12638 6439 -8307 -13196 -5532 1074 3972 4421 -1498 -8148 -7337
523 -7337 -3284 -1334 3966 9986 8777 4276 1214 -4634 -8443 -469 9715 7516 -1392 -8230 -12683
538 -12683 -9674 1738 6848 1354 -1728 901 1927 3167 5446 1252 -2656 3454 8166 2634 -3692
553 -3692 -6134 -8223 -5916 107 849 -1214 2645 5198 -1823 -6322 -1995 3173 8683 14601 8891
568 8891 -7523 -15120 -8828 836 8097 8642 -1977 -12346 -9380 -2294 417 4721 8330 5682 2531
$$ packed form
461g678k922Q017M983j436j77j791n803m04O201L824K133M102k200o948k723K62
477b560J284M311L821n763q263n99J894J448N516L053m236k299M020K647L05L0
493D609m158m136N229N802m218p180k429j168R74N819K871j594J157J643m226
508a005k903L811M372L972M391o199j4746m889P664O606K898M49n919o650Q11
523g337M053J950N300O020j209m501l062n848l809P974J0184k199q908o838m453
538a2683L009J1412N110n494l082K629J026J240K279m194l908O110M712n532o326
553c692k442k089K307O023P42k063L859K553p021m499M327N168N510N918n710
568H891j6414p597O292R664P261N45j0619j0369K966P086K711M304L609k648l151
$$ plain form
583 2531 2613 -2266 -7532 -1401 8488 8037 1125 -6410 -12686 -9792 2160 7009 1196 -2857 -1055 1082
599 1082 3401 5082 893 -2165 2633 6165 2145 -1984 -3699 -5569 -3531 680 -1548 -5370 89
614 89 6508 3884 -2957 -5880 -4739 3949 14533 13464 17 -10889 -12368 -5522 6040 11239 2786
629 2786 -7493 -8415 -5203 -3265 789 5228 6134 6459 4047 -4001 -9450 -3285 7394 10899 5935
644 5935 -4148 -12335 -9357 992 4567 703 -1417 -1463 -193 2438 1844 -3036 -1501 5765 8320
659 8320 3340 -1617 -4978 -5202 -521 3280 -235 -4461 -2876 -452 546 1082 -1666 -4600 892 9000
675 9000 8044 1660 -3100 -5797 -4404 3489 7178 573 -5130 -4252 -3963 -4132 -1265 1130 2383 5792
691 5792 4743 -3261 -6246 391 6110 7167 5620 -2004 -8931 -5678 1882 1634 -2096 -1654 -1731 -2952
$$ packed form
583B531Q2m879n266O131R889m51o912p535o276K894J1952M849n813m053J802K137
599A082K319J681m189l058M798L532m020m129j715j870K038M211k228l822N459
614H9O419k624o841k923J141Q688J0584j069j3447j0906j479O846J1562N199q453
629B786j0279r22L212J938M054M439R06L25k412q048n449O165J0679L505m964
644E935j0083q187K978J0349L575l864k120m6J270K631n94m880J535P266K555
659H320m980m957l361k24M681L801l515m226J585K424R98N36k748k934N492Q108
675I000r56o384m760k697J393P893L689o605n703Q78K89j69K867K395J253L409
691E792j049q004k985O637N719J057j547p624o927L253P560k48l730M42p7j221
$$ plain form
707 -2952 723 2841 -94 132 3926 2769 1540 3028 1677 -2087 -2074 -582 -2451 -3032 -183 -1257
723 -1257 -2931 207 -191 -3519 -677 5931 5886 2578 1366 -1234 -3219 955 3950 250 -2606 -1307
739 -1307 -3161 -5114 -4011 -1610 666 5018 5371 -1106 -3526 1466 4416 3568 4231 2019 -2813 -3894
755 -3894 -2400 -3276 -2579 1481 617 -3044 -3150 -723 706 3149 4658 1723 730 2850 1899 -1218 -741
772 -741 148 -1866 -2654 -2147 -3167 -2826 342 21 -2586 -43 4112 4065 2244 1247 513 823 2493 993
790 993 -2483 -2396 -708 -2605 -3286 -2125 -1525 -866 1871 1874 -631 754 4030 3180 1044 990 926 113 15
809 15 -1640 -3873 -2404 -33 -1658 -2933 -964 597 691 1910 1943 827 2408 3836 736 -1206 494
826 494 1248 -1121 -2155 -2781 -3531 -1142 1159 -841 -2546 677 2199 1311 1930 2892 1088 1349 2604
$$ packed form
707b952L675K118k935K26L794j157j229J488j351l764J3J492j869n81K849j074
723a257j674L138l98l328K842O608m5l308j212k600j985M174K995l700k856J299
739a307j854j953J103K401K276M352L53o477k420M992K950q48O63k212m832j081
755c894J494q76O97M060q64l661j06K427J429K443J509k935r93K120r51l117M77
772g41Q89k014p88N07j020L41L168l21k607K543M155m7j821r97p34L10J670j500
790I93l476Q7J688j897o81J161O00O59K737Lk505J385L276q50k136n4o4q13r8
809A5j655k233J469K371j625j275J969J561R4J219L3j116J581J428l100j942J700
826D94P54k369j034o26p50K389K301k000j705L223J522q88O19R62j804K61J255
$$ plain form
843 2604 -863 -3030 366 793 -2651 -3781 -1115 -1628 -1218 1160 -185 -1022 2248 3915 427 275
859 275 2603 1216 160 1089 -776 -3259 -572 568 -3098 -3692 380 997 -848 304 938 -16 2429
876 2429 4163 715 -1050 1534 1223 -1494 -431 -15 -2310 -1709 -323 -2505 -2262 1347 1913 -1238
892 -1238 -168 2237 1367 1660 2736 134 -1440 1092 1005 -2214 -2392 -596 -1378 -1694 -811 -1393 -1673 1336
910 1336 2305 -773 556 3266 1957 488 1235 558 -1235 -58 119 -2207 -2396 -419 -919 -2012 -237
927 -237 60 -36 1922 2543 416 1158 3022 1195 -635 176 369 -1131 -929 -1535 -3351 -2526 553 -38
945 -38 -1437 261 1565 920 1477 2354 1039 1156 2435 957 -1599 -666 -711 -2581 -2322 -1039 -1495 -1116
963 -1116 1033 324 -1541 858 3662 2513 1702 1848 321 -824 301 -647 -2197 -882 -161 -2835
$$ packed form
843B604l467k167L396M27l444j130K666n13M10K378j345q37L270J667l488j52
859B75K328j387j056R29j865k483K687J140l666n94M072O17j845J152O34r54K445
876B429J734l448j765K584l11k717J063M16k295O01J386k182K43L609N66l151
892a238J070K405q70K93J076k602j574K532q7l219j78J796p82l16Q83n82k80L009
910A336R69l078J329K710j309j469P47o77j793J177J77k326j89J977n00j093J775
927b37K97r6J958O21k127P42J864j827j830Q11J93j500K02o06j816Q25L079n91
945c8j399J698J304o45N57Q77j315J17J279j478k556R33m5j870K59J283m56L79
963a116K149p09j865K399K804j149q11J46j527j145J125r48j550J315P21k674
$$ plain form
979 -2835 -3412 -1148 -396 -87 2326 1742 51 1856 3030 1309 399 1470 346 -1214 -431 -1672 -3847
996 -3847 -2397 -539 -1463 -1335 1415 1360 250 1680 1750 737 2116 3062 276 -1252 221 -922 -3695
1013 -3695 -2385 -948 -1539 -495 635 -1628 -2042 1818 3273 1861 2395 2900 267 -454 727 -1334
1029 -1334 -2325 821 1330 -2989 -4195 -2247 -1508 425 3059 2069 -353 1340 2290 580 1127 2638
1045 2638 1002 -1402 -164 -1202 -3190 -2088 -1089 -2094 -1214 1608 820 -1054 845 2128 1167 1925
1061 1925 2106 30 -243 1879 -212 -3954 -3465 -565 523 731 -685 -3327 -2370 2216 3134 536
1077 536 1008 2575 1766 542 9 -2088 -1742 1503 1815 -1510 -3238 -2897 -2343 94 2410 1342 98
1094 98 1138 743 -203 1628 2644 541 -821 351 -105 -1466 -1706 -2250 -2427 382 2103 -513 -2354
$$ packed form
979b835n77K264P52L09K413n84j691J805J174j721r10J071j124j560P83j241k175
996c847J450J858r24J28K750n5j110J430P0j013J379R46k786j528J473j143k773
1013c695J310J437n91J044J130k263m14L860J455j412N34N05k633p21J181k061
1029a334r91L146N09m319j206J948P39J933K634r90k422J693R50j710N47J511
1045B638j636k404J238j038j988J102R99j005Q80K822p88j874J899J283r61P58
1061A925J81k076k73K122k091l742M89K900J088K08j416k642R57M586R18k598
1077E36M72J567q09j224n33k097L46L245L12l325j728L41N54K437K316j068j244
1094I8J040l95r46J831J016k103j362J172m56j361k40n44j77K809J721k616j841
$$ plain form
1111 -2354 -133 1844 1748 1770 22 -459 2048 3851 -34 -4265 -2948 17 1343 1347 -1111 -4318 -2380
1128 -2380 1805 1584 -433 999 2260 1819 1186 -234 -1646 -85 2518 1286 -1160 -1762 -2349 -3225
1144 -3225 -1155 1414 1164 222 195 -952 -668 2733 3409 665 -246 1035 656 99 -1313 -2956 -2506
1161 -2506 1291 1618 -2696 -3716 -313 1839 2575 1437 -1320 -625 3345 4760 -25 -2660 -1093 192
1177 192 -13 480 -1327 -3359 -1281 231 -1517 -910 2067 1999 1038 1653 610 -397 1129 2382 -178
1194 -178 -818 754 -1187 -4744 -3069 435 481 -4 -257 -1707 -365 3696 2874 -659 30 2579 1835
1211 1835 260 -1274 -3293 -2207 1765 957 -3729 -3926 -326 990 845 886 39 514 3558 3362 -672
1228 -672 -1424 1004 712 -1021 -1066 -1364 -1886 -853 -1112 -2572 -631 2581 1692 -365 1156 2128 918
$$ packed form
1111b354K221J977r6K2j748m81K507J803l885m231J317K965J326Mk458l207J938
1128b380M185k21k017J432J261m41o33j420j412J561K603j232k446o02n87q76
1144c225K070K569k50r42k7j147K84L401O76k744r11J281l79n57j412j643M50
1161b506L797L27m314j020L403K152P36j138k757O95L970J415m785k635J567J285
1177A92k05M93j807k032K078J512j748O07K977o8r61O15j043j007J526J253k560
1194a78o40J572j941l557J675L504M6m85k53j450J342M061q22l533O89K549p44
1211A835j575j534k019J086L972q08m686j97L600J316j45M1q47M75L044j96m034
1228f72p52K428k92j733m5k98n22J033k59j460J941L212q89k057J521R72j210
$$ plain form
1245 918 1141 1299 -270 91 1217 -1247 -4288 -2650 177 264 -52 -1069 -1885 532 3641 2147 -837
1262 -837 786 3095 1758 -257 -1328 -1840 -632 951 -1133 -3769 -1800 949 142 -614 9 512
1278 512 1710 2910 1318 -533 776 2061 -44 -1691 -1171 -1041 -771 -660 -1857 -2694 -189 2324
1294 2324 554 -648 1105 2417 1901 942 -392 -586 1213 1344 -1631 -3338 -1155 -83 -870 -842 -1298
1311 -1298 -942 1250 2275 -107 -714 1976 2796 858 -144 -562 -679 651 393 -2447 -3068 269 604
1328 604 -1277 -1145 -175 528 1880 1948 -366 -647 2517 2360 -1004 -1126 209 57 -571 -836 -2363 -2233
1346 -2233 784 978 -1587 -862 1505 1294 602 1414 182 -70 1918 1261 -1950 -2273 1009 371 -1898
1363 -1898 -1423 -1011 -549 852 930 -1211 -459 2413 2264 -484 135 1146 262 853 283 -2047 -1530 957
$$ packed form
1245I18K23J58j569L61J126k464l041J638K827Q7l16j017q16K417L109j494k984
1262h37J623K309j337k015j071n12J208J583k084k636J969K749q07p56O23N03
1278E12J198J200j592j851J309J285k105j647N20J30K70J11j197q37K505K513
1294B324j770j202J753J312n16r59j334j94J799J31k975j707K183J072p87K8m56
1311a298L56K192J025k382o07K690Q20j938j002m18j17J330k58k840o21L337L35
1328F04j881J32R70P03J352O8k314k81L164j57l364j22J335j52o28k65j527J30
1346b233L017J94k565P25K367k11o92Q12j232k52J988o57l211l23L282o38k269
1363a898M75M12M62J401P8k141P52K872j49k748O19J011q84N91n70k330N17K487
$$ plain form
1381 957 71 -2489 -1887 250 207 444 613 -421 254 2895 1909 -839 -135 1537 256 -789 -1078 -1605
1399 -1605 -1195 369 -635 -2517 -815 1778 900 -176 689 1075 954 1928 1066 -1013 -392 1176 -197
1416 -197 -1920 -1369 -1231 -922 55 -373 -1667 242 2403 1153 -324 998 1758 1104 405 4 -1179
1433 -1179 -435 522 -1128 -2707 -1429 -196 -298 -316 -39 -279 1161 2353 1032 40 964 1874 464
1450 464 -384 -652 -1261 -789 -291 -1895 -2390 -172 1355 -27 -277 734 1504 1966 1961 363 -223 887
1468 887 811 -1278 -1585 -779 -1020 -1143 -493 -1410 -1498 753 1559 -251 -28 1792 1702 1227 1109 -348 -796
1487 -796 504 456 -2150 -2391 -576 -674 -1165 -207 -65 -202 1332 1975 148 350 2361 1621 -664 -42
1505 -42 204 -1581 -928 -357 -1835 -1623 390 237 -1099 -221 1356 810 1387 1618 371 -59 1709 1098
$$ packed form
1381I57q86k560O02K137m3K37J69j034O75K641r86k748P04J672j281j045k89n27
1399a605M10J564j004j882J702K593q78j076Q65L86j21R74q62k079O21J568j373
1416a97j723N51J38L09R77m28j294J909K161j250j477J322P60o54o99m01j183
1433a179P44R57j650j579J278J233j02j8K77k40J440J192j321r92R24R10j410
1450D64q48k68o09M72M98j604m95K218J527j382k50J011P70M62nj598n86J110
1468H87p6k089l07Q06k41j23O50r17q8K251Q06j810K23J820r0m75j18j457m48
1487g96J300m8k606k41J815r8m91R58J42j37J534O43j827K02K011p40k285O22
1505d2K46j785O53N71j478K12K013j53j336Q78J577n46N77K31j247m30J768o11
$$ plain form
1523 1098 -1877 -1208 -6 -876 -1440 -949 -1025 -1454 622 829 -556 334 2355 1177 395 1297 452 -442
1541 -442 567 305 -1596 -1751 154 -480 -1740 -574 373 -393 615 1220 5 448 1994 1189 -254
1558 -254 375 641 -684 -800 -344 -1576 -1460 225 -316 -1350 -145 1041 229 413 1389 768 376 1245
1576 1245 510 -855 -232 377 -902 -768 -377 -760 -888 30 -179 -607 752 1861 376 -83 855 831
1594 831 480 675 104 -1110 -354 326 -1280 -1772 -708 -285 -394 456 151 -427 572 1545 880 209 968
1613 968 417 -288 76 24 -1050 -558 -26 -886 -1132 -197 -68 -644 226 909 457 1000 1148 -91 107 711
1633 711 246 -1348 -838 11 -956 -851 -531 -1411 -1154 929 1074 -346 -265 948 1047 1204 1210 -149 -715 918
1653 918 255 -1263 -1372 -624 -1308 -831 227 -676 -1008 784 1245 556 705 1533 449 -60 997 245
$$ packed form
1523A098k975O69J202q70n64M91p6m29K076K07j385Q90K021j178p82R02q45q94
1541d42J009k62j901j55J905o34j260J166R47p66J008O05j215M43J546q05j443
1558b54O29K66j325j16M56j232J16J685n41j034J205J186q12J84R76o21l92Q69
1576A245p35j365O23O09j279J34L91l83j28R18k09m28J359J109j485m59R38k4
1594H31l51J95n71j214P56O80j606m92J064M23j09Q50l05n78R99R73o65o71P59
1613I68n51p05L64n2j074M92N32q60k46R35J29n76Q70O83m52N43J48j239J98O04
1633G11m65j594N10Q49r67J05L20q80K57K083J45j420Q1J213R9J57Oj359n66J633
1653I18o63j518j09P48o84M77J058r03l32J792M61o89J49Q28j084n09J057p52
$$ plain form
1671 245 -1021 -666 -528 -1231 -1129 -83 -930 -1409 229 919 497 692 1321 255 848 1775 522 -1171
1689 -1171 -596 232 -802 -1084 -987 -1705 -921 743 542 -628 67 1275 937 1151 1596 253 -262 763
1707 763 265 -1238 -1322 -502 -1068 -1020 -369 -450 -859 548 906 505 1075 1735 579 -6 788 508 -506 -524
1727 -524 -432 -1419 -749 -257 -1264 -1432 257 724 455 916 819 320 962 1986 335 -907 -215 181 -679
1746 -679 -823 -1211 -1695 -446 350 -236 -762 691 946 789 1009 1130 592 274 799 -132 -1032 -410 -437 -1027
1766 -1027 -1072 -410 -755 -457 514 365 -33 1048 1403 239 393 1030 589 1 -200 -977 -1122 -158 -289
1785 -289 -1554 -1463 61 487 118 418 238 383 1240 1336 -21 -82 432 369 -453 -572 -967 -1034 -142 -49 -1041
1806 -1041 -732 597 343 -59 516 877 299 843 768 -388 -620 624 -341 -1281 -530 -265 -1035 -499 16
$$ packed form
1671B45j266L55J38p03J02J046q47m79J638O90m22J95O29j066N93R27j253j693
1689a171N75Q28j034k82R7p18P84J664k01j170O95J208l38K14M45j343n15J025
1707G63m98j503q4Q20n66M8O51q1m09J407L58m01N70O60j156n85P94k80j014j8
1727e24R2r87O70M92j007j68J689M67k69M61r7m99O42J024j651j242O92L96q60
1746f79j44l88m84J249P96n86n26J453K55j57K20J21n38l18N25r31r00O22k7n90
1766a027m5O62l45K98R71j49l98J081L55j164J54O37m41n88k01p77j45R64j31
1785b89j265R1J524M26l69L00j80J45Q57R6j357o1N14o3q22j19l95o7Q92R3r92
1806a041L09J329k54m02N75L61n78N44p5j156k32J244r65r40P51K65p70N36N15
$$ plain form
1825 16 -465 -246 1295 820 -482 356 1213 486 159 301 -280 -591 436 -332 -1642 -942 177 -206 -418
1844 -418 112 -67 25 1337 868 -457 477 1591 535 -431 -324 -257 -825 -436 -354 -1362 -771 359 -93
1863 -93 -608 327 813 536 844 985 59 222 705 29 -1295 -195 30 -800 -1133 -582 -741 -173 722 353
1883 353 -436 617 1629 574 362 646 9 120 486 -439 -1628 -278 351 -872 -1051 -216 228 53
1901 53 717 668 203 889 1874 357 -292 203 66 -426 -148 -909 -1413 -584 130 -853 -956 344 805 234
1921 234 779 553 486 726 907 -429 -998 -4 -13 -1106 -1230 -1250 -931 -47 276 -392 -491 877 1367 476 331
1942 331 886 528 460 355 -679 -1179 -438 -660 -1354 -1037 -262 -214 383 490 45 460 1428 1186 227 268 602
1963 602 -40 -500 -444 -1218 -955 -163 -463 -1240 -627 541 666 287 630 731 903 1294 683 -469 -94 414
$$ packed form
1825A6m81K19J541m75j302Q38Q57p27l27J42n81l11J027p68j310P00J119l83k12
1844d18N30j79R2J312m69j325R34J114j056r66J07O7n68L89Q2j008N91J130m52
1863i3n15R35M86k77L08J41r26J63M83o76j324J100K25q30l33N51j59N68Q95l69
1883C53p89J053J012j055k12K84o37J11L66r25j189J350O29j223j79Q35M44j75
1901E3O64m9m65O86R85j517o49M95j37m92K78p61n04Q29P14r83j03J300M61n71
1921B34N45k26o7K40J81j336n69R94rj093j24k0L19Q84L23o68r9J368M90q91j45
1942C31N55l58o8j05j034n00P41k22o94L17P75M8N97J07m45M15R68k42r59M1L34
1963F02o42m60N6p74K63P92l00p77O13J168J25l79L43J01J72L91o11j152L75N08
$$ plain form
1983 414 -486 -1101 -782 -775 -664 -74 -120 -972 -77 1344 934 95 770 773 632 698 256 -737 -633 449 -573
2004 -573 -1450 -912 202 -592 -45 362 -243 393 1358 671 -223 580 807 247 -371 -230 -687 -559 94 -490
2024 -490 -1354 -563 540 -56 15 436 573 460 1010 522 -322 300 682 -443 -1100 -409 0 -508 -413 -235
2044 -235 -842 17 843 342 -282 607 905 428 315 347 -476 -148 204 -735 -1182 -327 -12 -856 -291 -13
2064 -13 -200 292 830 329 -245 501 1152 48 -156 242 -83 -351 -127 -535 -1233 -216 -160 -578 -510 244
2084 244 325 385 812 203 -74 799 654 -213 -603 127 -92 -462 -284 -745 -1014 175 235 -356 -54 758 922
2105 922 347 674 139 22 338 592 -645 -688 145 -423 -766 -614 -278 -532 128 332 -152 285 1027 733
2125 733 -28 289 373 14 54 -57 -736 -965 107 -439 -1140 -717 73 -231 428 867 160 215 1375 705
$$ packed form
1983D14r00o15L19PJ11N90m6q52Q95J421m10q39O75Lj41O6m42r93J04J082j022
2004e73q77N38J114p94N47M07o05O36R65o87q94Q03K27n60o18J41m57J28O53n84
2024d90q64P91J103n96P1M21J37j13N50m88q44O22L82j125o57O91M09n08R5J78
2044b35o07Q59Q26n01o24Q89K98m77j13L2q23L28L52r39m47Q55L15q44N65K78
2064a3j87M92N38n01n74P46O51j104k04L98l25k68K24m08o98J017N6m18O8P54
2084B44Q1O0M27o09k77Q73j45q67l90P30k19l70J78m61k69J189O0n91L02Q12J64
2105I22n75L27n35j17L16K54j237m3Q33n68l43J52L36k54O60K04m84M37P42k94
2125G33p61L17Q4l59M0j11o79k29J072n46p01M23P90l04O59M39p07N5J160o70
$$ plain form
2145 705 -426 443 430 -537 -754 -136 -981 -1116 111 -313 -720 -3 786 206 192 994 771 80 672 349
2165 349 -499 -141 377 -873 -1232 -577 -270 -691 -195 132 -142 98 1271 921 -19 612 968 80 173 -57
2185 -57 -862 -853 -195 -534 -1144 -578 -6 48 108 533 265 475 1058 771 84 416 435 -589 -755 -245 -400 -899
2207 -899 -769 -654 -607 117 622 -109 225 906 744 268 613 502 -212 9 286 -746 -1128 -751 -454 -457 -55
2228 -55 -146 -282 484 947 526 258 880 648 475 202 230 -585 -342 -397 -618 -731 -355 -330 -496 3 329 230
2250 230 595 526 382 136 652 540 -340 -129 -168 -502 -922 -465 -538 -646 100 125 -358 234 600 446 356 483
2272 483 242 243 403 10 -748 -425 -28 -406 -673 -256 -476 -628 364 254 -145 396 746 474 95 461 125
2293 125 -546 -218 12 -687 -586 127 -711 -872 156 161 -129 286 485 184 426 859 315 -132 299 331 -634
$$ packed form
2145G05j131Q69j3r67k17O18q45j35J227m24m07P17P89n80j4Q02k23o91N92l23
2165C49q48L58N18j250l59O55L07m21M96L27k74K40J173l50r40O31L56q88R3k30
2185e7q05RO58l39o10N66N72N4O0M25k68K10N83k87o87L32J9j024j66N10j55m99
2207h99J30J15M7P24N05p31L34O81j62m76L45j11p14K21K77j032l82L77K97lM02
2228e5r1j36P66M63m21k68O22k32j73k73K8q15K43n5k21j13L76K5j66M99L26r9
2250B30L65o9j44k46N16j12q80K11l9l34m20M57p3j08P46K5m83N92L66j54r0J27
2272D83k41JJ60l93p58L23L97l78k67M17k20j52R92j10l99N41L50k72l79L66l36
2293A25o71L28K30o99J01P13q38j61J028Nk90M15J99l01K42M33n44m47M31L2r65
$$ plain form
2314 -634 -236 -248 -704 -631 75 -242 -1026 209 588 21 235 611 164 132 712 191 -534 -63 144 -653 -641
2335 -641 -149 -536 -691 23 47 -295 187 845 214 155 706 560 -30 427 -9 -537 -300 -184 -742 -1084 -84
2356 -84 -226 -496 96 289 -106 331 1118 327 -71 681 328 -127 -65 -49 -674 -384 -20 -660 -781 -27 441
2377 441 -160 143 539 399 553 929 538 -110 376 35 -756 -673 -379 -586 -835 -289 -275 -416 395 559 -47
2398 -47 594 854 478 122 261 207 -513 -62 -69 -1090 -877 -35 -302 -625 -136 74 67 535 595 114 242 944
2420 944 493 -124 -62 -266 -598 -556 -427 -796 -488 43 -211 -177 209 746 196 487 612 205 65 675 18
2441 18 -672 -487 -368 -609 -560 -230 -518 -460 390 261 -273 511 814 221 185 615 138 26 149 -397 -979
2462 -979 -498 -14 -642 -787 105 -199 -103 384 528 100 415 886 103 -138 331 -1 -574 -185 -313 -1001
$$ packed form
2314f34L98j2m56P3P06l17p84J235L79n67K14L76m47l2N80n21p25M71K07p97J2
2335f41M92l87j55P14K4l42M82O58o31n9N51j46n90M57m36n28K37J16n58l42J000
2356h4j42k70N92J93l95M37P87p91l98P52l53m55O2J6o25K90L64o40j21P54M68
2377D41o01L03L96j40J54L76l91o48M86l41p91Q3K94k07k49N46J4j41Q11J64o06
2398d7O41K60l76l56J39n4p20M51pj021K13Q42k67l23M89K10pM68O0m81J28P02
2420I44m51o17O2k04l32M2J29l69L08N31k54L4L86N37n50K91J25m07j40O10o57
2441A8o90J85J19k41M9L30k88N8Q50j29n34P84L03n93l6M30m77j12J23n46n82
2462i79M81M84o28j45Q92l04R6M87J44m28L15M71p83k41M69l32n73L89j28o88
$$ plain form
2482 -1001 -420 200 -488 -463 378 222 -180 237 414 123 451 738 -23 -223 180 35 -468 -591 -301 -475
2502 -475 -119 250 -113 -126 595 671 17 72 779 260 107 356 -68 -491 -101 125 -335 -677 42 1 -158
2523 -158 391 33 2 536 548 -201 70 509 116 -198 -120 -125 -571 -346 -70 -606 -722 -17 304 -149 306 385
2545 385 49 569 545 -234 -316 539 147 -465 -386 -169 -563 -288 166 -324 -397 201 362 -250 263 737 246
2566 246 273 631 -46 -328 160 166 -620 -602 -90 -230 -426 -223 57 -117 619 533 208 128 533 493 -71 122
2588 122 -38 -425 -190 -306 -832 -305 129 -354 -304 176 204 112 635 425 125 177 542 74 -50 -136 -153 -375
2610 -375 -303 -371 -635 -218 390 65 -116 352 533 378 419 415 115 32 376 -112 -695 -124 -227 -427 -195 -382
2632 -382 -415 -36 555 530 -179 245 745 13 283 447 -161 -390 -72 -363 -881 -559 -207 -681 -459 279 437
$$ packed form
2482a001N81O20o88K5Q41j56m02M17J77k91L28K87p61k00M03j45n03j23K90j74
2502d75L56L69l63j3P21P6o54N5P07n19j53K49m24m23L90K26m60l42P19m1j59
2523a58N49l58l1N34J2p49K71M39l93l14P8nm46K25K76n36j16P05L21m53M55P9
2545C85l36N20k4p79q2Q55l92o12P9K17l94K75M54m90p3N98J61o12N13M74m91
2566B46K7L58o77k82M88Op86J8N12j40j96K03K80j74P36q6l25q0M05m0n64J93
2588A22j60l87K35j16n26N27M34m83N0M80K8r2N23k10l00N2L65m68j24q6j7k22
2610c75P2o8k64M17O08l25j81M68J81j55M1ml00q3L44m88n83N71j03k00K32j87
2632c82l3L79N91k5p09M24N00p32K70J64o08k29L18k91n18L22L52m74K22P38J58
$$ plain form
2653 437 79 455 357 48 469 704 -153 -174 259 -1 -577 -199 -452 -1016 -343 37 -161 -173 544 461 167
2674 167 178 658 132 206 343 -174 -571 -232 -576 -747 -767 -342 -402 -56 308 91 17 647 640 68 54 713 247
2697 247 -74 -161 -374 -763 -179 -331 -687 -474 88 94 64 279 107 55 827 662 -242 -207 123 -209 -481 -316
2719 -316 -234 -444 -270 40 -390 -351 448 321 36 302 329 200 354 155 -81 -463 -29 -139 -747 -433 -270
2740 -270 -362 -171 256 -90 27 457 205 -93 255 215 -34 79 92 -374 -253 -50 -361 -638 -250 174 -41
2761 -41 69 229 212 -43 685 458 19 304 220 -133 -154 57 -365 -515 -44 -377 -428 -176 41 -251 255 540
2783 540 278 250 422 500 -327 126 402 -419 -615 244 -229 -483 -496 -190 -302 -31 546 -22 146 576 246
2804 246 119 404 67 -147 -74 164 -414 -527 80 -213 -577 -377 278 -81 -221 547 269 118 477 505 -17
$$ packed form
2653D37l58L76r8l09M21K35q57k1M33k60n76L78k53n64O73L80j98j2P17q3k94
2674A67J1M80n26P4J37n17l97L39l44j71k0M25o0L46L64k17p4O30pn72j4O59m66
2697B47l21q7k13l89N84j52l56K13N62Ol0K15j72n2P72j65r04L5L30l32k72J65
2719c16Q2k10J74L10m30L9P99j27k85K66K7j29J54j99k36l82M34j10o08L14J63
2740b70r2J91M27l46J17M30k52k98L48m0k49J13J3m66J21K03l11k77L88M24k15
2761d1J10J60j7k55P28k27m39K85q4l53k1K11m22j50M71l33n1K52K17k92N06K85
2783E40k62k8J72P8q27M53K76q21j96Q59m73k54j3L06j12K71N77n68J68M30l30
2804B46j27K85l37k14P3K38n78j13O07k93l64K00O55l59j40P68k78j51L59K8n22
$$ plain form
2825 -17 155 590 -193 -447 47 -293 -575 -191 129 -288 -408 385 5 151 377 779 128 341 390 -169 -163
2846 -163 243 -206 -419 -250 -339 -637 -60 390 -369 -218 451 444 253 462 387 69 -129 272 -372 -517 -127
2867 -127 -98 -382 -358 -46 -518 -13 264 357 237 587 624 184 179 266 -363 -522 -243 -425 -520 -163 -386 -448 -285
2890 -285 205 111 364 647 180 163 542 384 -27 -128 108 -421 -441 -322 -455 -521 -28 93 -56 125 440
2911 440 280 248 580 419 251 169 59 -237 -252 -31 -371 -652 -35 -112 -146 87 297 -47 492 612 271 110
2933 110 417 56 -204 -13 -206 -259 -520 152 -381 -503 -157 -44 -99 -69 363 163 71 779 457 -409 275
2954 275 60 -270 -241 -170 -284 -444 -93 -109 -381 200 387 105 258 433 333 60 364 58 -231 -95 137
2975 137 -325 -384 32 -334 -434 -339 201 -334 127 442 89 166 551 253 -382 -3 1 -68 -167 -38 -384 -468 -218
$$ packed form
2825a7J72M35p83k54M94l40k82L84L20m17j20P93l80J46K26M02o51K13M9n59O
2846a63M06m49k13J69q9k98N77M50p59J51O69pj91K09p5l18j98M01o44j45L90
2867a27K9k84K4L12m72N05K77R3j20L50L7m40nQ7o29j59K79j82r5L57k23o2J63
2890b85M90r4K53K83m67j7L79j58m11j01K36n29k0J19j33o6M93J21j49J81L15
2911D40j60l2L32j61j68q2j10k96j5K21l40k81O17p7l4K33K10l44N39J20l41j61
2933A10L07l61k60J91j93n3k61O72n33j22L46J13n5L0M32k00r2P08l22q66O84
2954B75k15l30K9P1j14j60L51j6k72N81J87k82J53J75j00k73L04l06k89J36K32
2975A37m62n9M16l66j00R5N40n35M61L15l53P7L85k98o35L79Mo9r9J29l46q4K50
$$ plain form
2998 -218 183 -176 58 291 49 221 383 346 80 333 249 -205 -24 -57 -262 -527 -224 -262 -281 51 -216 -210
3020 -210 151 450 296 35 276 330 42 63 39 -146 -344 250 -285 -507 -126 -235 -361 255 215 156 -15 538
3042 538 431 57 351 360 -242 -102 -190 -213 -411 116 -150 -321 -260 33 173 264 33 227 227 524 373 -167 157
3065 157 157 -111 -118 -111 -473 -375 232 -53 -233 -63 259 -30 190 222 197 365 298 294 -93 -124 170 -376 -510 -115
3089 -115 -157 -125 35 115 -91 438 254 125 133 462 260 0 -116 -250 -33 -163 -79 -289 -570 242 -171 -245
3111 -245 208 317 115 277 361 139 172 487 46 -257 -50 -336 -472 -583 -255 -236 -418 209 28 -4 327
3132 327 302 218 290 488 19 81 31 -1 -573 -231 43 -638 -267 81 -101 -50 474 454 -56 255 346 451 165
3155 165 341 -83 -645 -321 -71 -393 -471 -90 -260 -197 39 -32 -37 366 437 233 117 510 157 -148 -112 -44 -507
$$ packed form
2998b18M01l59K34K33k42J72J62l7k66K53q4m54J81l3k05k65L03l8j9L32k67O
3020b10L61K99j54k61K41N4k88K1k4j85j98N94n35k22L81j09j26O16m0n9j71N53
3042E38j07l74K94Ro02J40q8k3j98N27k66j71O1K93J40R1k31J94%K97j51n40L24
3065A57%k68pPl62R8O07k85j80J70L22k89K20L2k5J68o7ml87l1K94n46j34L95
3089a15m2L2J60Q0k06N29j84j29QL29k02k60j16j34K17j30Q4k10k81Q12m13p4
3111b45M53J09k02J62Q4k22L3L15m41l03K07k86j36j11L28J9j82O27j81l2L31
3132C27k5q4P2J98m69O2n0l2n72L42K74o81L71L48j82N1N24k0n10L11R1J05k86
3155A65J76m24n62L24K50l22p8L81j70O3K36p1nM03P1k04j16L93l53l05L6O8m63
$$ plain form
3178 -507 -139 -175 -182 -177 -149 139 -232 112 413 101 249 496 150 86 132 -12 -264 -205 0 -317 -261 52 -246
3201 -246 -285 189 124 -72 290 350 383 59 118 34 -283 -46 -215 -322 -363 252 -194 -370 85 166 -25 252 167
3224 167 139 -12 393 105 -128 62 181 -19 -293 -317 -244 -75 260 -206 -237 -74 240 141 56 278 192 193 244
3247 244 -77 -295 -120 139 -412 -176 -314 -473 -255 -114 -233 -164 323 213 32 41 330 53 10 221 -238
3268 -238 -236 6 -270 -376 -336 194 105 -249 191 -16 29 404 485 -291 132 137 91 -340 -196 -40 -449 -229 35
3291 35 -636 -458 158 137 64 415 172 -21 521 583 126 133 331 -85 -361 -230 -96 -636 -565 -8 -55 -395 72
3314 72 9 -35 312 433 16 -74 220 -219 -182 79 -43 -444 -404 -238 -300 -170 27 -14 204 156 586 191 266
3337 266 579 155 -297 147 144 -89 33 99 -514 -326 -31 -234 -284 304 588 105 98 406 165 -21 426 -415
$$ packed form
3178e07L68l6pNK8K88l71L44L01l12J48K47l46o4M6j44k52N9K05l17N6L13k98
3201b46l9M74o5j96L62O0L3l24N9q4l17K37j69j07m1O15m46j76M55Q1j91K77q5
3224A67k8j51M05k88k33J90J19k00k74k4P3J69L35m66l1J63L14r9q5K22q6JN1
3247B44l21k18J75K59n51K36j38j59K18J41j19O9M87j10j81RK89k77m3K11m59
3268b38KK42k76j06M0N30q9l54M40k07M5L75Q1p76M23Nm6m31J44J56m09K20K64
3291C5o71J78O16k1p3L51k43j93N42O2m57PJ98m16k76J31J34n40P1N57m7l40M67
3314G2o3m4L47J21m17r0K94m39L7K61j22m01M0J66o2J30J97m1K18m8M30l95P5
3337B66L13m24m52M44lk33J22O6o13J88K95k03n0N88K84m83pL08k41j86M47q41
$$ plain form
3359 -415 -263 -208 -96 -172 -268 -270 -168 -143 7 240 18 173 409 166 -96 190 115 44 -165 -385 -158 -301 -108
3382 -108 -450 -260 -172 10 -279 249 10 25 458 450 124 116 152 -68 -225 -173 -404 -358 -274 -328 -8 -199 152 111
3406 111 188 202 184 118 537 351 15 -158 -416 -390 -256 -114 -333 -233 -72 187 -285 -92 277 -13 35 84
3428 84 156 -149 113 38 -302 -277 -238 -228 -166 62 -73 -259 -192 174 -8 -74 254 325 -217 -168 249 -3 -342 168
3452 168 -116 -120 102 85 -260 -170 198 -14 -145 202 -48 14 294 344 -162 -178 98 91 -394 -17 121 -324 23
3475 23 -188 -115 30 131 20 32 419 214 185 246 232 -346 182 103 -158 -400 -304 160 -105 -36 155 -332 117
3498 117 359 222 -9 185 195 -19 -12 277 -166 -281 174 -194 -343 -273 -83 -296 -136 139 -15 43 196 318
3520 318 170 1 180 155 37 94 -185 16 22 -129 -283 -168 -132 7 -85 143 230 9 248 397 33 55 404
$$ packed form
3359d15J52N5J12p6r6kJ02K5J50K33k22J55K36k43k62K86p5p1k09k20K27j43J93
3382a08l42J90Q8J82k89N28k39J5M33ql26qL6k20j57N2k31M6Q4n4L20j91L51m1
3406A11P7J4j8o6M19j86l36j73k58K6J34J42k19J00J61K59m72J93L69k90M8M9
3428H4P2l05K62p5l40K5L9J0O2K28j35j86O7L66j82o6L28P1n42M9M17k52l39N10
3452A68k84mK22j7l45R0L68k12j31L47k50O2K80N0n06j6K76pm85L77J38m45L47
3475B3k11P3J45J01j11J2L87k05k9O1j4n78N28p9k61k42R6M64k65O9J91m87M49
3498A17K42j37k31J94J0k14PK89m43j15M55l68j49P0J90k13J60K75j54N8J53J22
3520C18j48j69J79k5j18N7k79K01Oj51j54J15L6J39r2K28Q7k21K39J49l64K2L49
$$ plain form
3543 404 -10 -297 -145 -175 -202 -209 -246 -162 -17 72 212 407 69 -42 -26 69 431 -192 -146 -101 -56 -406 -128 -165
3567 -165 -316 -236 9 -10 230 269 123 308 415 343 -74 218 -40 -37 -130 36 -440 -197 -81 -35 -309 -80 464
3590 464 166 32 362 207 -206 100 301 -267 -427 2 -427 -320 -90 -234 -80 -55 349 -169 -87 200 227
3611 227 41 246 150 -63 -136 69 -22 -212 -112 -142 -263 80 -74 22 361 146 153 -50 548 362 -56 -40 102
3634 102 -215 -230 -34 -207 -418 -147 -239 -256 217 407 23 68 224 279 34 42 215 -290 -88 34 -346 -279 -267
3657 -267 -77 -161 -151 92 4 178 303 207 -197 211 145 143 51 -29 141 20 -76 -117 -265 82 -9 -247 -106 217
3681 217 -116 -69 413 94 -91 171 268 53 140 84 -243 -524 14 -67 -318 -131 178 -77 -25 -66 207 96
3703 96 136 119 4 -4 -231 -73 -267 -33 -249 -264 -103 78 -57 288 -47 -216 -136 240 141 72 -5 -103 -46 -253
$$ packed form
3543D04m14k87J52l0k7pl7Q4J45Q9J40J95l38j11J6R5L62o23M6M5M5l50K78l7
3567a65j51Q0K45j9K40L9j46J85J07p2m17K92k58Lr3J66m76K43J16M6k74K29N44
3590D64k98j34L30j55m13L06K01n68j60M29m29J07K30j44J54K5M04n18Q2K87K7
3611B27j86K05r6k13p3K05r1j90J00l0j21L43j54R6L39k15Pk03N98j86m18J6J42
3634A02l17j5J96j73k11K71r2j7M73J90l84M5J56N5k45QJ73n05K02J22l80O7J2
3657b67J90q4J0K43q8J74J25r6m04M08o6kr2q0J70j21r6m1j48L47r1k38J41L23
3681B17l33M7M82l19j85K62R7k15Q7n6l27k81N38q1k51J87L09k55N2m1K73j11
3703I6M0j7j15qk27J58j94K34k16j5J61J81j35L45l35j69Q0L76r9o9p7r8N7k07
$$ plain form
3727 -253 -83 -12 77 -109 -150 -281 -232 111 -59 183 86 -85 -129 296 22 -191 128 -96 -100 66 36 -174 -259
3750 -259 51 -200 -143 272 98 -9 162 152 215 294 285 73 -223 -340 48 -141 -402 65 2 -73 246 88 -135
3773 -135 -10 50 -35 146 311 220 -212 131 66 -36 -304 -114 -148 -148 58 87 -402 26 63 -171 312 380 157
3796 157 -96 287 74 -120 -280 -59 -378 -294 -284 -77 -308 -73 -54 -39 340 0 -39 -16 327 0 -170 153
3818 153 79 -210 -69 197 -327 -194 140 -186 -71 82 370 97 -99 417 203 5 15 -119 -286 -28 20
3839 20 -525 -410 13 -201 -286 119 109 220 28 161 140 225 99 280 -67 -63 -272 -60 -223 106 12 -313 57
3862 57 105 -93 226 275 103 261 400 -136 33 -43 -31 -197 -205 -97 -168 -123 -101 15 -259 154 206 -124 181 244
3886 244 83 20 79 -35 123 -77 -86 -50 -426 89 -337 -304 -86 82 -259 45 212 -5 33 236 -65 14 207
$$ packed form
3727b53J70P1Q9j86m1j31M9L43j70K42r7j71m4M25k74k13L19k24mJ66l0k10q5
3750b59L10k51N7M15j74j07J71j0O3P9rk12k96j17L88j89k61M67o3p5L19j58k23
3773a35J25O0q5J81J65r1m32L43o5j02k68J90l4%K06K9m89M28L7k34M83O8k23
3796A57k53L83k13j94j60K21l19Q4J0K07k31K35J9J5L79l40l9K3L43l27j70L23
3818A53p4k89J41K66n24J33L34l26J15J53K88k73j96N16k14j98J0j34j67K58M8
3839B0n45J15M23k14q5M05j0J11j92J33k1Q5j26J81l47Mk09K12j63L29r4l25L70
3862E7M8j98L19M9j72J58J39n36J69p6J2j66qJ08p1M5K2J16k74M13N2l30L05O3
3886B44j61o3N9j14J58k00rL6l76N15m26L3K18J68l41L04J67k17L8K03l01P9J93
$$ plain form
3909 207 -76 -84 -317 -184 -178 -153 -123 -116 -40 -142 -78 -60 337 126 69 39 105 -27 -26 2 -71 -239 -65 -119 -57 -218 38
3936 38 99 77 -14 -30 -25 99 104 -119 -67 19 -105 -28 -183 61 -173 -287 -36 -230 -77 170 133 -48 430 247
3960 247 20 64 205 66 -54 -7 -1 -281 18 -87 -175 -223 -286 -126 -150 122 293 71 111 254 127 167 44
3983 44 -4 -346 -277 -284 -257 -251 -35 26 -174 -112 205 -80 139 394 -7 204 -86 -21 80 54 -127 -446 -130 -68
4007 -68 150 55 -240 214 -165 179 187 -54 312 89 122 7 20 -37 -120 10 -266 -268 -45 -173 -129 -6 186 37
4031 37 187 218 42 -146 -115 257 -143 -122 -121 152 -215 -308 -234 -282 -20 119 37 88 130 33 -38 302 263 24 276
4056 276 80 -291 -316 52 -59 -185 -134 -73 11 -79 208 121 67 42 263 55 101 250 158 -311 -72 -22 -380 -332
4080 -332 -118 25 -169 -161 48 -23 1 251 -4 247 260 -73 -120 264 29 -87 -133 -28 -250 -92 -13 188 -49
$$ packed form
3909B07k83qk33J33OK5L0PP6j02O4J8L97k11n7l0O6j32JK8p3j68J74n4O2j61K56
3936C8O1k2r1j6NJ24Nk23N2Q6j24P7j55K44k34j14K51j94J53K47l7j81M78j83
3960B47k27M4J41j39j20M7Ok80K99j05q8m8o3J60k4K72J71k22M0J43j27M0j23
3983D4m8l42O9pK7OK16O1k00O2L17k85K19K55m01K11k90O5J01k6j81l19L16O2
4007f8K18r5k95M54l79L44Qk41L66k23L3j15J3n7q3J30k76kK23j28M4J23J92j49
4031C7J50L1j76j88L1L72m00K1JK73l67r3P4m8K62J39q2N1M2r7p1L40l9k39K52
4056B76j96l71k5L68j11j26N1O1Q4r0K87q7n4k5K21k08M6J49r2m69K39N0l58M8
4080c32K14J43j94QK09p1K4K50k55K51J3l33m7L84k35j16m6J05k22J58P9K01k37
$$ plain form
4103 -49 222 344 -127 57 57 60 137 84 -128 0 43 -272 -133 153 -99 -135 2 150 -140 -156 153 193 223 87
4127 87 -46 39 -159 266 -311 -556 77 121 -319 -77 313 102 195 116 -34 114 102 104 317 -165 41 -18 -75
4150 -75 8 -37 -202 117 152 -121 -95 -216 265 -350 96 67 88 75 214 -17 -79 54 37 -176 -151 -94 30 215
4174 215 30 -100 -203 391 64 -75 -13 106 23 -177 87 -142 -40 54 -33 -54 -130 -196 16 -43 126 -40 173
4197 173 261 55 167 185 98 72 -8 99 -264 15 -18 -171 125 130 148 60 110 -40 1 -11 -18 174 143 82 -113 208
4223 208 -215 26 -157 -158 45 -450 36 204 118 -272 106 169 -27 143 115 328 -251 -35 -18 44 -59 -34 -13
4246 -13 -87 -143 147 31 69 420 120 16 -7 117 -210 82 -58 5 -86 -311 -72 -156 19 159 129 -12 90
4269 90 232 7 257 78 312 335 244 -143 -219 133 -52 -100 -95 -66 -114 -182 144 -259 -24 202 219 -182 166 35
$$ packed form
4103d9K71J22m71J84%LP7n3k12J28M3l15J39K86k52l6J37J48k90j6L09M0L0j36
4127H7j33Q5j98M25n77k45O33M4m40K42L90k11R3p9j50J48j2KK13m82K06n9n7
4150g5Q3m5j65L19L5k73K6j21M81o15M46k9K1j3J39k31o2J33j7k13K5N7J24J85
4174B15j85j30j03N94l27j39O2J19q3k00K64k29J02R4q7k1p6o6K12n9J69j66K13
4197A73Q8k06J12J8q7k6q0J07l63K79l3j53K96NJ8q8N0j50M1j2pJ92l1o1j95L21
4223B08m23K41j83jK03m95M86J68q6l90L78O3j96J70k8K13n79K16J7O2j03K5K1
4246a3p4n6K90j16L8L51l00j04k3J24l27K92j40O3r1k25K39q4J75J40l0j41J02
4269I0J42k25K50j79K34K3r1l87p6L52j85m8NK9m8o8L26m03K35K26J7m01L48j31
$$ plain form
4293 35 -78 128 -4 -71 -332 -110 -106 -289 -291 99 -152 43 134 -240 -116 239 300 -64 415 419 -210 -89 132
4316 132 -110 -197 5 -150 -68 -259 13 -87 129 179 38 -113 95 94 92 -109 186 -122 -148 -145 -52 -52 181 -30
4340 -30 -95 170 70 194 107 368 -33 146 139 -146 -39 -23 103 -162 -84 -115 -220 -186 -111 -16 -184 36 249 232
4364 232 -56 69 7 -159 86 31 -181 -190 -100 -187 -182 -304 -2 -10 46 138 -63 229 152 -23 -93 -5 -42 -51 -102 48
4390 48 89 -4 -236 103 -188 302 -85 -51 -108 317 -66 -150 30 -81 -169 83 -62 -78 -128 -120 126 -28 60 75
4414 75 -66 -11 -45 -278 -32 137 41 -198 270 -20 55 3 235 181 -352 -214 98 -103 143 35 169 -72
4436 -72 -7 -2 -52 188 280 -72 24 125 -3 29 -171 -91 -158 31 -38 -158 108 76 112 -24 276 186 -150 -96 241
4461 241 -240 -277 157 15 -247 -81 -211 -122 -23 72 -76 -245 11 -66 48 133 210 56 77 155 -3 -207 83
$$ packed form
4293C5j13K06j32o7k61K22Mj83kL90k51J95R1l74J24L55O1l64M79Mo29J21K21
4316A32k42q7K02j55Q2j91K72j00K16N0j41j51K08jkk01K95l08k6LR3%K33k11
4340c0o5K65j00J24q7K61m01J79pk85J07J6J26k65P8l1j05L4P5R5j68K20K13j7
4364B32k88J25o2j66K45n5k12rR0q7Nj22L02qN6R2k01K92p7j75p0Q8l7rn1J50
4390D8M1r3k32L39k91M90l87L4n7M25l83q4J80j11q8K52j45j6n0QK46j54Q8J5
4414G5j41N5l4k33K46J69r6k39M68k90P5n2K32n4n33J38L12k01K46j08J34k41
4436g2O5Nn0K40R2l52R6J01j28L2k00Q0o7J89o9j20K66l2L6j36L00r0l36N4L37
4461B41m81l7M34j42k62J66j30Q9R9R5j48j69K56p7J14Q5P7j54K1P8j58k04K90
$$ plain form
4484 83 -140 85 70 -57 -131 125 28 118 235 285 92 -12 -49 -85 -276 51 -33 -234 27 -120 -189 -57 9 221
4508 221 -12 135 110 -144 -89 334 173 96 129 -188 -161 -78 177 -204 -195 -52 -1 -53 -6 162 31 104 172 81 -75
4533 -75 25 101 -60 -59 124 151 -188 3 41 -84 -139 3 292 -39 271 -10 -31 -13 -92 -124 -139 -58 -60 -204 -64
4558 -64 -160 -315 163 14 -134 -296 189 -46 253 185 -9 -191 -43 -112 -73 -18 55 -233 69 -116 -4 45 -132
4581 -132 223 -168 163 92 15 171 -99 -11 -17 -198 181 -292 -242 -55 92 -265 54 97 -18 240 28 13 60
4604 60 172 49 34 134 53 -327 -150 18 -289 -28 18 -41 16 116 158 42 -7 1 151 -51 26 -129 -220 -63
4628 -63 86 -217 -35 17 -42 -20 -271 -97 -57 71 217 85 216 176 162 -150 275 160 -74 -226 -207 20 14
4651 14 -204 -199 181 -200 130 -5 -56 10 217 157 -131 95 -190 -12 -25 -109 -167 26 102 -89 10 313 162 -152
$$ packed form
4484H3k23K25j5j27p4K56r7R0J17N0j93j04l7l6j91L27q4k01K61j47o9J32O6K12
4508B21k33J47k5k54N5M23j61p7L3l17K7Q3K55l81RJ43N1n2M7J68j31P3O8r1j56
4533g5J00P6j61JJ83K7l39J91L8j25n5J42K89l31L10k81k1J8p9l2j5Q1kj44J40
4558f4r6j55M78j49j48j62M85k35K99o8j94j82J48o9L9N5P3k88L02j85J12M9j77
4581a32L55l91L31p1p7J56k70Q8oj81L79m73N0J87J47l57L19M3j15K58k12j5M7
4604F0J12j23j5J00q1l80J77J68l07K61M6n9N7J00M2j16m9QJ50k02P7j55r1J57
4628f3J49l03J82N2n9K2k51J74M0J28J46j32J31m0j4l12M25j15k34j52J9K27o
4651A4k18NL80l81L30j35n1O6K07o0k88K26k85J78j3q4n8J93P6j91R9L03j51l14
$$ plain form
4675 -152 17 49 -283 -135 29 53 37 56 10 -75 -55 -212 40 134 -150 -63 -3 -58 14 213 -104 71 88 -305
4699 -305 179 -81 145 141 -291 -162 104 -47 -1 -330 -154 -56 -36 222 141 128 19 -44 -216 186 59 -202 22
4722 22 82 -57 85 -64 36 -99 1 264 100 413 91 262 -8 48 126 -175 86 -215 -271 -216 -74 -237
4744 -237 10 -84 91 -92 218 215 6 -35 121 -16 -57 5 -127 -100 -27 45 -132 -45 166 179 256 224 197 46 -105
4769 -105 201 121 175 162 -15 -211 49 121 4 -158 50 -200 14 -157 289 -11 -145 58 -56 -6 442 -3
4791 -3 -96 106 -146 77 2 -91 -173 -42 14 72 -51 -12 26 47 -45 203 205 -112 92 -121 -149 -189 -150 62 2 -158
4817 -158 -34 -74 92 319 65 -14 193 35 -133 -126 -44 -202 120 -71 -88 -92 72 183 37 -277 223 64 63
4840 63 -19 158 17 131 34 76 -96 -156 18 59 -165 -103 -145 -213 -169 -97 -53 52 34 100 357 -60 -162 141 108
$$ packed form
4675a52J69L2l32J48J64K4j6J9m6q5K0j57K52R4k84Q7O0n5P2J99l17J75J7l93
4699c05M84k60K26mm32J29K66j51M6l29J76R8K0K58q1j3j09o3j72M02j27k61K24
4722B2O0j39J42j49J00j35J00K63j64L13l22J71k70N6P8l01K61l01n6N5J42j63
4744b37K47r4J75j83L10lk09m1J56j37m1O2j32K7P3P2j77Q7K11J3P7l2k7j51j51
4769a05L06q0N4j3j77j96K60P2j17j62K08k50K14j71M46l00j34K03j14N0M48m45
4791cr3K02k52K23p5r3q2J31N6N8j23L9L8K1r2K48Kl17K04k13k8m0L9K12o0j60
4817a58J24m0J66K27k54p9K07j58j68PQ2j58L22j91j7mJ64J11j46l14N00j59j
4840F3q2J77j41J14r7M2j72o0J74M1k24O2m2o8M4P2M4J05j8O6K57m17j02L03l3
$$ plain form
4865 108 -308 -44 -45 -70 72 25 38 -130 110 205 1 137 159 -44 124 13 -203 -68 22 -153 -36 -51 14
4888 14 -214 -158 241 56 -10 55 239 -15 165 -82 7 -99 140 197 -183 51 9 -87 -54 -129 -330 36 69 68
4912 68 -25 -94 51 -150 43 113 67 -191 293 -60 -243 85 -207 -200 -115 -33 6 -17 -2 -29 -45 -205 226 141 45
4937 45 -26 -109 -270 -155 -26 -136 126 82 -134 3 -115 180 -43 135 107 -115 284 141 104 58 118 -89 -185
4960 -185 77 -243 -125 96 -58 -26 -64 87 70 222 134 -69 -61 -4 98 119 -96 12 -210 28 2 172 -197
4983 -197 -58 92 -217 154 -1 -25 -6 -21 195 -12 72 31 -87 -75 -220 -9 53 58 57 99 233 190 180 -1 179
5008 179 71 262 324 195 11 -38 245 -114 10 14 -29 -78 72 127 -161 81 64 -179 39 79 327 -347 -125
5031 -125 140 -81 -123 155 -186 121 49 155 -203 -35 149 216 234 47 -47 -129 -38 108 -83 -137 347 -115 -31
$$ packed form
4865A08m16K64jk5J42m7J3j68K40R5k04J36K2k03J68j11k16J35R0j75J17j5O5
4888A4k28N6L99j85o6O5J84k54J80k47Q9j06K39N7l80K34m2r6L3p5k01L66L3j
4912F8r3o9J45k01J93P0m6k58M84l53j83L28k92PQ5Q2L9k3J5k7j6j60M31q5r6
4937D5p1q3j61J15J29j10K62m4k16J37j18K95k23J78k8k22L99j43l7m6O0k07r6
4960a85K62l20J18K21j54L2l8J51j7J52q8k03QN7J02K1k15J08k22K38k6J70l69
4983a97J39J50l09L71j55k4J9j5K16k07Q4m1j18J2j45K11O2NjM2J34m3j0j81J80
5008A79j08J91O2j29j84m9K83l59J24Mm3m9J50N5k88K42j7k43K18M0K48o74K22
5031a25K65k21m2K78l41L07p2J06l58J68J84O7J8j87r4q2R1J46j91n4M84m62Q4
$$ plain form
5054 -31 71 102 -126 -38 55 112 2 204 112 -98 314 52 -73 141 202 -177 -72 -111 -154 -11 -1 168 92 -271
5078 -271 86 166 11 136 123 -39 -28 107 40 -243 -98 -151 42 -142 139 -189 -114 105 -6 -33 -60 53 -90
5101 -90 115 194 -129 101 156 -181 -83 -51 -174 -170 21 -47 -254 -119 167 124 -122 -3 54 -13 -9 -109 -205 74 36
5126 36 116 16 3 -30 54 160 -169 -19 -37 152 91 47 42 51 -7 -170 -221 -200 163 -15 -21 -314 -7 57 213 126
5152 126 93 15 -196 24 123 244 131 -26 -2 -200 -120 -300 26 12 72 -81 -4 -124 -216 198 117 44 -24 -88
5176 -88 -254 14 22 -37 -195 -55 -8 -34 142 -61 175 -21 25 -155 176 -40 -88 191 -51 188 -44 -142 -3
5199 -3 -29 -145 -188 -32 -92 96 90 39 23 -95 117 150 -143 -274 63 77 6 80 75 64 -381 -184 -80 -81 -108 -103 214
5226 214 107 -119 -93 177 186 59 22 -100 -330 156 107 -210 17 -167 113 50 131 194 30 133 -13 -29 -92
$$ packed form
5054c1J02L1k28Q8R3N7j10K02r2k10M12k62j25K14O1l79J05l9m3J43J0J69p6l63
5078b71L57Q0j55J25j3j62J1J35o7k83J45n3J93j84K81l28P5K19j11k7k7J13j43
5101i0K05P9l23K30N5l37R8L2j23MJ91o8k07J35K86m3k46J19N7o7Mj00r6K79l8
5126C6Q0j00j3l3Q4J06l29J50j8J89o1m4nRn8j63n1K1L63j78ok93L07O4J56q7
5152A26l3p8k11K20R9J21j13j57K4j98Q0j80L26j4O0j53P7j20r2M14q1p3o8o4
5176h8j66K68Qn9j58J40M7k6J76k03K36j96M6j80L31k16m8K79k42K39k32r8J39
5199ck6j16m3J56o0J88on1j6j18K12L3k93j31L37J4p1P4nj1m45J97J04jk7NL17
5226B14j07k26K6K70Rj27l7j22k30M86m9l17K27j84K80o3Q1O3j64J03j46j6o3
$$ plain form
5249 -92 -412 85 -192 21 -123 -32 33 334 127 -12 -158 -56 156 -187 29 -208 -41 182 92 122 -80 114
5271 114 -95 183 -33 -137 -100 -57 -28 -132 -16 -46 -10 142 130 58 -83 -74 -20 -274 -129 37 -80 -339 53
5294 53 -59 -189 243 -17 108 -192 56 77 42 62 304 169 -14 -346 -15 84 55 -64 -63 167 -226 3 70
5317 70 -30 17 -9 66 54 10 -171 111 -160 113 242 -422 8 -67 -106 42 -83 12 -115 127 158 -101 -3 63
5341 63 91 -30 -2 217 -208 -80 118 -199 -120 -122 22 -38 219 12 -131 -58 -38 -256 -205 46 81 -499 -73 -110
5365 -110 -115 -160 -129 -300 33 46 -242 -84 -60 -116 106 54 -29 -74 -198 36 -101 -263 65 81 7 -253 13 -170
5389 -170 -70 198 -27 -354 -107 417 -66 143 196 -9 10 70 88 33 69 23 -39 -51 46 282 -136 109 -157
5412 -157 63 0 195 39 1 -245 56 139 98 27 -50 38 78 209 -101 257 164 -34 -20 -35 111 226 -60 -148
$$ packed form
5249i2l20M97k77K13j44R1O5L01k07j39j46J02K12l43K16k37J67K23r0L0k02J94
5271A14k09K78k16j04L7M3K9j04J16l0L6J52j2p2j41RN4k54J45J66j17k59L92
5294E3j12j30M32k60J25l00K48K1l5K0K42j35j83l32L31R9k9j19JK30l93K29O7
5317G0j00M7k6P5j2m4j81K82k71K73J29o64M30p5l9J48j25R5j27K42L1k59R8O6
5341F3K8j21K8K19m25J28J98l17P9kJ44o0K57k07j43P3K0k18N1K51L5n80M26l7
5365a10nm5L1j71L33J3k88J58K4n6K22n2q3m5j24K34j37j62L28J6p4k60K66j83
5389a70J00K68k25l27K47N24m83K09N3k05J9O0J8n5L6m6o2j2R7K36m18K45k66
5412a57K20o3J95j56l8k46L01Q3m1p1p7Q8M0J31l10L58r3j98J4j5J46J15k86q8
$$ plain form
5436 -148 1 148 -186 125 69 -5 39 95 38 365 -36 271 75 -146 -56 -162 -76 2 58 -53 -17 -119 33
5459 33 30 224 92 -26 271 192 34 103 183 56 78 -85 -186 215 -12 152 -19 -78 162 -23 -144 -323 -116
5482 -116 35 128 166 11 -227 36 101 -47 -90 -73 -31 -40 68 281 10 -41 5 147 19 -65 62 54 111 -94 248
5507 248 78 -90 -94 18 15 108 -23 55 3 -3 -50 206 -68 -13 -303 3 -14 -59 5 8 -166 -149 253 -83 134 174
5533 174 -39 -90 108 -109 -94 181 -4 -199 -139 -133 214 169 -65 276 62 -40 -67 -225 -11 180 -36 217
5555 217 50 227 -37 -36 167 -18 -47 -80 215 -210 163 -66 -210 -37 83 -37 -136 -71 -16 -73 -150 324 104
5578 104 -124 63 -16 78 -135 -144 147 84 -171 40 -163 64 53 4 83 -193 95 26 -58 -84 92 -48 13 50
5602 50 -136 -181 -39 -49 -19 1 29 -22 47 -91 79 -48 -40 -79 55 -54 -123 63 57 -44 0 -48 -146 -18 -47 160
$$ packed form
5436a48J49J47l34L11n6p4M4N6n7L27m01L07j96k21R0j06Q6P8N6j11L6j02J52
5459C3lJ94j32j18K97p9j58O9Q0j27K2j63j01M01k27J64j71n9K40j85j21j79K07
5482a16J51R3L8j55k38K63O5j48m3J7M2rJ08K13k71n1M6J42j28q4J27qN7k05L42
5507B48j70j68mJ12lR3j31P8n2om7K56k74N5k90L06j7m5O4Lj74J7M02l36K17M0
5533A74k13n1J98k17J5K75j85j95O0OL47m5k34L41k14j02k7j58K14J91k16K53
5555B17j67J77k64JK03j85k9l3K95m25L73k29j44J73J20j20r9O5N5n7p7M74k20
5578A04k28J87p9R4k13rK91o3k55K11k03K27j1m9P9k76K88o9q4k6J76j40O1L7
5602E0j86m5J42j0L0K0K8n1O9j38J70j27Ql9J34j09o9J86oj01M4m8r8J28k9K07
$$ plain form
5628 160 70 99 -113 -211 53 179 114 -31 26 270 86 -211 -234 -31 -145 112 -177 18 -86 35 122 201 170
5651 170 -191 -10 -222 -141 12 87 205 82 75 33 235 76 -73 -112 -280 17 33 -55 87 140 -16 110 -27
5674 -27 331 -136 190 -139 27 -57 18 -69 -195 -9 186 -28 121 175 76 239 65 24 151 -49 9 -199 28
5697 28 105 -144 22 77 11 1 95 58 -29 68 46 95 -17 -162 -62 54 29 -14 66 -56 -204 -18 -14 -19 52 -199
5723 -199 161 322 113 226 32 52 76 95 57 -113 -114 24 199 13 -127 -53 -18 -47 46 -83 135 40 82 25
5747 25 47 34 -126 -119 24 -292 -139 176 -60 121 134 66 23 158 120 -230 170 238 76 53 -65 -4 61 3 -80
5772 -80 171 -150 101 -9 15 -66 -157 138 38 -81 -3 -14 63 -128 -99 -89 88 0 -47 -29 -148 -62 23 87 -131
5797 -131 -34 -15 82 10 21 279 101 -84 -133 38 -109 -179 155 -11 -75 -154 -162 223 107 268 56 240 100 -177
$$ packed form
5628A60r0K9k12r8K64J26o5j45N7K44j84k97k3K03j14K57k89J95j04J21Q7P9l1
5651A70l61J81k12Q1J53P5J18j23pm2K02j59j49l9j68K97J6q8J42N3j56J26j37
5674b7L58m67L26l29J66q4P5q7j26J86J95k14J49N4r9J63j74m1J27k00N8k08K27
5697B8P7k49J66N5o6j0R4l7q7R7k2M9j12j45J00J16k5m3Q0j22j48J86MnP1k51
5723a99L60J61k09J13j94K0K4J9l8j70jJ38J75j86j40P4L5k9R3j29K18r5M2n7
5747B5K2j3j60PJ43l16J53L15k36J81J3o8m3J35l8l50M00O8j62k3j18O1O5n8q3
5772h0K51l21K51j10K4q1r1K95j00j19P8j1P7j91K9J0J77q8m7J8j19Q6Q5O4k18
5797a31R7J9R7p2J1K58j78j85m9J71j47p0L34j66o4p9qL85j16J61k12J84j40k77
$$ plain form
5821 -177 247 -119 -86 -234 16 -295 -121 85 -113 280 184 34 230 169 26 -81 104 270 11 -196 122
5842 122 -70 -20 221 -206 -176 102 94 206 -22 -17 55 -51 -212 -88 216 -88 198 131 -75 -135 -52 -280 -94
5865 -94 -9 163 8 220 12 115 178 -33 -115 243 200 -56 -118 75 137 1 -20 -78 156 -232 -160 -69 -22 53
5889 53 2 -77 -95 87 197 -58 -276 -414 184 -248 66 -231 -58 333 -35 -68 93 166 126 104 65 -98 -141
$$ packed form
5821a77M24l66L3j48K50l11J74K06j98L93r6j50J96o1j43j07J85J66k59k07L18
5842A22j92N0K41m27L0K78qJ12k28NP2j06j61J24L04l04K86o7k06o0Q3k28J86
5865i4Q5J72j55K12k08J03O3k11q2L58m3k56o2J93O2j36k1n8K34l88P2R1M7P5
5889E3n1p9j8J82J10k55k18j38N98m32L14k97J73L91l68l3J61P3m0k2l9j63m3
$$ [...]
16383C
##END NTUPLES=NMR FID
##END=
