##TITLE=abcd
##JCAMPDX= 6.0         $$ Bruker NMR JCAMP-DX V2.0
##DATA TYPE= NMR FID
##DATA CLASS= NTUPLES
##ORIGIN= UXNMR, Bruker Analytische Messtechnik GmbH
##OWNER= root
$$ XWIN-NMR		Version 3.5
$$ Sun Jul  6 16:27:26 2025 Russian Standard Time (UT+4h)  servis@DPX200
##.OBSERVE FREQUENCY= 200.131235884673
##.OBSERVE NUCLEUS= ^1H
##.DELAY= (6, 6)
##.ACQUISITION MODE= SIMULTANEOUS
##.ACQUISITION SCHEME= undefined
##.AVERAGES= 32
##.DIGITISER RES= 18
##SPECTROMETER/DATA SYSTEM= spect
##.PULSE SEQUENCE= zg
##.SOLVENT NAME= CDCl3
##.SHIFT REFERENCE= (INTERNAL, CDCl3, 0, 16.5164)
##AUDIT TRAIL= $$ (NUMBER, WHEN, WHO, WHERE, WHAT)
$$ ##TITLE= Audit trail, XWIN-NMR		Version 3.5
$$ ##JCAMPDX= 5.01
$$ ##ORIGIN= Bruker BioSpin GmbH
$$ ##OWNER= servis
$$ F:\spectra/data/av/nmr/H1/1/audita.txt
$$ ##AUDIT TRAIL=  $$ (NUMBER, WHEN, WHO, WHERE, WHAT)
(   1,<2025-07-06 16:26:49.06 +0400>,<servis>,<DPX200>,
      <created by zg, POWCHK disabled, PULCHK disabled
       configuration hash MD5:
       00 E9 B6 7A A2 85 ED C7 34 08 36 98 17 FE 4E 26
       data hash MD5: 32K
       39 0C 2B 3E C7 99 45 9D 7D 78 FD 28 47 2A 05 81>)
$$ ##END=
$$ 
$$ hash MD5
$$ 7B EF 75 BE 18 BB 50 E5 20 05 9F 9F DF B1 B7 7F
##$RELAX= 
##$RELAX= 
##$RELAX= 
##$RELAX= 
##$RELAX= 
##$RELAX= 
##$RELAX= 
##$RELAX= 
$$ Bruker specific parameters
$$ --------------------------
##$DU= <F:\spectra>
##$EXPNO= 1
##$NAME= <H1>
##$PROCNO= 1
##$TYPE= <nmr>
##$USER= <av>
##$AMP= (0..31)
100 100 100 100 100 100 100 100 100 100 100 100 100 100 100 100 100 100 
100 100 100 100 100 100 100 100 100 100 100 100 100 100 
##$AQSEQ= 0
##$AQ_mod= 1
##$AUNM= <au_zg>
##$AUTOPOS= <>
##$BF1= 200.13
##$BF2= 200.13
##$BF3= 200.13
##$BF4= 200.13
##$BF5= 500.13
##$BF6= 500.13
##$BF7= 500.13
##$BF8= 500.13
##$BYTORDA= 1
##$CFDGTYP= 0
##$CFRGTYP= 5
##$CHEMSTR= <none>
##$CNST= (0..31)
1 1 145 1 1 1 1 1 1 1 1 1 1 1 1 1 1 1 1 1 1 1 1 1 1 1 1 1 1 1 1 1 
##$CPDPRG= <>
##$CPDPRG1= <>
##$CPDPRG2= <>
##$CPDPRG3= <>
##$CPDPRG4= <mlev>
##$CPDPRG5= <mlev>
##$CPDPRG6= <mlev>
##$CPDPRG7= <mlev>
##$CPDPRG8= <mlev>
##$CPDPRGB= <>
##$CPDPRGT= <>
##$D= (0..31)
0 2 0 0 0 0 0 0 0 0.06 0 0 0 0 0 0 0.0002 0 0 0 0 0 0 0 0 0 0 0 0 0 0 
0 
##$DATE= 1751804808
##$DBL= (0..7)
120 120 120 120 120 120 120 120 
##$DBP= (0..7)
150 150 150 150 150 150 150 150 
##$DBP07= 0
##$DBPNAM0= <>
##$DBPNAM1= <>
##$DBPNAM2= <>
##$DBPNAM3= <>
##$DBPNAM4= <>
##$DBPNAM5= <>
##$DBPNAM6= <>
##$DBPNAM7= <>
##$DBPOAL= (0..7)
0.5 0.5 0.5 0.5 0.5 0.5 0.5 0.5 
##$DBPOFFS= (0..7)
0 0 0 0 0 0 0 0 
##$DE= 6
##$DECBNUC= <off>
##$DECIM= 32
##$DECNUC= <off>
##$DECSTAT= 4
##$DIGMOD= 1
##$DIGTYP= 9
##$DL= (0..7)
0 120 120 120 120 120 120 120 
##$DP= (0..7)
150 150 150 150 150 150 150 150 
##$DP07= 0
##$DPNAME0= <>
##$DPNAME1= <>
##$DPNAME2= <>
##$DPNAME3= <>
##$DPNAME4= <>
##$DPNAME5= <>
##$DPNAME6= <>
##$DPNAME7= <>
##$DPOAL= (0..7)
0.5 0.5 0.5 0.5 0.5 0.5 0.5 0.5 
##$DPOFFS= (0..7)
0 0 0 0 0 0 0 0 
##$DQDMODE= 0
##$DR= 18
##$DS= 0
##$DSLIST= <SSSSSSSSSSSSSSS>
##$DSPFIRM= 0
$$ [...]
##$SUBNAM0= <"">
##$SUBNAM1= <"">
##$SUBNAM2= <"">
##$SUBNAM3= <"">
##$SUBNAM4= <"">
##$SUBNAM5= <"">
##$SUBNAM6= <"">
##$SUBNAM7= <"">
##$SUBNAM8= <"">
##$SUBNAM9= <"">
##$SW= 20.6817932712277
##$SWIBOX= (0..15)
0 0 3 0 0 0 0 0 0 0 0 0 0 0 0 0 
##$SW_h= 4139.07284768212
##$TD= 32768
##$TD0= 1
##$TE= 0
##$TE2= 300
##$TE3= 300
##$TEG= 300
##$TL= (0..7)
0 120 120 120 120 120 120 120 
##$TP= (0..7)
150 150 150 150 150 150 150 150 
##$TP07= 0
##$TPNAME0= <>
##$TPNAME1= <>
##$TPNAME2= <>
##$TPNAME3= <>
##$TPNAME4= <>
##$TPNAME5= <>
##$TPNAME6= <>
##$TPNAME7= <>
##$TPOAL= (0..7)
0.5 0.5 0.5 0.5 0.5 0.5 0.5 0.5 
##$TPOFFS= (0..7)
0 0 0 0 0 0 0 0 
##$TUNHIN= 0
##$TUNHOUT= 0
##$TUNXOUT= 0
##$USERA1= <user>
##$USERA2= <user>
##$USERA3= <user>
##$USERA4= <user>
##$USERA5= <user>
##$V9= 5
##$VALIST= <valist>
##$VCLIST= <CCCCCCCCCCCCCCC>
##$VD= 0
##$VDLIST= <DDDDDDDDDDDDDDD>
##$VPLIST= <PPPPPPPPPPPPPPP>
##$VTLIST= <TTTTTTTTTTTTTTT>
##$WBST= 1024
##$WBSW= 30
##$XGAIN= (0..3)
0 0 0 0 
##$XL= 0
##$YL= 0
##$YMAX_a= 2473060
##$YMIN_a= -2069392
##$ZGOPTNS= <>
##$ZL1= 120
##$ZL2= 120
##$ZL3= 120
##$ZL4= 120
##$ABSF1= 10
##$ABSF2= 0
##$ABSG= 5
##$ABSL= 3
##$ALPHA= 0
##$AQORDER= 0
##$ASSFAC= 0
##$ASSFACI= 0
##$ASSFACX= 0
##$ASSWID= 0
##$AUNMP= <proc_1d>
##$AZFE= 0.1
##$AZFW= 0.1
##$BCFW= 1
##$BC_mod= 2
##$BYTORDP= 0
##$COROFFS= 0
##$CY= 19
##$DATMOD= 1
##$DC= 2
##$DFILT= <>
##$DTYPP= 0
##$F1P= 11.0000007629395
##$F2P= -0.999999237060547
##$FCOR= 0.5
##$FTSIZE= 0
##$FT_mod= 4
##$GAMMA= 1
##$GB= 1
##$INTBC= 1
##$INTSCL= 1
##$ISEN= 128
##$LB= 0.05
##$LEV0= 0
##$LPBIN= 0
##$MAXI= 10000
##$MC2= 0
##$MEAN= 0
##$ME_mod= 0
##$MI= 0
##$NCOEF= 0
##$NC_proc= 0
##$NLEV= 6
##$NOISF1= 0
##$NOISF2= 0
##$NSP= 1
##$NTH_PI= 0
##$NZP= 0
##$OFFSET= 16.51637
##$PC= 1
##$PHC0= -274.4572
##$PHC1= 1.101538
##$PH_mod= 0
##$PKNL= yes
##$PPARMOD= 0
##$PSCAL= 4
##$PSIGN= 0
##$REVERSE= no
##$SF= 200.13
##$SI= 16384
##$SIGF1= 0
##$SIGF2= 0
##$SINO= 400
##$SIOLD= 16384
##$SREGLST= <1H.CDCl3>
##$SSB= 0
##$STSI= 0
##$STSR= 0
##$SW_p= 4139.07284768211
##$SYMM= 0
##$S_DEV= 0
##$TDeff= 0
##$TDoff= 0
##$TI= <>
##$TILT= no
##$TM1= 0
##$TM2= 0
##$TOPLEV= 0
##$USERP1= <user>
##$USERP2= <user>
##$USERP3= <user>
##$USERP4= <user>
##$USERP5= <user>
##$WDW= 1
##$XDIM= 8192
##$YMAX_p= 0
##$YMIN_p= 0
$$ End of Bruker specific parameters
$$ ---------------------------------
##NTUPLES= NMR FID
##VAR_NAME=  TIME,          FID/REAL,        FID/IMAG
##SYMBOL=    X,             R,               I
##VAR_TYPE=  INDEPENDENT,   DEPENDENT,       DEPENDENT
##VAR_FORM=  AFFN,          ASDF,            ASDF
##VAR_DIM=   16384,         16384,           16384
##UNITS=     SECONDS,       ARBITRARY UNITS, ARBITRARY UNITS
##FACTOR=    0.0002416,     1,               1
##FIRST=     0,             0,               0
##LAST=      3.9581328,     0,               0
##MIN=       0,             -2069392,        0
##MAX=       3.9581328,     2473060,         0
$$ Real data points
##PAGE= N=1
##DATA TABLE= (X++(R..R)), XYDATA
0 0 0 0 0 0 0 0 0 0 0 0 0 0 0 0 0 0 0 0 0 0 -32 23 -32 32 -32 32 -38 40 -47 62 -64 69 -81 82 -96 111 -117 130
38 130 -147 154 -177 192 -207 231 -254 276 -302 335 -364 402 -443 492 -542 602 -676 760 -858
57 -858 981 -1133 1324 -1576 1918 -2398 3105 -4221 6137 -9890 18805 -49029 359737 2473060
71 2473060 1938341 -733097 -2069392 -1160980 495000 1183723 507530 -262588 -319202 -314085
81 -314085 -559990 -340401 654324 1192628 376803 -919925 -1394410 -418820 1107003 1300943
91 1300943 -72559 -1224624 -876196 141239 549970 388908 72147 -202424 -288549 -332233
101 -332233 -221999 301610 739220 288388 -679550 -807605 30253 596056 335460 -256049
111 -256049 -457258 -94526 177020 -97117 -336941 125118 635265 183147 -649307 -656468
121 -656468 146146 798380 533528 -392636 -862677 -248219 586420 442634 -289499 -416738
131 -416738 71095 309548 -61431 -474662 -180486 597201 728989 -208161 -971681 -401451
141 -401451 699074 876000 50279 -712864 -601779 119781 534301 226859 -199304 -132805
151 -132805 55548 -85066 -187644 98766 430269 327946 -157162 -494426 -238986 389278
161 389278 582547 51709 -454818 -324761 105743 263134 92449 -76840 -35287 89575
171 89575 26223 -157043 -44563 306082 306189 -113800 -324345 -28621 296297 184058 -175145
182 -175145 -275113 42368 329993 105703 -338203 -308805 192655 457552 144175 -289734
192 -289734 -311241 53811 341601 201121 -137211 -184564 37106 76676 -129907 -153725 128047
203 128047 290575 41728 -352728 -378703 91013 517958 319632 -271971 -473716 -83453
213 -83453 304474 263899 -3194 -162270 -140893 -71267 -53516 -9903 138278 188543 -73138
224 -73138 -362300 -230271 191925 383887 155371 -220258 -352638 -91902 260201 252618
234 252618 -57976 -210615 -103017 -16361 -23616 9068 73836 66029 -49014 -196385 -165342
245 -165342 128078 319420 83057 -253064 -218966 60788 188924 81897 -92735 -148157
255 -148157 -18746 88067 -22759 -127959 5746 137446 31145 -113665 -90967 27362
265 27362 131420 122088 -49492 -156911 -7529 135148 29332 -93700 -31574 53053 32273
276 32273 -40110 -103127 -45688 140178 163595 -72707 -179070 15849 162918 80745 -25648
287 -25648 -52842 -31570 38995 51914 -42474 -42481 80335 53768 -103532 -92808 58616 114271
299 114271 70100 -14788 -110638 -57789 134910 152471 -37913 -104576 -3471 39731 19440
310 19440 13918 -17738 -24830 28290 -4164 -85353 9293 151626 56726 -114125 -82859 46328
322 46328 101608 82874 -20130 -124516 -46204 99967 56361 -59358 -35902 5879 -28167
333 -28167 -12371 30853 7015 7548 36379 -32487 -82007 37297 121621 17179 -80766 -59846
345 -59846 -14094 40881 66771 -33178 -116304 -15916 74801 -3858 -53325 14386 28759 -17217
357 -17217 -13612 -4061 -1969 45977 37556 -69073 -77396 36171 51999 -27756 -40826 -21318 -26286
370 -26286 12789 39583 -26972 -50718 28435 43213 -22692 -19402 22793 11123 -159 -1640
382 -1640 -39762 -30450 43702 26470 -65113 -47247 33931 23489 -19906 -9044 718 5528 33335
395 33335 15180 -34107 -3376 48807 6825 -40493 -8411 10920 -8685 3261 7717 -28803
407 -28803 -20227 27122 13734 -17521 12369 35176 6864 -5157 1238 -3857 18673 42691 -7166
420 -7166 -58451 -13959 38828 12262 -17798 -7212 -6511 -7677 15726 22889 11394 19591 16148
433 16148 -18184 -14216 30510 31591 -4324 -12561 -11732 -22390 -5289 23278 7732 -19478 -9018
446 -9018 5673 4840 16785 28047 9910 -6256 -909 -575 3946 25299 14030 -34058 -39637 5977
460 5977 19369 -9377 -19008 -4903 5248 11609 8994 -7132 216 29786 21381 -17347 -18526
473 -18526 7167 8305 -192 -4687 -27979 -39292 25 29864 665 -25863 -8398 10268 14227
486 14227 14840 -1993 -14159 16815 33707 -11077 -42118 -11814 9429 -963 -1921 -13664 -43231
499 -43231 -24557 30861 33180 -4208 -13790 -8498 139 29574 29881 -17196 -22613 21148 10096
512 10096 -39582 -33253 2525 10503 14443 2670 -47491 -48842 32024 70930 22113 -21490 -27869
525 -27869 -14476 33616 57241 -9581 -61469 -7985 33798 -12059 -43083 -15916 11869 34225
537 34225 30646 -37955 -72589 16468 96921 54399 -17215 -42128 -40899 6173 68879 31877
549 31877 -56759 -47988 10564 2500 -18153 1546 12259 19928 33393 -14345 -67081 1928 100935
562 100935 69915 -22631 -62526 -63438 -13217 82546 81178 -43445 -105146 -43038 22509 51322
574 51322 52003 -5577 -49852 195 40654 -882 -4760 50048 37628 -31158 -56903 -48465 -7791
587 -7791 77063 81337 -55489 -139973 -48956 76319 110565 56600 -56590 -114849 -12179 111708
599 111708 73644 -29479 -43937 -20235 -14836 175 -471 -16698 15952 38213 -38891 -93421
611 -93421 -8466 90878 84698 18116 -59345 -97102 -10948 113060 87578 -40081 -88750 -52395
623 -52395 -5730 38393 38280 -21606 -40514 4011 4145 -25041 10374 55310 36056 4566 -19987
636 -19987 -58649 -36556 60323 85655 -7121 -85327 -80905 -23071 57104 81700 -1305 -73301
648 -73301 -30819 30450 25931 15194 22239 11434 1570 -4393 -40271 -47457 29469 79448 10125
661 10125 -82146 -89364 -19983 72629 103644 13598 -91217 -62212 41256 72482 33550 -3967
673 -3967 -25248 -24544 -3831 -5227 -16393 11762 34692 -9786 -59098 -38607 16272 54506 58538
686 58538 7987 -57931 -45584 33406 67737 30311 -16825 -42367 -38517 -2719 22641 6947
698 6947 -9417 -3682 -8480 -19253 -2447 22381 26151 25042 16206 -18214 -37789 -1321 44890
711 44890 39544 -7268 -51941 -58373 -10968 45227 39463 -13064 -35081 -15563 4295 17701 31143
724 31143 26099 6614 -6698 -20067 -28138 -632 42278 33710 -25530 -65780 -48839 9115 62263
737 62263 49566 -23695 -63502 -22042 32598 46271 36231 10643 -28816 -42162 -13345 15202
749 15202 24419 19252 -13782 -55532 -43402 11710 40616 32052 9388 -26839 -42467 2111 52889
762 52889 41555 1345 -22287 -36618 -26172 17482 32559 -1279 -25464 -23863 -23704 -3184 34143
775 34143 26758 -10158 -9182 7695 -758 3440 24947 12257 -16195 -15659 -12131 -13945 8767 19063
789 19063 -15015 -29654 -166 8371 -444 16656 19644 -8684 -6322 18711 6400 -9446 8625
802 8625 6852 -17655 -11530 615 -12855 -6440 15567 -3225 -21501 7467 20504 -1800 4494
815 4494 21507 -552 -12305 10019 7076 -10174 5567 6074 -24802 -17590 12614 -464 -13248
828 -13248 10476 7339 -16035 5633 29370 5045 -6976 8927 -1548 -10671 14343 11586 -21263
841 -21263 -14677 4932 -11806 -9955 19809 4649 -24837 -817 21974 3784 4333 17655 -6191
854 -6191 -17599 11860 14733 -8368 -1530 -92 -27434 -16721 20729 9711 -15242 514 4241
867 4241 -12633 7260 28890 2933 -12721 4784 -555 -10180 13655 14034 -21315 -20240 4442
880 4442 -5623 -9360 16364 8989 -20371 -6650 14958 4459 5692 17212 -3819 -17455 7702
893 7702 11249 -10964 -3072 6512 -17645 -18594 11936 9101 -11302 547 6795 -9075 880 19820
907 19820 4968 -6203 7661 2136 -11990 4418 10668 -14525 -15622 7032 290 -11379 4170
920 4170 6453 -9277 -383 12991 1299 -207 13220 3397 -10374 4122 8726 -9762 -7631
933 -7631 6113 -5032 -12565 2211 3424 -7952 799 8988 -2107 -1728 11194 6495 -117 7091
947 7091 2091 -12137 -2771 11176 -1628 -12364 -1925 -605 -8555 -2257 6326 2216 2642 5241
961 5241 -3419 -3564 12925 14675 -2584 -7977 -2447 -3928 -1696 7134 1288 -12194 -9398 -1080 -2323
976 -2323 1548 11660 7648 -4149 -4455 1010 4932 12631 11294 -8171 -17162 -1619 8380 -1711
990 -1711 -6446 -1610 -4892 -8393 -2640 3288 7472 13656 6457 -12757 -10825 11824 17825 4305
1004 4305 -4321 -10045 -13704 -1635 9996 -2173 -13155 -1471 3373 -6690 -3141 9957 10539
1017 10539 6633 3066 -9947 -10158 14351 20780 -4491 -16014 -7350 -8654 -7586 8896 8844 -8015
1031 -8015 -8410 -2132 -4140 8284 23428 6612 -14040 -2657 7973 -1467 2120 9204 -6249
1044 -6249 -15042 -5110 -8665 -11404 14567 23378 -9115 -25406 -5889 12838 24547 25801 -7532
1057 -7532 -34615 -3117 29928 7104 -17615 -7369 -1187 -6234 -2421 -7590 -11156 16526 29116
1070 29116 -11063 -33519 1568 29684 23563 10297 -13948 -33778 -4697 32347 9862 -24200
1082 -24200 -13445 274 -6243 266 5928 -5409 3755 20717 -1026 -19545 7721 24144 5138
1095 5138 -449 -337 -21121 -19008 14301 15967 -9086 -12006 -11713 -15778 10714 33514 2554 -22877
1109 -22877 2739 19634 5208 1408 -769 -12027 2630 18276 -14606 -37919 87 29821
1121 29821 7594 -17304 -22732 -13026 25584 48781 1183 -44701 -10006 36640 22013 -10221
1133 -10221 -20032 -16022 6402 21758 -11648 -40302 -3220 34217 10314 -19980 -14047 2206
1145 2206 22458 34104 1165 -36518 -11779 28583 15843 -11946 -14250 -13898 -8370 9582 4776
1158 4776 -16956 -5558 16397 5209 -5317 7916 7581 -2423 10407 15072 -9283 -17544 -2295
1171 -2295 3204 3715 4644 -16854 -32170 -60 31676 12002 -16142 -11461 5688 18635 21043
1184 21043 -3487 -24240 1310 29764 4962 -31660 -24264 5217 19526 9129 -22328 -34831
1196 -34831 5290 45872 20103 -26058 -21585 13995 28853 13855 -14077 -24873 953 23523
1208 23523 313 -31320 -18688 11620 14523 -1680 -13083 -9855 10345 25298 9544 -13539
1220 -13539 -6364 13635 11936 -2219 -8079 -8435 -5621 -562 -2802 -8062 -2312 2836 -3785 -3496 10503
1235 10503 13022 -781 -4550 6840 13106 5873 -6225 -12713 -4697 8325 2026 -18413 -18155 5746
1249 5746 16979 935 -14167 -7444 12338 23507 9907 -14782 -13546 15057 23150 -4189 -25570
1262 -25570 -13304 7812 11179 -4984 -21596 -13087 15319 20734 -6284 -17406 6411 23883
1274 23883 11638 -6699 -11138 -877 12972 6740 -17384 -20365 3568 11451 -5751 -12775 -2963
1287 -2963 4588 9086 7167 -4585 -2948 16136 14720 -8921 -11537 5669 6086 -5738 -10191 -9858
1301 -9858 -3312 8117 1123 -16307 -4567 19222 10722 -9180 -2402 10470 9168 5579 -3059
1314 -3059 -13393 -1330 14659 -2382 -22644 -7007 10376 1403 -7127 -4670 -2902 8672 18981
1327 18981 1242 -15500 4836 21186 1582 -13407 -5873 -151 2311 3728 -11856 -19540 5561
1340 5561 19286 -6234 -17595 5796 16786 7343 1800 -4049 -5086 11545 14104 -13145 -19600
1353 -19600 6233 10905 -9276 -11829 -4277 -2027 8412 10473 -9267 -10326 16541 17830 -7117
1366 -7117 -8089 6516 5083 1510 -720 -12561 -9427 11456 4945 -20043 -11017 13280 8621 -3515
1380 -3515 148 1210 2833 13323 5387 -13674 -2430 15827 -232 -16702 -5224 3269 -1433
1393 -1433 -25 -3105 -12389 2075 19256 2444 -13906 2261 14505 3748 -1598 -1424 -5257
1406 -5257 3336 9935 -9630 -20292 3007 14773 -4539 -12533 -758 4747 7104 8028 -4739
1419 -4739 -8957 10653 15338 -6663 -11487 4785 5398 -3961 -5231 -7979 -7170 7352 8387 -10054
1433 -10054 -10098 9375 11293 -1249 -1919 1876 2297 7623 3811 -11175 -8054 9855 4832 -12958
1447 -12958 -9442 3217 3875 1226 -1104 -5707 525 11899 5090 -7612 -93 10527 3104 -5527
1461 -5527 -4213 -2792 9 4152 -3093 -11736 -2051 9301 2005 -6696 -1021 5427 5324 3253 -1053
1476 -1053 -3262 4867 8562 -4035 -11698 -1380 6660 174 -7176 -6141 -1030 4609 4244 -3758 -4535
1491 -4535 6105 10335 979 -5176 -269 4576 2780 -1601 -5655 -5030 1912 4189 -3835 -8429 -993
1506 -993 5955 2973 -1827 -1501 2186 5750 4604 -2423 -4714 2198 5565 -1637 -6691 -1798 1642
1521 1642 -1372 -3180 -2562 -1186 2518 3800 -575 -2161 4412 6217 -424 -2137 1477 1375 -453
1536 -453 -114 -2832 -4890 593 2373 -5217 -5488 3268 4926 354 620 620 -163 5112 5524 -3534 -4696
1553 -4696 4490 3167 -5860 -4101 -4 -2326 -1291 1633 -3134 -3555 5445 5182 -2943 478 4972
1568 4972 -507 -289 5385 459 -5517 384 1409 -6095 -2875 3525 -2630 -5067 2773 2473 -2591
1583 -2591 2993 4856 -2338 801 7302 -688 -5980 4115 3753 -6387 -4581 325 -3785 -1170 5278
1598 5278 -2704 -8268 3576 7665 -1086 728 5017 -1473 -1160 7711 1091 -8657 -696 4589 -4542
1613 -4542 -5052 691 -3424 -2673 7037 1649 -8898 397 10564 3167 -124 3368 -3130 -4210 6968
1628 6968 4344 -9895 -6388 3300 -1061 -3268 679 -3458 -4318 8129 7851 -7046 -3345 9937
1642 9937 6394 -788 868 -4374 -6564 4975 6877 -7970 -10330 855 654 -1473 3565 -434
1656 -434 -6335 5402 11844 -850 -5481 4393 3896 -976 1624 -2869 -10059 -642 7808 -3084 -9886
1671 -9886 -2317 700 1529 8089 4332 -7625 -1168 12232 5980 -4718 -2814 -549 -465 4055 -495
1686 -495 -12775 -7334 8205 4399 -6958 -4712 1211 4369 9632 5979 -8156 -5881 9763 9383
1700 9383 -3335 -6940 -4650 -1964 3928 1924 -10420 -9812 6176 8849 -1822 -4174 1132 4399
1714 4399 7555 6241 -4569 -7174 3633 7090 -1994 -6708 -6063 -5447 621 5136 -2157 -7698 379
1729 379 7708 4138 1022 640 140 3134 6979 840 -7125 -4568 1723 739 -2617 -5508 -7033 -1271
1745 -1271 7808 5768 -4115 -4469 4140 9098 5907 -836 -4798 -1069 6280 3321 -7505 -10352 -2219
1760 -2219 4162 711 -5269 -5968 -109 8020 7811 -893 -4874 2323 9363 5825 -2998 -6327 -2775
1775 -2775 2398 1693 -5057 -9111 -2736 4757 1944 -3368 -1802 3084 5049 4981 2454 -367 255 3547
1791 3547 1678 -2966 -3918 -3046 -3390 -1652 151 -2690 -4103 656 3359 1719 2393 3473 708 1859
1807 1859 5731 2448 -4594 -3145 608 -1213 -2582 -3723 -6257 -2684 5402 2728 -5335 -1343 7078
1822 7078 6493 2380 837 -1869 196 6005 1239 -9089 -6091 3372 799 -4852 -3734 -2656 25
1837 25 6094 3948 -4473 -232 9700 5683 -2382 -929 568 -986 1102 -839 -8393 -4800 3992
1852 3992 -499 -7140 -828 4100 890 2260 4611 299 1370 6535 1250 -5394 789 3138 -4631
1867 -4631 -5200 45 -3314 -4285 1717 -384 -3830 3992 7439 -1304 -1309 6534 4474 -1400 487 -839
1883 -839 -4115 1320 2055 -8030 -7139 4066 1989 -5707 -1289 3607 1750 4147 4974 -2613 -1266
1898 -1266 8354 4080 -6602 -3208 2088 -2034 -2866 -1484 -5688 -3838 5886 2818 -5755 156 7916
1913 7916 3079 -270 2387 -400 -425 4851 520 -8542 -3208 4145 -2836 -7027 -784 641 -770
1928 -770 2909 2149 -2546 2906 8082 612 -3834 3146 3357 -3011 -1820 -1008 -4453 -2291 2245 -3403
1944 -3403 -5510 3224 4872 -1730 -711 3819 2202 2222 3701 -1142 -3102 3867 2549 -6460 -5536 954
1960 954 -362 -3091 -679 -1146 -963 4151 3891 -2894 -434 6337 3370 -1930 -209 103 -1489 564
1976 564 -762 -5911 -3507 2871 628 -3976 -838 2885 2032 2183 1757 -480 1501 5560 852 -4555
1992 -4555 -1500 2007 -1021 -3711 -2325 -1872 -43 1469 -837 -2828 1647 4946 1426 -813 1564
2007 1564 2544 1281 205 -1620 -3463 -503 1133 -1947 -3858 -1153 1532 559 -667 34 1175 2846
2023 2846 3273 217 -663 1899 2258 -1116 -3006 -762 464 -940 -2064 -2151 -921 874 1108 -845
2039 -845 -224 2925 3801 823 -893 618 2101 880 -778 -2491 -2274 709 1189 -2746 -4297 10
2055 10 2914 903 -1083 -4 1185 3485 2897 -1157 -3002 1936 3247 -1491 -3926 -1281 -96 -355
2071 -355 -305 -2158 -2570 1879 3847 -385 -1394 2694 2577 145 715 392 -1403 938 1803 -3085 -3458
2088 -3458 1063 590 -3062 -746 1563 134 861 2210 -688 199 4395 1725 -3645 -288 3514 -580
2104 -580 -2954 -1069 -1300 -1322 1817 -450 -4669 290 5228 382 -2338 1402 1886 810 2923 775
2120 775 -4208 -512 4112 -1534 -5369 -363 1127 -1517 410 671 -2822 389 5147 72 -3263
2135 -3263 2774 3696 -1347 -456 1591 -1879 -1643 1547 -1771 -3782 1722 1926 -3555 -1082 3724 266
2151 266 -1114 2522 1221 -947 3221 2314 -4032 -2034 3469 -31 -4232 -1057 -464 -1431 1845 1469
2167 1469 -4517 -1216 6224 2593 -2779 649 2555 195 1470 1055 -4260 -2680 4050 442 -5149
2182 -5149 -1585 1370 -1133 678 2597 -2048 -1223 5081 3272 -2253 156 2151 -1311 -360 1975
2197 1975 -2552 -3953 1009 588 -3218 -1003 1464 -1646 223 4395 940 -2385 1728 3407 -252
2212 -252 139 179 -2916 -1116 3026 -730 -5395 -1814 1818 -15 -233 1015 -1449 81 4968 2736
2228 2736 -2900 -605 2888 1254 -67 -835 -3686 -2376 2744 780 -4801 -2927 1879 1816 1182 1750
2244 1750 -959 -672 3887 3438 -1409 -2454 760 426 -364 -1026 -3442 -3478 1317 2467 -1665 -2539 628
2261 628 2763 2731 1973 -655 -1412 2454 3904 -714 -3342 -1648 -430 -71 -677 -2404 -2883 412 3119
2278 3119 1205 -1791 -271 2229 3241 2386 -433 -1817 348 2058 -29 -3264 -2992 -1062 -334 -102
2294 -102 -639 -1234 -478 1998 2598 1242 336 915 1964 2032 464 -1658 -2489 -1000 789 -606 -3071
2311 -3071 -2637 -173 1296 1501 608 -1186 302 3929 3630 -315 -1599 599 1556 188 -1984 -4086
2327 -4086 -2653 1673 1441 -3290 -3541 1015 3263 2007 727 -506 190 3861 3761 -1777 -3489 511
2343 511 1027 -1385 -2281 -2455 -2026 792 1994 -1722 -2450 2605 3979 740 782 1371 26 903 1771 -1716
2361 -1716 -2839 267 -216 -3279 -1486 908 -1664 -1380 2090 1678 348 2507 2070 -580 1869 2913
2377 2913 -1903 -3132 806 585 -2454 -1988 -1659 -2499 515 3075 -1675 -2686 3170 4634 416 -268
2393 -268 914 269 1642 2371 -3567 -5082 1217 2172 -3678 -3791 -182 109 1476 2799 -533 -1534
2409 -1534 4294 4503 -1346 -1537 1964 469 -1074 -156 -2397 -3760 428 1429 -3759 -2124 2775 1566
2425 1566 -257 2213 2094 -134 2260 2166 -2262 -878 2820 -1335 -4796 -998 723 -2155 -1341 446
2441 446 -1083 865 3681 346 -2126 3090 4309 -503 -1587 668 -475 -498 608 -2835 -5260 413
2457 413 3104 -1665 -2509 1628 1823 1393 2294 -100 -1270 3464 4045 -2197 -3688 758 819 -1852 -1830
2474 -1830 -1836 -2582 971 2351 -1643 -1111 3509 2607 -599 799 1941 428 769 477 -2619 -2511 1062
2491 1062 -539 -3794 -1322 1148 -482 -492 997 355 1429 3440 1067 -1992 1068 3561 -225 -2897
2507 -2897 -1591 -723 -490 -255 -1812 -2847 1007 2609 -244 -1699 1222 3187 1932 1008 -585 -1142
2523 -1142 1506 2048 -2067 -3912 -991 996 -693 -1655 -1243 -126 1779 1751 -566 -289 2797 3000 -221
2540 -221 -1290 -409 373 159 -1214 -2492 -1427 368 -75 -1612 -940 1397 1561 400 -204 712 2303
2557 2303 1989 17 -1579 -800 952 179 -2011 -2531 -847 727 -370 -1563 -768 1563 2178 800
2573 800 -661 -351 2215 2470 -457 -2309 -735 871 143 -1533 -2160 -1327 485 850 -837 -1249 1926
2590 1926 2813 369 -379 832 890 1098 618 -1788 -1932 501 791 -2095 -2300 340 697 -354 -100 30
2608 30 566 2520 1560 -1681 -511 2666 1057 -1739 -1367 -868 -755 -42 -608 -2891 -1060 2476 942
2625 942 -1542 332 2212 910 661 463 -1205 183 2559 -192 -3350 -853 838 -908 -1427 -168
2641 -168 -963 -248 2169 378 -1530 1300 2713 -633 -1325 1220 497 -1012 92 -1079 -2443 366
2657 366 1406 -2010 -1853 1981 1099 -1028 511 985 125 1602 2042 -1958 -1625 2701 1336 -2665 -1567
2674 -1567 -131 -898 471 832 -2150 -1350 3052 1727 -1994 -13 2498 566 190 992 -1133 -1280
2690 -1280 1870 312 -3212 -947 1169 -1017 -836 1031 -289 -1224 1976 1599 -863 819 2340 -360
2706 -360 -1164 1089 428 -2032 -162 317 -1516 -46 1179 -1452 -1749 2094 1672 -1443 55 1749
2722 1749 615 899 1051 -1695 -1613 1712 1154 -2633 -1802 464 -546 -261 541 -1013 -993 2650 2147 -1426
2740 -1426 -730 1806 1040 141 534 -1261 -1665 1335 1032 -2314 -1676 438 -149 -447 1090 159 -674 1311
2758 1311 1968 -184 -714 1135 33 -684 756 -638 -1955 -745 730 -818 -940 -41 -446 233 1908
2775 1908 1273 -946 -205 1662 1009 51 146 -1002 -696 762 -17 -1966 -1606 493 763 -242 -273 -472
2793 -472 634 2040 1593 -636 -713 1221 1125 -16 -798 -1634 -1113 210 186 -1436 -1325 183 975 662
2811 662 333 -157 410 1598 1511 -183 -1018 -414 205 5 -1053 -1730 -1155 -107 541 77 -550 -590 410
2830 410 1428 1307 49 -3 719 864 399 -749 -1560 -681 348 -201 -1660 -1214 -140 448 707 510
2848 510 -330 232 2038 1941 -215 -353 -224 -131 259 -223 -1632 -1888 251 268 -925 -566 167 85 1132
2867 1132 1732 122 -110 1466 1538 -276 -845 -432 -1281 -521 562 -1194 -2196 -281 861 -70 238
2884 238 540 308 1022 2239 837 -1345 154 1198 -546 -730 -928 -1695 -1015 934 -380 -2409 -330
2901 -330 1952 1032 707 1268 65 538 2208 638 -1722 -676 680 -1130 -1591 -283 -1254 -1526 606
2918 606 529 -981 365 2011 551 342 1814 297 -990 816 751 -1529 -1189 3 -1716 -1611 617
2935 617 -283 -1767 479 2228 387 419 1283 168 484 2035 188 -2358 -502 1518 -1169 -2033 -908
2952 -908 -1159 -774 1537 364 -1716 678 2831 805 -171 990 676 97 1256 -223 -2599 -1224
2968 -1224 1120 -1025 -2183 -128 116 -221 1241 1114 -664 594 2403 450 -842 1016 545 -1379
2984 -1379 -590 -315 -1443 -941 280 -1156 -1395 946 1059 -700 690 2308 471 107 1252 154
3000 154 -504 860 -144 -2791 -1563 528 -314 -1526 -582 -135 110 1800 1123 -870 865 2790 1013
3017 1013 -1202 -363 54 -289 -103 -1272 -2538 -911 1283 -160 -1593 107 1092 813 965 771 -79
3034 -79 927 2010 186 -1721 -333 99 -1067 -1115 -818 -1242 -150 505 56 -198 1192 1620 305 269
3052 269 1315 1081 89 -456 -894 -625 22 -477 -2085 -1439 394 310 -301 -225 704 1148 1564 483 -593
3071 -593 412 1497 578 -1187 -1376 -699 151 -365 -1283 -1694 -27 1042 395 -422 372 1410 1828 813
3089 813 -511 -256 431 531 -505 -1355 -824 -374 -204 -791 -969 -2 819 435 -202 557 986 1153 483
3108 483 -80 -475 209 519 -1007 -1411 -334 -63 -981 -936 92 405 1235 816 -537 -76 1806 1803 -322
3127 -322 -825 -56 113 -257 -213 -1736 -1416 593 178 -1402 -659 1259 1088 604 444 -26 204 2142 588
3146 588 -1475 -782 580 -363 -1218 -770 -576 -414 288 -86 -768 438 2081 434 -566 670 847 223
3164 223 35 -109 -1223 -166 375 -1306 -1839 508 836 -638 -340 654 94 968 1498 -483 -930 1384
3182 1384 1493 -1162 -1164 85 -606 -545 -128 -1175 -1150 1374 1322 -1167 -626 1691 1070 226 570 -56 -522
3201 -522 974 641 -1987 -976 858 -377 -1468 21 287 -405 527 780 -646 142 1980 538 -958
3218 -958 441 890 -687 -301 -519 -1418 -448 914 -716 -1843 603 1409 -331 -559 630 305 530
3235 530 1128 -311 -1349 1057 1515 -1123 -1635 120 -73 -514 219 -759 -1534 1212 1795 -491 -485 1415
3253 1415 945 -161 319 -208 -771 545 761 -1539 -1393 877 270 -1034 -14 242 -147 668 1340 -232
3271 -232 -187 1363 171 -1038 491 806 -586 -1033 -207 -607 -195 609 -431 -1096 513 1563 -224
3288 -224 -342 673 442 528 639 -713 -943 602 1301 -1015 -1830 -224 484 300 -212 -715 -322 830
3306 830 1613 -139 -864 548 791 36 -408 -678 -370 582 495 -1158 -1274 -156 749 -152 -27 65 -168
3325 -168 499 432 189 -54 532 245 -534 -385 -262 -313 -536 -199 -483 -343 188 37 270 481 501 44 -121
3346 -121 510 755 677 -41 -1000 -466 252 -60 -822 -1423 -567 419 510 -268 -601 401 1416 571 -233 -213
3366 -213 289 786 571 -570 -1384 -315 481 34 -848 -707 -202 400 635 122 -280 689 947 412 -1
3385 -1 211 -94 -263 36 -414 -1045 -294 164 -456 -308 85 -96 -36 875 966 207 219 606 -318 -49 631 -305
3407 -305 -1423 -304 241 -820 -856 -155 -334 -195 995 174 -387 991 1636 -73 -93 137 -231 -172 262
3426 262 -632 -1702 -364 619 -560 -811 453 343 -68 1262 648 -326 484 1530 -198 -938 286
3443 286 -262 -837 10 -314 -1840 -617 630 13 -86 1008 416 -160 1179 1076 -653 -33 632 -294
3461 -294 -774 181 -562 -1383 -224 431 -1142 -665 618 406 223 1116 454 -644 901 1618 -239 -754
3479 -754 232 -523 -1080 42 -476 -1454 -301 1112 -207 -356 852 668 50 969 793 -616 140 1386
3497 1386 -190 -957 -378 -745 -1101 -5 288 -1337 -266 1052 628 -73 1001 538 28 670 1262 -833
3515 -833 -844 551 -314 -1326 -625 -637 -1201 451 1239 -503 -649 1167 1090 213 1091 602 -341 174 715
3534 715 -907 -1472 7 -35 -973 -93 -78 -606 230 1439 187 3 1107 956 455 623 265 -987 -707
3553 -707 212 -224 -1187 -716 -539 -588 71 782 -331 26 1287 962 227 460 318 -219 207 145 -1457 -1251
3573 -1251 101 -31 -899 -762 -364 50 610 888 -160 31 1212 1094 -146 -142 -250 -297 -163 -177 -1257
3592 -1257 -836 -150 98 -605 -331 258 304 1187 1013 445 242 332 453 -169 -143 -327 -950 -550 -434 -500 -640
3613 -640 -200 -126 353 863 424 354 519 899 927 282 -402 -493 -113 -36 -657 -1350 -679 22 -157 -88 -334 71
3635 71 1072 1348 146 -112 396 846 326 -501 -824 -1105 -131 35 -902 -1147 -467 360 317 166 452 216
3655 216 884 1173 -62 -325 682 435 -496 -511 -536 -832 -434 -195 -885 -545 377 625 -136 645 895 139
3675 139 70 689 314 -148 465 -705 -1308 -335 303 -824 -960 249 106 32 579 251 -146 982 1355
3694 1355 -319 -636 785 71 -380 -447 -1010 -1227 267 404 -877 -728 689 759 -29 639 573 396 798
3713 798 1000 -550 -771 514 273 -1108 -477 -214 -686 -130 694 -380 -338 1195 920 -252 381 1190
3731 1190 -48 62 148 -748 -845 256 -84 -1385 -17 681 -450 -542 403 578 5 963 505 -333 277
3750 277 973 -609 -1088 120 -75 -739 -285 -302 -935 -13 788 -275 -554 686 721 -195 527 568 -463
3769 -463 229 365 -686 -1096 212 14 -1055 -440 460 -140 -163 649 77 -97 1270 959 -346 86 678
3788 678 -532 -544 152 -530 -942 353 -248 -971 -201 652 108 -336 454 512 110 795 291 -832 -25 518
3808 518 -422 -1000 139 100 -720 -125 -316 -143 308 991 95 -265 479 517 181 21 364 -530 -246 62
3828 62 -487 -624 306 52 -607 -20 249 -11 406 583 13 -104 656 327 -185 -131 296 -308 -727 18 -415
3849 -415 -298 13 -30 -677 -4 809 87 -169 434 351 345 436 -11 -447 143 171 -492 -630 -278 145 33 -57
3871 -57 -137 -334 447 758 168 -47 195 441 5 -44 -196 -264 -152 -97 -876 -452 -170 -18 119 -171 -185 24
3893 24 491 409 25 543 426 86 -15 -107 -178 -453 -141 -238 -515 76 320 -125 -156 577 324 124 314 228
3915 228 2 345 296 -583 -267 251 6 -544 -441 60 -228 244 75 -484 -40 657 411 85 240 177 -312
3936 -312 -122 63 -813 -453 266 -86 -591 -312 59 108 460 717 -22 157 575 319 -269 552 401 -613
3956 -613 -288 -6 -411 -586 143 -382 -751 183 379 -366 288 952 162 -104 570 355 -538 454 295 -973
3976 -973 -701 292 -259 -652 0 -99 -242 522 690 -67 124 851 403 -350 95 73 -622 499 299 -1224
3996 -1224 -828 189 -140 -477 141 425 -133 686 952 57 -1 674 190 -373 193 -6 -930 -407 169 -663
4016 -663 -627 440 289 -299 354 583 -246 380 1060 183 -174 344 -92 -595 -46 -103 -1120 -684 471 -256
4036 -256 -679 370 316 -117 500 713 -208 -10 1058 305 -391 133 -248 -730 11 42 -894 -758 635 125
4056 125 -270 398 742 29 581 1058 -218 -131 427 321 -486 -291 -497 -696 -318 182 -588 -663 278 778
4076 778 92 518 685 -115 308 830 -75 -720 -153 -180 -572 -390 -351 -678 -167 637 140 -246 709 885 273
4097 273 668 466 -346 -111 582 -306 -735 -521 -435 -591 -18 130 -283 -71 399 462 164 469 439 345 323 153
4119 153 -156 -440 50 -272 -798 -677 -445 -398 19 269 -221 10 657 574 152 382 135 -29 255 154 -601
4140 -601 -767 -211 -160 -433 -20 -440 -223 574 587 274 239 431 233 353 334 -39 -412 -41 -402 -632 -393
4161 -393 -523 -185 -46 25 -35 8 628 652 544 560 388 188 -7 40 -272 -571 -562 -327 -475 -446 -87 -433 31
4184 31 597 346 107 612 507 366 220 -37 -400 -253 -160 -520 -872 -442 -188 -292 113 124 -35 161 831
4205 831 438 20 560 416 82 -160 -40 -752 -786 208 -284 -802 -303 153 8 192 479 146 39 789
4225 789 578 -119 123 172 -439 -564 -81 -481 -593 250 -149 -426 172 463 157 329 895 269 63 610
4245 610 490 -224 -151 214 -1004 -489 254 -457 -764 58 526 -33 452 520 150 349 883 14 -637 203
4265 203 319 -590 -519 -199 -527 -650 403 -283 -430 142 529 -64 313 787 156 100 361 -114 -734 59
4285 59 342 -648 -495 171 -345 -423 325 380 -179 92 699 379 23 768 -43 -352 154 182 -416 -241 -79
4306 -79 -573 -334 394 34 -286 368 577 119 444 332 -123 5 490 -92 -646 -46 -48 -631 -569 -23 -210
4327 -210 -153 465 151 -481 379 806 185 85 390 73 -3 176 -90 -497 -436 -127 -228 -294 207 46 -53 164
4349 164 369 -112 254 611 -123 -50 510 -119 -549 -96 -51 -487 -220 67 -560 -289 475 232 -220 325 541
4370 541 221 163 531 -301 -142 147 -234 -542 -441 -160 -56 -356 -184 -192 117 371 122 -149 381 607 -3
4391 -3 53 9 -110 -366 -61 -136 -499 -166 -60 -261 -187 429 329 40 227 86 135 356 147 -57 -97 -168 -86
4414 -86 -468 -21 -307 -28 -125 -51 -385 134 281 76 10 -14 366 395 332 -117 -257 56 220 -420 -372 72 152
4437 152 124 73 -247 40 477 476 442 220 521 93 -96 150 -244 -150 -87 -48 -294 -3 245 -56 -139 9 177
4460 177 49 324 151 -102 210 339 40 -118 186 -159 -315 47 17 -320 21 161 -341 -149 164 198 -6
4481 -6 360 204 -175 9 45 -124 -454 160 90 -453 -150 178 -227 83 323 -90 70 559 526 -232 142 275
4503 275 -150 -202 197 -264 -479 62 -152 -429 109 436 -186 -12 468 329 125 296 329 -228 -7 443 -349
4524 -349 -441 114 -224 -349 -162 118 -290 -20 369 -166 -192 494 428 -117 216 259 -220 214 347 -374 -462 141
4546 141 112 -525 -39 243 -321 130 555 -63 -442 391 391 -62 163 314 -157 -227 37 -275 -511 95 27 -281
4568 -281 68 387 -96 118 500 429 -296 353 386 -163 -142 47 -679 -540 12 -116 -221 -247 80 -122 487
4589 487 847 -38 -392 372 364 -35 -77 112 -295 -338 210 -507 -471 237 288 -87 -6 132 -123 179 282 107
4611 107 23 337 155 -204 -34 -282 -480 -285 41 -263 -455 22 199 -166 55 399 232 164 724 423 -152
4632 -152 171 -101 -242 -245 -201 -591 -291 -57 -189 -117 183 430 78 462 615 21 172 276 200 -221 16 -183
4654 -183 -129 13 -222 -444 -283 99 -10 -112 -70 136 254 314 260 44 14 359 -41 -333 -245 -315 -342 -53 176
4677 176 -477 -226 204 421 109 380 300 84 211 343 245 -373 -146 -196 -352 -279 -368 -350 -2 352 20 167
4699 167 228 350 224 237 158 -78 -61 64 -429 -401 -282 -437 -360 -37 -32 -243 360 58 142 475 319 307 114
4722 114 497 185 -476 -75 -50 -362 -344 -34 -266 -336 160 142 -129 161 489 150 507 259 33 49 123 162
4744 162 -586 -164 -241 -447 -130 151 -260 -191 453 323 96 342 348 -65 230 467 -76 -245 63 -111 -510
4765 -510 -240 -12 -335 -126 329 -67 -25 652 514 143 488 329 -132 -146 60 -59 -466 32 -175 -459 -363
4786 -363 52 98 -116 356 461 31 391 491 -110 -13 399 -313 -309 -2 -181 -584 4 188 -262 -32 364
4807 364 18 -30 317 596 -68 336 332 -371 -167 96 -549 -522 -74 -80 -588 -11 2 -136 39 291 302 -113 473
4830 473 396 -321 87 355 -236 -621 -138 -357 -335 51 -294 -335 -54 618 -93 140 220 457 178 48 207
4851 207 -315 -236 42 -374 -723 -33 17 -47 -45 294 20 112 553 118 -237 577 460 -106 -147 -176 -280 -74 71
4874 71 -433 -388 137 233 -293 309 437 360 155 482 -64 -132 110 48 -240 -204 1 -323 -234 -69 -168 -165 51 182
4898 182 -181 198 501 74 52 252 225 -141 53 -21 -168 50 -114 -37 -178 11 146 -49 155 6 -23 89
4920 89 248 -65 0 289 -61 -380 -250 -36 -97 -174 11 -360 -9 344 215 48 162 341 206 115 318 -280
4942 -280 172 53 -176 -224 -269 29 -115 14 -41 -165 125 372 397 -40 283 134 119 -206 101 -35 -194 82
4964 82 -423 -11 -41 -4 -174 173 101 185 75 100 117 192 269 247 -172 53 -188 -361 -17 -149 -269 -380 224
4987 224 55 -359 218 273 -6 -218 352 -10 186 246 -7 -276 -177 209 -333 -23 -74 113 -245 267 -46
5008 -46 -141 372 260 -117 -187 105 151 -202 152 66 -469 -95 100 -286 -188 150 24 -186 -50 201 -47 226
5030 226 117 -71 -133 84 -82 -352 -73 59 -439 -201 -34 -255 -108 225 87 -64 213 84 101 207 5
5051 5 -133 -154 227 -116 -609 -243 109 -101 -104 -36 47 -61 263 48 -240 320 258 -15 127 -8 156 -284 86
5074 86 68 -116 115 68 -433 -260 248 99 -74 186 17 -161 168 302 -242 84 58 -102 -391 -191 -173 -132
5096 -132 -40 1 -117 160 404 148 -268 -65 372 2 -180 285 -30 -72 195 -100 -276 -401 96 -386 -235
5117 -235 178 98 -266 289 202 36 355 350 -13 -64 -31 -8 75 76 70 -464 18 82 -139 -175 515 84 -69 364 316
5142 316 -20 16 -5 -212 -239 92 -137 -142 31 -113 -357 17 86 -86 162 243 187 -143 133 450 -78 -37 36
5165 36 -291 -145 49 -38 -95 52 -31 115 -144 156 152 36 312 94 117 102 203 -229 102 -216 -160 -118 -54 -276
5189 -276 -529 201 243 -152 260 229 119 282 170 241 -197 133 99 -183 -38 -168 -192 -326 -47 -119 152 -266
5211 -266 128 30 268 399 284 260 235 123 -148 -15 -78 44 -192 -135 -176 -305 134 179 -287 73 -22 50 -96
5234 -96 56 -217 -25 334 -117 -82 -232 -290 -16 -277 -43 19 -17 111 220 -26 -17 -75 147 78 17 33 -172 -48
5258 -48 -258 -109 -84 -193 -178 -302 -43 -253 48 273 101 111 327 110 -23 -17 147 -126 -443 121 16 -357
5280 -357 134 -94 -357 226 196 26 224 131 115 146 244 -161 -147 -187 -129 -127 -337 -209 100 1 38 152 14 310
5304 310 391 -83 -266 151 342 114 138 62 -359 -18 -179 22 -196 -110 -71 27 74 212 60 11 102 138 124 63
5328 63 -3 -87 -197 49 -340 -289 -22 67 -106 -74 -67 105 343 413 15 -88 260 309 121 313 -129 -255 -259 79
5352 79 -305 -275 112 -59 64 -44 111 -112 531 130 38 -92 241 -5 -234 254 150 -299 -323 88 -217
5373 -217 -153 94 140 75 239 183 -96 -19 396 -72 -166 479 48 -329 -213 -153 -589 -61 339 -31 -258 74
5395 74 391 0 182 369 -51 0 -117 -277 -7 -297 -265 -178 36 175 -176 -209 260 180 -129 299 74 13
5417 13 268 43 -114 -104 53 -132 -114 47 -312 -95 -188 137 -144 275 494 155 74 -36 73 -181 163 -216
5439 -216 15 -209 98 -27 -96 -8 -80 -130 28 208 23 106 370 221 -6 93 213 70 -136 -79 71 -196
5461 -196 134 -161 -157 -98 -105 56 -129 50 121 -15 102 163 254 -25 -166 -98 77 -24 -290 -390 -137 -313 -106
5484 -106 -15 117 199 226 289 -89 96 148 158 -185 70 90 -29 -55 -217 -308 107 105 69 -253 141 66 168 22
5508 22 55 -64 76 -202 -138 -19 220 57 -152 -117 47 -188 198 -111 149 13 311 31 -25 93 140 4
5530 4 83 -5 -219 -183 -18 -122 -129 -11 153 -55 35 261 135 152 280 -56 -230 366 69 10 -152 78 -124
5553 -124 -404 -80 -67 -280 24 108 -49 -9 150 -163 -79 -126 52 -307 -37 -88 -21 64 103 -64 -435 -180 -159
5576 -159 -282 -21 124 -222 155 167 152 149 407 -43 -57 95 -32 -201 -5 -29 -142 -427 256 11 -167 379
5598 379 148 278 89 397 149 -28 -150 268 -77 3 157 -153 290 17 -7 -315 259 330 136 158 307
5619 307 -223 -9 65 87 -133 -51 66 -285 -190 -122 -152 -237 -27 -22 -62 96 231 78 -44 176 3 2 66 117 -109
5644 -109 -229 0 77 81 106 216 -85 171 61 -64 52 154 -235 125 228 78 -116 -6 99 -321 -13
5665 -13 179 -223 -190 -67 -91 53 -105 226 -123 332 63 214 187 148 -46 119 136 226 -194 -524 186 -55
5687 -55 -180 0 65 -302 202 304 49 -131 -12 -106 -9 176 -175 -83 67 -175 -148 -64 221 91 -55 -47 315
5710 315 -106 254 207 37 104 -119 -108 -36 -147 -81 106 -329 -169 81 150 282 -4 36 74 66 -146 6 40 16
5734 16 -52 -24 -419 -262 -8 88 -188 33 -15 -100 36 157 -8 150 337 -176 224 81 199 -97 -151 -11
5756 -11 -180 -288 154 -386 -70 -50 19 -160 -78 26 106 -223 38 200 -57 -108 152 -274 -210 -67 -247 -115
5778 -115 57 -83 -54 258 29 236 282 368 114 -83 257 198 -83 35 -251 -315 -27 177 -48 -241 -51 152
5800 152 -24 133 65 -156 268 203 -193 -311 -79 -54 -109 45 -251 -272 -87 -26 186 -21 -53 217 -47 450
5822 450 153 -7 -116 192 -64 -300 -29 -13 -76 -31 32 -159 -7 13 219 68 339 152 -157 176 191 57
5844 57 -118 129 -169 -155 42 -17 -458 -261 49 -91 95 247 -78 -112 164 24 -21 -86 99 -141 -239 -174 3
5867 3 -94 -96 -60 -42 87 223 -65 -8 177 440 -170 158 30 -290 -111 202 -81 -287 36 -199 -121 -14 142
5890 142 112 37 120 179 222 32 273 142 157 -91 -265 -87 -79 -259 -76 9 -121 -188 -81 88 -184 86 132 7
5914 7 127 -293 48 -361 -184 102 -168 -165 -106 -174 35 -86 115 87 54 330 166 236 274 -28 132 -228 13
5937 13 -20 -125 -105 -2 -19 77 -55 -175 23 150 -72 125 247 168 -195 98 372 -214 -112 122 -104 -126
5959 -126 94 -107 -224 106 189 150 297 30 53 -2 170 336 -127 2 39 -98 -131 137 -168 -191 -96 -136 103
5982 103 42 187 371 4 -7 137 57 -213 117 -233 -197 104 -362 20 4 -118 66 108 30 113 -86 103 3
6005 3 214 -36 -241 22 -3 -213 -39 134 -72 -391 34 15 -82 133 177 267 54 212 290 -144 8 -3 -147
6028 -147 -271 59 -260 -103 35 -133 6 321 171 -91 194 159 188 -67 84 52 130 -107 101 -136 -158 -285
6050 -285 -185 -222 -23 2 -43 289 32 -54 100 139 -43 -36 1 123 -109 -31 -262 -331 -29 149 -86 37 177
6073 177 15 -27 371 283 119 -76 70 42 150 -45 125 -141 97 120 -84 -70 319 101 -40 34 361 -10
6095 -10 156 231 -30 -12 265 -119 -228 -212 -141 -341 -35 258 -20 103 -94 -63 3 321 -13 -4 93 240 -118
6118 -118 226 -39 -44 -103 89 3 -64 -17 103 33 14 100 109 -80 311 183 8 169 337 -195 -79 -22 -97 -153 0
6143 0 104 -282 72 105 -173 102 153 -80 -115 -26 -39 -76 -85 100 -153 -32 92 86 -151 147 107 -163 -14 223
6167 223 75 31 329 35 -95 238 124 -27 -43 110 -46 -138 135 -191 -279 48 199 -74 -93 165 -83 -155
6189 -155 -17 -115 -136 5 -151 21 -34 105 -69 -246 392 36 -121 100 388 -224 129 -54 54 100 412
6210 412 23 -94 62 63 -427 -26 -92 104 -202 49 532 -74 31 181 -104 133 415 163 -185 93 285
6231 285 -102 32 42 -188 -4 147 -162 -314 -139 209 7 161 3 20 65 58 -102 -162 -10 99 -60 -62 84
6254 84 -49 0 109 -59 8 49 -25 -60 17 158 -104 493 198 139 57 105 -205 -114 -211 -143 -222 -93 72 247 121
6279 121 21 82 44 -175 -120 -37 -76 141 -16 -55 0 -10 -13 -160 -35 -260 -63 328 -8 180 -3 2 77 131 -25
6304 -25 -124 -108 -174 257 -117 -72 -132 36 -39 -10 110 53 72 69 187 126 61 23 -104 -321 -325 -255 7 11 81 29 134
6331 134 104 86 229 38 162 171 -90 133 331 -110 -16 -202 166 -204 -124 39 -85 28 -63 155 -211 96
6353 96 -13 56 -67 180 59 -92 27 -165 -339 -314 -258 31 72 -101 -228 18 356 198 -69 71 46 -30
6375 -30 -45 82 173 -207 -54 -153 -89 -284 -63 -99 -160 108 -38 124 250 41 91 -3 306 -106 -290 -160 -69
6398 -69 -82 -197 -82 -132 -106 251 34 -43 92 146 53 130 383 71 -63 -54 -321 -302 131 -152 -146 -116 328 56 -16
6423 -16 294 203 75 398 484 -331 85 267 -166 -190 -154 -118 -88 65 -22 -370 124 86 168 -11 17 130 17 160
6447 160 110 -10 -218 7 -150 -228 -63 -18 -307 -28 134 -413 44 277 21 -52 184 155 10 -1 140 -182
6469 -182 -162 -130 -234 -239 24 -51 -203 -25 -59 5 -73 348 214 410 180 103 -63 -101 123 -95 -464 -83 -3 -137
6493 -137 -120 -93 -127 118 163 132 39 129 52 -191 20 279 -47 -227 -184 -189 -122 34 -64 -131 74 73 210 -14 199
6518 199 168 -12 229 -80 -58 -75 -83 -355 -101 160 1 -363 185 -127 31 71 308 126 166 279 -71 -18 -56
6541 -56 187 -175 68 12 -27 -224 239 -314 -62 189 -29 130 253 182 53 30 125 99 -185 -235 -161 -60 -266
6564 -266 -74 -298 -82 -39 86 -148 157 139 106 327 139 55 -49 -95 45 -33 -303 -276 -377 74 79 -131 -252
6587 -252 352 114 -234 118 -13 189 -7 41 -82 -291 -101 -47 -142 -102 56 -86 140 184 83 -103 181 98
6609 98 9 169 388 118 109 103 -77 32 82 -6 58 -27 -65 -42 89 -23 -199 88 -76 123 145 18 14 76 -30
6634 -30 -11 -258 -143 109 73 23 -178 -15 -176 90 270 -53 104 397 42 -400 15 -217 -172 124 -152 -163
6656 -163 23 -99 -78 -44 226 -149 190 -63 107 208 -11 10 -98 -146 184 158 -163 -255 -193 -83 -137 66 107
6679 107 92 117 171 -240 -40 110 -181 -52 5 -63 -59 9 73 -73 -17 113 -221 424 109 -141 -3 215 253 -80
6703 -80 -84 28 -29 -77 46 -31 -104 9 246 -92 -4 82 75 218 284 118 57 44 380 99 -250 92 -156 -212 -203 -14
6729 -14 -311 85 248 40 -225 247 192 207 -8 83 33 74 162 7 -112 50 -67 -194 141 -29 -92 158 239
6752 239 100 86 124 111 43 110 -220 98 -80 -134 38 -33 -176 -100 -156 -119 51 -92 49 -40 210 129 70 13 -99
6777 -99 146 -73 -115 66 6 -155 28 -14 87 -263 -178 281 221 -110 -170 159 -86 113 72 212 38 56 -117
6800 -117 -139 -75 -152 -195 33 -141 -229 -8 -32 115 -48 73 205 -394 158 -97 -146 -195 3 38 -206 114 -119
6823 -119 -40 -40 227 47 56 133 -114 79 236 25 38 148 -47 -238 103 125 -83 -95 -24 -193 -265 211 -36 -166
6847 -166 51 34 -34 104 -10 -42 -12 150 215 -120 -51 -139 72 164 35 -157 16 273 159 -247 -222 1 -79
6870 -79 124 -28 -158 26 -208 -122 -202 -21 -81 -219 44 146 68 19 274 -66 123 -118 117 -135 -2 39
6892 39 50 -384 131 -154 -242 144 91 235 -50 -9 95 338 244 25 81 -120 18 -286 -236 -190 -420 -73 17
6915 17 423 -172 284 -43 -4 -38 105 -260 49 100 -493 -13 138 62 -241 -71 278 -49 -307 59 266 -67
6937 -67 -10 37 -48 -114 279 13 -289 -25 129 -316 -147 36 -46 67 42 -109 -278 -6 -13 135 3 329 -109
6960 -109 -109 204 -32 -205 16 -145 -228 194 -295 -11 135 39 79 -272 91 213 -237 53 154 -17 -9 15 -65
6983 -65 4 -195 -33 -27 -170 149 -217 -26 199 346 -174 117 495 177 152 -31 -78 -316 -67 20 -234 -40
7005 -40 -152 -193 -177 299 229 261 327 143 57 44 -94 -114 -15 163 6 -141 -170 116 -107 -245 90 -297 -125 105
7029 105 224 -34 275 325 166 -89 82 -158 -180 -73 -32 -8 -202 -10 -85 -198 76 -89 69 462 108 24
7051 24 -25 253 -71 22 -58 -352 -195 33 -90 -37 -129 111 -122 31 171 15 47 52 283 -56 -11 34 -18 3
7075 3 146 -81 -49 -103 -44 -206 -17 68 289 -1 -208 -46 158 1 -61 -372 44 307 -137 20 121 -23
7097 -23 -221 21 16 -64 -72 39 71 11 -62 -89 117 -2 -37 -173 31 -41 -240 -25 -74 59 -42 31 69 104 162 123
7123 123 -90 -44 74 269 18 132 83 -174 -233 58 8 -32 45 -26 58 145 166 56 416 239 302 58 22 -118
7147 -118 -122 -60 -54 -160 87 -219 -177 -101 204 221 -81 -53 53 -7 -27 245 -123 -166 -85 -40 -252 70 -178 -63 -134
7172 -134 50 90 134 88 188 -86 246 234 -204 205 -22 -280 4 -264 -103 4 163 -12 -115 -104 332 -20
7194 -20 221 386 -244 -143 40 162 -340 -82 -236 -79 -289 -257 -255 -176 -37 36 6 -139 73 73 -202 191 20
7217 20 -262 -104 -123 -199 36 16 21 -140 176 -110 -83 -65 -16 376 156 31 -9 -95 90 -25 -312 -31 -188 -218
7241 -218 -251 87 -234 -94 19 176 -56 7 -24 -156 223 141 105 -195 158 15 -155 -156 342 6 -298 -19
7263 -19 21 46 -103 181 154 382 97 -373 255 17 -168 -313 -74 -72 45 -102 181 -163 -31 0 9 236 316
7286 316 263 177 141 208 110 10 172 63 23 -122 -117 -169 123 -14 42 84 153 233 4 -52 63 48 -47 122 -49
7311 -49 -155 -191 -155 116 -97 92 -53 -48 196 314 150 77 319 -103 -96 409 69 -114 83 17 -218 -152 -35
7334 -35 157 147 51 -242 216 339 29 -176 151 131 -3 16 148 -63 6 -164 -171 43 -192 -93 -222 129 80
7357 80 101 -152 90 -220 -27 -66 169 139 -5 -36 -239 -66 -36 -89 40 107 58 48 -75 -24 -80 -90 -181 -96 -171
7382 -171 -97 -72 9 -9 -104 -283 -258 -63 -29 -44 21 -105 -175 -30 188 41 -6 96 -99 -101 -62 -211 -125 -327 -86
7407 -86 206 -171 196 38 -191 197 287 29 54 162 -53 16 113 200 -127 -2 -33 -183 -178 71 -73 -5 45 392
7431 392 22 393 214 -114 -4 -69 -104 -204 40 -389 33 64 70 -178 -207 -161 -167 42 132 -131 130 234 34
7454 34 -303 116 388 -8 181 -49 52 -36 -49 124 -41 -107 109 -125 34 119 107 -77 64 258 61 122
7476 122 175 -17 142 -143 -38 -130 196 64 -233 -100 -8 -110 -264 -12 108 79 19 337 -173 -146 23 -34
7498 -34 -223 -5 17 3 -225 -31 59 -93 -8 138 -166 -46 49 79 -32 -58 -28 -145 62 -18 -143 39 93 -15
7522 -15 38 204 -81 -102 167 -21 -311 75 133 -113 34 315 -34 -164 -114 5 -356 -237 89 -234 -23 -27
7544 -27 -23 -41 -16 -23 116 125 138 164 -75 129 -35 -72 -119 81 -167 -54 270 105 -92 140 25 130 84 108 -158
7569 -158 -1 -170 -91 -209 125 32 111 417 77 -243 38 194 50 -32 56 -30 186 72 74 -208 -71 -59 197
7592 197 -14 -87 -112 -40 90 107 -60 34 268 55 -162 152 -91 -36 -111 -239 -54 -200 -12 -312 65 32 -103
7615 -103 169 162 63 3 -37 -63 -108 -287 -55 -164 -312 -89 -199 -110 0 72 -84 226 170 66 205 170 78 -206
7639 -206 -139 -15 -144 -58 73 0 -251 -181 -41 -241 -82 42 -191 152 143 112 92 -44 -292 -114 -192 87 -42
7662 -42 -123 126 21 -363 56 272 236 32 173 -225 169 106 91 97 -134 209 -233 7 -114 -286 -90 61
7684 61 61 113 -65 259 -235 29 126 -224 20 207 70 -59 -87 132 -38 -130 244 -246 -37 183 -100 3
7706 3 42 169 -40 -66 149 147 28 113 -84 -177 302 50 -154 -13 109 31 -198 170 96 20 65 -47 -69 -5 100
7731 100 -83 -160 -19 -274 -282 -88 -7 32 130 200 26 -57 218 -53 99 143 78 -36 151 -34 -95 -171 -24 -231
7755 -231 -182 202 -167 26 -18 -22 197 123 212 -141 -83 104 -112 -348 -199 97 138 39 -74 -72 -122 57 21 114 -81
7780 -81 190 -187 -65 -185 134 41 163 22 -113 -312 -67 -163 -25 -76 120 -67 -137 126 -34 -221 -170 362
7802 362 27 -255 8 277 -107 270 15 -68 -130 -108 9 42 79 -189 -15 -14 -40 -111 67 192 -20 -39 -42 -49 -192
7827 -192 176 16 13 227 34 -73 269 354 248 -151 9 57 39 -236 50 -157 -13 -58 -62 -46 269 -160 -138
7850 -138 -156 1 6 230 122 92 41 -94 79 -159 2 -62 -23 -184 90 -8 20 188 249 120 144 216 -51 116
7874 116 40 109 63 122 -139 112 -294 -276 -163 -279 -61 -126 -190 286 -236 83 79 64 109 -85 173 -87 161 -46
7898 -46 -13 -84 -233 69 -74 -38 166 -30 150 136 156 62 21 234 -2 -195 227 -135 81 76 -18 -188 -92 37
7922 37 -152 265 219 235 51 416 -232 -219 207 -58 -93 96 270 43 -122 138 -62 113 -91 115 -181 63
7944 63 -10 175 33 130 307 55 26 -38 -23 -83 181 34 59 -69 146 83 96 82 168 47 404 -27 -163 -103
7968 -103 11 8 -164 -65 -96 -63 22 -150 125 -129 -19 -186 59 -159 79 -51 -171 123 -215 -53 118 90
7990 90 -13 164 -124 2 26 77 91 386 18 -146 6 228 144 -28 155 8 24 -103 126 -68 -191 -105
8012 -105 0 -97 20 73 -71 159 -11 83 80 15 60 -69 -54 150 -33 -121 -82 -40 82 -51 -78 33 -92 11
8036 11 195 -144 -58 128 -273 268 145 32 169 130 -72 -141 30 -78 -186 -274 191 -29 77 73 -18 280 181
8059 181 165 -140 99 -8 -99 -3 85 36 -156 -139 65 -131 -203 58 40 105 215 41 -57 -66 120 -58 16 -161
8083 -161 -125 -125 -149 -109 -39 -11 -64 -17 47 -16 195 -153 -161 12 -137 209 -335 171 -75 9 20 143 -44 56 29
8108 29 151 160 -47 80 77 144 4 300 179 -86 179 -133 -294 18 -57 18 -345 134 -96 155 102 251 -26
8131 -26 -20 208 143 -140 43 79 -53 -111 215 72 -60 34 -26 186 226 -111 -55 245 295 -266 85 203 -89 97
8155 97 20 32 62 43 -82 -259 -18 -56 -84 42 11 2 -166 236 83 35 159 -1 91 -62 -44 20 -233 -58 7
8180 7 58 -7 260 147 15 281 -52 11 141 -140 -108 251 -74 -194 -113 -60 148 28 103 -26 40 275 17
8203 17 67 100 79 -2 62 163 -48 -214 -188 5 -154 -160 111 66 113 175 154 -41 140 16 190 -104 -61 42 82
8228 82 -38 212 -76 100 119 -117 -25 374 -98 -71 -63 -71 25 6 213 -15 -187 106 -112 70 -15 -110 -167 15
8252 15 18 -107 63 84 72 167 97 1 -157 -120 -83 -111 36 98 80 -219 91 -39 -162 27 325 -112 240 125
8276 125 10 24 -6 -41 -149 -41 119 -293 21 0 -123 -28 -198 86 50 121 -74 -129 -74 134 122 -187 -45
8299 -45 89 -180 33 -234 -82 -68 -50 -39 -113 116 26 82 240 21 -147 235 -5 20 -156 -76 -191 -130 -223 21
8323 21 -53 -44 -32 60 150 140 200 22 71 129 -105 -106 38 -37 -190 -27 64 9 -185 -45 13 183 154 143 103 47 -50
8350 -50 -192 -89 -201 -160 -114 -4 -47 -64 13 102 -70 -243 -125 -51 -184 63 52 214 15 110 54 14 192 -133
8374 -133 -9 -36 -124 -21 -185 122 -105 10 -69 5 53 205 -24 -54 -124 -20 144 33 -184 81 -179 0
8396 0 -26 -74 -134 55 199 42 64 -147 -47 -27 186 149 23 100 -23 -97 119 102 126 276 79 37 185 238 49
8421 49 -15 76 -78 -56 -17 -73 -131 169 -111 -43 -61 309 -38 -134 298 -49 43 -69 -86 -167 -186 76 79 60 277 209
8447 209 -220 88 87 20 9 -40 252 -61 5 85 185 83 151 43 56 -65 197 31 -13 84 -245 -97 87 67
8471 67 -90 110 -249 -107 144 94 -42 40 163 103 -54 173 153 -90 79 -38 -91 96 29 98 -121 130 267
8494 267 139 -103 41 132 27 -47 40 45 83 -19 123 28 -51 18 -101 101 -10 -47 371 -73 -38 15 62 -33 -3
8519 -3 58 -122 -264 -242 128 40 116 82 124 25 -165 63 -109 4 -18 57 -50 135 106 161 310 -150 147 35
8543 35 -18 172 60 126 -65 -266 39 10 -69 -42 -60 -51 -84 -76 -292 8 -56 187 45 -79 -19 -153 -36 -309 7
8568 7 26 44 -83 167 201 54 123 -96 205 -28 -91 63 -11 -196 24 -100 -28 34 3 57 -184 25 140 -77
8592 -77 65 231 156 -95 80 -169 -213 54 190 -239 91 -55 5 -101 -179 144 415 75 16 38 -147 -236 -282
8615 -282 90 -67 -50 -8 -327 68 163 -223 -52 -136 62 -55 -8 -162 -63 -129 -33 68 -7 -120 -55 247 113
8638 113 -116 -165 -188 50 157 79 -68 18 53 171 17 -116 -107 -363 25 -79 -185 -4 -56 -137 -163 -79 -40 28
8662 28 -108 22 127 -59 4 32 -11 -11 -53 -85 251 78 -7 69 -14 -32 104 -129 40 -92 6 61 30 -59 -145 35
8688 35 36 -71 200 4 -107 34 189 56 31 342 -79 -21 -36 -50 -198 -129 -273 -217 172 180 -209 187 184 -82
8712 -82 131 211 127 -40 148 84 26 -105 18 -62 -29 -70 -161 7 -54 68 -206 52 1 -81 -50 33 147 -155 135
8737 135 133 149 3 150 -152 -414 147 -55 -58 117 -173 -37 252 61 -296 55 -163 63 158 59 97 -9 99
8760 99 89 38 -22 241 6 -19 267 -75 159 149 104 153 -51 134 15 -86 86 43 -91 4 144 -209 -51
8783 -51 -34 88 -227 -55 93 33 53 -22 10 57 -78 -34 -42 -226 258 5 -53 -187 -73 -68 -100 -18 -179 -12 -123
8808 -123 -94 26 -380 -192 110 -10 28 -100 -187 -252 -124 -46 31 109 177 -9 110 86 65 228 -248 -13 -48 -165
8832 -165 8 -112 -15 -89 -44 -87 -11 151 55 -17 -104 67 -27 91 -210 106 -21 -259 -230 -105 -39 -185 -207 126
8856 126 -250 42 203 -250 239 64 -166 33 194 -181 43 -132 116 -11 -88 75 -69 -1 -112 -20 -46
8877 -46 -65 133 56 202 -24 -139 -73 -38 104 98 -22 -135 -75 -143 -41 -269 -135 221 81 20 -120 -183 -41 114
8901 114 158 -81 125 -78 159 -144 321 -100 92 38 -21 -49 62 101 196 12 -152 21 119 -11 1 161 -97
8924 -97 4 142 -85 -43 -104 -68 -158 -133 66 41 -65 -34 -305 -346 -39 -273 149 -108 -106 -121 44 -229 -235 118 -110
8949 -110 -42 91 -66 -52 -55 -140 -98 349 58 45 17 -117 -16 -162 -123 -45 147 124 75 -36 132 -31 135 134 95
8974 95 -190 22 94 152 -51 143 -164 6 114 -11 211 -46 -21 -23 256 -49 133 148 -235 -70 -94 -95 -356
8997 -356 0 -58 -117 -8 -66 186 -30 76 -93 -93 -27 38 -233 -139 -75 49 -194 -26 -77 -48 -81 68 -116 20
9021 20 94 15 -149 77 -90 -146 -211 206 -60 85 -122 -224 -36 131 -187 -33 -113 -14 117 5 -46 48 62
9044 62 -175 44 -139 194 43 -182 -82 -92 41 -211 97 -166 -146 42 128 55 237 117 147 188 -120 38
9066 38 -43 45 247 -170 52 170 79 54 -22 39 115 -151 -84 111 -77 -347 20 -263 -178 -52 -186 37 36 73
9090 73 -39 252 37 -12 107 202 100 66 -43 -33 90 266 -4 -210 118 -16 34 71 -65 -62 162 26 57
9113 57 -78 -71 17 33 -66 -131 27 -2 -212 -135 99 169 37 -49 60 34 27 -85 153 -232 237 -8 -155 228 -9
9138 -9 128 -32 30 -41 -36 -214 -34 -98 -59 -159 -5 -72 -79 42 78 199 183 -162 -39 50 56 148 -18 -172 -6 139
9164 139 -54 -216 -52 -93 25 -173 97 -112 -36 95 -59 -40 66 -73 -129 141 19 46 -17 58 -88 103
9186 103 -179 -48 -318 124 -35 204 67 -73 -100 32 36 171 41 129 92 -91 32 281 -30 8 -12 182
9208 182 253 100 59 -27 111 56 118 -191 193 -126 -218 123 -50 -222 -2 197 43 235 49 234 73 58
9230 58 -150 89 131 194 -145 166 18 92 67 -36 -56 7 105 75 114 96 -132 58 -9 -37 -19 3 -55 108 192 -270
9256 -270 -51 -186 135 55 160 77 -134 -335 100 -142 -78 2 13 13 -172 -60 -162 -192 41 13 -46 85 -213
9279 -213 -129 -66 -33 244 -129 -108 93 56 -53 -100 21 50 -30 188 105 -32 183 163 -65 -118 -77 85 137 -101
9303 -101 -168 33 -105 137 -216 -50 21 134 40 -92 -196 -131 -46 -6 56 133 -138 -165 -17 -141 -27 284 -50
9326 -50 -112 -183 86 89 26 -84 119 56 73 119 52 -4 142 201 -303 14 133 -42 181 -8 -131 40 160 -90
9350 -90 19 24 -20 126 16 174 34 223 144 156 214 139 82 -6 -10 121 83 3 -54 142 228 133 62 -189 -32 -148
9376 -148 -82 84 -5 -94 -45 -337 -50 -319 -97 121 -128 90 -351 -25 21 71 -49 -53 61 -155 18 214 -91
9399 -91 86 28 206 24 175 97 85 -64 -12 -45 -21 -120 95 -150 -114 -103 37 -54 185 -53 161 -44 -141 73
9423 73 179 238 -88 -21 -118 -60 -48 -102 31 -65 196 82 -54 95 -31 -143 59 260 -177 9 22 18 24 -108
9447 -108 115 83 24 97 53 -110 54 128 138 -132 79 -50 -19 163 180 201 239 -36 -49 28 -56 -132 -40 -78 -159 -21
9473 -21 21 -63 -37 -260 128 -48 -206 99 -31 141 17 2 -80 91 -76 207 -34 181 272 -106 2 104
9495 104 256 -201 1 -7 9 -150 163 -49 -44 75 95 -57 -37 61 13 -84 -159 98 23 89 -92 -265 77 12 67
9520 67 238 -116 -59 -127 -6 -204 127 -130 203 -85 52 7 103 265 38 -35 -12 62 -147 -23 -102 150 12
9543 12 -202 -356 -32 -101 63 120 63 -43 -22 -139 -234 173 -33 -132 -30 -58 -47 -144 -65 -74 -43 -32 -40 35 -183 -75
9569 -75 183 99 167 -8 234 94 42 64 -229 -58 -142 90 39 -93 76 -74 280 -54 89 210 3 -195
9591 -195 139 200 157 -132 -81 124 -94 -153 40 -15 78 118 -21 80 -73 186 -64 121 118 -321 -100 -162 -37
9614 -37 191 -71 -50 193 -139 101 -66 84 121 -115 -19 -195 -188 -38 11 200 -19 101 24 238 -101 -136 -71
9637 -71 246 -164 152 122 -66 89 105 240 -88 -48 -82 139 -42 159 -20 74 -83 -267 358 67 89 -328
9659 -328 42 -196 -363 -18 -61 -144 -151 -93 -22 9 41 8 73 -42 -151 178 -133 -114 -79 -176 -172 -50 -6 34 -11 -195
9685 -195 32 -26 -54 -74 21 115 201 30 49 -97 -16 24 -39 -40 148 -102 171 -51 -99 -177 -111 9 -105 37 -133
9710 -133 24 -53 -109 45 -189 -143 31 126 32 -105 256 -3 -137 128 -168 -178 -413 -23 26 -18 81 40 11 88
9734 88 51 34 195 6 -132 105 154 -102 -26 86 103 168 -87 190 -42 -198 -141 8 160 -26 184 -29 -60
9757 -60 -78 158 -153 259 -240 119 -118 67 101 -176 54 50 80 40 23 56 -66 -8 -27 208 81 -140 -112 88
9781 88 154 21 23 163 21 -51 20 -14 -75 97 -280 -27 10 110 180 177 22 -146 -65 71 -95 102 -101 113
9805 113 188 48 -106 -274 -18 317 23 -3 264 -35 -60 109 -95 9 144 -56 95 -5 103 66 30 165
9827 165 57 42 -41 -240 -148 45 143 68 99 -144 25 -90 59 38 112 21 6 89 -357 -129 -165 0 0 210 -26
9852 -26 -28 -123 -334 -15 -167 52 -32 40 -93 -110 -166 -60 156 94 -100 -54 193 120 57 -49 -25 -193 17 -193
9876 -193 61 -35 53 83 -54 134 -137 243 -72 -70 -79 60 -28 -26 124 -181 75 77 211 46 -34 56 43 4 -139
9901 -139 127 -179 111 -91 -157 112 129 52 -8 162 -92 -38 -281 147 -244 -237 137 -12 68 -25 7 -70 -18 39
9925 39 318 -6 -211 -36 -95 41 -121 -111 20 -29 -98 144 30 43 92 100 57 -18 251 -175 40 39 149 -144
9949 -144 -103 -97 55 -27 109 -14 189 -135 4 73 112 -18 -121 92 -53 117 -71 -75 -67 -31 -191 104 90 -43
9973 -43 21 73 151 -51 161 233 -52 -70 -185 -11 -82 -62 -5 -20 206 -46 -117 2 216 -196 -130 9 166 238
9997 238 216 298 -93 -9 -12 -30 -100 238 37 82 0 52 -12 18 242 12 -96 46 -135 -72 -34 -40 236 -259 -34
10022 -34 70 130 170 -191 143 -301 29 162 -58 -66 -45 19 -140 28 242 -16 30 -238 35 23 -122 25 150
10045 150 -91 80 -324 50 -146 -148 -198 -26 102 -9 80 -1 161 161 -153 117 98 -58 92 127 73 75 64 43
10069 43 58 -1 76 -128 -96 319 -39 -194 50 -35 -259 65 21 -155 8 174 210 117 -117 -50 205 -60 163
10092 163 -41 -52 -91 -227 -48 -211 -3 -266 69 88 119 115 163 -162 219 17 130 191 46 285 168 -101
10114 -101 43 107 -9 25 -122 23 185 126 372 -21 -45 -224 -168 108 24 -168 -191 -78 114 4 83 -65
10136 -65 -23 198 261 20 4 -22 -75 18 -195 -50 18 175 -169 -208 -31 31 -140 59 -110 -64 51 42 -57 -40 -188
10161 -188 120 -29 -206 23 18 -39 22 -2 38 -218 54 -175 -23 234 233 -28 -44 -138 -50 -51 -22 97 -128 72
10185 72 -49 137 -55 -11 -53 -75 49 -137 -55 -278 -139 -171 50 174 -79 -197 -166 -39 -70 -13 -142 137 -40
10208 -40 136 -312 -174 91 -72 27 53 246 -70 -58 183 122 58 -126 4 -87 97 -23 -185 -96 105 -179
10230 -179 114 193 49 147 375 -27 168 -128 147 138 -225 40 60 334 -296 -96 -68 -47 -119 92 227 122
10252 122 175 20 29 102 49 25 -73 -7 114 -166 -164 39 105 229 101 71 82 -31 10 4 12 -110 147 94 -62 -228
10278 -228 117 78 -232 -73 -78 57 144 272 30 55 95 1 182 -34 -65 -189 -200 96 210 -35 57 122 4
10301 4 -116 114 185 61 -134 -145 120 -5 -95 58 36 -7 -152 -59 -139 -153 -20 -77 -114 53 -69 108 -57 139
10325 139 36 -46 -121 -60 38 -172 83 88 -122 -58 -76 -60 -43 -287 49 156 201 43 63 164 -52 58 213 53
10349 53 -45 25 235 -27 52 9 -25 111 97 29 -258 -15 -84 -35 -38 -201 -119 45 32 -124 122 -63 188 14
10373 14 56 -198 121 -72 -39 -160 21 110 25 -31 -171 116 69 -51 85 -106 -40 92 264 102 -328 -76
10395 -76 -24 54 240 114 -306 -144 -145 206 61 -69 -94 -165 -178 -140 -38 -16 -23 16 -34 315 -49 -64 -42 234 -62
10420 -62 -101 21 71 -6 111 24 20 149 76 -137 -28 -335 46 -51 7 206 45 265 77 177 76 -58 -210
10443 -210 367 -19 -17 -86 36 -29 -46 140 237 204 -41 157 71 173 -20 113 20 -403 -79 39 -43 123 -72
10466 -72 43 113 -65 -134 94 31 22 1 -271 137 -145 -190 85 -111 -129 27 -30 -80 -6 87 -43 -92 49 198
10490 198 268 -83 -12 35 -86 -21 13 49 -110 4 214 -129 -93 -165 66 109 -177 -3 188 41 11 -200 -9
10513 -9 -116 57 136 -6 -173 -32 240 -18 57 182 -95 56 -118 9 -153 -387 -71 -143 37 10 -117 -18
10535 -18 -95 -46 37 55 -86 164 25 26 264 133 89 76 -123 -62 -53 -120 -79 143 -39 74 -200 123 88 -9 22
10560 22 -190 246 87 83 -123 102 74 -78 87 -15 28 -80 155 115 21 48 10 -14 265 212 45 -88 52
10583 52 -116 -126 -7 196 64 -278 9 -15 0 333 -59 43 -43 106 121 -61 -212 -12 69 80 -81 -109 -69
10606 -69 -68 -269 -52 -110 -215 -129 15 230 -23 173 153 80 -100 -178 -108 -130 -156 -86 -72 7 72 48 -64 19 -88
10631 -88 -239 12 -21 -34 -86 218 126 -58 -229 -178 43 30 -80 -179 6 -67 119 -42 -74 -93 18 -95 -51 -12
10655 -12 116 107 220 22 45 -159 141 44 51 41 17 -11 -117 10 9 196 97 8 -72 -274 -26 -27 -5 4 -149 71
10681 71 -193 101 -226 95 184 227 -36 -161 225 212 -180 268 47 15 87 256 -37 25 8 115 -13 -63 34
10704 34 62 96 -26 17 33 83 26 -45 2 20 -29 -21 55 38 -93 -65 -187 125 30 -16 166 -88 -43 83 22 59 111
10731 111 15 -70 -118 -177 -207 43 -2 212 -17 87 125 -57 137 16 137 138 197 198 -22 -171 -25 -11 -108 -109 -23
10756 -23 72 -169 -62 -101 118 220 138 313 23 -207 -199 142 137 -72 -76 -46 136 -19 -39 -27 -1 -19 -96 -19 -222
10781 -222 -2 -110 266 -9 167 92 315 -244 -47 174 62 -25 94 243 30 12 64 188 -111 -58 19 -127
10803 -127 32 -206 -135 -167 -234 -206 -20 -100 -159 62 -76 43 -163 -135 -127 -16 177 40 -79 -180 -149 -32 -94
10826 -94 45 -62 -216 -235 -264 94 136 153 73 20 -290 -59 -124 -71 -56 -157 36 23 39 201 51 143 -43 230
10850 230 209 68 -39 98 142 -190 -2 170 -100 70 111 111 -8 -10 -35 16 -73 155 -239 -264 -127 67 -93
10873 -93 -65 -195 -48 -208 -207 165 -255 -58 166 -29 1 30 -42 -52 91 -104 -365 80 -109 19 113 -109 28
10896 28 81 193 125 -46 -122 -49 186 -39 -84 -131 54 -107 -162 -40 -79 12 -13 -100 -121 38 -30 69 181 -110 97
10921 97 169 47 -34 12 -92 39 316 68 -12 69 258 57 -87 -28 -39 57 -30 -236 -51 90 94 220 -39 -53
10945 -53 13 19 88 180 67 94 -31 -115 156 137 275 -87 -29 60 -29 -4 -32 -29 77 87 -139 -160 9 -105 -165 194
10971 194 197 13 -171 -74 -136 73 92 119 -99 54 -109 147 100 200 118 47 22 130 -254 21 -6 -19 18 6
10995 6 -118 -126 -137 36 167 24 143 22 -105 -45 252 -227 -160 -77 -138 190 -101 109 -123 23 -57 33 91 -27
11019 -27 109 -1 62 -252 -48 177 -134 -167 112 -138 7 39 -32 -38 74 -4 37 69 149 -3 -32 107 68 -82
11043 -82 205 119 97 121 192 99 5 205 -164 -67 29 66 -77 3 -164 -15 90 34 -31 -234 19 -10 -187 51
11067 51 276 -29 -82 -78 -36 -100 -97 118 27 -164 186 95 140 285 172 47 8 188 34 -172 64 -304 -49 34
11091 34 61 -1 -218 -21 -110 -290 -64 203 -36 -138 246 -65 -17 -169 14 -44 -76 37 -149 113 -279 -87
11113 -87 -98 150 -60 2 7 -8 -44 68 31 30 -47 -9 34 -148 -50 63 -4 -16 47 -135 -84 -160 149 55 -122 -21
11139 -21 30 -53 112 125 108 152 -234 39 228 -141 -110 -143 157 235 50 -42 -203 -215 -131 -53 -112 -231 -283 196 -120
11164 -120 -4 -12 62 122 160 -215 -61 -168 -117 213 33 61 -116 -7 135 -102 26 58 -180 54 -147 -170 -116
11187 -116 7 82 -195 -53 -83 9 -238 -11 80 14 -55 32 194 -129 161 205 37 26 -63 -70 -108 133 106 232
11211 232 -88 -184 -135 -9 230 -80 255 175 0 -60 4 -87 74 49 138 72 59 221 -198 -134 112 70 -133 320
11235 320 -75 -142 -48 91 31 -94 3 -246 76 -20 112 -108 -181 -217 -62 200 53 -22 7 -55 4 46 23 237
11259 237 179 12 -38 15 -6 -158 -266 13 -116 42 25 -193 202 95 86 51 38 -10 -60 -216 -68 165 -182
11282 -182 366 190 108 41 26 139 -41 66 -1 222 -192 35 -50 -100 -182 -233 -100 -127 118 -109 -25 -49 -190
11305 -190 -50 66 119 83 -120 -30 146 -70 11 107 -274 -334 -67 137 197 -58 -183 -107 122 188 57 -189 300
11328 300 66 6 50 105 -78 -57 116 -59 -209 -45 -202 -20 48 -153 -52 21 85 -176 35 -16 32 -164 -222
11351 -222 27 15 6 -22 148 -92 -60 66 -33 38 -9 52 -245 55 96 -86 23 -33 -5 86 -267 99 -37 -129
11375 -129 -30 -141 -33 233 -64 36 126 119 30 -101 154 -246 118 103 -74 -287 -63 -260 -194 -21 -85 -63 106
11398 106 149 313 -119 302 107 -45 117 50 -220 -187 -63 -41 -184 -10 -11 -29 9 -135 -105 -7 -198 259 -77
11421 -77 -109 -235 93 17 -124 -178 -97 242 -59 38 -60 159 142 164 78 143 -31 -105 -234 -142 132 -62 -52 -136 4
11446 4 -100 312 31 199 -46 -117 -4 -125 271 -39 -113 25 -173 401 65 72 125 -161 -97 8 -63 -118 -78
11469 -78 41 19 -37 -142 93 49 -180 -246 -157 10 73 25 -100 -97 -68 -40 -158 -84 -315 138 -45 -247 50 50 90
11494 90 -77 -10 -102 -129 164 15 -131 92 51 -153 -124 80 104 65 -126 -62 -32 -73 360 -30 -19 132 -47 47
11518 47 256 238 84 -74 -55 -253 -51 -100 -53 -126 -67 -144 -69 220 23 -40 -231 -121 145 11 240 89 -86
11541 -86 -218 22 98 -154 3 51 -113 7 -50 -21 -119 -146 243 -96 -197 124 -42 -13 -239 88 200 -50
11563 -50 54 102 354 159 126 415 -10 -92 -23 129 58 98 -208 97 -262 37 52 -133 15 -132 -166 -165 -133 -103
11587 -103 -131 54 -237 -50 17 -65 -99 230 157 -152 87 102 40 -280 -235 -84 179 202 171 113 161 -49 -60 -112
11611 -112 -137 91 -47 15 -188 -54 93 8 23 195 -91 66 159 -45 -46 22 10 108 201 -159 -82 -62 5 -251
11635 -251 -9 56 -5 -229 145 -77 -58 75 33 37 122 -43 -45 -202 -157 -113 -9 78 7 -145 -188 105 347 45
11659 45 280 -141 -56 -71 -120 -97 -11 -25 -121 -180 -114 -110 177 56 50 -139 -10 26 -166 -165 52 -320 -98 -45 -1 -88
11685 -88 -28 82 -201 73 14 103 41 -89 101 72 -159 -24 -60 186 208 65 1 -194 -126 -115 63 122 -384 31
11709 31 -121 85 -25 -222 -77 98 -32 -26 260 195 -62 -76 -196 -91 47 160 -36 13 -36 140 50 -90
11731 -90 -4 189 158 -359 -165 -15 -2 -264 59 55 128 -271 -33 -19 137 359 -48 141 88 164 68 -106 -14 -44
11755 -44 -163 -2 78 -157 -229 148 -202 -99 -196 -183 195 153 200 8 288 29 136 -124 98 240 -60 -28
11777 -28 -6 -375 -11 -153 81 160 -122 57 -31 215 -283 81 46 -85 -290 55 -1 190 20 84 -10 143
11799 143 115 -56 -75 5 -54 -23 14 1 -2 185 85 18 -60 -17 -103 -53 -143 -48 -217 -75 272 82 -100 -19 147
11824 147 32 -58 44 -249 -31 24 45 46 79 88 -307 16 -20 37 17 58 148 -45 163 201 -9 -145 56 -115
11848 -115 -94 154 70 134 -164 81 196 34 52 3 12 -111 130 2 -131 244 160 95 139 151 17 209 35
11871 35 -137 8 -57 17 186 -64 26 47 -149 57 22 9 49 59 -27 14 -202 -175 -276 186 52 7 -195 -51
11895 -51 -232 -144 29 -33 -159 239 55 -158 110 -38 45 169 112 -61 284 -204 107 -59 63 -185 34
11916 34 -113 45 -142 117 -107 192 82 14 101 -29 81 171 -199 110 -25 -121 104 -150 32 42 253 51
11938 51 22 -133 -48 319 -137 0 165 -29 -64 101 -29 71 -131 -44 33 19 87 -98 -51 -64 -78 -175 -57 -29
11962 -29 239 190 -198 -202 -97 33 27 222 140 -9 -123 -33 15 -37 32 42 -116 -177 -6 -136 -24 -192 116 46
11986 46 -95 85 2 -222 -15 -167 -126 207 -182 -164 170 -71 -174 -101 182 54 141 -125 45 -50 149 -63
12008 -63 5 -10 137 20 -230 -61 -74 188 -136 -123 3 -33 185 -44 -154 -52 -4 256 360 -82 175 315
12030 315 -188 243 -42 237 -194 41 171 -22 42 42 -187 -99 147 157 54 -61 -13 -176 -202 71 46 18 18
12053 18 -50 277 23 -148 -33 -50 76 -96 146 10 -60 76 157 105 80 -28 25 31 -151 -52 -124 56 173 137
12077 137 -99 -129 -180 287 -92 -117 348 17 -316 -85 -1 73 134 95 93 134 -130 -60 181 49 -162 82 19 -23
12101 -23 124 37 -40 -77 289 129 18 -361 190 32 -84 -113 -98 67 -225 49 -122 -63 3 76 -123 -102 45
12124 45 -428 32 -35 -62 -385 121 -64 77 46 199 -84 242 -59 -84 -85 27 -97 3 358 133 152 21
12146 21 155 47 188 90 -13 71 -151 -32 222 -154 245 124 37 -118 20 -210 -82 119 -121 47 -123
12167 -123 170 -226 -31 318 -142 149 42 -102 95 -66 7 138 -173 -37 -292 11 -39 72 163 199 88
12188 88 161 -28 146 -124 8 183 -122 14 129 63 -82 -45 -136 23 -126 -214 -203 -266 -247 -70 -64 -274 -207 -29
12212 -29 159 -89 65 -204 -184 78 -308 43 146 -66 -40 29 133 -78 -41 -234 -19 3 65 -101 -123 -334
12234 -334 -14 -72 33 89 -49 -165 -154 -51 76 0 -33 16 137 -150 59 -75 162 123 65 22 -61 -226 -25
12257 -25 -152 -31 52 -166 -102 3 24 -60 146 193 104 12 20 -29 -102 -4 112 -331 4 -9 220 156 -6 -136 203
12282 203 -168 323 165 -102 -259 -66 -75 147 -28 10 -313 -57 -31 -51 87 -46 24 63 31 -92 -47 145 175
12305 175 158 181 -171 -153 -45 139 -72 -28 -146 -124 -136 73 -8 -93 252 -83 26 330 52 -149 138 11
12327 11 25 276 -153 -111 -117 83 -10 20 266 18 46 247 -86 -10 18 -97 -26 -147 63 33 -61 -326 -189 144
12351 144 -12 -79 139 224 -172 27 60 -26 301 160 91 105 -71 -28 257 -142 -73 -26 -103 35 91 -213 -43
12374 -43 278 75 60 240 101 -18 -234 135 134 26 96 -1 -7 -28 37 -107 211 93 217 47 -21 71 -135 -193
12398 -193 -207 -152 -17 39 -273 -192 -75 -203 -176 0 75 -106 58 -5 15 55 87 77 -87 -1 84 177 -7 55 -139
12423 -139 55 -3 204 -166 33 85 -77 166 116 -56 5 -53 73 41 87 21 59 164 -16 84 78 -135 104
12446 104 2 21 -16 -71 -17 23 -84 40 125 3 -125 -197 -209 101 15 16 -87 79 -63 176 220 44 -19 9
12470 9 110 -43 83 -102 122 -102 -149 183 -112 -293 89 -31 -97 -179 -171 121 67 -123 120 -85 -22 168 -154
12493 -154 -88 -195 -118 -212 -13 -73 -24 -185 -96 50 -70 56 347 -70 -234 20 -314 -83 -142 -135 -2 8 -169
12516 -169 -44 -153 -4 -88 219 -185 90 61 34 317 82 376 37 -209 -4 171 34 139 26 98 124
12537 124 186 18 177 -37 48 -50 -161 -45 32 13 -41 17 133 204 -64 -4 -67 -26 212 68 -64 15 30 -49
12561 -49 97 53 -5 13 48 -354 122 132 26 -26 94 -246 30 90 -12 72 35 -78 -8 -54 185 -111 -113 -86 1
12586 1 236 -73 -115 -40 38 -9 -1 -48 165 235 -52 -142 -47 93 -72 -25 -177 -237 109 109 -213 177 -168 20 -84
12611 -84 23 192 -126 -238 -222 162 -65 -133 108 157 -26 -157 -95 -20 40 93 6 7 -125 140 139 204 -97 -122 -42
12636 -42 -128 93 16 -330 -126 -354 320 -202 -40 -12 97 -161 59 -120 61 -112 218 214 -94 -62 16 -87
12658 -87 -3 -102 192 256 -147 -50 -47 -2 78 28 210 -204 -220 -40 67 121 -60 -18 2 131 98 -80 2 168 126
12683 126 124 -62 24 -188 46 102 124 -195 -32 -503 114 -150 120 18 11 21 3 90 -17 -165 -39 58 198
12706 198 -53 101 32 -123 -60 26 40 119 53 -242 40 -73 69 111 195 -94 2 -54 220 -90 9 72 64 -133
12730 -133 -202 81 25 53 -72 -84 -111 -25 -49 -68 -90 171 -98 -119 43 72 -60 -132 131 70 11 67 -106 -45 -127
12755 -127 9 211 -267 46 -164 -48 -56 -100 36 -82 -37 174 -113 -11 -70 -188 -63 79 -115 -102 -62 23
12777 23 -222 24 17 -281 -90 -112 80 -34 -28 -156 -248 -82 -244 93 278 -37 -106 -81 -17 186 -13 2 -86 -163
12801 -163 30 -13 -82 -92 78 90 -125 113 141 -175 23 9 -18 -66 41 -54 75 152 -176 36 -159 171 161
12824 161 -409 -3 -77 50 76 -254 -236 298 54 -73 -1 129 99 -24 -71 117 107 46 93 -48 113 -136 36
12847 36 -7 20 79 43 63 17 -20 -206 38 -120 6 -209 111 -62 -31 55 4 -32 58 107 63 60 112 -20 53 107
12873 107 -3 15 5 -61 -44 -41 95 145 -63 153 -209 -257 74 152 -108 -28 117 -165 -106 74 -236 40 40 52
12897 52 -181 -44 80 54 -13 -26 196 -185 233 -2 -43 -19 77 -21 -65 100 -43 -74 -36 -72 96 -139 339 -170
12921 -170 233 -20 -223 -307 -79 -33 -117 -283 -9 37 -53 -165 115 43 -10 -174 -78 -183 32 67 -2 -120 90
12944 90 58 112 -140 12 -78 -12 22 -21 141 70 94 -101 114 -175 -21 40 -17 -105 -9 -50 150 74 -190 -11 -176
12969 -176 91 -14 -160 -214 -184 121 122 7 -46 -160 98 32 -1 210 189 115 -5 -29 -137 -168 184 -36 11 51
12993 51 -125 178 186 247 -44 51 34 61 -74 -161 80 -171 18 -1 -72 -10 175 -16 -19 116 -126 -67 53 278
13017 278 -42 52 188 -149 12 -30 -59 -83 -67 -60 -30 -191 20 -173 299 -101 77 -142 361 -23 33 74 -133
13040 -133 138 -38 138 -113 21 112 43 -131 116 50 169 180 124 -173 58 -176 -188 -5 -163 -54 -131 -152
13062 -152 47 111 -323 7 21 21 3 -8 -72 -458 14 1 15 -212 -69 159 -234 -45 42 144 119 5 -10 6
13086 6 47 -67 -112 76 -53 -48 5 -20 -16 -5 -225 -179 -2 41 26 43 100 119 177 86 9 -29 130 -19 -150 -101 65
13113 65 -111 -208 -213 -132 -360 -223 -201 -86 -248 252 194 14 -72 -55 -79 -215 154 -71 154 52 -93 90 -4
13136 -4 -179 -46 113 -181 4 64 227 170 -106 38 48 -69 -105 207 -90 -85 -261 -160 -120 50 17 -12 79 370
13160 370 179 61 -25 -66 -123 -137 -27 -9 -102 -185 -89 -206 147 7 -83 -108 56 -25 -5 -180 71 -128 -65 23
13184 23 -43 202 -272 53 -82 144 -136 -65 -144 -2 54 -73 -11 252 98 123 -11 281 52 205 -86 -295
13206 -295 -96 -170 -135 -125 -52 -150 -54 -28 4 -150 -5 -5 2 -50 50 41 -22 -120 -49 129 132 -101 -64 262 -148 -149 65
13233 65 235 -239 182 64 155 -397 106 -72 -200 186 25 -214 -177 81 150 -57 -154 26 15 128 17 43
13255 43 146 -95 -96 -74 81 -3 -104 171 136 -98 -160 99 90 -157 -29 -4 26 245 126 101 -19 21 36 -430
13279 -430 -91 155 62 106 -9 -131 -105 29 180 69 -173 99 55 -189 -81 25 -164 158 112 2 -8 202
13301 202 -53 -189 147 -55 134 -192 1 -43 124 -19 -39 110 55 -31 20 -86 -239 -89 3 78 -205 -105
13323 -105 14 -122 118 -41 78 89 -171 29 62 59 83 52 82 136 -16 -217 97 57 12 110 8 415 -77
13346 -77 -44 83 -87 116 49 -112 -415 37 -141 170 6 169 -139 -110 91 40 -89 -213 -8 -106 207 119
13368 119 -37 -8 35 -52 -313 86 106 -278 -32 39 10 -63 21 -300 47 152 367 46 1 -35 78 -388 -155
13391 -155 79 -170 88 159 141 131 -170 -141 -235 0 -28 -147 41 -12 123 -70 15 56 21 -105 -157 50 5 217
13415 217 -40 -108 -42 -106 40 58 -73 -62 -96 40 -246 -112 128 -53 13 -266 -45 11 90 -70 53 297 -19
13438 -19 39 -259 113 -173 -112 -13 -35 -12 120 -117 -118 -172 -218 48 -107 -195 114 209 -33 -34 -36 -126 -376 -132 -400
13463 -400 37 -91 -153 -107 30 -128 -180 52 160 -196 -62 62 -159 -348 132 74 185 195 157 61 56 0 -91
13486 -91 262 21 239 13 301 8 -97 -3 57 100 -65 -192 -80 34 211 -157 -200 -104 147 -253 -277 24
13508 24 197 76 38 95 -20 181 -123 -245 133 -21 30 -167 -155 -8 164 -101 36 46 -36 171 47 75
13530 75 -83 -2 -131 -275 92 -193 -3 54 -103 -69 36 163 77 -38 85 250 29 -42 1 14 93 38 -218
13553 -218 128 196 96 138 20 -51 138 80 -119 70 -124 -55 128 3 140 -157 -122 124 112 -44 77 81 -153
13576 -153 57 -15 64 7 76 59 215 -84 -88 84 -163 -171 -38 32 52 -99 162 175 42 -133 12 37 80 -104
13600 -104 174 -43 107 -59 -101 -12 119 -32 -139 -153 -120 -176 -334 46 89 73 -80 96 -17 -185 152 129
13622 129 26 20 12 181 18 -110 -79 46 -143 -45 19 -2 25 -15 147 -134 50 182 -263 49 15 -77 -207 18
13646 18 -111 -101 22 -237 24 -133 149 210 -37 -161 39 -81 -17 -88 -196 4 84 -132 -153 218 -19 175
13668 175 -130 -239 -224 -47 -133 218 184 110 -287 -2 -9 -119 -121 -337 209 -302 -118 -72 32 3 34 -35 2 46
13692 46 81 140 -90 -64 -44 53 -443 -93 -255 108 -90 108 50 -267 -176 -190 102 121 -339 -28 -71 -59 -293 -116
13716 -116 -178 -230 176 -120 -83 36 -219 -163 -73 165 85 8 231 -162 -79 -21 -73 -38 -74 57 192 25 -106 -41
13740 -41 94 -267 -103 -63 -205 243 50 182 -73 -161 -18 -223 -3 -70 -306 -38 -83 -49 68 -126 46 -152
13762 -152 -203 -45 42 345 45 100 -329 40 -19 73 131 104 59 -196 -241 229 72 178 -65 182 26 24 -101
13785 -101 -20 177 -41 107 -100 -59 -247 17 -91 47 -251 6 153 165 -45 -147 -53 0 41 78 -94 -41
13807 -41 190 -150 -106 -127 151 203 -64 281 204 -52 70 103 -34 262 153 -163 64 182 26 63 26 86 62
13830 62 -289 133 122 241 99 -49 -57 0 83 31 35 -209 -76 -86 -5 2 208 68 -172 -200 51 -76 72 -163
13854 -163 119 134 -94 1 -143 92 -6 6 -89 -37 -227 -12 -55 90 29 131 195 -58 -146 88 -45 37 52 -88
13878 -88 66 18 272 -185 -7 -184 -59 261 0 1 -83 -126 -173 -36 76 -17 -140 -152 -62 -82 -32 -133 -114 94
13902 94 -41 3 91 67 -190 -116 35 108 134 29 -63 6 63 139 54 96 185 -34 -167 -43 -148 -206 94 95 55 4
13928 4 103 23 -51 -197 88 -43 -67 22 -24 -35 38 -72 -93 -123 -11 -81 -59 -146 11 91 178 146 -108 -16 6 -41 -33
13955 -33 30 -215 -174 16 -237 25 65 232 -8 -41 58 -129 -65 245 140 9 -143 33 77 -109 -12 -1 89
13978 89 250 -142 -211 -64 200 227 -68 129 26 -17 196 -102 -346 98 16 -315 122 8 -333 17 -237
13999 -237 -32 147 -177 96 -136 -31 50 139 -75 278 71 -353 -44 -8 19 -126 173 -28 -74 157 -37
14020 -37 136 -13 28 258 15 108 169 -109 -242 101 -248 10 73 116 -61 -158 -123 0 160 240 -3 48 107
14043 107 -76 36 364 -73 -24 156 -79 67 128 -296 143 -94 -165 107 102 266 85 -248 -21 185 -40
14064 -40 -29 32 117 -170 169 38 -175 1 -50 65 -146 123 -66 -93 -28 -61 -179 75 248 -223 -280 43 -40
14087 -40 -178 -52 -273 -224 -226 -175 -127 102 137 56 52 107 194 -89 -91 59 -265 -196 25 50 -59 -57 -19 -27 210 103 9
14114 9 135 49 -68 -51 139 181 -47 -179 -39 51 -29 -155 54 -8 -117 89 -118 113 225 -63 -115 -6 77
14137 77 -92 -47 -54 -92 -57 64 -7 62 -81 -273 36 -58 -160 -74 -32 87 -72 -9 92 167 -70 174 124 202 -8
14162 -8 129 -175 -81 -103 -6 191 5 43 -23 -105 -184 185 49 -86 78 -254 152 -41 107 -88 37 209 -112
14185 -112 -261 93 -46 -53 131 44 -29 93 62 5 -168 -177 12 161 -125 -188 81 -32 126 -3 -62 97 12
14208 12 -3 -44 -170 -121 -318 -129 -37 15 -75 -91 -11 -270 107 -21 33 66 -197 154 76 -12 -263 -45 -327 -81
14232 -81 -143 -113 -23 -46 -146 -90 48 41 98 168 -22 20 -63 -41 -141 -104 22 -124 146 -56 -168 -137 24 109 127
14257 127 211 -195 -51 3 -112 -3 97 25 -34 -58 -172 -37 -39 22 90 71 28 96 -61 -9 206 -183 -34 80
14281 80 44 28 -12 -23 240 55 -28 -162 -34 35 -173 -181 16 99 -155 232 80 45 183 -11 68 53 126 -159
14305 -159 -163 -171 120 50 53 87 168 80 19 27 127 -50 -288 -51 -124 78 13 146 -94 -244 79 -24 80 7 -12
14330 -12 25 136 -317 53 83 -128 -85 106 56 25 174 -199 -238 -82 -48 -98 -2 150 135 150 125 140 20 69 10
14355 10 179 -4 -9 -129 -86 35 -213 -70 -80 -26 -103 -52 73 -313 -120 -5 103 -87 -161 62 -202 95 59
14378 59 58 34 14 77 -34 -46 -99 -32 195 -98 -29 209 40 -61 -88 83 -10 -287 173 -18 -189 17 141 107
14402 107 15 212 -3 268 -68 -83 120 -58 -10 127 -285 -31 -69 53 -115 -92 -126 79 -168 -169 91 39 -46
14425 -46 -24 79 -17 -249 -347 43 -141 -148 -86 20 -81 -77 73 137 -73 -30 -92 26 -145 -159 -96 -100 -134 194 -171
14450 -171 303 -62 -111 183 91 157 58 81 58 328 84 -190 50 -18 53 38 -249 -69 24 -4 214 179 -131 -113
14474 -113 -178 -156 -230 -93 71 -156 58 -48 -50 0 93 -38 -123 -207 85 77 99 -45 -90 -24 58 -11 -136 299 -88
14499 -88 -39 164 -137 -18 101 53 107 -49 9 107 -55 64 -159 249 9 -114 26 1 -41 -77 -124 122 3
14522 3 34 31 64 -40 7 110 -202 -100 1 -137 -140 -246 -7 283 -208 -135 -136 164 112 119 -219 164 103 133 26
14547 26 -70 -2 -59 -23 -12 -166 148 265 -258 46 59 11 -7 -91 11 28 3 -22 112 112 -57 33 -51 220 -136
14572 -136 36 48 -239 267 45 32 6 -74 -66 -4 200 -132 -254 -2 194 84 77 130 -55 -66 -227 -123 -37 -59
14596 -59 31 209 34 -78 294 150 -171 -284 -96 42 140 184 -30 33 -73 11 -8 -83 71 27 -386 232 -2
14619 -2 -57 117 81 46 -17 194 119 16 71 -261 -58 42 -106 -2 -108 -99 -17 -43 -199 85 75 144 126 -143 -25
14644 -25 150 -153 124 121 120 78 96 173 69 -30 58 -81 -138 -9 -73 104 21 70 35 77 -300 -62 -197 16 -18
14669 -18 -279 -95 -124 -139 -235 -4 -181 -68 -130 24 -198 205 -68 -90 190 -90 108 -153 184 -139 -102 -44
14691 -44 63 196 -90 76 235 -54 147 32 131 -120 -85 -127 38 50 -199 -148 23 -196 -183 139 -81 -72 -133
14714 -133 -34 -105 120 -95 90 52 35 7 -62 -35 -33 24 155 -45 -53 -34 -90 220 35 76 -108 16 -37 -31 255 -11
14740 -11 195 -18 -275 -112 -76 -228 -10 -145 174 -149 167 -152 -115 102 -29 11 -56 23 -136 -122 111 -204
14762 -204 -14 106 -274 -2 110 -81 183 -177 -111 -102 -52 -313 -130 -30 -101 76 -120 -267 -122 38 -272
14783 -272 -1 -71 81 193 199 -103 -402 -15 128 -204 -188 100 -175 38 -101 -211 -221 -171 -7 -190 252 104
14805 104 -119 262 -21 -150 127 -2 115 -75 -97 -44 42 6 -62 -122 -64 -171 58 181 -29 15 45 11 270
14828 270 91 -13 39 -44 -62 -45 39 20 -113 -235 -35 101 -17 -6 -190 -52 -68 48 -40 -44 70 -185 65
14851 65 76 -156 -200 160 -27 -242 -121 -6 180 1 -181 293 -179 52 -58 -47 199 -128 88 77 -78
14872 -78 54 -116 -122 209 -6 -122 -195 -101 -67 60 -65 8 23 128 321 -107 -56 -49 66 -10 -117 4 -160 181
14896 181 -151 -35 -156 32 -19 -88 -19 -96 -95 109 -171 108 -171 102 -81 -100 163 -181 78 207 -223 58
14918 58 -82 23 -143 98 -87 -143 -44 -99 -229 1 428 -199 -3 136 1 -186 1 29 92 136 133 120 88
14941 88 152 11 -208 142 -82 -42 -101 -51 36 -48 96 -77 -147 147 313 66 5 -170 -159 25 -165 -135 -185 -64
14965 -64 89 -91 -228 37 91 -145 175 63 54 132 6 219 -6 -18 175 62 50 133 29 55 8 -195 133
14988 133 30 155 78 31 86 30 141 -206 182 -264 -57 119 -54 -79 318 85 -96 37 -105 296 -57
15009 -57 -100 130 -25 176 100 -2 21 -336 -85 47 -139 -100 -65 -111 -177 -314 -65 -163 -34 -44 -97 -201 -93
15032 -93 84 86 -116 174 191 2 -266 -103 61 219 -153 83 -5 -159 95 -120 -61 119 295 9 -61 -175
15054 -175 156 69 50 -65 -140 131 139 -37 136 0 43 -68 238 -128 -215 -16 47 -53 -174 -18 -229 -20
15076 -20 85 29 82 -23 -84 -83 70 115 -245 1 52 140 42 67 -53 85 -27 -120 -5 10 55 65 76 -88 46
15101 46 -105 -9 -39 23 -17 -75 -187 45 64 -5 -106 76 -40 -302 -55 -50 -32 92 195 -216 172 165 350 -26
15125 -26 -60 -184 -104 87 305 -53 93 -208 51 -105 83 110 13 478 -72 -9 64 -50 -41 -217 -101 40 283
15148 283 288 -149 -134 26 24 65 -56 -150 151 164 232 55 -83 -220 43 -187 139 297 -104 -136 75 98 14 -189
15172 -189 184 125 -15 78 -237 -68 33 7 4 48 6 -4 2 42 53 -51 200 -14 203 -51 -200 61 -43 71
15196 71 -121 -130 -169 -135 -246 -2 77 -50 104 252 124 69 -24 -73 -9 -60 -222 -141 -77 330 292 -144 138 116 -226
15221 -226 248 97 -362 105 -157 -208 58 68 153 -12 236 36 -111 11 39 108 93 -44 -64 -166 -156 -58 33
15244 33 57 44 118 -75 211 -8 -151 -11 164 173 119 -10 -51 0 -309 245 -112 24 61 -162 -79 102 73 38
15268 38 38 -20 -11 -131 -110 -165 78 134 -17 -61 72 -165 -114 163 -49 -38 135 149 60 -43 -22 -185 -246 -169 43
15293 43 -94 -175 20 -123 -143 -1 94 -99 -104 34 67 -134 96 13 162 -203 -24 251 -17 -194 159 94 -129
15316 -129 116 74 201 68 -209 -81 100 -144 -20 317 152 34 45 -74 77 107 -3 129 -83 -125 273
15337 273 -76 -65 135 -82 73 -108 211 107 3 10 23 -222 -19 -93 142 -59 227 -131 -213 -11 286 110
15359 110 -31 16 -210 -22 127 40 48 18 108 20 6 -42 -85 -43 -107 96 -253 -79 161 446 -145 -16 -2 -1 317
15384 317 -378 -101 -249 210 29 -296 43 116 150 -55 -35 -187 -71 -33 82 -64 -171 32 94 5 -23 98
15406 98 -30 -120 54 295 91 6 13 -33 -51 -93 137 -31 -84 159 -30 249 6 176 108 -184 -162 208 241 -64
15430 -64 28 130 -17 -248 17 62 82 -198 85 267 -88 -50 -15 -42 -8 -382 -45 -49 -158 17 164 226 -184
15453 -184 63 -95 -120 103 87 47 -60 -74 -138 -51 51 87 12 126 159 -229 123 420 -124 -81 -161 -68 35 -98
15477 -98 52 71 117 61 -183 -81 5 -157 61 32 74 1 -57 37 -14 -140 79 -129 -30 -50 33 -106 -49 57 -96
15502 -96 -50 219 -26 36 96 68 3 -102 97 -219 61 -89 25 60 70 77 -84 182 -103 -119 118 50 148 -147
15526 -147 55 -68 125 -84 -20 -116 24 240 -165 -93 33 60 3 -290 103 40 86 39 125 11 176 -53 -26
15549 -26 70 98 -306 140 -27 -106 -126 -24 80 -76 186 -270 -16 72 -47 63 -43 -40 -142 -200 -139 -18 -47
15572 -47 25 72 -8 -114 23 133 181 208 -211 283 -238 278 107 -153 -95 108 229 -231 9 -114 -89 -163 -113
15595 -113 -34 -45 -224 7 -72 -131 -220 -74 9 -112 -202 16 -53 25 23 -69 22 -145 -89 -215 100 -152 20 -120
15619 -120 -67 -180 -30 172 97 -75 26 -268 14 46 -281 148 -104 24 196 23 148 -9 -15 117 -71
15640 -71 227 -56 -233 17 65 196 91 -2 -38 73 94 -161 -37 20 -8 237 -255 109 -29 93 -140 124
15662 124 136 231 160 -57 -45 -151 97 -31 225 36 94 -52 -241 223 41 41 -166 -162 31 67 11 -217 271
15685 271 -137 147 23 -110 12 -46 -36 84 -15 -60 -63 18 52 -296 16 -146 -60 107 -157 -117 390 114 111 54
15709 54 -56 117 -89 -199 96 135 -10 -201 -69 -200 138 203 -145 -25 1 -158 -184 91 -7 -258 -20 19
15731 19 16 -132 121 146 -57 -10 -127 91 72 -103 -82 171 20 134 4 57 32 -87 79 187 -119 193 -370
15754 -370 97 350 -110 193 -9 -121 65 124 -66 -111 21 -23 68 223 84 73 51 159 -14 67 -42 -75
15776 -75 -133 -122 54 -74 -132 -54 -322 248 -92 -233 134 -22 -163 -28 174 -99 126 85 238 -155 -94 0
15798 0 163 -14 25 108 -205 361 66 -21 234 -99 13 -27 91 208 -40 -204 -13 58 113 -88 50 -149
15820 -149 -17 70 -466 112 -74 5 106 -6 66 9 -66 139 -188 163 131 -188 -61 -2 43 89 399 -30 -200
15843 -200 -82 114 59 -239 12 205 61 75 -11 8 29 -6 81 30 49 -1 146 92 79 -249 -44 39 104 -76
15867 -76 -142 -143 63 131 -42 -44 -4 -165 104 10 -33 -122 -201 134 88 -43 -242 -159 -48 116 0 246 51 -56
15891 -56 97 -131 -21 -170 -173 108 -219 155 -4 9 -138 -120 -66 -13 55 -189 19 29 -14 -40 27 14 100 70 -19
15916 -19 -312 194 -24 -15 -145 -52 80 -105 -198 -11 124 -109 -112 56 128 44 -51 -196 -83 81 76 -205 245 56
15940 56 98 51 -21 86 -6 -19 86 12 16 59 -32 74 -127 122 9 -9 -78 149 32 -82 51 -71 -114 186
15964 186 -128 -353 10 -274 -93 81 135 -153 -109 -129 54 -79 4 18 -16 -23 -50 -18 -57 -225 -138 56 165 158
15988 158 306 -122 -207 -113 -2 76 235 77 99 -13 188 -79 120 136 149 58 101 11 -17 -9 39 -71 -108 273
16012 273 71 218 -244 102 141 118 91 115 -146 -124 198 37 -97 23 -45 47 199 -1 -81 -197 -3 28 192
16035 192 143 -60 -173 160 -264 -98 34 60 30 142 -101 -34 96 49 94 9 202 111 2 112 15 -63 -40
16058 -40 6 156 -278 -354 -173 -166 -110 37 -10 -84 26 25 -30 -33 -143 -218 -82 102 -215 70 202 29 41 155 9
16083 9 -57 84 -26 66 -53 -87 164 -99 -112 169 67 -49 -62 -204 62 -95 -78 -7 -116 -18 -121 -19 -97
16106 -97 -14 -84 -154 -26 -130 -32 -179 -24 -119 -276 187 -33 -272 -93 164 -110 -94 -141 -16 99 18 -284 -67
16129 -67 137 -39 -126 34 -37 64 -85 -76 -14 -27 180 57 -3 98 35 198 -66 -199 148 241 76 6 132
16152 132 240 -150 16 -78 -109 93 92 -26 -13 47 215 78 -68 -34 8 97 -59 22 -245 -1 145 151 -49 12
16176 12 80 -64 183 -95 11 86 -64 -29 193 216 -132 -83 47 5 52 93 -2 -201 -87 -231 -160 -16 108
16199 108 -71 -5 51 -75 127 -53 88 -222 58 163 -71 193 -81 32 33 -266 5 -36 -3 -97 162 151
16221 151 16 -186 -53 211 -58 37 -56 77 -115 111 165 195 74 -87 -100 -83 10 224 31 126 25 280
16243 280 -110 -91 25 175 91 -169 -29 -108 40 -33 88 240 110 17 -108 -35 346 -129 -227 -63 70 11
16265 11 49 -9 -265 -13 -42 -122 -32 109 42 201 -33 53 199 224 -26 172 -50 -135 222 77 35 305 -270
16288 -270 -13 230 -59 -127 -136 44 -75 -97 -95 -171 110 -103 19 272 -126 148 151 -142 -170 -110 -71 119 -85 35
16312 35 -20 179 53 243 208 148 -21 -225 124 259 -101 32 7 215 153 256 148 -25 107 -86 -75 -77 222
16335 222 7 93 -4 71 240 44 -133 -30 -196 1 -51 -36 -23 -225 111 -97 -40 -26 50 -74 66 -72 100
16358 100 -157 -63 -41 -47 32 161 -57 -143 -134 25 108 79 64 24 -92 128 -66 -47 -124 53 174 81 -164 -30 -73
16383g3
$$ Imaginary data points
##PAGE= N=2
##DATA TABLE= (X++(I..I)), XYDATA
0 0 0 0 0 0 0 0 0 0 0 32 -32 32 -64 64 -96 111 -128 160 -224 256 -289 353 -416 512 -602 673 -800 929
28 929 -1057 1217 -1409 1600 -1816 2049 -2310 2606 -2927 3276 -3671 4091 -4550 5062 -5609
43 -5609 6214 -6874 7591 -8377 9241 -10178 11216 -12352 13612 -15007 16559 -18296
55 -18296 20266 -22499 25060 -28048 31575 -35806 41002 -47571 56150 -67910 85082 -112634
67 -112634 164104 -293492 1325897 1548937 -1772282 -2027241 -404309 1515174 1346403
76 1346403 196141 -790175 -582970 -194029 -118828 67244 837946 832824 -152498 -1181579
86 -1181579 -925008 388622 1484609 1028033 -564209 -1415256 -474653 688942 815458
95 815458 209176 -277486 -414755 -309774 -128933 101401 396234 557073 -11182 -772775
105 -772775 -556030 410142 804195 232973 -438834 -444685 8 263939 -12446 -276005
115 -276005 98046 433008 -74888 -733242 -464348 447798 802512 213852 -625682 -758999
125 -758999 68042 782293 385764 -439985 -492099 97145 286034 -142575 -430709 -77908
135 -77908 515033 410406 -499260 -926302 -89538 913960 719003 -332709 -863947 -381321
145 -381321 420621 628419 81600 -411245 -271160 25887 -38677 -143380 97630 312357
155 312357 74614 -351978 -447478 -20570 520536 479594 -152639 -546845 -216862 291534
165 291534 320943 8091 -186296 -116633 26001 -12713 -141377 -24431 248088 186888 -209326
176 -209326 -307178 81748 362355 155061 -200144 -206735 130451 311008 20240 -356956
186 -356956 -222419 275000 392426 -38805 -402753 -243888 198582 385732 131829 -202160
196 -202160 -176909 106630 165096 -38657 -64521 164810 225289 -73987 -363236 -222601 247114
207 247114 483204 119821 -429593 -427608 111048 453919 248369 -111837 -206991 -74026
217 -74026 57978 84596 76320 117865 83204 -153853 -322023 -91818 298594 330501 -27779
228 -27779 -338130 -280928 78826 360886 226434 -136528 -237674 -32520 102861 57452
238 57452 28689 44619 -5289 -110477 -173178 -76263 166095 245932 -38447 -316903 -167522
249 -167522 171401 234194 35387 -133364 -122198 28058 113509 -7649 -119819 -4347
259 -4347 106934 -24662 -165540 -88678 56604 105248 41215 -100946 -148732 23270 160901
270 160901 34245 -106033 -27917 67076 16035 -65114 -84876 -19294 104217 81254 -138267
281 -138267 -201919 31823 175071 39117 -90767 -65742 100 56568 59116 -26715 -42783
292 -42783 58458 37637 -108825 -86193 76195 96736 -9386 -84667 -107148 -24490 136163
303 136163 123413 -77013 -123474 29071 91091 32135 5067 -10106 -21500 17250 6628
314 6628 -60222 4564 115626 13330 -146710 -73184 92682 111208 35349 -49101 -94890
325 -94890 2079 138028 74993 -68228 -42375 33222 2448 -9506 30733 6407 -20773 6428
337 6428 -24567 -56254 49179 120334 1472 -93321 -25263 52642 70731 56492 -29885 -93790
349 -93790 5681 95190 2716 -71388 607 31283 -24991 -23138 11674 12564 32785 28867 -50376
362 -50376 -48869 66352 77819 -26946 -47403 -780 -29 9510 24650 -32609 -60323 16484
374 16484 40081 -31094 -33255 25593 19296 -6770 655 -12641 -8022 47562 30060 -60515 -46334
387 -46334 40170 23394 -42147 -31470 -3767 -4934 8203 -123 -36772 -8411 47141 11265
399 11265 -40334 -2104 31200 2451 -4820 3110 -26796 -27068 15873 4487 -35764 -12144 16990
412 16990 -10810 -24143 -817 7661 17497 32501 -5930 -46038 2424 54437 13921 -33909
424 -33909 -19665 -6679 -12460 1770 8013 -9992 -8348 -1464 -18353 -8186 37593 37158 -5829
437 -5829 -12801 4281 1658 8301 25504 3425 -29930 -19136 2894 -169 1057 9204 -5501
450 -5501 -16302 1478 15595 18058 28626 18882 -18907 -18629 27075 33989 -8130 -24451 -6186
463 -6186 2193 -1017 -5548 -14789 -6363 21080 17165 -14619 -7521 27970 30015 9927 2612 -8621
477 -8621 -15015 15015 32224 -7577 -40172 -16563 7722 3645 -1873 -8076 -10447 17370 34874
490 34874 -2456 -26513 12698 38450 13828 -4112 -10731 -28990 -14582 28351 17556 -32652
502 -32652 -38465 -12587 3031 21641 22296 -14338 -16837 30068 27162 -22191 -14803 26599 21697
515 21697 -1993 -18156 -49269 -41807 29967 52278 -15583 -57763 -30449 6519 40986 49418
527 49418 -10233 -51530 8233 54304 1042 -38894 -4696 19875 11581 -9281 -56631 -68248
539 -68248 20724 85858 18808 -60462 -49047 -4770 40167 75485 28079 -58120 -40808 32398
551 32398 22335 -20022 -8393 3725 -7223 -7792 -32401 -58324 11860 95724 42852 -59121
563 -59121 -62802 -8653 44686 95440 59866 -67541 -107045 -10051 59801 43827 6425 -44188
575 -44188 -69656 -9249 44889 7445 -10003 39700 32429 -33598 -37560 7440 43150 76349
587 76349 44480 -82157 -130751 -6794 108403 78168 -21376 -101843 -99716 24581 131547
598 131547 63337 -57669 -51086 12610 25377 24063 19817 -3759 2653 13886 -45800 -81550
610 -81550 8952 91901 41921 -47526 -83158 -59013 39347 131250 71425 -67824 -87191 -2486
622 -2486 50099 55246 25174 -39626 -58079 -6543 7238 -24396 -667 40307 11422 -28964
634 -28964 -28174 -23133 9774 83401 79035 -30255 -91789 -42218 30966 71162 48991 -44887 -102156
647 -102156 -35794 41402 26542 -4409 3016 2072 -6745 -557 -8857 -5167 52170 73498 -13904
660 -13904 -95493 -62534 25774 78986 54501 -47801 -121072 -53131 66401 77887 7688 -30340
672 -30340 -24566 -4319 21780 24080 6006 14381 22683 -22923 -63198 -27204 30431 40501 11850
685 11850 -36432 -70086 -28604 56719 74076 13066 -33525 -30836 -4295 29722 40845 8699
697 8699 -21443 -17722 -14712 -22240 -7698 14565 10075 -2810 -8568 -21437 -19569 24073 60916
710 60916 35220 -19224 -44154 -23875 24595 55530 22564 -41211 -55375 -17349 10293 14365
722 14365 14883 5554 -12144 -14446 -5783 3175 27856 51986 26076 -34453 -55138 -15051 37713
735 37713 54170 10745 -61092 -75545 -9458 49322 41508 8553 -14487 -30887 -20604 21483
747 21483 46674 33594 7771 -22599 -46340 -22325 30116 38689 1741 -29713 -44739 -35571
759 -35571 15144 56733 29201 -19919 -28005 -13273 8582 40400 40404 -7256 -35139 -21048 -8356
772 -8356 3268 23218 7075 -32719 -28033 4485 5397 3752 22123 13640 -13362 -6548 10052
785 10052 8423 15480 17159 -17993 -34864 -3026 9908 -8398 -3282 4066 -17704 -15012 16921
798 16921 13038 -5547 10711 17088 -6834 -4217 13121 -271 -6347 9152 -6626 -29032 -3934
811 -3934 14053 -10706 -12396 10590 -1317 -12910 13049 19355 -976 7252 14096 -12630 -11605
824 -11605 18057 5101 -19838 -2962 1853 -21487 -6832 19718 -1832 -18100 5714 9346
836 9346 -1769 17628 20127 -12480 -10098 15527 1586 -10541 11112 -284 -31645 -10093 18912
849 18912 -1338 -10843 7492 -3104 -13201 17200 25956 -2808 -2882 7883 -11652 -7966 24375
862 24375 10263 -24858 -12541 2025 -12817 -1829 19851 -2535 -20361 4534 12509 138
874 138 15109 18809 -14172 -16116 14003 7233 -9173 7209 2699 -26586 -14565 13960 3186
887 3186 -5319 7507 -2952 -14304 11769 21713 -2915 -2173 12222 -6591 -12980 13773 10626
900 10626 -17693 -11113 2851 -10531 -6886 13736 2146 -12319 4329 8633 -4770 7331 16930
913 16930 -6316 -11182 11914 6806 -13003 -2589 3580 -13176 -9377 7281 -2066 -8203 6897
926 6897 4015 -8627 5448 15502 -2207 -3834 11562 2953 -9883 1579 4704 -10027 -7000
939 -7000 2917 -6854 -9378 4971 4149 -4382 2742 5187 -4965 3482 17533 4707 -10094 -65
953 -65 4213 -6722 -4740 3325 -2580 -7191 -3269 -5911 -5280 9802 12002 -5142 -8067 5064 7697
968 7697 5928 10065 3025 -10991 -8179 2576 573 -2515 2645 -2246 -12961 -9178 2355 7012
982 7012 9581 7239 -6721 -10341 8644 18306 4025 -5866 -1305 -2571 -7967 -3144 2217 984
996 984 789 -4824 -16175 -8598 16256 20081 1594 -6877 -3349 -374 8549 15103 254 -13626
1010 -13626 -3778 2793 -8252 -8199 4563 3052 -5268 -5460 -7606 -3244 18657 22624 -4007 -14963
1024 -14963 1274 6231 2258 9589 5717 -14333 -16025 -3402 -2734 1791 12083 -2294 -19929
1037 -19929 -3134 15677 6811 4126 11373 -415 -10820 1587 3677 -4064 9299 12046 -20623
1050 -20623 -33886 -3631 17857 15205 6706 -16277 -28947 7066 40543 13171 -18276 -3814
1062 -3814 9676 -522 -2463 -2686 -8366 6330 13436 -22131 -38287 4510 34208 14299 -7133
1075 -7133 -16477 -18759 11452 42492 14016 -26220 -12311 10082 -333 -4036 1296 -9078 -8189
1088 -8189 7104 -6993 -22243 6226 26861 4209 -7503 2585 -4961 -2965 24553 21561 -13486
1101 -13486 -19311 -7763 -8118 6254 19919 -10379 -34293 -2347 22156 4321 -3977 4131 483
1114 483 8353 20959 -4992 -26060 9148 33393 -1352 -32282 -23441 -4135 20402 28376 -15571
1127 -15571 -50177 -4084 47305 24040 -16413 -14579 3047 18329 22485 -8832 -34108 153
1139 153 32675 -515 -36061 -19602 6997 16778 16127 -10140 -33540 -866 41937 23058 -13506
1152 -13506 -11049 960 3278 11278 3810 -19469 -12609 9501 -1508 -16921 -2356 5925 -3366
1165 -3366 5510 14330 -3819 -9433 11596 17710 7130 1212 -13018 -23014 3684 27047 -1103
1178 -1103 -32778 -18798 6887 14012 9426 -8057 -18158 9763 35264 8644 -26339 -10672
1190 -10672 21777 22424 -1551 -28160 -29854 7492 35094 1157 -42321 -24661 20936 29839 6044
1203 6044 -15376 -12887 14674 31245 4257 -25961 -9923 19496 12360 -13425 -21600 -11687 5950
1216 5950 14136 -2864 -20762 -6310 18823 16293 -426 -2767 2878 5790 6886 2176 -6037 -4912
1230 -4912 -953 -8035 -10335 523 3127 -8768 -9226 6538 13859 5282 -3281 -2656 7197 16001 6390
1245 6390 -13205 -12024 8992 12553 -9681 -23687 -11182 8481 13214 -2215 -18547 -8407 21147
1258 21147 25990 -2735 -18920 355 20939 14239 -7806 -20505 -9841 12614 10553 -17860
1270 -17860 -25011 2984 20424 3904 -12234 -6734 9206 18971 10836 -9918 -10745 12491 15538
1283 15538 -7937 -17825 -5264 1970 -177 -3959 -10416 -6923 11470 12126 -8288 -7762 13968 15414
1297 15414 -468 -4867 -225 2808 6661 -2422 -18357 -9453 12141 2991 -18198 -8561 10047
1310 10047 8461 1752 -732 -3589 6905 19746 3609 -17366 -2638 14832 444 -14615 -8783
1323 -8783 -3593 1483 7072 -6162 -18380 3492 22417 3466 -12372 2577 12478 8326 4581
1336 4581 -6743 -13714 5239 15337 -11862 -24839 1018 13958 -1853 -8551 -4403 -436 12338
1349 12338 15681 -7007 -12327 13939 17907 -7467 -13031 -189 776 1231 1488 -14245 -15012 10913
1363 10913 13890 -11608 -10934 11206 11923 2749 2385 -2829 -2039 13200 6929 -18602 -12188 12783
1377 12783 5257 -13691 -8485 -771 -134 6752 3819 -10298 609 20201 5920 -12790 269
1390 269 11894 1226 -3478 -4103 -11050 -2106 12052 -3530 -20132 -1504 14875 2372 -5130
1403 -5130 1464 2602 6441 11263 -3873 -14124 6917 17108 -6350 -17395 -1822 4801 96
1416 96 -1114 -7869 -9236 8968 14759 -5733 -9819 10085 12216 -1540 -3565 -1298 -1505 6072 5485
1431 5485 -12938 -14133 6461 7890 -7531 -7684 1927 3828 5472 4420 -5838 -2399 13923 8779
1445 8779 -10672 -7561 7290 4388 -4219 -6331 -7294 -2663 6809 1458 -10129 -1375 11595 4502
1459 4502 -5397 -149 4926 4661 4904 -1403 -8957 -1370 8071 -1148 -11692 -4672 3800 1552 -1358
1474 -1358 -2634 -1886 5393 8948 -1312 -7343 4132 11176 1259 -7178 -4740 748 2560 -401 -6954
1489 -6954 -7387 3212 6795 -2530 -7183 1100 7400 4202 -143 -1929 481 5191 5000 -3925 -8190
1504 -8190 -850 4398 -371 -6352 -4377 1004 3409 1700 -2792 -3098 4560 7953 969 -4236 1411
1519 1411 5130 350 -3365 -2242 -1155 -84 -19 -4084 -5116 1628 4064 -1951 -2616 3277 4380 1780
1535 1780 1651 764 -1129 2133 3304 -4687 -6140 1704 2659 -4178 -4468 -1368 -863 2245 4410 -2173
1551 -2173 -2903 6764 6688 -3069 -2130 4011 820 -1577 276 -3240 -5341 1834 2080 -6354 -4003 3509
1567 3509 443 -1118 5237 2726 -3163 2367 5411 -2104 -1725 4552 -953 -6444 313 1205 -5303
1582 -5303 -1856 1975 -3515 -2181 5922 1306 -4318 5292 7546 -3291 -2875 4828 587 -1405 3121
1597 3121 -3398 -10117 383 5666 -4395 -4776 2722 -780 -1811 7042 3882 -5597 1999 9300 -392
1612 -392 -4094 2528 -356 -3808 2657 -1149 -11403 -2786 8617 665 -5689 1205 413 -1506 8246
1627 8246 7606 -6039 -3704 7897 2658 -4634 -899 -2922 -5905 2888 3263 -10260 -7003 9127
1641 9127 6147 -3511 -569 1469 -259 8157 9620 -5584 -8838 3928 3913 -3996 -1832 -2873 -8104
1656 -8104 434 7451 -3803 -8171 4398 7475 444 1986 2137 -3617 3163 10224 -1746 -11251
1670 -11251 -2464 2705 -1390 399 -1670 -10698 -3898 10781 4972 -6351 -1287 5749 4577 5767
1684 5767 2342 -7950 -3536 9938 3852 -11350 -8508 357 1763 2396 -643 -9748 -4879 11848
1698 11848 11511 -3018 -4950 2685 5053 5702 2392 -8585 -8235 5432 6036 -7895 -10248 -1234 2456
1713 2456 3344 2025 -4558 -4043 8123 11531 879 -4562 -700 1035 2707 3752 -4544 -10738 -2857
1728 -2857 4313 -1141 -5337 -2548 118 3423 6830 2379 -3298 1084 7888 4808 -1440 -4053 -3798
1743 -3798 -673 4534 -586 -10406 -8654 2253 6436 1309 -3276 -2486 3661 9784 6267 -3755 -4896
1758 -4896 4111 7160 -44 -7754 -7460 -1383 3217 529 -7264 -7981 2251 8963 4491 -3002 -2395
1773 -2395 3985 8109 5321 -2484 -5729 -199 4523 -953 -8261 -6422 -298 1046 -439 -1206 -1518
1788 -1518 1243 5646 4835 584 609 2891 1909 999 977 -2893 -6045 -2524 -3 -3280 -3246 -980 -888 327
1806 327 4923 3636 -1442 1281 6317 3910 306 -976 -2937 -1935 2619 -1042 -9812 -5753 3537
1821 3537 2502 -2769 -2319 -79 3151 7956 4708 -4218 -794 8502 4079 -5047 -4533 -1992 -2001 747
1837 747 -1199 -8390 -4069 6602 3413 -4481 -293 5183 4154 4244 3399 -3066 -1174 5869 484 -8737
1853 -8737 -3918 1920 -2962 -4143 -499 -1905 -1138 5100 2640 -2692 3840 8183 406 -2069 3250
1868 3250 730 -3671 -262 -1559 -6452 -1408 2655 -4878 -5975 3999 4349 -1829 1131 4113 1312
1883 1312 4319 5429 -3754 -4771 4971 2285 -8369 -5271 1261 -1534 -1992 303 -3740 -2203 8041
1898 8041 5508 -4336 -93 7775 3049 -1294 390 -2514 -3284 3166 150 -9557 -4510 4691 69
1913 69 -4806 393 1929 1173 5757 4090 -3860 362 7912 627 -6688 -1006 1450 -3318 -1925 -1196
1929 -1196 -5380 -1664 4819 -418 -4527 4118 6800 -14 302 3566 70 37 3387 -2087 -6338 389
1945 389 2167 -5493 -5287 1565 651 -428 2361 294 -958 5560 6117 -2907 -2928 4898 2633 -3171
1961 -3171 -2065 -1896 -3228 -18 22 -5429 -2957 4679 2839 -2368 855 3856 1976 2482 2353 -2254
1977 -2254 -1301 3592 352 -6147 -3058 737 -1166 -1985 -965 -1462 823 4637 1667 -2533 1366 5728
1993 5728 2175 -1750 -232 312 34 -294 -3012 -5145 -889 2256 -1161 -3417 481 2959 1602 1068
2009 1068 802 563 2316 3474 -455 -2943 -641 1345 -1334 -3064 -2378 -1088 379 622 -1162 -1005
2025 -1005 2304 3545 666 -572 1962 3050 594 -1346 -1311 -747 -70 -949 -2863 -2419 605 1617
2041 1617 -1126 -2011 884 3121 1868 222 215 844 2527 2351 -2005 -3916 -201 1828 -1590 -3732
2057 -3732 -2021 -194 1512 1244 -1676 -1493 3121 5159 -44 -2365 1004 2438 316 -815 -1740 -2679
2073 -2679 223 1511 -2866 -3810 823 1766 -575 47 1331 433 2133 3324 -599 -2107 2320 1772
2089 1772 -3209 -1869 984 -1077 -1953 -90 -1588 -1604 2723 1528 -2929 696 5159 1256 -2188 756
2105 756 1458 -389 1383 -252 -4853 -1098 3624 -1413 -5077 -485 1951 -5 1525 1370 -2169 872
2121 872 5630 846 -4230 712 3177 -879 -1112 -280 -3246 -1364 3006 -1188 -4749 1582 4235 -971
2137 -971 -785 2832 168 -744 2918 853 -2933 1149 2270 -3961 -2876 2180 -635 -3562 462 1003
2153 1003 -1713 1807 3061 -2561 -1091 5651 2254 -3132 50 1961 -1130 12 221 -5189 -2915
2168 -2915 4511 1149 -5102 -1054 3351 752 762 1844 -1597 -409 5339 2220 -4283 -1397 2479
2183 2479 -804 -1962 240 -2987 -3043 2800 2089 -3535 -679 3320 723 504 3064 78 -2228 2404
2199 2404 2555 -3140 -2090 1060 -2115 -2229 1768 -665 -4258 230 3357 -89 -346 1795 154 685
2215 685 4198 969 -4403 -1343 2779 -499 -2601 -1080 -2489 -1571 2523 1344 -3966 -822 4476
2230 4476 2959 315 567 -416 188 3731 1606 -4469 -3204 1801 857 -2253 -1722 -2233 -1501 2881 2888
2247 2888 -1621 -1411 3159 3381 693 80 -960 -1620 1860 1930 -3179 -4903 -747 1213 19 -957 -1979
2264 -1979 -1182 2712 4554 447 -1922 961 2815 1785 101 -1646 -2476 -166 1397 -1672 -4086
2279 -4086 -2098 1177 1382 329 -1020 -676 2230 4142 1679 -1207 -690 1296 1250 -402 -1809 -2590
2295 -2590 -1942 -223 -228 -1376 -1827 -16 2002 2230 803 369 714 2144 2689 695 -2144 -1961 191
2312 191 185 -1508 -2640 -2987 -1219 2112 1848 -1336 -1138 2301 3887 1965 74 -944 374 2940 1366
2329 1366 -3720 -4615 135 1767 -1221 -2968 -1956 22 2962 3088 -1213 -1516 2893 4087 217 -749
2345 -749 -281 -592 356 428 -3335 -4229 149 1657 -1814 -1739 723 740 1766 2817 799 -403 2520 2423
2363 2423 -1778 -1193 943 -1798 -3287 -119 -159 -2611 -726 712 -1023 1081 3320 290 -993 3487
2379 3487 3589 -943 -959 120 -1282 -574 844 -3598 -5067 849 2597 -2017 -2294 1299 1619 2435 3250
2396 3250 -495 -2017 3598 4349 -2804 -3957 147 215 -1034 -733 -2992 -3506 1598 3286 -2150 -1477
2412 -1477 3685 3278 441 1590 602 -1620 1394 2074 -3707 -3549 1167 -294 -3592 -1026 477 -1385
2428 -1385 691 2586 -338 269 4638 1936 -2438 822 2819 -1453 -2448 -215 -1738 -1698 486 -1609
$$ [...]
16383D07
##END NTUPLES=NMR FID
##END=
