##TITLE=abcd
##JCAMPDX= 6.0         $$ Bruker NMR JCAMP-DX V2.0
##DATA TYPE= NMR FID
##DATA CLASS= NTUPLES
##ORIGIN= UXNMR, Bruker Analytische Messtechnik GmbH
##OWNER= root
$$ XWIN-NMR		Version 3.5
$$ Sun Jul  6 15:18:55 2025 Russian Standard Time (UT+4h)  servis@DPX200
##.OBSERVE FREQUENCY= 200.131235884673
##.OBSERVE NUCLEUS= ^1H
##.DELAY= (6, 6)
##.ACQUISITION MODE= SIMULTANEOUS
##.ACQUISITION SCHEME= undefined
##.AVERAGES= 32
##.DIGITISER RES= 18
##SPECTROMETER/DATA SYSTEM= spect
##.PULSE SEQUENCE= zg
##.SOLVENT NAME= CDCl3
##.SHIFT REFERENCE= (INTERNAL, CDCl3, 0, 16.5164)
##AUDIT TRAIL= $$ (NUMBER, WHEN, WHO, WHERE, WHAT)
$$ ##TITLE= Audit trail, XWIN-NMR		Version 3.5
$$ ##JCAMPDX= 5.01
$$ ##ORIGIN= Bruker BioSpin GmbH
$$ ##OWNER= servis
$$ F:\spectra/data/av/nmr/H1/1/audita.txt
$$ ##AUDIT TRAIL=  $$ (NUMBER, WHEN, WHO, WHERE, WHAT)
(   1,<2025-07-06 15:18:27.15 +0400>,<servis>,<DPX200>,
      <created by zg, POWCHK disabled, PULCHK disabled
       configuration hash MD5:
       00 E9 B6 7A A2 85 ED C7 34 08 36 98 17 FE 4E 26
       data hash MD5: 32K
       61 95 F0 7D 8A 58 33 C1 3E 5A 03 B4 FE FC AF 1C>)
$$ ##END=
$$ 
$$ hash MD5
$$ 21 8A 1F E4 0E 7D DD EC 32 43 A4 1A D4 BA F8 59
##$RELAX= 
##$RELAX= 
##$RELAX= 
##$RELAX= 
##$RELAX= 
##$RELAX= 
##$RELAX= 
##$RELAX= 
$$ Bruker specific parameters
$$ --------------------------
##$DU= <F:\spectra>
##$EXPNO= 1
##$NAME= <H1>
##$PROCNO= 1
##$TYPE= <nmr>
##$USER= <av>
##$AMP= (0..31)
100 100 100 100 100 100 100 100 100 100 100 100 100 100 100 100 100 100 
100 100 100 100 100 100 100 100 100 100 100 100 100 100 
##$AQSEQ= 0
##$AQ_mod= 1
##$AUNM= <au_zg>
##$AUTOPOS= <>
##$BF1= 200.13
##$BF2= 200.13
##$BF3= 200.13
##$BF4= 200.13
##$BF5= 500.13
##$BF6= 500.13
##$BF7= 500.13
##$BF8= 500.13
##$BYTORDA= 1
##$CFDGTYP= 0
##$CFRGTYP= 5
##$CHEMSTR= <none>
##$CNST= (0..31)
1 1 145 1 1 1 1 1 1 1 1 1 1 1 1 1 1 1 1 1 1 1 1 1 1 1 1 1 1 1 1 1 
##$CPDPRG= <>
##$CPDPRG1= <>
##$CPDPRG2= <>
##$CPDPRG3= <>
##$CPDPRG4= <mlev>
##$CPDPRG5= <mlev>
##$CPDPRG6= <mlev>
##$CPDPRG7= <mlev>
##$CPDPRG8= <mlev>
##$CPDPRGB= <>
##$CPDPRGT= <>
##$D= (0..31)
0 2 0 0 0 0 0 0 0 0.06 0 0 0 0 0 0 0.0002 0 0 0 0 0 0 0 0 0 0 0 0 0 0 
0 
##$DATE= 1751800706
##$DBL= (0..7)
120 120 120 120 120 120 120 120 
##$DBP= (0..7)
150 150 150 150 150 150 150 150 
##$DBP07= 0
##$DBPNAM0= <>
##$DBPNAM1= <>
##$DBPNAM2= <>
##$DBPNAM3= <>
##$DBPNAM4= <>
##$DBPNAM5= <>
##$DBPNAM6= <>
##$DBPNAM7= <>
##$DBPOAL= (0..7)
0.5 0.5 0.5 0.5 0.5 0.5 0.5 0.5 
##$DBPOFFS= (0..7)
0 0 0 0 0 0 0 0 
##$DE= 6
##$DECBNUC= <off>
##$DECIM= 32
##$DECNUC= <off>
##$DECSTAT= 4
##$DIGMOD= 1
##$DIGTYP= 9
##$DL= (0..7)
0 120 120 120 120 120 120 120 
##$DP= (0..7)
150 150 150 150 150 150 150 150 
##$DP07= 0
##$DPNAME0= <>
##$DPNAME1= <>
##$DPNAME2= <>
##$DPNAME3= <>
##$DPNAME4= <>
##$DPNAME5= <>
##$DPNAME6= <>
##$DPNAME7= <>
##$DPOAL= (0..7)
0.5 0.5 0.5 0.5 0.5 0.5 0.5 0.5 
##$DPOFFS= (0..7)
0 0 0 0 0 0 0 0 
##$DQDMODE= 0
##$DR= 18
##$DS= 0
##$DSLIST= <SSSSSSSSSSSSSSS>
##$DSPFIRM= 0
$$ [...]
##$SUBNAM0= <"">
##$SUBNAM1= <"">
##$SUBNAM2= <"">
##$SUBNAM3= <"">
##$SUBNAM4= <"">
##$SUBNAM5= <"">
##$SUBNAM6= <"">
##$SUBNAM7= <"">
##$SUBNAM8= <"">
##$SUBNAM9= <"">
##$SW= 20.6817932712277
##$SWIBOX= (0..15)
0 0 3 0 0 0 0 0 0 0 0 0 0 0 0 0 
##$SW_h= 4139.07284768212
##$TD= 32768
##$TD0= 1
##$TE= 0
##$TE2= 300
##$TE3= 300
##$TEG= 300
##$TL= (0..7)
0 120 120 120 120 120 120 120 
##$TP= (0..7)
150 150 150 150 150 150 150 150 
##$TP07= 0
##$TPNAME0= <>
##$TPNAME1= <>
##$TPNAME2= <>
##$TPNAME3= <>
##$TPNAME4= <>
##$TPNAME5= <>
##$TPNAME6= <>
##$TPNAME7= <>
##$TPOAL= (0..7)
0.5 0.5 0.5 0.5 0.5 0.5 0.5 0.5 
##$TPOFFS= (0..7)
0 0 0 0 0 0 0 0 
##$TUNHIN= 0
##$TUNHOUT= 0
##$TUNXOUT= 0
##$USERA1= <user>
##$USERA2= <user>
##$USERA3= <user>
##$USERA4= <user>
##$USERA5= <user>
##$V9= 5
##$VALIST= <valist>
##$VCLIST= <CCCCCCCCCCCCCCC>
##$VD= 0
##$VDLIST= <DDDDDDDDDDDDDDD>
##$VPLIST= <PPPPPPPPPPPPPPP>
##$VTLIST= <TTTTTTTTTTTTTTT>
##$WBST= 1024
##$WBSW= 30
##$XGAIN= (0..3)
0 0 0 0 
##$XL= 0
##$YL= 0
##$YMAX_a= 680108
##$YMIN_a= -633489
##$ZGOPTNS= <>
##$ZL1= 120
##$ZL2= 120
##$ZL3= 120
##$ZL4= 120
##$ABSF1= 10
##$ABSF2= 0
##$ABSG= 5
##$ABSL= 3
##$ALPHA= 0
##$AQORDER= 0
##$ASSFAC= 0
##$ASSFACI= 0
##$ASSFACX= 0
##$ASSWID= 0
##$AUNMP= <proc_1d>
##$AZFE= 0.1
##$AZFW= 0.1
##$BCFW= 1
##$BC_mod= 2
##$BYTORDP= 0
##$COROFFS= 0
##$CY= 19
##$DATMOD= 1
##$DC= 2
##$DFILT= <>
##$DTYPP= 0
##$F1P= 11.0000007629395
##$F2P= -0.999999237060547
##$FCOR= 0.5
##$FTSIZE= 0
##$FT_mod= 4
##$GAMMA= 1
##$GB= 1
##$INTBC= 1
##$INTSCL= 1
##$ISEN= 128
##$LB= 0.05
##$LEV0= 0
##$LPBIN= 0
##$MAXI= 10000
##$MC2= 0
##$MEAN= 0
##$ME_mod= 0
##$MI= 0
##$NCOEF= 0
##$NC_proc= 0
##$NLEV= 6
##$NOISF1= 0
##$NOISF2= 0
##$NSP= 1
##$NTH_PI= 0
##$NZP= 0
##$OFFSET= 16.51637
##$PC= 1
##$PHC0= -271.4733
##$PHC1= 1.101538
##$PH_mod= 0
##$PKNL= yes
##$PPARMOD= 0
##$PSCAL= 4
##$PSIGN= 0
##$REVERSE= no
##$SF= 200.13
##$SI= 16384
##$SIGF1= 0
##$SIGF2= 0
##$SINO= 400
##$SIOLD= 16384
##$SREGLST= <1H.CDCl3>
##$SSB= 0
##$STSI= 0
##$STSR= 0
##$SW_p= 4139.07284768211
##$SYMM= 0
##$S_DEV= 0
##$TDeff= 0
##$TDoff= 0
##$TI= <>
##$TILT= no
##$TM1= 0
##$TM2= 0
##$TOPLEV= 0
##$USERP1= <user>
##$USERP2= <user>
##$USERP3= <user>
##$USERP4= <user>
##$USERP5= <user>
##$WDW= 1
##$XDIM= 8192
##$YMAX_p= 0
##$YMIN_p= 0
$$ End of Bruker specific parameters
$$ ---------------------------------
##NTUPLES= NMR FID
##VAR_NAME=  TIME,          FID/REAL,        FID/IMAG
##SYMBOL=    X,             R,               I
##VAR_TYPE=  INDEPENDENT,   DEPENDENT,       DEPENDENT
##VAR_FORM=  AFFN,          ASDF,            ASDF
##VAR_DIM=   16384,         16384,           16384
##UNITS=     SECONDS,       ARBITRARY UNITS, ARBITRARY UNITS
##FACTOR=    0.0002416,     1,               1
##FIRST=     0,             0,               0
##LAST=      3.9581328,     0,               0
##MIN=       0,             -633489,         0
##MAX=       3.9581328,     680108,          0
$$ Real data points
##PAGE= N=1
##DATA TABLE= (X++(R..R)), XYDATA
$$ [...]
9974C04O9P7R0k28j71m1l31o8q8r8j78J78K56K1K45K19J41J60k0j06j40J20j03
$$ 304 373 450 540 312 141 100 -231 -299 -387 -485 -663 -485 -229 -208 37 256 397 557 537 431 291 411 308
9997C08m89j66Lj70m5J63M8J00J84K59P0J32J16M2k39N2k98k55m5q9j72j98L83
$$ 308 -181 -347 -344 -514 -559 -396 -348 -248 -64 195 265 397 513 555 316 368 70 -185 -230 -319 -491 -689 -306
10020c06j4J22R8K73PJ23K26j07Kp2j06l06j16j44r4o6K8K5J17L40J03M9K03J98
$$ -306 -320 -198 -100 173 180 303 529 422 424 352 246 -60 -176 -320 -414 -480 -452 -427 -310 30 133 182 385 583
10044E83j31k6m7j63k20l1j85k49j0k7j05J27M82l1J87L31Qp1J02n3k56j36k14
$$ 583 452 426 379 216 -4 -35 -220 -469 -479 -506 -611 -484 -2 -33 154 485 493 422 524 471 215 79 -135
10067a35j95k25M2P5j2J99J32rK65K26Q6p5J22n3k64j7k61k82j62J54j64J14J69
$$ -135 -330 -555 -513 -438 -450 -251 -119 -128 137 363 449 374 496 443 179 162 -99 -381 -543 -389 -553 -439 -270
10090b70J23L4J69L41j4R4J08o3j57j54j39m46J6j13n1R6O9J79j9J54L09J26p
$$ -270 -147 -113 56 397 383 477 585 522 365 211 72 -374 -358 -471 -522 -426 -357 -178 -197 -43 266 392 385
10113C85P1L8j81j23j83k54j60J7j65L1P9J33J21K06K62k9J82J12j34j69J85l72
$$ 385 456 494 313 190 7 -247 -407 -390 -555 -524 -445 -312 -191 15 277 248 430 542 408 239 424 52
10135E2k33J59m17k29J56K20o9J37K84P2N1K28J32m3m1j83j10l25nj98j64K5J27
$$ 52 -181 -22 -439 -668 -512 -292 -361 -224 60 132 183 411 543 500 459 276 166 -159 -164 -362 -526 -501 -374
10158c74p2J27L20N2K06K09k5k3q6M6l75K1r5l93Q2r5Q6j62L11J47J07K08K67
$$ -374 -446 -319 1 53 259 468 443 420 334 380 5 26 -69 -462 -380 -475 -389 -551 -240 -93 14 222 489
10181D89p2l7K42k81k29l7j87j61j23j27Q6J4J82J39kL18J36K9K9K47l11q2j88
$$ 489 417 380 622 341 112 75 -112 -273 -396 -523 -437 -423 -241 -102 -104 214 350 379 408 655 344 262 74
10204G4k61n4j26Lk27N9K55j1Q3K47L34K1O1Rj24j58p8k46k51p7P0r2J8J67J48
$$ 74 -187 -241 -367 -364 -591 -532 -277 -288 -205 42 376 397 458 467 343 185 107 -139 -390 -467 -397 -489 -471 -304 -156
10229a56n5K65J66J75L8Q2j29j26K0l01k07p6o4j40P0J01J8M1M62l5K59J30J77
$$ -156 -211 54 220 395 433 515 386 260 280 -21 -228 -304 -368 -508 -438 -337 -319 -278 184 149 408 538 715
10252G15l00j40J74l71k08j75l8k05P3K15j71J00M47L3J29K19P4j88p4J1k11j09
$$ 715 415 275 449 78 -130 -305 -343 -548 -475 -260 -431 -331 116 149 278 497 571 383 309 320 109 0
10274@n5l55K4nJ05j85J75K57Q9K23L17j57K0L2j50l50n6L5j78k84J42r5l3K40
$$ 0 -55 -410 -386 -391 -286 -471 -296 -39 50 273 590 433 453 485 335 -15 -71 -36 -214 -498 -356 -451 -484 -244
10298b44K75Q1P4J73J72j82J36j64j56k47m1j91j13P2j76L2J76J69J7K47K67n1
$$ -244 31 112 186 359 531 349 485 321 165 -82 -123 -314 -427 -355 -531 -499 -323 -154 -137 110 377 326
10320C26O8M6j28k67O8k21k27o0J7P3l27K95R1J84K74J53J5k2K54k15j98j9j77
$$ 326 394 440 312 45 113 -108 -335 -395 -378 -305 -632 -337 -246 -62 212 365 380 358 612 397 199 180 3
10343Cm10k9J29j28J4K01k6J24K70J50k3J01P6j57o5j63p3k17j08j35r2J43J14
$$ 3 -407 -436 -307 -435 -421 -220 -246 -122 148 298 275 376 452 295 230 67 -6 -223 -331 -466 -558 -415 -301
10366c01oM2M65J37n0J55p3j2m4q0k46k04o2r8j89K01n6P4J10K79J57KK64J18
$$ -301 -307 -265 200 337 287 442 369 357 313 233 -13 -217 -279 -377 -566 -365 -421 -347 -237 42 199 201 465 583
10390E83j08jk18k37j45R6l75j40j4J67KJ03L74R3j8L34n7R2p8j73k64j74j4k50
$$ 583 475 474 256 19 -126 -30 -405 -545 -559 -392 -390 -287 87 180 162 496 439 531 453 280 16 -158 -172 -422
10414d22j20J66j52J09L49O7l8M26pN6l2N4j54k25m0r3l64j53K06j86N6L23J07
$$ -422 -542 -376 -528 -419 -70 -3 -41 385 378 434 402 456 302 77 37 -56 -420 -573 -367 -553 -497 -174 -67
10437f7M4L04N3J46p8M8j25j74r2j63k96O5k5k30Q9J98KL29J89P2J49nJ71l02
$$ -67 -23 281 334 480 402 450 325 151 59 -104 -400 -335 -360 -590 -501 -303 -301 28 217 289 438 433 604 302
10461C02O8k09j70l63qp6j2J0J27P5J07L57J11n3L02K7j14p4j00m19j22M9k18
$$ 302 370 161 -9 -372 -380 -456 -468 -458 -331 -256 -149 208 319 266 568 595 481 407 307 -112 -234 -185 -403
10484d03r8P6J12o1K93K31Q7J25M5J09j20L2k33l05Nj97k41j33J94L3K2L10J22
$$ -403 -501 -425 -313 -374 -81 150 237 362 407 516 396 428 195 -110 -105 -302 -543 -676 -482 -449 -427 -117 5
10507EO6J76J76m2O9q6j85j10k92o2j46JJ52j09M5J90N1J81K61O6Km8K09k49k44
$$ 5 71 247 423 381 450 364 179 69 -223 -285 -431 -430 -278 -387 -342 -152 -101 80 341 407 409 361 570 321 77
10532G7j83q8j44j07j7k3J04J21K59lL06N7L8P7qj55j47o3k10j73j27p0j03O3
$$ 77 -106 -194 -338 -445 -462 -485 -381 -260 -1 -4 302 359 397 474 466 311 164 101 -109 -282 -409 -479 -582 -519
10556e19K28J23J64K40L0J37L5M8j94j44k3l55r2Qj94J7J39J02oK40K75J31K5
$$ -519 -291 -168 -4 236 266 403 438 486 292 148 125 -230 -322 -314 -508 -491 -352 -250 -256 -16 259 390 415
10579D15J28Lj68j84p9k48q3q8j23o9J17J04m0L35J79J04J10J24j63n3P7k88k32
$$ 415 543 546 378 194 115 -133 -216 -304 -427 -496 -379 -275 -315 20 199 303 413 537 374 321 398 110 -122
10602a22j36M8k52jN5R8o2L37K25O0O2K46l3n3r5l9m35j09m7j40j48J86j2r6L46
$$ -122 -258 -210 -462 -463 -408 -310 -372 -35 190 250 312 558 525 472 377 338 -97 -206 -253 -393 -541 -355 -367 -463 -117
10627a17L27n9M02N8j45q0k8j66k20q0K1l45j05K5J23J29J15K08LK71K55n8j97
$$ -117 210 151 553 611 466 386 358 192 -28 -108 -87 -432 -537 -512 -389 -260 -145 63 66 337 592 534 337
10650C37J09k76k33Q2j95j52jj31O9p6L48O6J36K16P4P5N3j8j83k86lk48j81k8
$$ 337 446 170 -63 19 -176 -328 -329 -460 -391 -467 -119 -53 83 299 373 448 501 483 300 14 11 -237 -418 -446
10674d46K7j18J41K43N8J40J89J66K8J51L8m13Oj37l32q3p5r2k22M02P5J80j2
$$ -446 -419 -537 -396 -153 -95 45 234 400 428 579 617 204 210 73 -259 -342 -417 -509 -731 -329 -254 -74 -86
10697h6L40N6J32P8j21m8ll36k52j84Kn1p6P0J99j30M45K25P2K3J90L1l54J09
$$ -86 254 310 442 520 399 351 348 12 -240 -424 -422 -473 -549 -479 -280 -410 35 260 332 355 545 576 222 331
10721C31k08l40j13J24k59m7R6L8J6M22K33j22K08R4R8j35qk66k82j04K1k90m3
$$ 331 123 -217 -330 -206 -465 -512 -416 -378 -362 60 293 171 379 473 571 436 428 162 -120 -224 -203 -493 -536
10744e36l2J18K06J10K13J32J45K02k22J56qk40k71pk28j08k79K74p4R3K43P9
$$ -536 -568 -450 -244 -134 79 211 356 558 336 492 484 244 -27 -34 -262 -370 -649 -375 -449 -356 -113 -34
10766c4L04J03J52j04Q0o6j49k31j10k43j49m3ok4J73J95J72L0L36J39p6J19j11
$$ -34 270 373 525 421 501 435 286 55 -55 -298 -447 -490 -496 -520 -347 -152 20 50 386 525 449 568 457
10789D57j45m21J35k51j38L7k07qJ55J20J71J61K22P9KJ03n6k21k9j30k91q4j03
$$ 457 312 -109 26 -225 -363 -326 -533 -541 -386 -266 -95 66 288 367 369 472 416 195 166 36 -255 -339 -442
10812d42j32J07J10K53j1K83K31n7M2N6P8j39j44k49k93L4j19j24L3L8K7L31Q3
$$ -442 -574 -467 -357 -104 -115 168 399 342 384 440 518 379 235 -14 -307 -273 -392 -516 -483 -445 -418 -87 -4
10835dL76r4N5J84q9j34N9l02k44L4k68j8r8L14j33N0L77J30J52MK17k27K1R6
$$ -4 372 278 333 517 428 294 353 51 -193 -159 -427 -445 -543 -229 -362 -312 65 195 347 351 568 341 362 458
10859D58k44l33o4l3l50J03l6K44L9K48J67r1L53J15j77J47j22l59j01q6j06l09
$$ 458 214 -119 -183 -216 -566 -463 -499 -255 -216 32 199 108 461 576 399 546 424 65 -36 -122 -228 -537
10881e37K05l7j14J57K99k4J80K78j3M8N1j18j25k36j36j29j68L7j15pK42J11
$$ -537 -332 -369 -483 -326 -27 -51 129 407 394 442 493 375 250 14 -122 -251 -419 -382 -497 -504 -262 -151
10903a51K63N3K67K0j06J80j71k61l4j16l13o3R0j43L2K67J36L7J52L01j05J97
$$ -151 112 165 432 452 346 526 355 94 60 -56 -369 -432 -342 -485 -453 -186 -50 -13 139 440 335 532
10925E32Q7j35m30J01j64j86k65L3j37J42J58J12Q7K22K09r7J87O6j26j4k50j99
$$ 532 619 484 54 155 -9 -195 -460 -427 -564 -422 -264 -152 -65 157 366 269 456 522 396 382 132 -67
10947f7k45O9k30m9Q3j8K44j38M85J35jK58j4j14M0j07k80k20m1j45k80J33K28
$$ -67 -312 -243 -473 -522 -439 -457 -213 -351 134 269 268 526 512 398 438 331 51 -169 -210 -355 -635 -502 -274
10970b74l5J34J15L42Q2R8J42k42j15P4k33l09r0r9j03M3J24p1K03K92K9L08N0
$$ -274 -309 -175 -60 282 364 462 604 362 247 321 88 -221 -311 -410 -513 -470 -346 -417 -214 78 107 415 465
10993D65O3j25L2j56j81j85k39j46n9J07PlK50J30O0L04J13k4NJ08k07j07j79
$$ 465 528 403 435 279 98 -87 -326 -472 -531 -424 -417 -420 -170 -40 20 324 437 413 418 526 319 212 33
11016C3j45l59o2J87j34K3J56K33J07J67K12Lp6J71k43j43n5q2l23j51j35O4J27
$$ 33 -112 -471 -533 -346 -480 -457 -301 -68 39 206 418 421 345 516 273 130 75 -7 -330 -481 -616 -552 -425
11039d25J42N7R0L93J24o5J10J44j54k97R3l08k16j38m6j58J69J83K4J49M28M
$$ -425 -283 -226 -136 257 381 316 426 570 416 119 212 -96 -312 -450 -496 -654 -485 -302 -278 -129 299 303
11061C03N7J01O8j79j90N3k72j49j30p9k16P7J61J24J64J98J36J42J54L1k23R6
$$ 303 360 461 529 350 160 213 -59 -208 -338 -417 -633 -556 -395 -271 -107 91 227 369 523 554 331 427
11083D27j66k39k80J22m21j17K92q1J01J68L33M2K43J37pk03qM5m25j51o6k14
$$ 427 261 22 -258 -136 -557 -674 -382 -463 -362 -194 139 181 424 561 554 351 343 388 -37 -188 -254 -468
11105d68j33R7J05K2J82K00J89K8K93P0l17J29j50j05k41j55j32p9J00l3k2L62
$$ -468 -601 -504 -399 -377 -195 5 194 222 515 585 268 397 247 142 -99 -254 -386 -465 -365 -398 -420 -58
11127e8O5o9L00L26L6j42L4q4k96j27j27l51L2L8Q6p6J92L09m7J63J55J5k3J50
$$ -58 7 -62 238 564 600 458 492 408 112 -15 -142 -493 -461 -423 -337 -413 -221 88 41 204 359 374 351 501
11151E01j88j46j49j39k91m3K87l39mL08J41L3L02K37q5J51M1l04nr6l74j37O
$$ 501 313 167 18 -121 -412 -455 -168 -507 -511 -203 -62 -29 273 510 425 576 617 313 308 212 -162 -299 -293
11174b93j14q2J28J18QK70K02J9M8J43J38j55j02j91k54k90R4j48j33J01J63J00
$$ -293 -407 -489 -361 -243 -235 35 237 256 304 447 585 430 328 137 -117 -407 -313 -461 -594 -493 -330 -230
11196b30J48K18N5J60K64nk43j23m6l71o5j9j5k08J32m0P2K55K84N3J22K14l2
$$ -230 -82 136 191 351 615 610 367 244 198 -173 -238 -257 -272 -480 -348 -388 -316 -61 223 276 398 612 580
11219E80j36j2j59k82q3j65k27j7K09j38J24J57K16M5K33K51j90j1P8k87k72o8
$$ 580 444 432 273 -9 -92 -257 -484 -501 -292 -430 -306 -149 67 112 345 596 406 395 473 186 -86 -154
11241a54Mj49j97J99j07pK71J08J43K58J95j72R0q6j82o4j43j38l37l9J07j04
$$ -154 -150 -299 -496 -297 -404 -411 -140 -32 111 369 564 392 482 396 214 150 7 -131 -468 -507 -400 -504
11263e04J98P4K34L9K93K30j95K74p0m16k8j24k11j34j21K0j54K06J48O2K86J43
$$ -504 -306 -232 2 41 334 564 369 643 573 157 129 5 -206 -340 -461 -441 -595 -389 -241 -179 107 250
11285B50R8k1J82n9k19N9j98k63q0q9Nj39L8J94J9J86K37K46j40K75j21j59o1
$$ 250 348 327 509 450 231 290 92 -171 -251 -340 -335 -474 -436 -242 -223 -37 200 446 306 581 460 301 240
11308B40p0l97m1l0j51j48J96Q4J20K09L24m9J19K19J2l12j13p7l69N9j94j23
$$ 240 170 -227 -268 -298 -449 -597 -401 -317 -197 12 336 287 406 625 637 325 212 135 -234 -175 -369 -492
11330d92o0L49j11J01J85K10k5K72K74k53n1j8k60k76M3j98j99n8K58n2l5M25
$$ -492 -552 -203 -314 -213 -28 182 157 429 703 450 399 381 121 -155 -112 -310 -509 -567 -309 -361 -396 29
11352B9J58M8R8J67k1J3k21N3l26k15l0k50K9L9k7J69L00J7J30M31j03J6J03k28
$$ 29 187 235 333 500 479 492 271 324 -2 -217 -247 -497 -468 -429 -456 -287 13 30 160 591 488 504 607 379
11376C79k33j00j87j04l36K26j47M5J05K32J92P3J81R0J8Lj0k22l1j37k90q4J3
$$ 379 146 46 -141 -245 -581 -355 -502 -457 -352 -120 72 145 326 416 434 437 427 205 174 37 -253 -337 -324
11399c24j31K5L4J48O4L09J78J44m4J96j35k83l4N8m02k23L5p7K0Q1J18J7K54
$$ -324 -455 -430 -396 -248 -184 125 303 447 403 599 464 181 147 205 -197 -420 -385 -462 -442 -361 -243 -226 28
11422B8L24k6J98N1r6k37pj55j94j37l5j35j35K04q3L11J81J84L8J7K35nl19J37
$$ 28 352 326 524 575 479 242 235 80 -114 -251 -286 -421 -556 -352 -435 -124 57 241 279 296 531 526 207 344
11446C44k09j52k53J04k74lO2Q3L0L42J60K3M7J50j90P0R2l43k29mj84j00O5L0
$$ 344 135 -17 -270 -166 -440 -443 -381 -298 -268 74 234 257 304 454 264 334 426 83 -146 -150 -334 -434 -369 -339
11470c39L5Q0J50J83K1K24J23jj4j96j34k42n2j08q5j12l5j6K56J82J56Q9K06
$$ -339 -304 -224 -74 109 130 354 477 476 462 266 132 -110 -162 -270 -355 -467 -502 -518 -262 -80 76 165 371
11493C71m9J04M5j10k77J3j41j79k59j05K40k9N7L48j91K36K79J51j98K24k7k34
$$ 371 322 426 471 361 84 97 -44 -223 -482 -587 -347 -376 -319 29 -162 74 353 504 306 530 503 269
11515B69j95p8j96j24k2n8p8J39J60J19J81K26m4J28J79j80l16L0k15p3j69p3
$$ 269 74 -4 -200 -324 -346 -404 -482 -343 -183 -64 117 343 299 427 606 426 110 140 -75 -148 -317 -390
11537c90p5j33K86O4J57K06J74M9J37L7j40j9r2j90k52j34J00l67K00L4k2J82
$$ -390 -465 -598 -312 -248 -91 115 289 338 475 512 372 353 261 71 -181 -315 -215 -582 -382 -348 -370 -188
11559a88L69J10j26K53J61k03P9k01k58j21n6j93k11L6J19RK01L03J83J09J02
$$ -188 181 291 165 418 579 376 455 254 -4 -125 -181 -374 -585 -549 -430 -421 -220 83 266 375 477
11580D77j0j39O7q3k98j34k0k33r3Q0P6n2J45J58K06J37J38L4q7J80p4l99j86
$$ 477 467 328 395 312 14 -120 -140 -373 -466 -386 -310 -362 -217 -59 147 284 422 456 369 549 475 76 -110
11603a10k2k02k81M5N6K4K52J45R4K19J73R6r6K69k01l07j32j81r8j93j5N3n7
$$ -110 -132 -334 -615 -570 -514 -490 -238 -93 1 220 393 489 393 662 461 154 22 -159 -257 -450 -465 -412 -469
11626d69K45oJ74J67K55N2J5pm1j67j11j72l00n4p0N1j10K06J60J18J78M04k02
$$ -469 -224 -230 -56 111 366 418 433 426 385 218 107 -65 -365 -419 -489 -438 -548 -342 -182 -64 114 518 316
11649C16J13J77k57j74P4k17k64j33J7j73N4J95m5K50K55Q7L6K17J11k62j62k5
$$ 316 429 606 349 175 249 32 -232 -365 -348 -521 -467 -272 -317 -67 188 275 311 528 639 377 215 190
11671A90k05l04M2j29r5J4M3R4K30J88K65j2J25R8j93j4j17j81j78n5j21k39J61
$$ 190 -15 -319 -277 -406 -501 -487 -444 -350 -120 68 333 321 446 544 351 337 220 39 -139 -194 -315 -554 -393
11694c93J06r0K12K90lJ73K42L1j10n8K6l90k73o8p4j05O1l9K9K94K77nJ42K41
$$ -393 -287 -377 -165 125 122 295 537 568 458 400 426 36 -237 -305 -379 -484 -423 -462 -433 -139 138 133 275 516
11718E16M0l05J02p9k44p8j11k58m3J17K9j51J59J03J58M04J49k6k9m6j16j35
$$ 516 556 251 353 274 30 -48 -159 -417 -460 -343 -314 -465 -306 -203 -45 359 508 482 453 407 291 156
11740A56j79j33k04j28J99k63K23J77J71Q2R9L14j61M4J04r1l29Pk37j84r9R6
$$ 156 -23 -156 -360 -488 -289 -552 -329 -152 19 101 200 514 353 397 501 410 81 88 -149 -333 -432 -336
11762c36k33J42J92J56JL67J22O9M1k8j95q5l3k29k43p3j21l6Q7J73J44O4K94
$$ -336 -569 -427 -235 -79 -78 289 411 480 521 493 298 213 180 -49 -292 -365 -486 -522 -435 -262 -118 -54 240
11785B40J18O2Q7J1q3k55M4j60k65k1j88K4KN7P7K10K69J70l5J62qk31kq1l02
$$ 240 358 420 507 518 435 180 224 64 -201 -222 -410 -386 -384 -327 -250 -40 229 399 364 526 518 287 285 204 -98
11810i8Kj93j17j67Q7J85L7K68J35J46R3J50p1j0q2k08k21q7j32j76j05J70j23
$$ -98 -96 -289 -406 -573 -486 -301 -264 4 139 285 378 528 457 447 365 157 -64 -151 -283 -459 -564 -394 -517
11833e17J58K17K28R3K21K52k70J0J0k02k43j0k17k12M8K6k30K98J50K68O1J33
$$ -517 -359 -142 86 179 400 652 382 392 402 200 -43 -53 -270 -482 -434 -408 -638 -340 -190 78 139 272
11855B72J73rnK8j98k28o4j07k79j12J15n3J69J71J01J04K22J76j52J07O6k35
$$ 272 445 436 431 459 261 33 -31 -138 -417 -529 -414 -467 -298 -127 -26 78 300 476 324 431 497 262
11877B62j75p3j59k32m5j05mK8L05J16P9K58J83l6K37j62j67r3j12j73k79j04
$$ 262 87 14 -145 -377 -422 -527 -531 -503 -198 -82 -3 255 438 402 639 477 310 217 105 -68 -347 -451
11899d51K5q3J62R2M8O9L75J04J12R6q5j98n4n3j92m00M4j40p1J03K76kJ80K48
$$ -451 -426 -509 -347 -255 -207 -138 237 341 453 549 464 266 212 159 -33 -433 -389 -529 -600 -497 -221 -223 -43 205
11923B05k0O4K52J07k48q2K9m41j29o6l6j31J8J56K1L55K05J6N1J93K6j24j1q7
$$ 205 185 249 501 608 360 278 307 -134 -263 -329 -365 -496 -478 -322 -301 54 259 275 326 519 545 421 410 323
11947C23l55n5j52k82o5J81j12K08K49J93rK27K31j65K4j4k05k21n5k88j51k7
$$ 323 -32 -87 -239 -521 -586 -405 -517 -309 -60 133 124 351 582 417 441 427 222 1 -54 -342 -493 -520
11969e20O4N2Q7J69J87R7K10J3O4llk29j58oj91l39R0O6j08J56J00O0J86L44O3
$$ -520 -456 -404 -317 -148 39 136 346 359 423 420 417 188 30 24 -167 -506 -416 -350 -458 -302 -202 -142 44 388 451
11994D51j11J51Qk23o3j44k89k20J37j38p6J16K74q9K90K48p6J76J39rl85Nm6
$$ 451 340 491 499 276 213 69 -220 -440 -303 -441 -517 -401 -127 -216 74 322 246 422 561 552 167 172 126
12017A26l16j52q1j78N3J86K46LJ12K09j2J32L46j78k30p1p1k97j56K7j68p0J23
$$ 126 -190 -342 -423 -601 -548 -362 -116 -113 -1 208 196 328 674 496 266 195 124 -173 -329 -302 -470 -540 -417
12040d17J48R3J19L31R0L5P2k6j25l5j50k60k31L0j90q8L02j19K82J39J13K4K13
$$ -417 -269 -176 -57 274 364 399 471 445 320 285 135 -125 -356 -326 -516 -604 -302 -421 -139 0 113 137 350
12063C50R6Mj22lk24k20k7p1k95NK9J89J45J47L3J55K27q6J9m5J09j62l29l2r6
$$ 350 446 450 328 325 101 -119 -146 -217 -512 -507 -478 -289 -144 3 36 191 418 332 351 306 415 253 -76 -108 -204
12088b04k66l7J27j67J23L25K19K2L06N4k9o2Q3m28r2m7j98j65l7O6j63K12J93
$$ -204 -470 -507 -380 -547 -424 -99 120 142 448 502 473 411 494 66 -26 -73 -271 -436 -473 -407 -570 -358 -165
12111a65K58J50J33J42j86J28n2k02j60n4l01k04J25q6n2K40J90R1J18K34l4k4
$$ -165 93 243 376 518 332 460 408 206 46 -8 -309 -513 -388 -474 -526 -286 -96 -5 113 347 313 289
12133B89J74q1j25j96j33j94n9jj90M8J07J66j9L35J71NJ35M9o6j75j09k23k22
$$ 289 463 382 257 61 -72 -266 -325 -326 -516 -468 -361 -195 -214 121 292 297 432 481 415 240 131 -92 -314
12156c14K3p3l00J09J73J40N5L66J57j05K24J56k58j15k7k47j51N4k30k36R1R1
$$ -314 -291 -364 -664 -555 -382 -242 -187 179 336 231 455 611 353 238 211 -36 -187 -133 -363 -599 -508 -417
12178d17O5J22K91J08QJ50J45j14K2j81q9k40j11j08j29K5J6P6K08K57kJ39K49
$$ -417 -352 -230 61 169 177 327 472 358 380 199 110 -130 -241 -349 -478 -453 -437 -361 -153 104 102 241 490
12201D90J5q7m3O3k80k75l1k21j32N5q0Q5J56L44p7J73K86J9k24K62r1k35j47
$$ 490 505 418 375 438 158 -117 -148 -369 -501 -446 -526 -441 -285 59 -18 155 441 460 236 498 407 172 25
12224B5q9l91mnjk3L08J65l4L19J23mQN0k1k97L0k24l03o1N5j50LK77J15RK10
$$ 25 -64 -455 -459 -464 -465 -488 -180 -15 -49 270 393 389 397 447 426 129 159 -65 -368 -429 -374 -524 -521 -244 -129 -120 90
12251I0K82j53J89J03n2k84M2k48l04o2N9o2j89L32j1J17L72J8O2J18J42k73r6
$$ 90 372 219 408 511 459 175 217 -31 -335 -397 -338 -400 -589 -257 -268 -151 221 239 301 419 561 288 192
12274A92l4k01j14j47n5j33N7K03r8K27J66K65K9J92lj18r5j10j41l10jj85l8
$$ 192 158 -43 -157 -304 -359 -492 -435 -232 -330 -103 63 328 357 549 546 428 333 223 82 -228 -229 -414 -452
12297d52l0J56r8L07K65m6J12J98m5m3L7l6j95l29O9l18p2J30l8J03K58J59R7
$$ -452 -482 -326 -424 -117 148 102 214 412 367 324 361 325 130 -199 -130 -448 -520 -390 -428 -325 -67 92 189
12320A89O6J60O1j37p6J8k61j85o1k8k17OJ26j10M38K6J9K27J81K6j21m2Q8l65
$$ 189 255 415 476 339 263 281 20 -165 -226 -254 -471 -465 -339 -449 -11 15 34 261 442 468 347 305 393 28
12344B8O3j41k08j20m5l9K45N7oK27J5K96LJ11Q9l33j90J1q5l18j8J01j77J29
$$ 28 91 -50 -258 -378 -423 -462 -217 -160 -166 61 76 372 375 486 575 242 52 63 -22 -340 -358 -257 -434 -305
12368c05J04J13J81K01J39K1j38K61j89k34Lk87k18O6l9j12k0K51J05J06K04J36
$$ -305 -201 -88 93 294 433 454 316 577 388 154 157 -130 -348 -282 -321 -433 -453 -202 -97 9 213 349
12390C49m8K00K5k05j64Mk55p6j59o3r2J7J53J2K92J69J06Q6J7J79k74l4o5k74
$$ 349 301 501 526 321 157 161 -94 -170 -329 -392 -484 -467 -314 -302 -10 159 265 351 368 547 273 239 174 -100
12414a00k42K2n8j18Q0J03l7K40K78R7nJ78qj07K7j12j55j68j09l18P8j2R4M0
$$ -100 -342 -320 -378 -496 -416 -313 -350 -110 168 265 260 438 430 323 350 238 83 -85 -194 -512 -434 -446 -352 -312
12438c12J01L35O2nK69o5j7J7j77j85j52q7j72m5J12L7p3J63K06%J89L27j95k0
$$ -312 -211 124 186 181 450 385 368 385 208 23 -129 -216 -388 -433 -321 -284 -357 -194 12 12 201 528 333 313
12462C13Q6k21r9j02j35j31j39R8k27K20J87N0L24J5J08p0K15J53l46j80j6j55
$$ 313 399 178 79 -23 -158 -289 -428 -330 -557 -337 -150 -100 224 239 347 277 492 645 299 119 103 -52
12484e2k52j25P0j86J92K06M0R4K64P5o8K18Rk60k8n8j50l39l2j3r7K8L60l0J54
$$ -52 -304 -429 -359 -545 -353 -147 -107 -13 251 326 258 476 485 225 197 139 -11 -350 -382 -395 -492 -464 -104 -134 20
12509B0K19J07j15K41K2k45j14l9k97r3k3j71l1J08J39RK17K50J19N8K1o4j6O4
$$ 20 239 346 231 472 494 249 135 96 -201 -294 -317 -488 -519 -411 -272 -263 -46 204 323 381 402 338 322 386
12533C86k69k29o1qk37j20K54j11J15J49K86K5K14KJ3p0j14n4k19j39mk51j31
$$ 386 117 -112 -173 -181 -418 -538 -284 -395 -280 -131 155 180 394 396 409 339 225 171 -48 -187 -191 -442 -573
12556e73K89r5P7J40J69Q3K04J83J5j90J99k72k32nk10k04P6L3n4J4J49J57K14
$$ -573 -284 -379 -302 -162 7 90 294 477 492 302 501 229 -3 -8 -218 -422 -346 -313 -367 -353 -204 -47 167
12579A67K70p3p5J39J09l16j40j21j99k26J72p5k01K30K06N3J54K18Q1p6J06N8
$$ 167 437 364 289 428 537 221 81 -40 -239 -465 -293 -368 -569 -339 -133 -80 74 292 373 297 403 461
12601D61j75j36j37j86j30n1N8k41K71J31oJ69J94M0R1L0%j52p0j29k64K3k27
$$ 461 286 150 13 -173 -303 -354 -296 -537 -266 -135 -141 28 222 262 353 383 383 231 161 32 -232 -209 -436
12624d36Q8j34J25K51L6J18K47p6J48R9j46j02m5Qk96j94kj69J9J20O5K0K81J56
$$ -436 -348 -482 -357 -106 -70 48 295 219 367 466 320 218 173 181 -115 -309 -311 -480 -461 -341 -276 -256 25 181
12648A81LJ84J40j49j25q0j13k83J30j44j20J0O3o8P8K99J35M7J85J12j12M0j00
$$ 181 184 368 508 359 234 154 41 -242 -112 -256 -376 -366 -303 -371 -293 6 141 188 373 485 373 413 313
12671C13j84k45p0j18k16J49j06Q1K17J79L1J10K49J28j13j8j11j83k09q1r5o5
$$ 313 129 -116 -186 -304 -520 -371 -477 -396 -179 0 31 141 390 518 405 387 276 93 -116 -197 -292 -357
12693c57j05M7j4L1M25k5N9L15R1l2j43J1j44k47K5j47k53J50n4n3M4L36k1J99
$$ -357 -462 -415 -429 -398 27 2 61 376 467 435 292 303 159 -88 -63 -210 -463 -313 -367 -420 -376 -40 -61 138
12717A38K99k7q9J20l0k90j0j57r1l20Q0p3M1O9K18J14J05J77p4K02Q2j02k44
$$ 138 437 410 321 441 411 121 111 -46 -137 -457 -377 -450 -409 -340 -122 -8 97 274 200 402 484 382 138
12740A38Kj40l44NK1p3n3J45J17L0K29J76j9J59K44k89j85Q6j14k82j80J11k99
$$ 138 140 0 -344 -339 -318 -391 -444 -299 -182 -152 77 253 234 393 637 348 163 249 135 -147 -327 -216 -515
12763e15P2J66n6J63J85J09J47J19K19k68r7N3k68k76l1Op9o3J37O8m3L16N2J82
$$ -515 -443 -277 -333 -170 15 124 271 390 609 341 244 297 29 -247 -278 -272 -351 -414 -277 -209 -252 64 116 298
12787B98J5J97j45oJ0l43j78K8k04n0k6J02j15J92L28L6Q1J88j43J31q7J09l90
$$ 298 313 510 365 359 369 26 -152 -124 -328 -378 -404 -302 -417 -225 103 139 220 408 265 396 309 418 28
12810B8o1M2l33n5j5Q4j45K61J45Q8J96K22R4k37J47j21j84j51q4j82r8o8Q0q3
$$ 28 -33 9 -324 -379 -394 -310 -455 -194 -49 39 235 457 551 314 461 340 156 5 -79 -261 -359 -427 -347 -430
12834d30J88K93n3K12J76J7m1k7m7m0j77n9k57j88R4l8j25K89J12k9K98J55j10
$$ -430 -242 51 -2 210 386 403 362 335 288 248 71 12 -245 -433 -339 -377 -502 -213 -101 -130 168 323 213
12857B13K19j2p3j08J2k80k01j25O6k65P9L19k0J0K18K69rJ34R2j39k54Qk17j64
$$ 213 432 420 347 239 251 -29 -230 -355 -289 -554 -475 -156 -176 -166 52 321 312 446 538 399 145 153 -64 -228
12881b28l8o8j97J8J66P4K10J66J03O8J81rj11q4m7k25j56nj03j46k6J38P2j0
$$ -228 -266 -334 -531 -513 -347 -273 -63 103 206 274 455 446 335 251 204 -21 -177 -182 -285 -431 -457 -319 -247 -257
12905b57K75O8J32J31N9L6n6j27k43j34J2q2j07p5P4j09K56K61n6J35K99j8j27
$$ -257 18 86 218 349 408 444 388 261 18 -116 -104 -186 -293 -368 -294 -403 -147 114 58 193 492 474 347
12928C47N4k44j29j95J0j50j44R9L7l1J22J98M9K72R3o1m0J79j84k01j58N2k60
$$ 347 401 157 28 -167 -157 -307 -451 -352 -315 -346 -224 -26 23 295 388 327 287 466 282 81 -77 -25 -285
12951b85j06L6l1j53M38P6n7L35K36o6q6J22j52l05o3Qk79J7rq3k3K58J80J2J48
$$ -285 -391 -355 -386 -539 -101 -25 -82 253 489 423 337 459 307 2 -61 -53 -332 -315 -324 -407 -430 -172 8 20 168
12976A68J59l8J24L4k26j21Ok55q7r9J9k33J79J46J54O7K24J06N9n2N5k38M8o5
$$ 168 327 289 413 447 221 100 106 -149 -236 -335 -316 -549 -370 -224 -70 -3 221 327 386 334 389 151 199 134
13000A34k26k61J41j17j58J50J41rQ6J51J88l3L20j34%O2k79k01j49l3j57o0K30
$$ 134 -92 -353 -212 -329 -487 -337 -196 -205 -119 32 220 187 507 373 373 435 156 -45 -194 -227 -384 -444 -214
13023b14Oj49K49J46K53j02K70k6j53Jk02j46n6l7k57j6M1LJ12J04K26oK32P5
$$ -214 -208 -357 -108 38 291 189 459 433 280 281 79 -67 -123 -160 -417 -433 -392 -389 -277 -173 53 47 279 354
13047C54o5J59k02j78j16m2j35k37K1J17p7J21L3K59J18O3J88Q0j16R4j67k34
$$ 354 289 448 246 68 -48 -90 -225 -462 -441 -324 -401 -280 -247 12 130 193 381 461 345 439 272 38
13069C8p8j77n0k12R0K6l9L03J62M3K04J76j92J04oj42j62j14k40q1N6j48pQ3
$$ 38 -40 -217 -267 -479 -389 -363 -402 -99 63 106 310 486 294 398 392 250 88 -26 -266 -347 -291 -439 -446 -363
13093c63J73k0R0L92J36j37J15J18k57j41J7k07j11j45j7n7O1K78l9Q2J79K09
$$ -363 -190 -210 -120 272 408 271 386 504 247 106 123 -84 -195 -340 -357 -414 -353 -75 -114 -32 147 356
13115C56J9%N4j82qj24j75j52L1j73q0J70O0J1J01L15j68K07J85n8j09l5j18j28
$$ 356 375 375 429 247 239 115 -60 -212 -181 -354 -434 -264 -204 -193 -92 223 55 262 447 389 280 245 127 -1
13139ak69M0j60n9J59M0oJ92J80m9K50Q2M2r1l0p2k54j64m4j92K4J2O4J15J70
$$ -1 -270 -230 -390 -449 -290 -250 -256 -64 116 67 317 399 441 350 320 248 -6 -170 -214 -406 -382 -370 -306 -191 -21
13164b1J29o7J29K11r5K9qp4j82k10j23j32l0J63O9n3J13J08J52K17pr1J4J52
$$ -21 108 41 170 381 286 315 307 233 51 -159 -282 -414 -444 -281 -212 -265 -152 -44 108 325 318 227 241 393
13188C93k97L8j90p2l97J49R9k1J3K61L5p0L68L4n9L8L4j97p4q4j06r5l0q7n7
$$ 393 96 134 -56 -128 -525 -376 -277 -298 -285 -24 11 -59 309 343 284 322 356 159 85 1 -105 -200 -230 -317 -374
13213c74J5K24K7J33K52n9J6K87j96q5L6j45j94k46R9j94J4P7O7J23R9K43r7K28
$$ -374 -359 -135 -108 25 277 218 234 521 325 240 276 131 -63 -309 -210 -404 -390 -313 -246 -123 -24 219 122 350
13237C50R9o2k78J25j76j64o9j04q3n9J37L6Q6J36J75OJ13J43l6j26J3j51j71
$$ 350 449 387 109 234 58 -106 -175 -279 -362 -421 -284 -248 -162 -26 149 155 268 411 375 249 262 111 -60
13260f0o7j12r3j06J41J0J99J33KR7J78N3J5j02K4j65l09m1l1q8j15k4J50j1J40
$$ -60 -127 -239 -332 -438 -297 -287 -88 45 47 144 322 375 390 288 312 147 -162 -203 -234 -322 -437 -461 -311 -322 -182
13285a82K59pJ69K00j75M9j60j29k5k17qk14K34j14q9J77J80Q8J86J21L3K0l0
$$ -182 77 70 239 439 264 313 153 24 -1 -218 -226 -440 -206 -320 -409 -232 -52 36 222 343 376 396 366
13308C66Nl16Pj15k31j13P4R7j32J16J66K27O0N1J05n2Qq8j23o2j09j56j89Q7
$$ 366 371 55 62 -53 -284 -397 -323 -226 -358 -242 -76 151 211 262 367 315 323 235 112 50 -59 -215 -404 -317
13332c17o2L3L9J94J81O1K10j56J99J00j10j56O3l16j20j43N4k07J79%J43n2K61
$$ -317 -379 -346 -307 -113 68 129 339 183 382 482 372 216 279 -37 -157 -300 -246 -453 -274 -274 -131 -183 78
13355G8K29r7J88j3o0k64J00l7k76l8k03O0o1mR9J66J37K15J1P2J05r4r3j4o6
$$ 78 307 210 398 385 325 61 161 124 -152 -190 -393 -333 -394 -398 -299 -133 4 219 230 302 407 313 220 206 140
13380A40l14Pr1k64O8K30OJ46J84J03L4K9M0m3l0l1j80j42J5k33K7NlN9O4L25
$$ 140 -174 -167 -258 -522 -454 -224 -218 -72 112 215 249 278 318 275 245 214 34 -108 -93 -326 -299 -294 -297 -238 -174 151
13406A51m2J22J46M9j33j6j8j35j83j2q8j70l6O0j8L5L75j09K52P8Q6l1k5j06
$$ 151 109 231 377 426 293 277 259 124 -59 -71 -159 -329 -365 -305 -323 -288 87 -22 230 308 394 363 338 232
13430B32r4j46j58n0j33J05j00j14K63R5J3K73J46o9J1J41j23k08Nj82r5j79l5
$$ 232 138 -8 -166 -216 -349 -244 -344 -458 -195 -100 -87 186 332 263 274 415 292 84 89 -93 -188 -367 -402
13453d02K22k21J21K61L2K27k8qJ02j2l6j57kk6k52p0J01k19j3J19J51nK33P2
$$ -402 -180 -401 -280 -19 13 240 212 204 306 294 258 101 99 73 -179 -249 -148 -367 -380 -261 -110 -115 118 190
13477A90lR6J08j87n4k8P4k30k66R4k74N9J93%K96j24K05L0J52J22j77j2j26r8
$$ 190 187 283 391 204 150 122 196 -34 -300 -206 -480 -421 -228 -228 68 -56 149 179 331 453 276 264 138 40
13501D0m8j48l0k15O8J09j81K64K39J87k34K54j8j3n0j19j4o0j45l24Q2J25q7
$$ 40 -8 -156 -186 -401 -333 -224 -405 -141 98 285 51 305 287 274 224 105 91 31 -114 -438 -356 -231 -318
13524c18PK03K06J19j26J77J93k13J14n6j52k02p1m4k31J80k06K70K1J82l9J81
$$ -318 -311 -108 98 217 91 268 461 248 362 306 154 -48 -119 -163 -394 -214 -420 -150 -129 53 14 195
13546A95K14o8k7K9p8k56m3q4j87m4L1M8r6K14Q7O1J94r7J36q2K45r8k38j79O6
$$ 195 409 341 314 343 265 9 -34 -118 -305 -349 -318 -270 -366 -152 -65 -4 190 93 229 147 392 294 56 -123 -57
13571e7k41Qmm1k3K16JK29Q7J07NjJ26j96k51J42k09q9j35L1l8M3J6J00K19J52
$$ -57 -298 -290 -294 -335 -358 -142 -141 88 175 282 287 286 412 216 -35 107 -102 -191 -326 -295 -333 -290 -274 -174 45 197
13597A97R6M4l7N9j36j11O7j71k10q9N3r7J30l0J15O7K03PJ71k2r7M1K0j40j87
$$ 197 293 337 300 359 223 112 179 8 -202 -291 -238 -335 -205 -235 -120 -53 150 157 328 306 209 250 270 130 -57
13622e7l7j41p6j16Q2J27j55K55J97m1P0J16J13j44Oj0k49o8p2j25p0Q6m1J93
$$ -57 -94 -235 -311 -427 -345 -218 -373 -118 79 38 108 224 337 193 199 189 -60 -128 -200 -325 -395 -309 -350 -157
13646a57q3K88J05J25J24k06J02l1k1k94j16J20l96J51K13k38J00N6J32J70J53
$$ -157 -240 48 153 278 402 196 298 267 246 -48 -164 -44 -440 -289 -76 -314 -214 -158 -26 144 297
13667B97l6q6Q8J4q6j29j32p0j50K4k8k3P9J22k5K57P2J62j91jJ22j13j22k3j28
$$ 297 261 175 263 277 191 62 -70 -140 -290 -266 -294 -317 -238 -116 -141 116 188 350 159 158 280 167 45 22 -106
13692a06k63J38q7O3j7K22k8O4J02J91m1R2L7j87L8q8k44k44L6l1k1O5J15M0J43
$$ -106 -369 -231 -318 -255 -272 -50 -78 -14 88 279 238 330 367 180 218 130 -114 -358 -322 -353 -374 -309 -194 -154 -11
13717a1J11J42J29q7m2q6M9p7j98r8l5j08j19J92M8K7K31Q5O4j38L36m3p2j81
$$ -11 100 242 371 284 242 156 205 128 -70 -168 -203 -311 -430 -238 -190 -163 68 153 217 79 415 372 300 119
13741A19J1l01j54K24k85R0j54K71o2K72K3R8J19o2J44k09K22k76j42r0j2k10
$$ 119 130 -171 -325 -101 -386 -296 -450 -179 -241 31 54 152 271 209 353 144 366 90 -52 -142 -154 -364
13763c64m4J18O0K5J39K28m8Q6J42n8j04K13j92k77L1p2k17o3n5J06J41Q5K87
$$ -364 -408 -290 -230 -205 -66 162 114 200 342 284 180 393 201 -76 -45 -117 -334 -397 -452 -346 -205 -120 167
13786A67j29L39j6nm4K2k37j01l3j08r0j2n0j48J78K26l0K10J9J31Mj37J96k63
$$ 167 38 377 361 356 312 334 97 -4 -37 -145 -235 -247 -297 -445 -267 -41 -71 139 158 289 293 156 352 89
13810H9l5j09j26j45Q3K8j45J68J22k4J9J98J12N3O8Rk58M4m6k50k32J67q7J6
$$ 89 54 -55 -181 -326 -243 -215 -360 -192 -70 -94 -75 123 235 288 356 365 107 151 105 -145 -377 -210 -297 -281
13834b81M7L6J14M3L09r9P5R6l5j37j3j18j65j0n0l9p2R3K8J3K23J3R7J62P3j82
$$ -281 -234 -198 -84 -41 268 169 244 340 305 168 155 37 -128 -138 -188 -227 -299 -206 -178 -165 58 71 168 330 403 221
13860B21n3lq2k34L4j31j94R5J22J2J8K09O2L6L2K20pj66K6j95j05p2K2k44L1
$$ 221 168 165 83 -151 -117 -248 -442 -347 -225 -213 -195 14 76 112 144 364 357 191 217 22 -83 -155 -133 -377 -346
13885c46J27m5P1K53n3K6K33J00l4j67k5m2j94p0m4o7r9J48m0M6J63J12P5L6J0
$$ -346 -219 -264 -193 60 7 33 266 366 332 165 140 98 -96 -166 -210 -277 -376 -228 -268 -222 -59 53 128 164 174
13910A74R4M3n4j18j89m1J9j32l8K3m5J8K13P6j4J51QL6k0j0n1n8n8j93q0N3p5
$$ 174 268 311 257 139 -50 -91 -72 -204 -242 -219 -264 -246 -33 43 29 180 188 224 204 194 143 85 27 -166 -246 -193 -268
13937b68k42K32J61O1K52J4K9J5J13m6k80M2o5j61n8o2j12M7J36R2RJ99K0N0R7
$$ -268 -510 -278 -117 -56 196 210 239 254 367 321 41 83 18 -143 -201 -263 -375 -328 -192 -100 -91 108 128 178 275
13962B75Nl3j46M1j32k14j5N6k42J68J0K23p9J29R8J13K9J11j40q9p6P2l00L3
$$ 275 280 247 101 142 10 -204 -219 -163 -405 -237 -227 -4 -83 46 144 257 286 397 257 168 92 164 -136 -103
13986a03j26j84R3J55MKJ33Q9N0J29J72k27MK4m3k40Lj46j54J89K9j69O7K83O3
$$ -103 -229 -413 -320 -165 -161 -159 -26 63 113 242 414 187 191 215 172 -68 -65 -211 -365 -176 -147 -316 -249 34 97
14011I7M5J77m0j08L5m9j38L9n3k39k6J02n7j20J70P4J31J36O9m4m3P1K4j34o2
$$ 97 142 319 279 171 206 157 19 58 5 -234 -260 -158 -215 -335 -165 -91 40 176 245 201 158 229 253 119 57
14036E7K1k85N1p8N8k3K2J22N6J10J71l2m3J70j17j56o9k12m4k1l5j04J3J45J69
$$ 57 78 -207 -156 -234 -176 -199 -177 -55 1 111 282 250 207 377 260 104 35 -177 -221 -242 -277 -381 -368 -223 -54
14061e4N8J1K48l1o9K60j76j76K5j48j25j5j37l5J70N9KM2R5K16m8J41n8l2m3
$$ -54 4 15 263 232 163 423 247 71 96 -52 -177 -192 -329 -364 -194 -135 -133 -91 4 220 172 313 255 223 180
14086A80j14o4p1j28Mo8j06J28O8J70J80L5K0K3P6j42k8l6j71j11N7p3j37J5N1
$$ 180 66 2 -69 -197 -193 -261 -367 -239 -171 -1 179 214 234 257 333 191 163 127 -44 -155 -98 -171 -308 -293 -242
14111b42MJ30K20k5J76L5O2r4l4j69M7k00k1j7k80J59K3O6Q6J39J23o7M1J28j04
$$ -242 -238 -108 112 87 263 298 360 266 232 63 110 -90 -111 -128 -408 -249 -226 -160 -74 65 188 121 162 290 186
14136A86J97j38j54r5n7k9j43O8j02j6J37K40j9J06L8R3n9L9j50o4k7k9l09j05
$$ 186 383 245 91 -4 -61 -90 -233 -165 -267 -283 -146 94 75 181 219 312 253 292 142 78 51 22 -287 -392
14160c92J79o2lK9K80qP2R7M7m3K4mj57m9Nj85l4J6j20P7J23L3P0J41J39k5j15
$$ -392 -213 -275 -278 -249 31 23 95 192 239 196 220 216 59 10 15 -170 -204 -188 -308 -231 -108 -75 -5 136 275 250 135
14187A35J59k06J01j74o3l31K40qq8P0J12l5P6J18n5rL29p6L5k05R4k87k46K01
$$ 135 294 88 189 15 -48 -379 -139 -147 -235 -165 -53 -88 -12 106 51 42 371 295 330 125 219 -68 -314 -113
14211a13j00Rj04J81R1J8J42j0K38j24O3j07j6k6j41j94P4j06p0M7M2L6R9L17
$$ -113 -213 -204 -308 -127 -36 -18 124 114 352 228 291 184 168 142 1 -193 -119 -225 -295 -248 -206 -170 -71 246
14235B46j08J47j18K07j23l1j54j88R7r4j74J5nM8k9J70J64J8J20R5n4j41L0m0
$$ 246 138 285 167 374 251 220 66 -122 -25 -119 -293 -278 -283 -235 -264 -94 70 88 208 303 249 108 138 98
14259I8q9p8J5k24m6J20Q0k19L15J43J47M4n7n5P2Q0k32j01m0m4j17q9L0Q6j15
$$ 98 9 -69 -54 -278 -324 -204 -124 -343 -28 115 262 306 249 194 266 346 114 13 -27 -71 -188 -277 -247 -161 -276
14284b76J96L3K3K29Q0k9j20J74j96l0j89%o1P3j63k5O0j5J15K9K25P5j8K5J06
$$ -276 -80 -47 -24 205 285 256 136 310 114 84 -105 -105 -166 -93 -256 -281 -221 -236 -121 -92 133 208 190 215 321
14309C21j48p1j90k8j78J17O3j31MJ64j49J65J75P1j02K05kj18m0R6k28j63M4
$$ 321 173 102 -88 -116 -294 -177 -114 -245 -241 -77 -226 -61 114 185 83 288 286 168 128 224 -4 -167 -123
14332a23j11j98K16N7l3Q8J90J01n3J65p0l6j20N1k48j04J15r8r9J17n7J8Q4J48
$$ -123 -234 -432 -216 -159 -192 -104 86 187 134 299 229 193 73 124 -124 -228 -113 -211 -310 -193 -250 -232 -148 0
14356@J61m2R4N0j99R6mk36M1j92N0j55Q2n3L5K79j3K5J57R1L3j35j6L4j30n1
$$ 0 161 119 213 263 64 160 156 -80 -39 -231 -181 -336 -254 -307 -272 7 -6 19 176 267 300 165 149 183 53 2
14382BPj94j45k4J65M7K00q3J4J45K2L2M5O1j69k00M4j00j39P3n9L9J1J56n0J89
$$ 2 9 -185 -330 -354 -189 -142 58 -25 -11 134 156 188 233 294 125 -75 -31 -131 -270 -197 -256 -217 -206 -50 -100 89
14408H9M8Q2j25J59j43J13j93j14j2l3p0k1P2n9J88p7J53J23K3J07K8j7k27n9
$$ 89 137 219 94 253 110 223 30 -84 -96 -129 -199 -220 -148 -207 -19 -96 57 180 203 310 338 321 94 35
14432C5O7k03r2O8n3j95L00Q4n4J28k2LO5J40j54k2ppr5p0j30j13L6M2J41Q1l1
$$ 35 102 -101 -193 -125 -178 -373 -73 11 -43 85 63 66 131 271 117 95 88 81 -14 -84 -214 -327 -291 -249 -108 -27 -58
14459e8P6L8J89r7R1j34N9k3k03o4L9k08O1M3J11J11k4J27rQ9L2r6L8q2p2r2M2
$$ -58 18 56 245 148 239 105 164 141 -62 -126 -87 -295 -234 -191 -80 31 7 134 125 214 246 150 188 106 34 -58 -16
14486a6j90q6p2J94o9O7K58j02P7R8R1l6j10J4k0j52o5n0j79J6J73p1N4J63P8
$$ -16 -206 -292 -364 -170 -239 -172 86 -16 61 159 250 214 104 118 98 -54 -119 -169 -348 -332 -159 -230 -176 -13 65
14511F5J8J47o6LJ18p0j96j05mj05m0O3j50L8J58J32J7J1J02K35k15J13j45kr7
$$ 65 83 230 164 167 285 215 19 -86 -90 -195 -235 -172 -322 -284 -126 6 23 34 136 371 156 269 124 122 25
14536B5L6k29L3j34O8r5J09R3j5J23J96lrj4J4j19NNk21j76K6R4m4m7K41r9J53
$$ 25 61 -168 -135 -269 -201 -296 -187 -94 -109 14 210 207 198 184 198 79 84 89 -132 -308 -282 -188 -232 -279 -38 -137 16
14563A6J87j43J60O4N3j90j08k6j38j4k6j32k9J14J50J9N8J19j0Q1J95l85O9M8
$$ 16 203 60 220 284 337 147 39 13 -125 -139 -165 -297 -326 -212 -62 -43 15 134 124 205 400 15 84 132
14587A32K1j78j27j28j4P6M4J5j29M10j22J35J35O6j70J2n0n7j19p9pj04j4O6
$$ 132 153 -25 -152 -280 -294 -218 -174 -159 -288 122 0 135 270 336 166 178 128 71 -48 -127 -134 -238 -252 -186
14611a86k4j3K22oO9R7J36n8J29k04l7j37P6k75O6K3j23L5J20Q7M6o4K54m7p2
$$ -186 -210 -223 -1 -7 62 159 295 237 366 162 125 -12 64 -211 -145 -122 -245 -210 -90 -3 43 -21 233 186 114
14636A14j1O5j21r0j36m5k4mL8m9M0J89P1l2J37O3j04J15l4j25P6j14j75k3J9
$$ 114 103 168 47 -43 -179 -224 -248 -252 -214 -263 -223 -34 37 5 142 205 101 216 182 57 133 19 -156 -179 -160
14661a60o2k2J15J55j40K33k4J27p2j8O8j23nj35j7j19N6j83R7J82j06J67J50
$$ -160 -222 -244 -129 26 -114 119 95 222 150 132 200 77 72 -63 -80 -199 -143 -326 -229 -47 -153 14 164
14684A64K4j8J21j50O3j06j24J94l33j1l6Lp4J26K9J37P2J3l1O1P1j1n1k8j65
$$ 164 188 170 291 141 204 98 -26 168 -165 -176 -212 -209 -283 -157 -128 9 81 94 63 124 195 184 133 105 -60
14709f0j19J71k16LO7J41m1j05J59J40j3M3N4q2J9o7j11j1j37p5J5J15NJ1Q2o
$$ -60 -179 -8 -224 -221 -154 -13 -54 -159 0 140 127 170 224 142 161 94 -17 -28 -165 -240 -225 -110 -105 -94 -12 -18
14735a8J8J57Pk3j4R8jk26nq5j13N3K0Lk3J05L0L4P8J22m3q5R5Ok35J4k6q8j06
$$ -18 0 157 164 141 127 225 224 -2 -7 -92 -205 -152 -132 -129 -152 -47 -17 17 95 217 174 89 184 190 -45 -31 -57 -145 -251
14764b51Q9n4J2J14P0J21N3o7J35Mn6k2j42j49J88m6j66r0J25m2P0N0J57opO1
$$ -251 -162 -216 -204 -90 -20 101 154 87 222 226 170 148 6 -143 45 -1 -167 -257 -132 -174 -104 -54 103 97 90 151
14790A51L0j8p4m5jk2j38j18k8j8J3N6R4j1K61N3j90K24P5k45L7k6q9j98N7J12
$$ 151 181 163 89 44 43 21 -117 -235 -263 -281 -268 -212 -118 -129 132 185 -5 219 294 49 86 60 -29 -227 -170 -58
14816e8k46J27j5L7J79J11j18J39L0N1j75L0k1j00p3j3Qj8q8N0J16k4O9J71k6
$$ -58 -304 -177 -192 -155 24 135 17 156 186 237 62 92 71 -29 -102 -115 -107 -125 -213 -163 -47 -71 -2 169 143
14841A43l1J0krQo7j75Q8k28J16j61K08j5q4K81N5n1Q5L3l5mr4p4j50K3m8K0j79
$$ 143 112 122 120 111 119 52 -123 -35 -263 -147 -308 -100 -115 -199 82 137 86 171 204 169 165 71 -3 -153 -130 -178 -158 -337
14869c37K03j10K06j2O1J35J3j25J36q9N1n1r0q9k5q0j0K9mR2PJ41K1P7O2Q5j04
$$ -337 -134 -244 -38 -50 11 146 159 34 170 81 132 81 -9 -98 -123 -203 -213 -184 -188 -96 -89 52 73 150 212 297 193
14896A93q7p7j14K0k2r0Oj46J25J8R0J49J2p0J55N0j53L3n3n1l4j49Q5K3j77J90
$$ 193 106 29 -85 -65 -87 -177 -171 -317 -192 -174 -84 65 77 7 162 212 59 92 39 -12 -46 -195 -110 -87 -264 -74
14922g4j4j67K56%J55l6Q6j9j68R7j41J40j36j18kk23K33M9p1J56J19k4K3R5j58
$$ -74 -88 -255 1 1 156 120 206 187 19 116 -25 115 -21 -139 -141 -364 -131 -82 -153 3 122 98 121 216 58
14947E8K12j69o4k8q0m5J4q3KJ02k6J48O2J7K0M4pOo2l5j30OP0j56n1R4o6JO3
$$ 58 270 101 37 9 -71 -116 -102 -185 -183 -81 -107 41 103 120 140 184 177 183 121 86 -44 -38 32 -124 -175 -81 -147 -146 -83
14976h3J37NlJ40l7q4J36j99%m6j66m2J07o4oRJ84M2J34rj04J3J20j18mp8o9j9
$$ -83 54 59 56 196 159 75 211 12 12 -34 -200 -242 -135 -199 -205 -196 -12 30 164 155 51 64 184 66 62 -16 -85 -104
15004a04J12l8j58J38j40J97n1r8K64O1k7J00j53l4j11q8Pj20R2J8m6M6N0j7o7
$$ -104 8 -30 -188 -50 -190 7 -44 -142 122 183 156 256 103 69 -42 -130 -123 -243 -151 -133 -179 -133 -83 -100 -167
15029a67J85J04r3R6P1j34j40M9P2r7o0j13NQ1N4K4N8J88j05J9J30Rj2j40J09
$$ -167 18 122 29 125 196 62 -78 -29 43 -54 -114 -227 -222 -141 -87 -63 -5 183 78 97 227 236 224 84 193
15054A93l31K04k29j9nR3K4qJ74O7K0J4o9R4k8j68K9j55R8j33o0j00K00J01j37
$$ 193 -138 66 -163 -182 -187 -94 -70 -78 96 163 183 197 128 222 194 26 55 -100 -2 -135 -195 -295 -95 6 -131
15079a31J3P7J43J01j30N9j2n5n1j22pq4r6M6p7J82Q5J02J02j48J32mM0o5n9K8
$$ -131 -118 -41 102 203 73 132 120 65 14 -108 -115 -199 -295 -249 -326 -144 -59 43 145 -3 129 125 165 100 41 69
15105F9j21K6j6q2K1j06J32j43K82J37j10J67j08L3Nj02n4j66J37q3j20R3q5J97
$$ 69 -52 -26 -42 -124 -103 -209 -77 -220 62 199 89 256 148 181 186 84 30 -136 1 -82 -202 -109 -194 3
15129Cj15J73N4k4rJ39j11J54j74o3l7q0O0k16J12m9O0m8J30K3J9J79J5k3J0j09
$$ 3 -112 61 115 91 82 221 110 264 90 27 -10 -90 -30 -246 -134 -183 -123 -171 -41 -18 1 180 195 172 182 73
15155G3J06o4n8r4j04Q9j19L7l9M5M6J14J70j8m0N2J0o3%q9k39k1J48j27l7M7
$$ 73 179 115 57 -37 -141 -52 -171 -134 -173 -128 -82 32 202 184 144 196 206 143 143 54 -185 -206 -58 -185 -222 -175
15181a75O5J8R6J1J26o5J05J8j10J08j39j16m7q8J20r8n6j8J55P1J46k7N0O5o2
$$ -175 -110 -92 4 15 141 76 181 199 89 197 58 -58 -105 -193 -73 -171 -227 -245 -90 -19 127 100 150 215 153
15206A53r5J00n1k10K3j5r0j9O1n9K00l6nO1Q7J94j84M6j13n1ro5n1L2j1p7k4
$$ 153 58 158 107 -103 -80 -95 -185 -204 -143 -202 -2 -38 -43 18 105 299 115 161 48 -3 -12 -77 -128 -96 -107 -184 -208
15233b08J62j5R5j57K09J01l3K0q5J15j13j24J5q1M4q3n0J40J27j30N1J87q1M7
$$ -208 -46 -61 34 -123 86 187 154 174 89 204 91 -33 -18 -99 -55 -138 -188 -48 79 -51 0 187 106 153
15257A53j4m7n3L4L5k50O0on8rN1o2N3J12J00n6N9R9l7q9l6j18p2N1j24J03n1
$$ 153 139 92 39 73 108 -142 -82 -88 -146 -155 -104 -166 -113 -1 99 43 102 201 164 75 39 -79 -151 -100 -224 -121 -172
15284a72P4J1J03J16l9n9J59k9l6l8k1K2k31M8q8qQ9l0Q2P2j4J53o7O7R2j53K5
$$ -172 -98 -87 16 132 93 34 193 164 128 90 69 91 -140 -92 -180 -188 -99 -129 -47 25 11 164 97 164 256 103 128
15311A28j5m8j47k6J29k00J85r6pl4J05J33l0P6l4M9p6l5j48O5n1p6j03K8J23
$$ 128 113 65 -82 -108 21 -179 6 -90 -97 -131 -26 107 77 153 119 168 92 57 -91 -26 -77 -153 -256 -228 -105
15336a05p3J87n5R3kJ22K8k7q5jK0k09J15q6n7p5J82j5Ml3J06O0k2Q9l7Kj9j38
$$ -105 -178 9 -46 47 45 167 195 168 83 82 102 -107 8 -78 -135 -210 -28 -43 -39 -72 34 94 72 161 124 126 107 -31
15364c1N5p1j23M9nq0J46p2PJ29j03J62Q4n5o6J18q7n0n8n1l1r1O6l9M9R3K4J63
$$ -31 24 -47 -170 -121 -126 -206 -60 -132 -125 4 -99 63 147 92 26 144 57 7 -51 -102 -133 -224 -158 -197 -148 -55 -31 132
15392A32r7Q6J11q7j39J12j17J9j24K6j40P8l5N1j1qK24oM6J14j8q8p3k2j0j60
$$ 132 35 121 232 145 6 118 1 20 -104 -78 -218 -140 -175 -124 -135 -143 81 75 121 235 217 129 56 34 24 -136
15418a36qm0q2Q4N5O7j1N8J33l0K04k44J68j06r6O1j29o2Rj98K15j07L6O6J42
$$ -136 -144 -184 -266 -182 -127 -60 -71 -13 120 90 294 50 218 112 16 77 -52 -114 -105 -303 -88 -195 -159 -93 49
15443D9N8J23K5p5l7J0J3j23o5j20J14j47R1n6oK5M6P0J36q1Q2P7j66K7j10l2
$$ 49 107 230 255 180 143 153 166 43 -22 -142 -28 -175 -84 -140 -146 -121 -75 -5 131 50 132 209 43 70 -40 -72
15469g2n2l4J3L3k8o1J22n9J62NJ66j4J9K1j31O4j79j04k1jQ5j26J20J11J1l2
$$ -72 -124 -158 -145 -112 -140 -201 -79 -138 24 29 195 181 200 221 90 154 -25 -129 -150 -151 -66 -192 -72 39 50 18
15495A8k1K27j30J41j03o3L2l7j63R0r2k9m0J16O5l1j49K21P2K3K9PPk09P1p1
$$ 18 -3 224 94 235 132 69 101 64 -99 -9 -101 -130 -170 -54 11 -20 -169 52 124 147 176 183 190 -19 52 -19
15521a9Lk03p3N2K49j33J32l6Q8P7o0J45oo3o0r4k8qj0j49J18r9O2J14L2J42j23
$$ -19 -16 -219 -292 -240 9 -124 8 -28 60 137 77 222 216 153 93 -1 -29 -37 -47 -196 -78 -177 -115 -1 31 173 50
15548E0O9Q9q7p2k0m2O9j38j8o3J08j14R5J6R7OJ6L6O9l0J5k00j1K2J6j11K4K9
$$ 50 119 208 121 49 29 -13 56 -82 -100 -163 -55 -169 -74 -58 39 45 61 97 166 136 151 -49 -60 -38 -22 -133 -109 -80
15576h0m4J8m1J53J10j7Q4n7n5K7k0R0j40m2k6j3p2J6l4O8N6P7j2M0Q3K7l4j30
$$ -80 -124 -106 -147 6 116 99 183 126 71 98 78 168 28 -14 -40 -53 -125 -109 -143 -75 -19 58 46 86 169 196 162 32
15604C2N2j19q6K5O1j84J03j19J03r4K92Km3J83q8J7km7l4%j43L6O7j63n0K21
$$ 32 84 -35 -121 -96 -35 -219 -116 -235 -132 -226 66 68 25 208 120 137 135 88 54 54 -89 -53 14 -149 -199 22
15630B2lm0q5J46J05p2Q9j9p9J9L3j43j33P7K6L7j35J1J03J28Q5r3j5J32n1J0
$$ 22 19 -21 -106 40 145 73 162 143 64 83 116 -27 -160 -83 -57 -20 -155 -144 -41 87 172 79 64 196 145 155
15656A55j66J43j35j72J51j84N3o7J81L8m8Q5J00q5J01k6m4L1j14j14j00Q8m1
$$ 155 -11 132 -3 -175 -24 -208 -155 -222 -41 -3 -51 34 134 49 150 124 80 111 -3 -117 -217 -129 -170
15679a70lJ7R5m6O1O7P6P2OK7q6j6j53O9j36Q2p8j13J45N5j31K15j7o5J63N0K2
$$ -170 -173 -156 -61 -107 -46 21 97 169 175 202 116 100 -53 16 -120 -38 -116 -229 -84 -29 -160 55 38 -27 136 186 208
15706B08j20J12k09j6kj6j00J2m3K08j89J20J06j45K90Np3q3M9P8j82M7j01j50
$$ 208 88 200 -9 -25 -27 -43 -143 -131 -174 34 -155 -35 71 -74 216 221 148 65 114 192 10 57 -44 -194
15730a94N8L8M6O5o2J90Kl1J3j67J41J0j07r9P5j3l0Mj29J12p9J13O5P4r0J27
$$ -194 -136 -98 -52 13 -49 141 143 112 125 -42 99 109 2 -97 -22 -35 -65 -61 -190 -78 -157 -44 21 95 5 132
15756A32J2l4j24R8n0q9mj24R8J01j34P9qR7L3L4j59M0Q7M4m0R4j71Lq5n2k9q6
$$ 132 144 110 -14 84 34 -55 -59 -183 -85 16 -118 -39 -47 50 83 117 -42 -2 85 129 89 183 12 15 -70 -122 -151 -237
15784b37K03n0L1J32j9j0j0J09l7Jm7P8j19r5K8k01J89j8l9j0K04l2J28p9k5p
$$ -237 -34 -84 -53 79 60 50 40 149 112 113 66 144 25 -70 -42 -243 -54 -72 -111 -121 83 51 179 100 75 68
15810F8L7m8K0j38R3j52Mm2m3J61r9R5NP8K68j86r9R8j4k5k4K4k95K5J9l7P2Q4
$$ 68 105 57 77 -61 32 -120 -116 -158 -201 -40 -139 -44 -39 39 307 121 22 120 106 81 57 81 -214 -189 -170 -207 -135 -51
15838e1J7P4O7J38j40m6P3Q4k34jj2m0o3o6J40q1Q0k8J23r6K11j35NL4l6J49j06
$$ -51 -34 40 107 245 105 59 132 216 -18 -19 -31 -71 -134 -200 -60 -141 -61 -89 34 -62 149 14 19 53 17 166 60
15865F0J9k23P3L5j8j69J29J37j7p7J43n9J57p9k1N3m4r0j08Q4k9r7m3J58j7L9
$$ 60 79 -144 -71 -36 -54 -223 -94 43 26 -51 92 33 190 111 90 143 99 9 -99 -15 -44 -141 -184 -26 -43 -4
15891dk4J52p7O4O8k4o3j59J92l1k10Q8j60J53j61Q3J81ol1l1J55q7L3MOj95J3
$$ -4 -28 124 47 111 179 155 92 -67 125 94 -116 -28 -188 -35 -196 -113 68 62 31 0 155 68 101 105 111 -84 -71
15918g1M5lj19J12J6j23J26RO4p3J80P5k87J35L3k3j92O7n0j53J60o1O4J46N7
$$ -71 -26 -29 -148 -36 -20 -143 -17 -8 56 -17 163 238 -49 86 119 96 -96 -29 -79 -232 -72 -133 -69 77 134
15943A34j73RJ48M5j25M4l9pk5j6m3j36Q7P6o3Q5n9O5m5K44m4o4j8P9q2j47P8
$$ 134 -39 -30 118 163 38 82 43 36 11 -5 -48 -184 -97 -21 -84 1 -58 7 -38 206 162 98 80 159 77 -70 8
15970HK0j75N6r0P1j7J06j7J29r3J64r3J11j6j37N9j83Q1o1j25P4N5m1J68j53
$$ 8 28 -147 -91 -181 -110 -127 -21 -38 91 -2 162 69 180 164 27 86 -97 -16 -77 -202 -128 -73 -114 54 -99
15995i9R5L7J01K4n3O3j94mM3r4k4p6k9J09R3J09k19J17Q6r9P9J52r3j05Q2k14
$$ -99 -4 33 134 158 105 168 -26 -30 13 -81 -105 -181 -210 -101 -8 101 -118 -1 85 -14 65 217 124 19 101 -113
16021a13P4j07p5R3r9K41%j7J28qm6J95k03m8J03m3o2m2n8L2q0LJ46n2o6K16m1
$$ -113 -39 -146 -221 -128 -227 14 14 -3 125 117 71 266 63 15 118 75 13 -29 -87 -55 -135 -132 14 -38 -104 112 71
16048G1L5K7L1J6ok63P9q7J00j25j4P7k6o5J81j14K42p6Q9k3J4Ok19P9p5Q2k48
$$ 71 106 133 164 180 174 -89 -10 -97 3 -122 -136 -59 -85 -150 31 -83 159 83 172 149 163 169 -50 29 -46 36 -212
16075b12J13PM2q3J60o0N4J8J21o7J11Oj62K9p4r1NO6j8j5m3qK4NJ28PK3P7j3
$$ -212 -99 -92 -50 -133 27 -33 21 39 160 93 204 210 48 77 3 -88 -83 -17 -35 -50 -93 -101 -77 -72 56 63 86 163 150
16104A50r3l3qq5O9j43J04o8j0Q2Qo2L4O2l3Q6O8k8j24J24j40k6qoq5qJ02K6J11
$$ 150 57 24 16 -69 0 -143 -39 -107 -117 -35 -27 -89 -55 7 -26 60 128 100 -24 100 -40 -66 -74 -80 -165 -173 -71 -45 66
16133F6Mo7l3J72J8j16k7J97j38j01JRj22N5Jm9Q3J12m0kO1N4lj12J18j81J4l
$$ 66 70 3 -30 142 160 44 17 214 76 -25 -24 -15 -137 -82 -81 -130 -47 65 25 23 84 138 135 23 141 -40 -26 -29
16161b9j04mJ6K2j28J40J73j73K12rj3j05L8O2Jo7N3j93Jn0N3k7J24p1J22R5R4
$$ -29 -133 -137 -121 -99 -227 -87 86 -87 125 116 103 -2 36 98 99 32 85 -108 -107 -157 -104 -131 -7 -78 44 139 233
16188B33l9o0j56J44j62p7J6O2l5n7J16j01K29j02m4J43n3qQ3p7km7N7q5j33K5
$$ 233 194 134 -22 122 -40 -117 -101 -39 -74 -131 -15 -116 113 11 -33 110 57 49 132 55 53 6 63 -22 -155 -130
16214a30M1m5N2j7Q7M3J39j40n9K35j21J3l7nk3j63J08ln7M1P5p7n1J43%PoP2
$$ -130 -89 -134 -82 -99 -12 31 170 30 -29 206 85 98 61 56 33 -130 -22 -25 -82 -41 34 -43 -94 49 49 56 50 122
16242A22o0n2L1o5m8l7m4M0n8J22mkN0J33k25M9QP3o0P4q3k3K1q3N6pQ5Mq4J08
$$ 122 62 10 41 -24 -72 -109 -153 -113 -171 -49 -53 -55 -5 128 -97 -48 -40 33 -27 47 -36 -59 -38 -121 -65 -72 13 17 -67 41
16272D1k1nJ90j39M2k6r7P3m3Jj91p0K62k1q8N1jP3n9O3Q1o7M7j06p7L7m7J2j19
$$ 41 20 15 205 66 108 82 -15 58 15 16 -175 -245 17 -4 -92 -41 -42 31 -28 35 116 49 96 -10 -87 -50 -97 -85 -204
16301b04Q0J65j60O3Q9j8j5P1r5J08k0o3O5J7n3j33m4J8J63j37P4M4KM8O3j5n
$$ -204 -124 41 -119 -56 33 15 0 71 -24 84 64 1 66 83 30 -103 -147 -129 34 -103 -29 15 17 65 128 113 108
16328A08l6k6j33J29l0j00K2K1j02N6Q6pO3K9q6J68q1M1r2K04j19k04P4o0R3k52
$$ 108 72 46 -87 42 12 -88 -66 -45 -147 -91 -5 -12 51 80 -6 162 81 122 30 234 115 -89 -15 -75 18 -234
16354b34J17P3M1k6R0M5P9j44J03j83O8O8r3j18l5M1qR7o1l9J34K7N6J4qN0p7
$$ -234 -117 -44 -3 -29 61 106 185 41 144 -39 29 97 4 -114 -149 -108 -116 -19 -80 -119 15 42 98 112 104 154 77
16381G7lr
$$ 77 74 65
16383F5
$$ Imaginary data points
##PAGE= N=2
##DATA TABLE= (X++(I..I)), XYDATA
0@%%%%%%%%%%%%l2O4o4O4o5R7j28J60j92K24k57K90l54M18m82N78o74P70q90J010
$$ 0 0 0 0 0 0 0 0 0 0 0 0 0 -32 32 -32 32 -33 64 -64 96 -96 128 -129 161 -193 225 -257 321 -353 417 -473 537
32E37j147J284j444J637j832K056k311K576k865L190l544L927m349M816n319N864
$$ 537 -610 674 -770 867 -965 1091 -1220 1356 -1509 1681 -1863 2064 -2285 2531 -2788 3076
48C076o465P121p844Q642r525J0506j1601J2834j4232J5830j7680J9850k2438
$$ 3076 -3389 3732 -4112 4530 -4995 5511 -6090 6744 -7488 8342 -9338 10512 -11926
61a1926K5584k9505L4560m1357N1040o6038R2640j54034N57788J86704j003114
$$ -11926 13658 -15847 18713 -22644 28396 -37642 54998 -99036 458752 645456 -357658
72c57658j72451L20518N02392K6962k58453l24766K911J07744R3691M8444J15463
$$ -357658 -530109 -209591 292801 319763 61310 -263456 -260545 -152801 -59110 -10666 104797
83A04797l3899j29471m8849J70648K06118P4664k30956l61803j14996K82661K78376
$$ 104797 70898 -58573 -107422 63226 269344 344008 113052 -248751 -363747 -81086 197290
94A97290k1468k32838j89917l8291J40571J76977Q2938R093l792p9587q7283N3642
$$ 197290 175822 -57016 -246933 -285224 -144653 32324 115262 124355 120563 40976 -46307 7335
106G335J27424j1430j31192r2083J1469O9346L4202p7502q4681N6090J07304K851
$$ 7335 134759 123329 -7863 -99946 -88477 -19131 15071 -62431 -147112 -91022 16282 19133
118A9133j4782Q5211Q4187l2853j03382q5748k18R4966N6527q9866j15103l427
$$ 19133 4351 89562 173749 140896 37514 -48234 -48452 46514 103041 13175 -101928 -105355
130a05355L5140j4982j2866M7178R4186Q2369k7910j25518k4174J51017J00914
$$ -105355 -70215 -85197 -98063 -50885 43301 125670 97760 -27758 -51932 99085 199999
141A99999j12505j78777m9238Q9871J06243j2558j34933q5654O4855R5598K9034
$$ 199999 87494 -91283 -140521 -50650 55593 43035 -91898 -177552 -112697 -17099 11935
152A1935K8426N2612M167m9981m2543J1N1801N0120n4284j31826n3452O3154O4270
$$ 11935 40361 92973 97140 47159 4616 4627 56428 106548 52264 -79562 -133014 -69860 -5590
165e590j008m5422m6454J9568J02041Q4509j950l3323k5286l6675j8412L4894
$$ -5590 -6598 -52020 -98474 -78906 23135 107644 105694 72371 47085 10410 -8002 26892
177B6892L6439j9860o8084p9510l1585N7695P6728L772l0165J3257L5895K4068
$$ 26892 63331 43471 -24613 -104123 -135708 -78013 -1285 2487 -27678 -14421 21474 45542
189D5542K4996J1672k7146l8853k2843n581K3203K4121m5773r6233l6687N6549
$$ 45542 70538 82210 55064 16211 -6632 -12213 10990 35111 -10662 -106895 -143582 -87033
201h7033Q5538N5330n113n1911j8265N4197N4427m405l4967l5553k8737l302R939
$$ -87033 -1495 53835 48722 -3189 -21454 32743 87170 82765 47798 12245 -16492 -19794 -9855
214i855j1439k2141j4412k3092n671O2691Q4693J7640m2675l5849M415M5977M5031
$$ -9855 -21294 -43435 -57847 -80939 -86610 -23919 60774 78414 35739 -110 4305 50282 95313
227I5313k2109p4374m5846q44Q613J1845L586k8939k5092K8061N3171L7551K3645
$$ 95313 73204 -1170 -47016 -47860 -39247 -27402 -23816 -52755 -77847 -49786 3385 40936 64581
240F4581k987l5254j5142K7166J9116j6613l5207m6413k9671K2261L0890j9140
$$ 64581 61594 26340 11198 38364 57480 40867 5660 -40753 -70424 -48163 -17273 -36413
252c6413k9294J3695L7203L9574L9158M675l5250k0534J0304J1172R882k519n0498
$$ -36413 -65707 -52012 -14809 24765 63923 68598 33348 12814 23118 34290 44172 41653 -8845
265h845o1993k155L3335Q647o247j277K980L4584O3383K0593l9431l5995o195
$$ -8845 -70838 -72993 -39658 -31011 -37258 -38535 -35555 -971 62412 83005 43574 7579 1384
278A384J3112L6489K0434n0683p8527l1161P784K4809M7245K6275k9346k3025
$$ 1384 14496 50985 71419 20736 -57791 -88952 -81168 -56359 -9114 17161 -12185 -35210
290c5210L3679M7855K4809k190m1084m3700J9320M7982p322n2298m9888m0622
$$ -35210 -1531 46324 71133 68943 27859 -15841 3479 51461 44139 -8159 -58047 -98669
302i8669j620O4452O4666R37k8188j7593k004L7409O2727Q919n2323l8778p387
$$ -98669 -100289 -35837 28829 29766 1578 -16015 -18019 19390 82117 91036 38713 -65 -7452
315g452n68J0724k809n2708m6857K6899N8588L2020J1745j2152l3019M442N3783
$$ -7452 -8020 2704 -105 -52813 -99670 -72771 -14183 17837 29582 17430 -15589 -11147 42636
328D2636L5615m981k2338m6635m9425P590L6530j1030l9538j3389P936K7066N0872
$$ 42636 78251 73270 50932 4297 -45128 -37538 -1008 -12038 -51576 -64965 -57029 -29963 20909
341B0909K2564k8787j6646K1441K0965J8079J3551l3621o2161j9520J5200R42
$$ 20909 43473 14686 -1960 19481 40446 58525 72076 38455 -23706 -43226 -28026 -27084
353b7084k766n04k1380o287M5958M6386L291j1086j0866r729K4778M3475r169
$$ -27084 -29850 -30354 -51734 -58021 -12063 34323 37614 26528 15662 5933 30711 74186 65017
366F5017n5472l7847j7749r875K0128K6092j3151k2061J2663K6578K4238K6513
$$ 65017 9545 -28302 -46051 -55926 -35798 -9706 -22857 -44918 -32255 -5677 18561 45074
378D5074j771l1861j531L5712J3144k0381l1672m7577l7250K0504M6157J0766
$$ 45074 43303 11442 9911 45623 58767 38386 6714 -40863 -78113 -57609 -11452 -686
390f86j3539j1058r932J4418M8872L0140j2728j4560l689p341M106O518l4802
$$ -686 -14225 -25283 -35215 -20797 28075 58215 45487 30927 27238 19897 24003 30521 -4281
403d281n4424j1119K7825K7873K0407k804l2737j3292L5612M3840K3229Q103k1364
$$ -4281 -58705 -69824 -41999 -14126 6281 3477 -29260 -42552 -6940 36900 60129 68232 46868
416D6868m2881j3060J8808r94k4801j9817j4047M66L0089K5966j0934j6582O591
$$ 46868 3987 -9073 9735 8741 -16060 -35877 -49924 -49458 -19369 6597 -4337 -20919 -14328
429a4328K0459L2273L3730o903m4825k8964o84K393K875j468k4665k5364R514
$$ -14328 6131 38404 72134 65231 20406 -8558 -9242 -6849 -3974 -5442 -30107 -55471 -45957
442d5957K7534J7627R023l242j1050J4689M0680J6932k1933l0720k5310j3059
$$ -45957 -18423 -796 8227 4985 -6065 8624 49304 66236 44303 13583 -11727 -24786
454b4786J2236J5935j4432k8431r887R315K4190L0415P140j8533m088K3522K2576
$$ -24786 -12550 3385 -11047 -39478 -49365 -40050 -15860 14555 21695 3162 -926 22596 45172
467D5172R311q459l7229m2101o249K2448J6325j905j9681k7221M9L6876L4729
$$ 45172 54483 46024 8795 -33306 -39555 -17107 -782 -2687 -22368 -49589 -49540 -12664 22065
480B2065Q637n090r606m377J8354K1634j5104m2760l0775n340J6927K6290L593
$$ 22065 30702 25612 16006 11629 29983 51617 36513 -6247 -37022 -42362 -25435 855 4448
493D448k7582k1575O911K3368L2224K9924k73k3573j1621M482J135m368j2897
$$ 4448 -23134 -44709 -37798 -14430 17794 47718 47445 23872 12251 16733 17868 13500 603
506F03k4715j3376J3045J4766k116r151j0010o22K9964M4691J3446j9767k1188
$$ 603 -24112 -37488 -24443 -9677 -11793 -20944 -30954 -31576 -1612 43079 56525 36758 15570
519A5570j0904J38J0645j821k5103j9121L025O145K185K165o717m350K4283L6773
$$ 15570 4666 4804 15449 13628 -11475 -30596 -27571 -21426 -19241 -17076 -23793 -28143 -3860 32913
533C2913J3799o114j3405k1833j3596J3535J5888p770k2541k7666j9990J6157
$$ 32913 46712 40598 27193 5360 -8236 5299 21187 13417 -9124 -36790 -56780 -40623
545d0623M0535J2389k1983j2345J4325L0423L3652N917l9160m0399p10J9990J3985
$$ -40623 -88 12301 -9682 -22027 -7702 22721 56373 62290 23130 -17269 -17979 2011 15996
558A5996K91k5635m0375j0029K6261K6791J7166R835j1635j7413J6142L5468J0760
$$ 15996 16287 -9348 -49723 -59752 -33491 -6700 10466 20301 8666 -8747 7395 42863 53623
571E3623j7344l1599l3216l404L2771J7326k4014l1833j5214M661L3982M3492
$$ 53623 36279 4680 -28536 -31940 831 18157 -5857 -37690 -52904 -48243 -14261 29231
583B9231O738k2221o983R429Q857R093m863k9132k0490P307M582q204l427o498
$$ 29231 35969 13748 6765 16194 25051 34144 29281 149 -20341 -13034 -8452 -16656 -20083 -26581
597b6581j3027R387L0327J8963Q082P159r753j7333N182J3015q099j5858j0290
$$ -26581 -39608 -30221 106 19069 27151 34310 24557 7224 12406 25421 17322 1464 -8826
610h826j1679j973R909j0258k5846Q215M1323K8804N380r048k0396p077K3049
$$ -8826 -20505 -22478 -12569 -22827 -48673 -40458 865 29669 35049 26001 5605 -1472 21577
623B1577J6170j3960j7532j2262j8317p024J1963J681j0773K330J0211J0116K6559
$$ 21577 37747 23787 6255 -6007 -24324 -31348 -19385 -17704 -28477 -26147 -15936 -5820 20739
636B0739K6735j1516l1835r586J2121J9098J6183j7023n0658l0946J3191K2750
$$ 20739 47474 35958 4123 -5463 6658 25756 41939 24916 -25742 -56688 -43497 -20747
648b0747J3944P487j0867j5236J6251L5549J4504o160j2627j9358o364K0291J1195
$$ -20747 -6803 684 -10183 -25419 -9168 26381 40885 34725 22098 2740 -3624 16667 27862
661B7862k1945k8394j7597r928J2819L3934J6410j0510q439J985R624K4263J9323
$$ 27862 5917 -22477 -40074 -50002 -37183 -3249 13161 2651 -5788 -3803 5821 30084 49407
674D9407j6627k9837q218O111L969q00j9025l2128m139L0219K3824L924P08k576
$$ 49407 32780 2943 -5275 836 4805 4005 -15020 -47148 -51287 -21068 2756 6680 7388 4812
688D812k793J3087J6110j107p193n810j6294j4296M896J827j7067j4147K806J2577
$$ 4812 2019 15106 31216 30109 22916 17106 812 -13484 -8588 -6761 -23828 -37975 -35169 -22592
702b2592K3420K2731m993k0647N4J8636J4225O055q267k5496j8290K408P52r931
$$ -22592 828 23559 18566 -2081 -2027 16609 30834 36889 28622 3126 -15164 -12756 -12004 -21935
716b1935m802L89J118J4571K2303N873q148m472R45R327K0050O747k3099k8683
$$ -21935 -26737 -26348 -25230 -10659 11644 17517 9369 4897 5842 15169 35219 41966 18867 -9816
730i816j3212m078M058J1348J193j0335l05J3637J3189J0031M024p929m241J4322
$$ -9816 -23028 -27106 -23048 -11700 -10507 -20842 -21147 -7510 5679 15710 19734 11805 7564 21886
744B1886J2992p665k0494k3926j8654M240K1401Q619r849p768R45R029J9202J5337
$$ 21886 34878 27213 6719 -17207 -35861 -31621 -10220 -1601 -11450 -19218 -18273 -9244 9958 25295
758B5295k391o964O82J188P2q24j5164k7632j2368J1604J7406J0204l107j6113
$$ 25295 22904 15940 16622 17810 17882 17058 1894 -25738 -38106 -26502 -9096 1108 -1999 -18112
772a8112p606J9838K8436J1832l340j2190j4811j049J1750q10k0145j9556q887
$$ -18112 -25718 -5880 22556 34388 31048 18858 4047 2998 14748 13938 -6207 -25763 -34650
785c4650M025J9311J7793m399j4771k444J1589K1804K2570J42k5175j9782N18
$$ -34650 -30625 -11314 6479 2080 -12691 -15135 -3546 18258 40828 40970 15795 -3987 -3469
798c469N330J033n934j7982j6658P389K1898J3467K246o581j1240N536K7861K0067
$$ -3469 1861 2894 -3040 -21022 -37680 -30291 -8393 5074 7320 739 -10501 -4965 22896 42963
812D2963n831j9010k1399j5811L733J4170k008j4879p345J101Q488J7745J0152
$$ 42963 37132 18122 -3277 -19088 -15355 -1185 -3193 -18072 -25417 -24316 -15828 1917 12069
825A2069q294m334J3214J3576O201j156j8618k8349r066J0958P882P55m532j3617
$$ 12069 3775 -559 12655 26231 32432 31276 12658 -15691 -24757 -13799 -5917 -5162 -9694 -23311
839b3311o098J6777J9236M321K217M546j034L405Q858q828k5031j3674J75L549
$$ -23311 -29409 -12632 6604 10925 13142 17688 16654 20059 28917 20089 -4942 -18616 -18441 -14892
853a4892R185M278j5221j4202Q516J7413J4463J4775L444j3237m771R635Q7j2204
$$ -14892 -5707 -1429 -16650 -30852 -22336 -4923 9540 24315 27759 14522 9751 19386 19473 7269
867G269j1051j2260r091R974J3088p146j2799p86N474J5296K7710J1878j5049
$$ 7269 -3782 -16042 -25133 -15159 -2071 -9217 -22016 -22802 -17328 -2032 25678 37556 22507
880B2507j3588l94K05K271K374j5284k2880k831J0171M753M481P53j0408J003
$$ 22507 8919 8525 8730 11001 13375 -1909 -24789 -27620 -17449 -12696 -8215 -7462 -17870 -16867
894a6867K6330K2473Q34p122j1778j6024N59J3834l168j8325j2116o659n27J6097
$$ -16867 9463 31936 32770 25648 13870 -2154 -1595 12239 9071 -9254 -21370 -28029 -28556 -12459
908a2459J4334p738p873J1416J5300J2871J2640p074k6881j4070O761M893j04
$$ -12459 1875 -5863 -13736 -2320 12980 25851 38491 31417 4536 -9534 -2773 2120 2016
921B016l685j7948j7284Q445J8896O446L819N456j199N744J9124O137j6892j6548
$$ 2016 -1669 -19617 -36901 -28456 -9560 -3114 705 6161 4962 10706 29830 35967 19075 2527
935B527q659m944P409J0242j2409k2381n543P302J1370J9971J3782o824n562J0388
$$ 2527 -6132 -11076 -3667 6575 -5834 -28215 -33758 -26456 -15086 4885 18667 11843 6281 16669
949A6669P927k790m502j1937j6849o8J1107l028j2775r014p397L869K5929K4179
$$ 16669 24596 21806 17304 5367 -11482 -11550 -443 -3471 -16246 -25260 -32657 -28788 -2859 21320
963B1320L3p898k364j852M177J0600l734j9608j1515j232k434R11P48j1071o862
$$ 21320 21353 13455 11091 9239 13416 24016 20282 674 -10841 -12073 -14507 -13596 -12848 -23919 -30781
978c0781J6272K3184J1239L789n268j3613j579J4487O444r270j3263j5985j2301
$$ -30781 -14509 8675 19914 23703 18435 4822 3243 17730 24174 14904 1641 -14344 -26645
991b6645N205J1826k546p251L140Q334J2687J7801N947j2709j0429K134M903L534
$$ -26645 -21440 -9614 -12160 -19411 -16271 -7937 4750 22551 28498 15789 5360 7494 12397 15931
1005A5931j320j7146k1404l926Q495N067L826K916k722L914J7665J3867j470o876
$$ 15931 14611 -2535 -23939 -27865 -19370 -14303 -10477 -7561 -10283 -6369 11296 25163 23693 16817
1019A6817q123o648N045Q931p237j9965j3770m557M710J4853J0623m447l369R366
$$ 16817 8694 2046 7091 16022 8785 -11180 -24950 -29507 -24797 -9944 679 -3768 -7137 2229
1033B229J1896P906K849q280j3710j684O972J72p638j2325j7219p292J4795J9925
$$ 2229 14125 22031 24880 16600 2890 1206 8178 8350 712 -11613 -28832 -36124 -21329 -1404
1047a404P960q00m018k716Q893J5585K944j0823j0035o099k548L696j777j6511
$$ -1404 6556 5756 1738 -978 7915 23500 26444 15621 5586 -513 -3061 635 -1142 -17653
1061a7653j4404L313J4132J6644J2817k281j2977k652J2120J1803N586l725j6916
$$ -17653 -32057 -28744 -14612 2032 14849 12568 -409 -3061 9059 20862 26448 22723 5807
1074E807j6944j377M310k955m523k747k270P392J8112R898l772n142j712L461
$$ 5807 -11137 -12514 -8204 -11159 -15682 -18429 -20699 -13307 4805 14703 10931 5789 4077 7538
1088G538J2851Q726j2347k1664j0968j968K586O549J0q679M5J2990J0495N046
$$ 7538 20389 29115 16768 -4896 -15864 -17832 -15246 -8697 -8687 -17366 -17321 -4331 6164 11210
1102A1210L535l869n089O785Q673m323j0633j1618j4537n568J1664R550l835m442
$$ 11210 14745 10876 5787 12572 21245 16922 6289 -5329 -19866 -25434 -13770 -4220 -8055 -12497
1116a2497R86M615J3914J4931k653j1599o60N426J158J74q272k0874j3109P296
$$ -12497 -11511 -6896 7018 21949 19296 7697 7037 12463 13621 13795 5523 -15351 -28460 -21164
1130b1164J0511M756L339k775o590P804J7842P049k026k441p867o689N881L715
$$ -21164 -10653 -5897 -2558 -5333 -11923 -4119 13723 20772 18746 16305 8438 1749 7630 11345
1144A1345j3918j6160n794m30R329J8093M762j1186m583P810R671J2644Q036j1693
$$ 11345 -2573 -18733 -24527 -24957 -15628 2465 7227 -3959 -8542 -732 8939 21583 29619 17926
1158A7926j6821j388L149n652o408n917r088K162J6251Q504k410K69O1p80J2144
$$ 17926 1105 -283 2866 -2786 -9194 -15111 -24199 -22037 -5786 2718 308 577 638 -142 12002
1173A2002J6197j570j3158j0099j0784o787O918M198j0956p865N710P649P840
$$ 12002 28199 26629 13471 3372 -7412 -14199 -7281 -3083 -14039 -21904 -16194 -8545 -705
1186g05Q448k486p145R262J6246K002o636q778j6245j1170O270O850m962m314
$$ -705 7743 5257 -1888 7374 23620 25622 18986 10208 -6037 -17207 -10937 -4087 -9049 -13363
1200a3363j368l393O295J7244O824m538J408M293J167N250J177j7046j9027k135
$$ -13363 -14731 -18124 -11829 5415 12239 7701 9109 13402 14569 19819 20996 3950 -15077 -17212
1214a7212N127L436M515l568j2482k36J6325J2957N653L950m753p513N480Q018
$$ -17212 -12085 -8649 -4134 -7702 -20184 -20420 -4095 8862 14515 18465 13712 6199 11679 19697
1228A9697p737j4302q983o843m31J0633M859q042l730M154N986J2319J5275Pj1332
$$ 19697 11960 -2342 -11325 -18168 -18599 -7966 -3107 -11149 -14879 -10725 -4739 7580 22855 22862 11530
1243A1530l588J825k129j269n257j5575r340P811R388Q67r73l028k694J1198J9365
$$ 11530 7942 9767 7638 6369 1112 -14463 -23803 -15992 -6604 -5737 -6710 -9738 -12432 -1234 18131
1258A8131O333n156m621p026p617J910K098r204r363j901J56L472Q737J136o767
$$ 18131 24464 19308 14687 7661 44 1954 4052 -5152 -14515 -16416 -16260 -12788 -4051 -2915 -9682
1273i682L630J4406J0679N674j279j3499j4245M61O079j235n192p193r297p0J1169
$$ -9682 -6052 8354 19033 24707 23428 9929 -4316 -3855 2224 989 -4203 -11396 -20693 -20763 -9594
1288i594P212k41K482M417M492R611P309q217j4845p331p17K447M740l567j4017
$$ -9594 -2382 -2623 -141 4276 8768 18379 25688 17471 2626 -4705 -5422 -2975 1765 -1802 -15819
1303a5819p901M692Q725R854R265K27m218M219Q266N94n153p887j0740l759O278
$$ -15819 -23720 -19028 -10303 -449 8816 9043 4825 9044 17310 17904 12751 4864 -5876 -9635 -3357
1318c357K905p435q333m192J262J2372J6190M631m634j706J194J957M001j336
$$ -3357 -452 -7887 -16220 -20412 -19150 -6778 9412 14043 9409 7703 8897 10854 14855 13519
1332A3519j1344j0103j271O56O63Q49n490o925N157J4673J0783M129j042o502
$$ 13519 2175 -7928 -9199 -8543 -7880 -7031 -12521 -19446 -14289 384 11167 15296 14254 7752
1346G752l811N812M255n494q753p802n850J775O083j562o485M44O547R124J2047
$$ 7752 3941 9753 14008 8514 -239 -8041 -13891 -12116 -6033 -7595 -14080 -13636 -7089 2035 14082
1361A4082O557o705r530j212K572K360Q76p869j3911m558N012L183P49J532l87
$$ 14082 20639 13934 4404 3192 5764 8124 9000 1131 -12780 -17338 -12326 -9143 -8394 -6862 -7249
1376g249K623J2332J0654j157o052n651n742J586P730j066j2107j0045m292o0
$$ -7249 -4626 7706 18360 17203 11151 5500 -242 1344 9074 8008 -4099 -14144 -18436 -18496
1390a8496Q244J0240j65l418N367P835L972K483l635j0403l700N878J429n060
$$ -18496 -10252 -12 -177 -3595 1772 9607 13579 16062 12427 2024 -1676 4202 5631 571
1404E71o055j0138q203O411J4433O707N67L42k386J320R571M358p319o862k146
$$ 571 -5484 -15622 -23825 -17414 -2981 3726 4293 4635 2249 3569 13140 17498 10179 3317 1171
1419A171l046m06J019p888j1111J230R395P928Q153M265o497m782O914P319O09
$$ 1171 -1875 -2281 -1262 -9150 -20261 -19031 -9636 -1708 6445 10710 4213 -569 6345 13664 14273
1434A4273j584o986j1959k834N609j815p156j943P80L359J1900J0247k869m856
$$ 14273 12689 5703 -6256 -9090 -3481 -5296 -12452 -14395 -13615 -10256 1644 11891 9022 4166
1448D166J036J456K829O091k928j3817q307K54p81M02K662l796l517Q901J2278
$$ 4166 5202 6658 9487 15578 12650 -1167 -9474 -9220 -10001 -9599 -6937 -10733 -14250 -5349 6929
1463F929L416n2j390n542L14R035K223r163q642p041o771K672Q807k09m629L094
$$ 6929 10345 10293 8903 3361 3675 12710 14933 5770 -2872 -9913 -16684 -14012 -5205 -5414 -10043 -6949
1479f949N891N070P792L032p799m538N252L217k235l412j0320j3154j094R019
$$ -6949 -1058 4012 11804 14836 7037 2499 7751 10968 8733 5321 -4999 -18153 -19247 -10228
1493a0228M990J521J940j836l86R638Q519j771l012q98l260n43K850o398j4041
$$ -10228 -5238 -3717 -1777 -3613 -3999 5639 14158 12387 9375 8477 5217 4674 7524 1126 -12915
1508a2915n608K976M604Q065O621m123n896N037Q413N162M287j528r555n705K455
$$ -12915 -18523 -15547 -10943 -2878 3743 -380 -6276 -1239 7174 12336 16623 15095 5540 -165 2290
1523B290j857o868m295l585k004P651J0117M14l575N02K291N487J0342L138r282
$$ 2290 433 -6435 -10730 -14315 -16319 -8668 1449 1863 -1712 -1210 1081 6568 16910 20048 10766
1538A0766r285l270k809n28J516m864p223J993P651M756L858J732l233N24R486
$$ 10766 1481 -1789 -4598 -5126 -3610 -8474 -15697 -13704 -6053 -1297 2561 4293 1060 1584 11070
1553A1070O677k519o067q285r191q42N565m81n559k478N60L252Q695O763j939
$$ 11070 17747 15228 9161 876 -8315 -9157 -3592 -4073 -9632 -12110 -11550 -8298 397 7160 5221
1568E221k037L681L940K377J118o512j2704o033K315K218J055k64m482k461O749
$$ 5221 3184 6865 10805 13182 14300 7788 -4916 -10949 -8634 -6416 -5361 -5625 -10107 -12568 -5819
1583e819R242L372J505K77j725J656M771k156r764q296m208p10N185M833l124
$$ -5819 3423 6795 8300 8577 6852 8508 13279 11123 1359 -6937 -11145 -11855 -6670 -1837 -4961
1598d961n273N58M976P195Q558K498m888k354K398l54l625n070p429n257L144
$$ -4961 -10234 -9676 -4700 2495 11053 13551 8663 6309 8707 8353 4728 -342 -7771 -13028 -9884
1613i884N709N59j999k047j495N077J1931P625j462m214m483l943J101J977n043
$$ -9884 -4175 -3616 -5615 -7662 -9157 -4080 7851 15476 14014 9800 5317 1374 2475 4452 -591
1628e91p924k689J247K479L900M53l856P98R038Q057L955p5o456q823j183L716
$$ -591 -8515 -11204 -9957 -7478 -3578 -3125 -6981 -6183 2855 10912 14867 14792 8336 -487 -1670 2046
1644B046k76l323m431o074j606O164N383j48N06K616K805N959O106k713q838n390
$$ 2046 1770 -1553 -5984 -12058 -13664 -7500 -2117 -2265 -1759 857 3662 9621 15727 13014 4176 -1214
1660a214j087M25K721r73q299o248K658N431M659M982O95k416L420P155R24l932
$$ -1214 -2301 -1876 845 -128 -8427 -14675 -12017 -6586 -1927 3055 3750 1334 4754 11909 12833 8901
1676H901m498o184l957L104K563m331m873j821r23M645J0152M739k714n42K388
$$ 8901 4403 -1781 -5738 -2634 -71 -4402 -9275 -11096 -12019 -7374 2778 7517 4803 4261 6649
1691F649J286K207l3q136q232J64K997k65o86l451n890J561J0307P468K055J148
$$ 6649 7935 10142 10109 1973 -6259 -6095 -3098 -3363 -4049 -7500 -13390 -11829 -1522 5946 8001 9149
1707I149j852l774K084L695l375o113l231l477j297L968N83n923j953N463O323
$$ 9149 7297 3523 5607 9302 5927 -186 -3417 -6894 -8191 -4223 -3640 -9563 -11516 -6053 270
1722B70P201O228k707q076j457L548P99m34k788q564n778L154L098j532K98J980
$$ 270 7471 13699 10992 2916 1459 5007 5806 5372 2584 -5980 -11758 -8604 -5506 -7038 -6740 -4760
1738d760R79O338R040R86n534k844j572j153L302J708p465q441k014j17K202O510
$$ -4760 -3781 2557 11597 12583 7049 4205 2633 1480 4782 6490 -975 -9416 -11430 -11547 -9345 -2835
1754b835K930l254J539P579L973N19p82n382n000K954L684m659o489m369m259
$$ -2835 95 -3159 -1620 5959 9932 10451 9669 4287 -713 2241 5925 1266 -5223 -9592 -13851
1769a3851Q91Q584N332j121L60K578J307L867M758l012o962k094k05j350j39k729
$$ -13851 -12960 -4376 956 -165 195 2773 4080 7947 12705 9693 2731 637 432 -918 -1057 -3786
1785c786q118l461O132O855L577L043m21k809L282O607N49m071l455m888l551
$$ -3786 -11904 -15365 -9233 -2378 1199 4242 3821 1012 4294 10901 11450 7379 3924 -964 -4515
1800d515K283P39o410m747J028L198N979Q340J677m287p29L225J853K143J66o736
$$ -4515 -2232 -1493 -7903 -12650 -11622 -8424 -2445 5895 7572 3285 2556 5781 7634 9777 9943 3207
1816C207p761q90P18k063r63r53k083L593R726N234j270j502j477k04N039L780
$$ 3207 -4554 -5444 -4726 -6789 -7752 -8705 -10788 -7195 2531 7765 6495 4993 3516 3312 8351 12131
1832A2131m422q241m777l366j233L373J511k795K03N235M578L644K875k165l713
$$ 12131 7709 -532 -5309 -8675 -9908 -6535 -5024 -7819 -7616 -2381 2197 5841 8716 6551 2838
1847B838K264M199m90l805o297q476l541M419M601jl08M98P23N006O656J158k657
$$ 2838 5102 9301 8811 5006 -1291 -9767 -13308 -8889 -4288 -4289 -4597 -4099 -3376 1630 8286 9444 6787
1864F787o28q4o58L78k846q589o302O79L168L611L230q76k891K432O866M407J820
$$ 6787 6159 6075 5417 5795 2949 -5640 -11942 -11263 -8095 -4484 -1254 -2130 -5021 -2589 4277 8684 10504
1881A0504m04m343l746J163K43m663n336l545j734L262O600K170k170l37K347
$$ 10504 10100 5757 2011 3174 3417 -1246 -6582 -10127 -11861 -8599 -1999 171 -1999 -2336 11
1896A1M131N783L135m264n426j820r61j837r94l781n302N9N288M389K210R05j926
$$ 11 4142 9925 13060 8796 3370 1550 589 -1248 -2242 -6023 -11325 -11266 -5978 -1589 621 1526 -400
1913d00J76N929N989J56l566m883n792k028K075o01m447j979R68K262N119M196
$$ -400 -224 5705 11694 11850 8284 3401 -2391 -4419 -2344 -2945 -7392 -9371 -8403 -6141 -1022 3174
1929C174j074j801K867M144K846J334l553q745n623R31J201K25k86k679k043L685
$$ 3174 2100 299 3166 7310 10156 11490 7937 -808 -6431 -5500 -4299 -4074 -4360 -7039 -9082 -5397
1945e397O229K148O11J411RJ241M064m46p180o418k930j190K921L585k049m580
$$ -5397 832 2980 3591 5002 5011 6252 10316 9870 2690 -3728 -6658 -7848 -4927 -1342 -3391 -7971
1961g971J08L668M185N797L157k672j820K268N60k995l170m468n262P14M657N34
$$ -7971 -7863 -4195 -10 5787 8944 6272 4452 6720 7280 4285 1115 -3353 -8615 -7901 -3244 -2710
1977b710k224q37n21J997Q016O586j122k874j161j919o29J361k971o920k551J727
$$ -2710 -4934 -5771 -6292 -4295 3721 10307 9185 6311 5150 3231 2602 3963 992 -5928 -8479 -6752
1993f752R45J802K088k347j490N755O868K380P07j923n882k528K960l32m449l130
$$ -6752 -5807 -4005 -1917 -4264 -5754 1 6869 9249 9956 8033 2151 -377 2583 2251 -2198 -5328
2009e328k433j765L396M966n78j912K750L440L452N082M85o678n214K4n41m88
$$ -5328 -7761 -9526 -6130 -1164 -1742 -3654 -904 2536 5988 11070 11555 4877 -337 -313 -854 -1342
2025a342M03l783n528J155M825J864J704K406m60J179O365L086l820m648l708
$$ -1342 -939 -4722 -10250 -9095 -4270 -2406 -702 1704 1244 2423 8788 11874 8054 3406 -302
2040c02l701N05L797j783n494k085Q63J496N545N511n23j084L330K239p92p10
$$ -302 -4003 -3498 299 -1484 -6978 -9063 -8200 -6704 -1159 4352 3829 2745 6075 8314 7522 6812
2056F812l626o471j792L132L30k494j948k985j425O241Q092K135l2L58j615o12
$$ 6812 3186 -3285 -5077 -1945 -1615 -4109 -6057 -9042 -10467 -4226 3866 6001 5969 6327 4712 4100
2072D100K820m02n970l630q28j239K23J340l053l416L648O418M494L671N77m149
$$ 4100 6920 6518 548 -3082 -3910 -5149 -4926 -3586 -6639 -10055 -6407 11 4505 8176 8753 4604
2088D604k646K887J391k364k588l961m881k03L251m33j693J168K362L165O462
$$ 4604 1958 4845 6236 3872 1284 -2677 -7558 -7761 -4510 -4943 -6636 -5468 -3106 59 6521
2103F521L869l151l626l33J03K09Q21l855o872k780J508J162J592K281n07N09
$$ 6521 10390 7239 3613 3280 3383 3592 4413 558 -6314 -9094 -7586 -6424 -4832 -2551 -3058 -2549
2119b549N508N201N18j427k111l728l35K745j027n201m288k547p76L701M991J87
$$ -2549 2959 8160 8678 7251 5140 1412 1077 3822 2795 -2406 -6694 -9241 -10017 -6316 -1325 -1138
2135a138n89K824L270K332K600j202n069k659J165J15j574k408n365m156K298
$$ -1138 -1727 1097 4367 6699 9299 8097 3028 369 1534 1649 75 -2333 -7698 -11854 -9556
2150i556N531L348J965J372o26J076M016J733k795k638j895k309k06J07l934n029
$$ -9556 -4025 -677 1288 2660 2034 3110 7126 8859 6064 3426 1531 -778 -984 -877 -4811 -9840
2166i840m94L024M274N388K690k441j397K532K513J333J11l522n439j790M72j705
$$ -9840 -10334 -7310 -3036 2352 5042 2601 1204 3736 6249 7582 7693 4171 -1268 -3058 -2586 -4291
2182d291k194j041n87J908O110M456k70j001j71K59K609L106j765n562m251k455
$$ -4291 -6485 -7526 -8113 -6205 -95 4361 4091 3090 2919 3178 5787 8893 7128 1566 -2685 -5140
2198e140j155J118J118k032r96L673M212K717K016q67k286J208L644J59l114l830
$$ -5140 -6295 -5177 -4059 -6091 -7087 -3414 798 3515 5531 4664 2378 3586 7230 7389 4275 445
2214D45n522l199J817K865m38n85Q24Q45L250N059J408k147o09N74j30N44r73
$$ 445 -5077 -8276 -6459 -3594 -4032 -4617 -3793 -2948 302 5361 6769 4622 4013 4587 4457 5001 4028
2231D028n913n714m65J942J595K268O80k045J174N164L065M98K26j947k449J301
$$ 4028 -1885 -7599 -8064 -6122 -4527 -2259 -1579 -3624 -2450 2714 5779 6277 6503 4556 2107 3408
2247C408R48l875n078k441j485J178N022K730j876n21K050J883L171L574j362
$$ 3408 4356 481 -4597 -7038 -8523 -7345 -2323 407 -1469 -1990 60 1943 5114 8688 7326
2262G326m129j158j80k199j691j799m101j056M740L751M16K68l86p29L709N689
$$ 7326 3197 2039 1859 -340 -2031 -3830 -7931 -8987 -4247 -496 -80 188 -198 -927 2782 8471
2278H471M75l140k399l182l259O52O17l336k087J523J506K047L624L77k226J588
$$ 8471 8946 5806 3407 225 -3034 -2382 -1765 -5101 -7188 -5665 -4159 -2112 1512 1889 -337 1251
2294A251M531J774K29j112n710n373L33J860j019q29l88j899J248N088K786q79
$$ 1251 5782 7556 7785 6673 963 -4410 -4077 -2217 -3236 -4065 -4453 -6352 -5104 -16 2770 1891
2310A891J005J461K00J973J385m526o088j586j56n0K002L46l535r48L861L177
$$ 1891 2896 4357 4557 6530 7915 3389 -2699 -4285 -4441 -4491 -2489 -2143 -5678 -6626 -2765 412
2326D12K458K820j71k445J142K446k105l653k735l617j453L126K204k041j318
$$ 412 2870 5690 5519 3074 4216 6662 4557 904 -1831 -5448 -6901 -3775 -1571 -3612 -4930
2341d930J120J250L503N539O58k680m69P37j541q54j145m796l701J523K209K32
$$ -4930 -3810 -2560 943 6482 7140 4460 3991 4728 3187 2333 1188 -3608 -7309 -5786 -3577 -3345
2357c345J097j71j820K293N969L155k55n05k396l273L87P46l135l663o24m39Q34
$$ -3345 -2248 -2419 -4239 -1946 4023 7178 6923 6418 4022 749 1136 1882 -1253 -4916 -5540 -5979 -5145
2374e145L042R55k154Q70M134L017K550J674l195m961j189P63j108j039j191l432
$$ -5145 -2103 -1148 -3302 -2432 1702 4719 7269 8943 5748 787 -402 361 -747 -1786 -2977 -6409
2390f409j152L155K537K22J170J655R96L312L504j599m341k677j575q27J430M6
$$ -6409 -7561 -4406 -1869 -1647 -477 1178 2174 5486 8990 7391 3050 373 -1202 -2029 -599 -553
2406e53l923k999Q34J599K635L919J280r94J668K904L39j477j884l795k615J214
$$ -553 -4476 -7475 -6641 -5042 -2407 1512 2792 1798 3466 6370 6709 5232 3348 -447 -3062 -1848
2422a848J115k273k177j298p76K727N438K798m95N01L65J19J260K85l652l868
$$ -1848 -733 -3006 -5183 -6481 -7257 -4530 908 3706 3211 3712 4077 4196 5456 5741 2089 -1779
2438a779r22l00l46K45j353k644R68M383L765K091J473j208j745J289J292j427
$$ -1779 -2701 -3001 -3347 -3102 -4455 -7099 -6131 -1748 2017 4108 5581 4373 2628 3917 5209 3782
2454C782k575k490k792q60J692q2j964k39J730K472M382L646r18k462l88L14k71
$$ 3782 1207 -1283 -4075 -4935 -3243 -3325 -5289 -5528 -3798 -1326 3056 6702 5784 3322 2934 3248 2977
2471B977K50j657m441k546N59M25J8R12J14K57L830M510J155j067j380k061p07
$$ 2977 3227 1570 -2871 -5417 -4858 -4433 -4415 -3503 -3389 -3132 698 5208 6363 5296 3916 1855 1148
2488A148J969P4l481l281j908j204J104K968Q66o06K106K860J616J717l5l196
$$ 1148 3117 3191 -290 -3571 -5479 -6683 -5579 -2611 -1745 -2351 -245 2615 4231 5948 5913 2717
2504B717k031J141O59j446j825l441l659P06L611K117J104J229J07L32K991K127
$$ 2717 686 1827 2486 1040 -785 -4226 -7885 -7179 -3568 -1451 -347 882 989 1321 4312 6439
2520F439j846j839q02j467n91M34k478m322p88K062K004L048K567r39j200K193
$$ 6439 4593 2754 1952 485 -106 328 -2150 -6472 -7260 -5198 -3194 -146 2421 1482 282 2475
2536B475K329J95J70j294l850j562J079j218k446r44o31J18L812M101Mj033Q94
$$ 2475 4804 4999 5169 3875 25 -1537 -458 -1676 -4122 -5066 -5697 -5579 -1767 2334 2338 1305 2199
2553B199K89P94K594m16l897k790m56j481n18P46j377j724K556L897J496J145
$$ 2199 2488 3282 5876 5460 1563 -1227 -1683 -3164 -3682 -2936 -4313 -6037 -3481 416 1912 3057
2569C057N57j657m22K915J179k293k184k696l157j29K333n23j485J167J740J333
$$ 3057 3614 1957 1535 4450 5629 3336 1152 -1544 -4701 -4830 -2497 -3020 -4505 -3338 -1598 -265
2585b65L070K131j997j324J567N57k25J3l070m924j538J919O77M96J473m43l53
$$ -265 2805 4936 2939 1615 3182 3739 3514 3527 457 -4467 -6005 -4086 -3409 -2913 -1440 -1883 -2236
2602b236L249L071l45k31K48j263k61J352j633m755k429j36K2K400K967o79j663
$$ -2236 1013 4084 3739 3508 3756 2493 2232 3584 1951 -2804 -5233 -5369 -5347 -2947 20 -659 -2322
2619b322J626K472J360K047N07k838j475Q46j023k640j377j853j871K141L505
$$ -2322 -696 1776 3136 5183 5690 2852 1377 2223 1200 -1440 -2817 -4670 -6541 -4400 -895
2634h95M36m44P17K44J237L658K045k365k180j064j962q80M03j900k840M82K260
$$ -895 -459 -903 -186 58 1295 4953 6998 4633 2453 1389 -573 -1453 -1050 -2950 -5790 -5308 -3048
2651c048J234J685J432j009k22L329K337k16p97k262l897j238J392q66j846l46
$$ -3048 -1814 -129 1303 294 72 3401 5738 5522 4725 2463 -1434 -2672 -1280 -2146 -3992 -4338
2667d338lK31K955K784m01m41J803J275N51J539j571m545k397Om62J2N82j445
$$ -4338 -4341 -4110 -1155 1629 1228 787 2590 3865 4416 5955 4384 -161 -2558 -2552 -3014 -3002 -2420 -3865
2685c865j243K271L073J136R92J132o47N27K252m74l412k710j945j655R63J815
$$ -3865 -5108 -2837 236 1372 2364 3496 2849 3376 5628 5154 1742 -968 -2913 -4568 -3605 -1790
2701a790n37j752N47J111J883L332J806q80n52J069l17j250j324k905l099J91
$$ -1790 -2327 -4079 -3532 -2421 -538 2794 4600 3720 3168 4237 3920 2670 1346 -1559 -4658 -4467
2717d467J884K17m09j05o77Q15M177L291L23m04p59j633m82N55j976l227j077
$$ -4467 -2583 -2366 -2775 -2880 -3557 -2742 1435 4726 5049 4645 3886 2253 1771 2326 350 -2877 -3954
2734c954l9m6J424Q80j141j18K828L040J886J413j071l164j133P17q36j473j225
$$ -3954 -3993 -4039 -2615 -1735 -2876 -2994 -166 2874 4760 6173 5102 1938 805 1522 686 -787 -2012
2751b012k110j339J656J753j00L16J345J356K209L017j79k592j870q43q77J47
$$ -2012 -4122 -5461 -3805 -2052 -2152 -1836 -491 865 3074 6091 5912 3320 1450 607 -270 -123
2767a23Q9k732k440K88J094J218K024J077l43J324L128Q72r04j191k470k110L27
$$ -123 -34 -2766 -5206 -4918 -3824 -2606 -582 495 152 1476 4604 5476 4572 3381 911 -1199 -872
2784h72R95j753j838j021q26J062L167K158k21Q97J395N80O92N47k441l193o17
$$ -872 123 -1630 -3468 -4489 -5315 -4253 -1086 1072 851 1748 3143 3723 4415 4962 2521 -672 -1289
2801a289K24n44k49q80k548k67K904K778J480J703M7j278P92J606j196k134j218
$$ -1289 -1065 -1609 -1858 -2738 -5286 -5553 -2649 129 1609 3312 3359 2081 2873 4479 3283 1149 -69
2818f9j537j229R75R5k463q45J435J851K611L194J16j872j84J000m54r0l70k987
$$ -69 -1606 -2835 -1860 -1765 -4228 -5073 -3638 -1787 824 4018 4134 2262 2078 3078 2624 2534 2164 -823
2836h23k513M33M48j097LO28k24K417L946J154j123m65p92p99J294P43k491l006
$$ -823 -3336 -2903 -2455 -3552 -3549 -2921 -3145 -728 3218 4372 3249 2784 1992 1193 2487 3230 739 -2267
2854b267j024q07k40J809Q32q78R98K944J542O18P61j421k161Q13J134j238j848
$$ -2267 -3291 -4098 -4338 -2529 -1697 -2575 -1577 1367 2909 3527 4288 2867 706 1519 2653 1415 -433
2871d33j761k624q07K466J824k36Q86J062N72J695K301q84k291k50r6r72p5r14
$$ -433 -2194 -4818 -5625 -3159 -1335 -1571 -685 377 949 2644 4945 4061 1770 1520 1424 452 377 -537
2889e37l414j857J608J534J117K154N50j082J458K379J15q02l24j766j762P69
$$ -537 -3951 -5808 -4200 -2666 -1549 605 1155 73 1531 3910 4025 3223 2899 1133 -629 140
2905A40j70k616j883j04K37J872L435J076j205L36J252M41Q37P49k144k629m04
$$ 140 -30 -2646 -4529 -4633 -4396 -2524 911 1987 782 1118 2370 2811 3648 4397 2253 -376 -780
2922g80k19j611l53m61j413R01L703J789J83M02k70n90J718J808j208k389j485
$$ -780 -999 -2610 -2963 -3424 -4837 -3936 -233 1556 1739 2141 1871 1281 2999 4807 3599 1210 -275
2939b75k032j225Q82K68j569K61K099J430J513J725n48j351J106J628k53q37j671
$$ -275 -2307 -3532 -2650 -2382 -3951 -3690 -1591 -161 1352 3077 2529 1178 2284 3912 3659 2822 1151
2956A151l457k116Q51J040l43M59O21r2J658K900O62q06L37J23o08O20o87l336
$$ 1151 -2306 -4422 -3571 -2531 -2874 -2415 -1794 -1886 -228 2672 3334 2528 2865 2988 2380 3000 2313 -1023
2974a023k780k05K25O84J585L10j095J011K345J461R71P74j052j612P00p9j965
$$ -1023 -3803 -4008 -3783 -3099 -1514 -1204 -2299 -1288 1057 2518 3489 4263 3211 1599 2299 2220 255
2991B55k266j531j127K86K496J047o13M34Q61J089K016K091q73j664n97q17j097
$$ 255 -2011 -3542 -4669 -4383 -1887 -840 -1453 -1019 -158 931 2947 5038 4165 2501 1904 1087 -10
3008a0o29j512k322m30J881J130R19Q40j43l8K200K461K82n33j114k263j503J06
$$ -10 -639 -2151 -4473 -4903 -3022 -1892 -973 -133 -276 -314 1886 4347 4629 4096 2982 719 -784 -678
3026f78n15j928q54K72M05J599J956J19m55J189J779J199Q83o36l054k361k24
$$ -678 -1193 -3121 -3975 -3703 -3298 -1699 257 376 -79 1110 2889 4088 4971 4335 1281 -1080 -1304
3043a304k59o98m6p32j097J065K237R82N94J039L46N60J844L59k383k434j363
$$ -1304 -1563 -2261 -2307 -3039 -4136 -3071 -834 148 742 1781 2127 2687 4531 4890 2507 73 -1290
3060a290j408J84J023m26j590j55J349J074K260J867l27k21J138L39r93j021j950
$$ -1290 -2698 -2514 -1491 -1917 -3507 -3662 -2313 -1239 1021 2888 2561 2340 3478 3817 2824 1803 -147
3077a47k449n67J339Lq57q1l80M69K729K687M34j74J89o26m55L62j248k694j326
$$ -147 -2596 -3163 -1824 -1821 -2678 -2759 -3139 -2670 59 2746 3180 3006 3195 2569 2114 2476 1228 -1466 -2792
3096b792J52p9L22Q36r26o70K022K479J548J233r4j701j193P13m05j713j160r54
$$ -2792 -2640 -2719 -2397 -1561 -2487 -3157 -1135 1344 2892 4125 4031 2330 1137 1850 1445 -268 -1428 -2382
3114b382j435P35J479l66m20J317J034J530K458R40j799j654k20n80o91K27j516
$$ -2382 -3817 -3082 -1603 -1969 -2389 -1072 -38 1492 3950 4890 3091 1437 1217 637 -54 173 -1343
3131a343k445K4J121L87P89J079N5O21K786J391q23j015j051j849l73J226r39
$$ -1343 -3788 -3764 -2643 -2256 -1467 -388 -333 288 3074 4465 3642 2627 1576 -273 -646 580 -359
3148c59k212p91j53j78J903K150NN9J786R20J44K14r26k538j000R49l90j100o34
$$ -359 -2571 -3362 -3515 -3693 -1790 360 365 424 2210 3130 3274 3488 2562 24 -976 -27 -417 -1517 -2151
3167b151j225j230J783K646R58O49R45l99K5J418o7k220j312k74j097r4L31j313
$$ -2151 -3376 -4606 -2823 -177 781 1430 2375 1976 2001 3419 3352 1132 -180 -454 -1551 -1645 -1314 -2627
3185b627j635R46J893J333K097J217j149n59J016L59r76l50j564k183k80R01p33
$$ -2627 -4262 -3316 -1423 -90 2007 3224 2075 1516 2532 2891 1915 1565 1 -2182 -2462 -1561 -2294
3202b294r95M89M86R75K741K019o00j005L40l68q8P49j287k723j112N5l60K92
$$ -2294 -3289 -2800 -2314 -1339 1402 3421 2821 1816 2156 1788 1700 2449 1162 -1561 -2673 -2618 -2978 -2686
3220b686Q92l46J62K321K094M71J89l33j512j45R92m02j952j352j292j104R21
$$ -2686 -1794 -2140 -1978 343 2437 2908 3097 2764 1252 1107 2099 1697 -255 -1607 -2899 -4003 -3082
3237c082J524N1l4J470J207R10J412J73j848q64N16k70p27p80j951j961K50J558
$$ -3082 -1558 -1507 -1541 -71 1136 2046 3458 3631 1783 919 1435 1165 438 -342 -2293 -4254 -4004 -2446
3255b446Q49R36J041m2N69J884Q15p83p71n39j297j99K90j709k248k93M98Q04
$$ -2446 -1597 -661 380 338 907 2791 3606 2823 2052 1513 216 17 307 -1402 -3650 -3943 -3445 -2641
3273b641K232J468m42P0J090Q44M40L19r59j853q64m9j074j120n36q05L11K131
$$ -2641 -409 1059 617 687 1777 2621 3061 3380 2421 568 -296 -345 -1419 -2539 -3075 -3880 -3569 -1438
3291a438K204L34P5M04k7O90J387l30j761j340j166j217kn4j024m60J463J751
$$ -1438 766 1100 1175 1579 1552 2242 3629 3299 1538 198 -968 -2185 -2187 -2241 -3265 -3725 -2262 -511
3309e11J078J239K06n88L14J361L02r19j121k127j823l4M63l46k75N20M52J132
$$ -511 567 1806 2012 1424 1738 3099 3401 2482 1361 -766 -2589 -2623 -2160 -2506 -2781 -2261 -1809 -677
3327f77K202R47n42q7N39K4K73l20k021k432q15K7K31P57M49n62L85J983J359
$$ -677 1525 2472 1930 1843 2382 2406 2679 2359 338 -2094 -2909 -2882 -2651 -1894 -1445 -2007 -1622 361 1720
3346A720N22N86l49p32L71M79j513j948j343j292k26J639J002l64J37Q11P90J377
$$ 1720 2242 2828 2479 1747 2118 2597 1084 -864 -2207 -3499 -3725 -2086 -1084 -1448 -1311 -500 290 1667
3364A667J775k9j293k14p2j099o33j070j882j099J190J265L70N07J77k95J400
$$ 1667 3442 3413 2120 1906 1834 735 102 -968 -2850 -3949 -2759 -1494 -1124 -617 -440 -735 665
3381F65K272O11n06m92j152j378o4k20j840r66J97K62O55J689L17o45P37J729
$$ 665 2937 3548 3042 2550 1398 20 -44 -264 -2104 -3070 -2873 -2611 -1956 -267 50 -595 142 1871
3399A871R47P03L33j906k204l69O0j001m11k09q96J85K086Q14j56Q28Q47K11J246
$$ 1871 2818 3521 3854 1948 -256 -625 -565 -1566 -1977 -2186 -3082 -2897 -811 3 -153 675 1522 1733 2979
3418B979J051j316k162r63q46o16M77J58j485k90J223P88R52J474L30m67R71J209
$$ 2979 4030 2714 552 -411 -1257 -1873 -1396 -1238 -2723 -3013 -1790 -1002 -50 1424 1754 1287 2258 3467
3436C467q31j217p98j911j027P42N61r05n02M39j84J273K489N87n38N52L59m61
$$ 3467 2636 1419 621 -1290 -2317 -1575 -1014 -1919 -2421 -1982 -2166 -893 1596 2183 1645 2197 2556 2095
3454B095k27k45k181j726L34J38n2L76j44q68P60K359J327M86N64n83j360M97
$$ 2095 1868 1623 -558 -2284 -1950 -1812 -1864 -1488 -1632 -2500 -1740 619 1946 2432 2996 2413 1053 1550
3472A550J46j466j486m86o43j68J180K71r32L58J585Q98J441J391p05j847j2K3
$$ 1550 1696 230 -1256 -1742 -2385 -2553 -1373 -1102 -2034 -1676 -91 807 2248 3639 2934 1087 1075 1098
3490A098j005l90m26j622p16J093O69k92O74N43K94J790J888k62j338o08j041
$$ 1098 93 -297 -723 -2345 -3061 -1968 -1299 -1591 -917 -374 -80 1710 3598 3336 1998 1390 349
3507C49p76M50M1j590j336K23K33M21J581O39k99J145J585J83k20k51j646j423
$$ 349 -427 23 64 -1526 -2862 -2639 -2406 -1985 -404 235 -64 1081 2666 2849 2629 2378 732 -691
3525f91L90K12r78r23m24r05N66K081J077R4Q59O29n4P19L85j538j788j55k62
$$ -691 -301 -89 -1067 -1990 -2414 -3319 -2753 -672 405 499 1358 1987 1933 2652 3037 1499 -289 -444 -706
3544g06o88J14n44j422K8J531J449J144J226n4o45N53P58q64p53q77j205q28M79
$$ -706 -1394 -1280 -1824 -3246 -3218 -1687 -238 906 2132 2078 1433 1986 2744 1880 1127 250 -955 -1783 -1304
3563a304k04j262r7P55P80J794J880M0m78l7J37l37N4n60j729j356N3j27k84K05
$$ -1304 -1508 -2770 -2867 -2112 -1332 462 2342 2382 1904 1867 2004 1667 1721 1161 -568 -1924 -1871 -1998 -2282 -2077
3583b077N3k6J534K043Q27l9N5p78n43N85R9j585j165r03j012O5R36L48j91J031
$$ -2077 -2024 -2050 -516 1527 2354 2315 2370 1592 1049 1634 1733 148 -1017 -1920 -2932 -2867 -1931 -1583 -1774 -743
3603g43J337R67J199K50j033q82K97L0n88p54j300j985k68J074P19L08J091M55
$$ -743 594 1561 2760 3010 1977 1095 1392 1422 834 80 -1220 -3205 -3473 -2399 -1680 -1372 -281 174
3621A74K66J445J203o01p01k09p40l88J6r65j952q12L03N20J139J544j30n4J197
$$ 174 440 1885 3088 2487 1786 1577 837 449 465 -500 -2452 -3264 -2961 -2441 -1302 242 112 58 1255
3640A255Q68J53M55l85j473q16L04p82j385n95n62l53J517J830L93m2P01K39L60
$$ 1255 2123 2276 2731 2346 873 57 361 -421 -1806 -2401 -2963 -3316 -1799 31 424 382 1083 1322 1682
3659A682J173J63j522j032m11j005o55N3q95q73R23J503Q78Q95O77l69j77J235
$$ 1682 2855 3018 1496 464 53 -952 -1607 -1554 -2449 -3322 -2399 -896 -18 877 1554 1185 1008 2243
3677B243N75o28p11j153j839n32O04m35p25M04O95M70J542J416n43k54O79L45
$$ 2243 2818 2190 1479 326 -1513 -2045 -1441 -1876 -2601 -2197 -1502 -1032 510 1926 1383 1129 1808 2153
3695B153PO3j084k381p66K83l58M4O08q2k07J495J464J10L69L43m08p8P52o42
$$ 2153 2160 2223 1139 -1242 -2008 -1725 -2083 -2039 -1431 -1513 -1720 -225 1239 1349 1718 2061 1653 1575 2327 1685
3715A685k017j228m68q25Q41J107l32l02R38Q84N56J221O84j080k76N51o55j078
$$ 1685 -332 -1560 -2028 -2853 -2012 -905 -1237 -1539 -601 283 839 2060 2744 1664 1388 1939 1284 206
3733B06p64j109j521O46J251J79nO88N1L87J737J206p86k75k64r96o47J26j049
$$ 206 -558 -1667 -3188 -2542 -1291 -1112 -1117 -429 -378 9 1746 2952 2166 1891 1627 631 -16 110 -939
3752i39j748J29Q27P4Q36Q92l90o9J554J115J38K59m99j662r52L88o49j141p2
$$ -939 -2687 -2558 -1731 -1657 -821 71 -319 -388 1166 2281 2419 2678 2179 517 -435 -47 -696 -1837 -1909
3771a909l11k23J201J342j41j00J108M75O73P35j71j854j040k69p06l28M48q41
$$ -1909 -2220 -2443 -1242 100 -41 -141 967 1442 2115 2850 2679 825 -215 -484 -1190 -1518 -1070 -1911
3789a911p52Q92J222L20O91Q50j66L77J261m7j306q50j016j330N8Q13m39p83L29
$$ -1911 -2663 -1771 -549 -229 462 1312 1146 1523 2784 2737 1431 581 -435 -1765 -1707 -894 -1333 -2116 -1787
3808a787N36K86J517J168k81j5Q09n5n74k71j299j762j62N78m9k72J73l50J27
$$ -1787 -1251 -965 552 1720 1439 1424 2233 2178 1604 1333 34 -1728 -1890 -1312 -1361 -1633 -1460 -1810 -1683
3827a683J778J415K07M02M0o11k56J69q11j574n25k32l64M81N69n75k62J385J109
$$ -1683 95 1510 1717 2119 2159 1548 1292 1461 650 -924 -1449 -1681 -2045 -1564 -995 -1570 -1832 -447 662
3846F62Q77J136Lj164n30L31p37p87m48j004q30M43P47j03J35Q41L62J049J680
$$ 662 1539 2675 2678 1514 984 1315 578 -209 -657 -1661 -2491 -2048 -1301 -1404 -1269 -428 -66 983 2663
3865B663K96j037n45m23o96n9j53j205j131O2K69J55Q71Q47j38P17J365P26k36
$$ 2663 2959 1922 1377 954 258 199 46 -1159 -2290 -2228 -1959 -1804 -933 -86 -224 493 1858 2584 2348
3884B348j31j077j181j07K43q46q49m02n44P5J203J149M4O05R68L19N07M39r52
$$ 2348 2217 1140 -41 -148 95 -751 -1600 -2002 -2546 -2471 -1268 -119 -75 530 1498 1817 2324 2763 1811
3903A811j389n20qo10l42l85j044m54J153J039P30J081N09k35L21Q59m06j029
$$ 1811 422 -98 -106 -716 -1058 -1443 -2487 -2941 -1788 -749 -19 1062 1571 1336 1657 2516 2110 1081
3921A081o25q53p12J73l9j056m74K66N69J166J758O31n93K46M55l33K2l02j302
$$ 1081 456 -397 -1109 -936 -975 -2031 -2505 -2239 -1670 -504 1254 1885 1292 1538 1993 1660 1682 1380 78
3940G8j315K6rp60j46L16k17Q75J941R34q5J85k32m28K87L69j076j292n61o35
$$ 78 -1237 -1211 -1220 -1980 -2126 -1810 -2027 -1152 789 1723 1638 1823 1591 1163 1450 1819 743 -549 -1110 -1745
3960a745n92O81J41m04N78J516P65N54R16o31p75J54M79p66o53o49j515p39P40
$$ -1745 -2337 -1656 -1515 -1919 -1341 175 940 1494 2410 1779 1004 1158 1637 871 218 -431 -1946 -2685 -1945
3979a945M76o7N54P69K92J032J323k21q39n8j18n98Rm46j628j005L98Q0K53J264
$$ -1945 -1469 -1536 -982 -213 79 1111 2434 2213 1374 1316 1198 600 609 163 -1465 -2470 -2072 -1992 -1739 -475
3999d75M52j92O19J349J25j44K15q11q43K47k00j253j008j32l69L79J637N14j25
$$ -475 -23 -215 404 1753 1878 1734 1949 1138 295 542 342 -911 -1919 -2051 -2420 -2041 -404 110 -15
4018a5L87P80J14N10P41r88j044m2l28j040k46m19j050L22J411O56M07O99nk05
$$ -15 372 1152 1266 1776 2517 1529 485 443 115 -925 -1171 -1590 -2640 -2318 -907 -251 156 855 850 645
4038F45Q14R28l53q45l81j129r50K09j61r60OQ26N22P57J263q4l79M50P57j08
$$ 645 1459 2387 2034 1189 808 -321 -1271 -1062 -1223 -2183 -2177 -1351 -829 -72 1191 1107 728 1178 1935 1827
4058A827r7m44j451j280O4J07n22K04L96j92P91J379M83l02M04J69k36M27l2j457
$$ 1827 1730 1286 -165 -1445 -1381 -1274 -1796 -1592 -1196 -1388 -597 782 1265 963 1367 1536 1300 1727 1695 238
4078B38j388l75l87P1Q00J49n65N04J166N05N59O62l15n96L67J96j092p97p69
$$ 238 -1150 -1525 -1912 -1841 -1041 -892 -1457 -953 213 718 1277 1939 1624 1028 1395 1591 499 -298 -1067
4097a067j112k9R47L70j44K94M76L15R33J005R0n70q2j96q63j71o79j449n11O79
$$ -1067 -2179 -2208 -1261 -891 -1035 -741 -265 50 983 1988 2078 1508 1426 1230 367 196 -483 -1932 -2443 -1764
4117a764M66K95P18J05k05Q51J292M02m5l13q98q03Q6m39j186n47M7R7N29J032
$$ -1764 -1298 -1003 -285 -180 -385 466 1758 2160 2115 1802 904 101 187 -252 -1438 -1985 -1938 -1841 -1312 -280
4137b80K78l25P89Q89L65N33Q9j031j092k62m89n61q2l19p66N20J015M57M18M18
$$ -280 -2 -327 462 1351 1716 2249 2338 1307 215 -47 -536 -1097 -1179 -1498 -2264 -1744 -729 -272 146 564
4157E64L72K50Q61N81r08j018p34q25l94J91j74p52NN62N62Q75R24J56k8O69N19
$$ 564 936 1186 2047 2628 1720 702 -32 -857 -1251 -1060 -1234 -1986 -1981 -1419 -857 18 942 1098 1070 1739 2258
4178B258n02k18r76j484m37K64j12k20l4n9r2J124J244K98L05L87k6k03J91n88
$$ 2258 1756 1538 562 -922 -1359 -1095 -1207 -1427 -1461 -1520 -1612 -488 756 1054 1359 1746 1720 1517 1708 1120
4198A120j501o97k16l33J53K47k72k65Q36J150N30J016L17m01m98L99n32p85o62
$$ 1120 -381 -1078 -1294 -1627 -1474 -1227 -1499 -1764 -928 222 752 1768 2085 1684 1186 1585 1053 268 -394
4217c94p54q45J59P85k58j19L68O29P17J287Q17n16m21n3n16o60K5p36j246r3
$$ -394 -1148 -1993 -1834 -1049 -1307 -1426 -1058 -429 288 1575 2392 1876 1455 1402 886 226 251 -485 -1731 -1824
4237a824K79qK58O64o7M42J386Q67J5k6m07j009m17K72n49j036l77j98l45O79
$$ -1824 -1545 -1553 -1295 -631 -698 -256 1130 1997 2012 1986 1579 570 153 425 -124 -1160 -1537 -1735 -2080 -1401
4257a401J021l28M92Q66P75M41L77k70j297n07Q7m23m33k47q32p19O85Q77K57
$$ -1401 -380 -708 -216 650 1425 1866 2243 1973 676 169 256 -167 -600 -847 -1679 -2398 -1713 -836 -579
4276e79O56P65J49J91Q41J54j138m45l44p24k84L39p93r55K05N82N00J099Q44
$$ -579 77 842 991 1182 2023 2177 1039 594 250 -474 -758 -419 -1212 -2167 -1962 -1380 -880 219 1063
4295A063j47L5O43Q8m12P8o59j255k09J88n93n35J06mJ82J342J135J1M9L20k82
$$ 1063 916 951 1594 1682 1270 1348 689 -566 -775 -587 -1180 -1715 -1609 -1613 -1431 -89 1046 1057 1106 1426 1144
4316A144Q9K92l47j290n66j56n77o6L52m40O9J114R36L62N14K61p32j59N96l10
$$ 1144 1233 1525 1178 -112 -678 -834 -1411 -1477 -1125 -1565 -1496 -382 554 916 1430 1691 959 800 1396 1086
4336A086p73m69q09q43J75N44j71m6P75N62M91R60M10q89j75K73j28n30j10r61
$$ 1086 313 -156 -965 -1808 -1633 -1089 -1260 -1306 -531 31 522 1482 1892 1003 828 1101 973 443 333 -628
4356f28j306J19L37J49M37N18Q4M14J019N36l29r9j85n05k35K41r67j013m12R3
$$ -628 -1934 -1815 -1478 -1329 -892 -374 -290 124 1143 1679 1350 1251 1066 561 326 567 -400 -1413 -1825 -1732
4376a732j23R80Q11k2P7Q91K53J61M77k92q75l82J85p34o62k60n62k97Q65R74
$$ -1732 -1855 -875 -64 -86 -9 882 1135 1296 1773 1481 606 224 409 -325 -987 -1247 -1809 -2106 -1241 -267
$$ [...]
16383A57
##END NTUPLES=NMR FID
##END=
