##TITLE=abcd
##JCAMPDX= 6.0         $$ Bruker NMR JCAMP-DX V2.0
##DATA TYPE= NMR FID
##DATA CLASS= NTUPLES
##ORIGIN= UXNMR, Bruker Analytische Messtechnik GmbH
##OWNER= root
$$ XWIN-NMR		Version 3.5
$$ Sun Jul  6 16:43:03 2025 Russian Standard Time (UT+4h)  servis@DPX200
##.OBSERVE FREQUENCY= 200.131235884673
##.OBSERVE NUCLEUS= ^1H
##.DELAY= (6, 6)
##.ACQUISITION MODE= SIMULTANEOUS
##.ACQUISITION SCHEME= undefined
##.AVERAGES= 32
##.DIGITISER RES= 18
##SPECTROMETER/DATA SYSTEM= spect
##.PULSE SEQUENCE= zg
##.SOLVENT NAME= CDCl3
##.SHIFT REFERENCE= (INTERNAL, CDCl3, 0, 16.5164)
##AUDIT TRAIL= $$ (NUMBER, WHEN, WHO, WHERE, WHAT)
$$ ##TITLE= Audit trail, XWIN-NMR		Version 3.5
$$ ##JCAMPDX= 5.01
$$ ##ORIGIN= Bruker BioSpin GmbH
$$ ##OWNER= servis
$$ F:\spectra/data/av/nmr/H1/1/audita.txt
$$ ##AUDIT TRAIL=  $$ (NUMBER, WHEN, WHO, WHERE, WHAT)
(   1,<2025-07-06 16:42:38.28 +0400>,<servis>,<DPX200>,
      <created by zg, POWCHK disabled, PULCHK disabled
       configuration hash MD5:
       00 E9 B6 7A A2 85 ED C7 34 08 36 98 17 FE 4E 26
       data hash MD5: 32K
       7A A2 64 60 A7 A2 C7 89 EE C1 89 90 DA EC FE 91>)
$$ ##END=
$$ 
$$ hash MD5
$$ 9C 9A B3 42 FC 6D 11 64 46 4F AD 48 18 5E 04 A9
##$RELAX= 
##$RELAX= 
##$RELAX= 
##$RELAX= 
##$RELAX= 
##$RELAX= 
##$RELAX= 
##$RELAX= 
$$ Bruker specific parameters
$$ --------------------------
##$DU= <F:\spectra>
##$EXPNO= 1
##$NAME= <H1>
##$PROCNO= 1
##$TYPE= <nmr>
##$USER= <av>
##$AMP= (0..31)
100 100 100 100 100 100 100 100 100 100 100 100 100 100 100 100 100 100 
100 100 100 100 100 100 100 100 100 100 100 100 100 100 
##$AQSEQ= 0
##$AQ_mod= 1
##$AUNM= <au_zg>
##$AUTOPOS= <>
##$BF1= 200.13
##$BF2= 200.13
##$BF3= 200.13
##$BF4= 200.13
##$BF5= 500.13
##$BF6= 500.13
##$BF7= 500.13
##$BF8= 500.13
##$BYTORDA= 1
##$CFDGTYP= 0
##$CFRGTYP= 5
##$CHEMSTR= <none>
##$CNST= (0..31)
1 1 145 1 1 1 1 1 1 1 1 1 1 1 1 1 1 1 1 1 1 1 1 1 1 1 1 1 1 1 1 1 
##$CPDPRG= <>
##$CPDPRG1= <>
##$CPDPRG2= <>
##$CPDPRG3= <>
##$CPDPRG4= <mlev>
##$CPDPRG5= <mlev>
##$CPDPRG6= <mlev>
##$CPDPRG7= <mlev>
##$CPDPRG8= <mlev>
##$CPDPRGB= <>
##$CPDPRGT= <>
##$D= (0..31)
0 2 0 0 0 0 0 0 0 0.06 0 0 0 0 0 0 0.0002 0 0 0 0 0 0 0 0 0 0 0 0 0 0 
0 
##$DATE= 1751805757
##$DBL= (0..7)
120 120 120 120 120 120 120 120 
##$DBP= (0..7)
150 150 150 150 150 150 150 150 
##$DBP07= 0
##$DBPNAM0= <>
##$DBPNAM1= <>
##$DBPNAM2= <>
##$DBPNAM3= <>
##$DBPNAM4= <>
##$DBPNAM5= <>
##$DBPNAM6= <>
##$DBPNAM7= <>
##$DBPOAL= (0..7)
0.5 0.5 0.5 0.5 0.5 0.5 0.5 0.5 
##$DBPOFFS= (0..7)
0 0 0 0 0 0 0 0 
##$DE= 6
##$DECBNUC= <off>
##$DECIM= 32
##$DECNUC= <off>
##$DECSTAT= 4
##$DIGMOD= 1
##$DIGTYP= 9
##$DL= (0..7)
0 120 120 120 120 120 120 120 
##$DP= (0..7)
150 150 150 150 150 150 150 150 
##$DP07= 0
##$DPNAME0= <>
##$DPNAME1= <>
##$DPNAME2= <>
##$DPNAME3= <>
##$DPNAME4= <>
##$DPNAME5= <>
##$DPNAME6= <>
##$DPNAME7= <>
##$DPOAL= (0..7)
0.5 0.5 0.5 0.5 0.5 0.5 0.5 0.5 
##$DPOFFS= (0..7)
0 0 0 0 0 0 0 0 
##$DQDMODE= 0
##$DR= 18
##$DS= 0
##$DSLIST= <SSSSSSSSSSSSSSS>
##$DSPFIRM= 0
$$ [...]
##$SUBNAM0= <"">
##$SUBNAM1= <"">
##$SUBNAM2= <"">
##$SUBNAM3= <"">
##$SUBNAM4= <"">
##$SUBNAM5= <"">
##$SUBNAM6= <"">
##$SUBNAM7= <"">
##$SUBNAM8= <"">
##$SUBNAM9= <"">
##$SW= 20.6817932712277
##$SWIBOX= (0..15)
0 0 3 0 0 0 0 0 0 0 0 0 0 0 0 0 
##$SW_h= 4139.07284768212
##$TD= 32768
##$TD0= 1
##$TE= 0
##$TE2= 300
##$TE3= 300
##$TEG= 300
##$TL= (0..7)
0 120 120 120 120 120 120 120 
##$TP= (0..7)
150 150 150 150 150 150 150 150 
##$TP07= 0
##$TPNAME0= <>
##$TPNAME1= <>
##$TPNAME2= <>
##$TPNAME3= <>
##$TPNAME4= <>
##$TPNAME5= <>
##$TPNAME6= <>
##$TPNAME7= <>
##$TPOAL= (0..7)
0.5 0.5 0.5 0.5 0.5 0.5 0.5 0.5 
##$TPOFFS= (0..7)
0 0 0 0 0 0 0 0 
##$TUNHIN= 0
##$TUNHOUT= 0
##$TUNXOUT= 0
##$USERA1= <user>
##$USERA2= <user>
##$USERA3= <user>
##$USERA4= <user>
##$USERA5= <user>
##$V9= 5
##$VALIST= <valist>
##$VCLIST= <CCCCCCCCCCCCCCC>
##$VD= 0
##$VDLIST= <DDDDDDDDDDDDDDD>
##$VPLIST= <PPPPPPPPPPPPPPP>
##$VTLIST= <TTTTTTTTTTTTTTT>
##$WBST= 1024
##$WBSW= 30
##$XGAIN= (0..3)
0 0 0 0 
##$XL= 0
##$YL= 0
##$YMAX_a= 952103
##$YMIN_a= -805098
##$ZGOPTNS= <>
##$ZL1= 120
##$ZL2= 120
##$ZL3= 120
##$ZL4= 120
##$ABSF1= 10
##$ABSF2= 0
##$ABSG= 5
##$ABSL= 3
##$ALPHA= 0
##$AQORDER= 0
##$ASSFAC= 0
##$ASSFACI= 0
##$ASSFACX= 0
##$ASSWID= 0
##$AUNMP= <proc_1d>
##$AZFE= 0.1
##$AZFW= 0.1
##$BCFW= 1
##$BC_mod= 2
##$BYTORDP= 0
##$COROFFS= 0
##$CY= 19
##$DATMOD= 1
##$DC= 2
##$DFILT= <>
##$DTYPP= 0
##$F1P= 11.0000007629395
##$F2P= -0.999999237060547
##$FCOR= 0.5
##$FTSIZE= 0
##$FT_mod= 4
##$GAMMA= 1
##$GB= 1
##$INTBC= 1
##$INTSCL= 1
##$ISEN= 128
##$LB= 0.05
##$LEV0= 0
##$LPBIN= 0
##$MAXI= 10000
##$MC2= 0
##$MEAN= 0
##$ME_mod= 0
##$MI= 0
##$NCOEF= 0
##$NC_proc= 0
##$NLEV= 6
##$NOISF1= 0
##$NOISF2= 0
##$NSP= 1
##$NTH_PI= 0
##$NZP= 0
##$OFFSET= 16.51637
##$PC= 1
##$PHC0= -274.4572
##$PHC1= 1.101538
##$PH_mod= 0
##$PKNL= yes
##$PPARMOD= 0
##$PSCAL= 4
##$PSIGN= 0
##$REVERSE= no
##$SF= 200.13
##$SI= 16384
##$SIGF1= 0
##$SIGF2= 0
##$SINO= 400
##$SIOLD= 16384
##$SREGLST= <1H.CDCl3>
##$SSB= 0
##$STSI= 0
##$STSR= 0
##$SW_p= 4139.07284768211
##$SYMM= 0
##$S_DEV= 0
##$TDeff= 0
##$TDoff= 0
##$TI= <>
##$TILT= no
##$TM1= 0
##$TM2= 0
##$TOPLEV= 0
##$USERP1= <user>
##$USERP2= <user>
##$USERP3= <user>
##$USERP4= <user>
##$USERP5= <user>
##$WDW= 1
##$XDIM= 8192
##$YMAX_p= 0
##$YMIN_p= 0
$$ End of Bruker specific parameters
$$ ---------------------------------
##NTUPLES= NMR FID
##VAR_NAME=  TIME,          FID/REAL,        FID/IMAG
##SYMBOL=    X,             R,               I
##VAR_TYPE=  INDEPENDENT,   DEPENDENT,       DEPENDENT
##VAR_FORM=  AFFN,          ASDF,            ASDF
##VAR_DIM=   16384,         16384,           16384
##UNITS=     SECONDS,       ARBITRARY UNITS, ARBITRARY UNITS
##FACTOR=    0.0002416,     1,               1
##FIRST=     0,             0,               0
##LAST=      3.9581328,     0,               0
##MIN=       0,             -805098,         0
##MAX=       3.9581328,     952103,          0
$$ Real data points
##PAGE= N=1
##DATA TABLE= (X++(R..R)), XYDATA
$$ [...]
5595 317 619 319 132 312 -233 -422 -64 -291 -578 -424 120 -329 -367 334 396 129 568 447 275 94 350
5616 350 -34 -442 81 68 -337 -275 -47 -132 -80 145 18 215 519 796 47 106 289 -151 -446 27 -429 -524
5638 -524 -100 -116 -237 -120 344 98 61 425 220 -164 345 247 -266 -479 -49 -498 -482 -165 -78 -36 182 706
5660 706 134 189 785 250 95 201 159 -379 -236 101 -629 -382 -36 -91 -317 382 369 -185 273 318 497 37
5682 37 474 169 -529 -396 23 -613 -449 -63 -311 -212 320 189 52 533 651 302 211 414 312 -380 -104
5703 -104 -308 -711 -377 31 -373 -218 297 67 53 430 729 68 347 453 -41 -326 -223 -237 -560 -371 -73
5724 -73 -488 2 209 285 250 510 452 247 255 428 -192 -162 101 -279 -589 -231 -225 -600 -155 16 -40 55 615 475
5748 475 157 664 431 -306 -157 248 -456 -639 -196 -354 -503 -89 113 284 171 1017 521 66 762 214
5768 214 -43 264 97 -539 -432 -151 -281 -623 42 -119 110 332 385 290 425 638 286 -172 -36 96 -441
5789 -441 -721 -313 -399 -473 -8 -1 -236 221 665 427 559 720 7 -23 167 51 -262 -266 -290 -425 -460 148 -35
5812 -35 -100 285 187 154 207 607 235 32 182 63 -236 -332 -195 -449 -368 -64 -344 -186 309 273 -189 498 281
5835 281 587 217 125 3 -220 -167 -223 -407 -358 -135 -173 -103 273 235 167 434 391 84 167 99 -127 -153 -160 -359 -573
5860 -573 -374 -196 -199 -105 324 67 161 468 231 15 229 -31 -129 -278 126 -380 -406 -88 16 -242 74 413
5882 413 56 282 481 174 162 289 115 -219 -173 -99 -497 -283 -20 -56 -399 42 267 -19 51 496 203 81
5904 81 230 -284 -413 140 9 -517 -419 49 -354 -128 241 337 -83 520 367 227 264 477 -154 -68 17 -244
5926 -244 -400 -14 141 -453 -213 -16 21 75 426 320 249 246 302 -311 -170 -60 -334 -405 -308 -165 -590 -249 83
5949 83 119 66 422 101 98 527 210 -292 -155 9 -437 -698 -245 -412 -307 209 290 18 11 537 311 342 410
5972 410 164 1 -69 -181 -170 -548 -154 -292 -493 -185 24 -105 439 590 275 173 339 -163 -211 210 58
5993 58 -306 -288 -323 -476 -447 294 162 -194 59 535 308 334 894 297 7 108 -57 -358 -282 -233 -424 -79
6015 -79 -164 -47 55 241 307 35 273 491 137 -69 191 275 -282 -313 -124 -490 -341 13 -148 -185 228 122
6037 122 205 353 450 67 -65 320 135 -205 81 -201 -647 -293 36 -334 273 341 436 -125 380 317 202 328
6059 328 299 97 -236 -65 -302 -659 -338 113 -253 -86 137 186 -103 396 420 -6 83 231 -131 -165 -28 -316
6081 -316 -592 -271 -186 -204 -5 121 -18 105 480 472 128 209 -34 -283 -345 -103 -339 -377 -74 -450 -251 146
6103 146 240 2 56 371 179 -14 319 9 -55 5 87 -381 -423 -146 -137 -173 89 278 -63 229 277 37 88 410
6127 410 -38 -224 -8 -8 -358 -180 -142 -247 5 349 -53 146 391 247 109 90 93 37 -133 74 -168 -534
6149 -534 -68 13 -363 -84 145 -168 130 414 285 -48 9 480 -178 -197 125 -212 -344 -258 -42 -33 55 406
6171 406 -1 344 446 173 187 201 143 106 31 25 -333 -87 19 -100 -327 221 266 -209 327 497 339 67 235
6194 235 -31 -92 51 -142 -291 -346 149 -123 -225 12 129 -219 187 474 21 246 431 128 -202 -126 -255
6215 -255 -456 136 -127 -418 -305 198 151 34 202 257 366 73 519 155 -188 366 43 -436 -408 -216 -279
6236 -279 -277 168 -177 91 244 395 200 420 302 -79 100 234 -215 -589 -123 -268 -468 -321 6 -256 -209
6257 -209 349 335 -23 439 356 91 212 397 -251 -132 -226 -92 -384 -349 -151 -345 -107 419 -35 129 252
6278 252 410 -1 364 211 -138 -290 31 -309 -623 -160 -193 -365 -227 255 238 77 316 325 -105 392 60
6299 60 -161 -207 61 -377 -223 -65 -51 -186 86 298 232 -127 296 490 -5 260 162 -151 8 33 -118 -373
6321 -373 -131 -12 -296 249 141 63 32 524 -31 86 264 86 -141 46 7 -497 -214 -4 -267 -39 15
6342 15 94 -214 138 330 88 -264 312 -24 -247 53 121 -601 -240 -233 -77 -392 -53 168 -247 353 346 -142
6364 -142 -25 524 -218 -284 59 -243 -321 -304 -139 -477 -40 128 -11 -88 61 603 -229 437 516 45 -168 119
6386 119 -360 -347 14 -167 -572 86 -182 322 -181 469 139 -53 200 121 -119 -112 -30 -320 -375 -84 -121 -151 -77
6409 -77 62 7 160 230 188 127 279 171 54 170 -156 -121 -94 3 -198 -425 54 25 83 319 363 316 130 428
6433 428 156 -172 -15 38 -269 -199 -121 -75 -172 292 197 76 250 258 115 344 202 -29 -116 66 193 -427 -42
6456 -42 -30 -310 -213 83 -246 59 362 169 74 227 214 -44 -35 -2 -51 -158 -320 -146 -400 -361 -156 -3 -112
6479 -112 93 261 -73 175 -30 288 229 119 -209 -207 82 -193 -218 -308 -38 -268 31 131 413 351 275 210 123
6502 123 178 -76 -167 -428 -42 -241 -277 -86 83 -353 143 243 83 99 219 219 123 266 171 -140 -106 83 -225
6525 -225 -123 -282 48 -33 31 54 232 297 373 324 143 370 291 -155 -121 -236 -187 -313 -146 -128 -472 -41 270
6548 270 -2 413 479 204 100 345 76 -117 9 -255 -9 -10 9 -329 -232 72 -80 -175 431 457 166 326
6570 326 127 307 -199 102 -266 -274 -34 -21 -307 -115 138 -109 232 486 181 102 224 196 256 134 3 2 -47
6593 -47 4 -145 -64 -127 -41 -109 -30 323 310 147 390 418 -119 73 152 -239 -109 113 -34 -180 65 -1 -166 117
6617 117 139 150 -11 109 209 -21 -152 -8 -40 -262 31 -280 -260 -96 -30 4 53 338 -18 -5 490 150 -187
6640 -187 -35 3 -108 -168 -110 -246 64 151 137 -185 129 132 4 125 -31 -53 136 -101 4 -278 -161 -45 -203
6663 -203 -276 61 -154 -109 308 142 -303 146 92 21 -18 343 -53 -210 -279 34 -479 -138 46 -6 -53 118 464
6686 464 95 221 108 -83 133 -25 -69 -487 160 -91 -225 -417 -24 -106 -155 126 187 124 490 188 -278 200
6708 200 288 -168 -48 -36 -223 -243 -39 -19 -40 101 29 210 74 382 130 101 104 11 -213 -186 -25 -273 -380 -212
6732 -212 -102 -217 -28 135 5 31 508 24 207 287 126 -213 -142 -75 -176 -204 40 -125 -238 200 124 -32
6754 -32 292 159 294 234 162 -28 -138 -65 135 -338 -238 -23 -392 90 -82 5 163 221 116 146 167 181 150
6777 150 182 -181 -139 -229 -143 47 -163 -137 82 -19 -12 284 160 18 137 212 -174 18 98 180 -231 -149 -181 -222
6801 -222 -240 262 -39 -92 -61 162 45 315 134 119 -155 95 -32 -86 112 -31 -95 164 169 -298 -224 123 25
6824 25 -136 214 -104 -70 131 120 -204 -113 -12 -90 -338 -84 -140 37 -14 115 107 222 155 26 -53 84 158 -33
6848 -33 -158 -19 -290 68 307 -176 -252 118 79 -61 157 210 49 30 -57 160 -50 -32 -41 -489 -330 -229 8
6871 8 -204 74 200 -159 146 251 110 -34 -17 3 -152 20 -36 -208 -36 -282 -75 11 9 69 -61 220 1
6894 1 90 200 69 -154 1 184 -79 -313 -12 78 -64 34 391 28 161 230 232 15 -7 246 -111 -388 -4
6917 -4 -235 -146 -199 -25 -150 -82 41 262 125 289 183 327 90 22 -161 -242 -110 -95 -167 -200 -260 -50 1 -17
6941 -17 -363 61 321 176 -156 324 199 -195 67 -192 -216 -151 93 -277 -72 -10 186 -54 272 169 164 73
6963 73 134 250 -215 -98 64 -116 -441 106 -169 -236 44 118 -124 189 291 126 115 254 153 -30 -219 72
6985 72 -219 -167 -26 -65 -115 -6 25 64 264 219 48 66 314 83 39 50 -115 -338 -215 -190 -171 97 62 70 -7
7010 -7 198 161 -30 505 321 -137 359 116 -101 -145 -107 65 -244 -145 -54 198 -98 344 71 212 -1 378
7032 378 216 -118 254 -266 -223 -178 -315 74 -146 -307 18 -115 108 118 44 380 154 -74 -147 -104 55 -38
7054 -38 -158 -403 -381 0 -155 -302 -21 228 45 -85 212 59 -115 -25 92 -287 -204 -74 -307 -96 -78 23
7076 23 30 117 184 -184 126 322 100 22 -152 1 240 -142 -143 -240 -80 -11 -280 111 111 134 -81 45 410 -105
7100 -105 185 38 5 -330 -161 81 -367 198 -90 -105 -120 -47 -179 -35 255 182 -9 195 136 -106 -13 -59 -77
7123 -77 -32 -71 -129 4 -172 34 90 -171 206 456 254 45 -72 -129 77 9 -63 -24 -111 -12 -98 -79 43 23 122
7148 122 376 56 -29 281 342 -24 41 -51 -180 -209 -103 -48 -192 1 44 -229 16 99 -113 -32 305 249 45
7171 45 -244 -114 -38 1 -16 -188 -25 30 -91 115 -120 280 261 -56 155 99 153 59 -154 -20 -212 125 -105
7194 -105 -186 296 -217 104 193 405 -224 -96 82 -51 -141 113 -21 -186 -254 -154 -390 -104 -11 -136 86 192
7216 192 255 -1 114 241 -185 -44 -152 -82 -217 -86 68 -208 -84 206 -76 -143 106 126 -41 96 228
7237 228 333 73 -90 -187 -124 -291 -326 104 -33 -101 -84 56 201 190 106 46 239 -24 -89 132 -239 -384 -15
7260 -15 -297 -421 -140 -167 107 176 185 -28 -85 278 -7 125 206 111 -99 -239 -97 -311 -181 -43 -83 13 70 172
7284 172 124 51 125 245 99 80 156 -69 194 -141 -131 -349 -7 15 -125 -106 90 106 126 258 60 109 9 -133
7308 -133 197 -149 -286 -506 -25 -47 57 -3 101 134 -4 197 7 -59 -27 351 2 -161 -202 -195 -272 -213 170
7331 170 -378 176 46 -269 56 420 305 260 -51 382 299 -3 -66 -323 -119 63 49 -275 -293 23 -51 8
7353 8 309 -82 -142 277 157 25 -36 -60 -47 47 -223 -11 -135 114 57 156 27 179 -25 -166 22 -13 -152
7376 -152 -250 -169 -139 27 -257 -28 -145 172 178 217 65 167 83 4 206 166 -244 -19 2 -396 -52 8 -202 -65
7400 -65 267 198 -211 -96 162 206 24 189 -215 -74 48 -244 -321 99 -13 -58 -388 188 28 56 55 174 45
7423 45 364 4 -184 -100 197 -41 -116 -151 -258 -75 14 -23 71 -134 169 150 -233 65 176 61 58 192 -59
7446 -59 99 72 102 -339 67 -197 115 273 175 14 -127 265 113 -224 86 185 -176 -125 -57 -205 -345 127
7468 127 -124 -53 -96 153 -38 -177 221 213 1 -3 -16 -152 78 11 -100 -147 -182 -71 -33 415 288 56 26 302
7492 302 1 116 128 123 -89 -113 56 -111 -121 -117 -72 -64 87 143 34 62 -9 -114 176 12 -2 -56 63 -195 -497
7517 -497 -239 -151 -127 -112 -226 111 212 83 223 165 -18 203 260 -157 -59 25 -133 -42 -105 52 107 212 156 5
7541 5 259 357 -113 47 303 85 -19 -17 -80 -67 -262 -218 -106 -107 103 -5 -236 439 -13 104 -71 47 -99
7564 -99 -93 92 -173 -130 -238 -116 -277 -23 37 -2 199 254 143 -109 39 -55 -141 188 95 -298 -90 -24 -216 -294
7588 -294 -26 -13 -31 16 -24 -84 292 360 155 -39 -37 -209 -172 21 36 -279 -149 -175 -171 19 248 231 -51 7 242
7613 242 90 -166 300 -37 -117 -65 -196 -339 -14 -68 -150 54 311 149 56 188 269 190 63 -77 -83 -144 146
7636 146 -134 -186 -165 58 3 -259 87 4 25 31 205 87 287 185 -46 -8 -33 37 -134 118 103 -355 58 158
7660 158 145 96 357 262 130 -12 68 -14 -79 82 -176 -126 179 39 -133 124 83 252 200 259 2 -113 30
7683 30 98 -53 48 -135 -178 -301 92 91 -192 52 251 218 142 -23 81 157 35 41 -317 -135 -52 7 -306 139
7707 139 151 -363 50 11 105 53 69 181 89 111 196 -260 -133 -209 -189 -201 118 -103 -264 32 193 122 -41 435
7731 435 154 -6 229 190 -127 -126 -59 -250 -184 -75 -250 -162 343 177 229 114 -43 -122 90 176 164 11 12 -61
7755 -61 -316 -289 -59 -225 14 160 13 101 201 300 -160 256 118 216 277 25 -28 -360 -131 -293 -232 12 90
7778 90 -95 128 154 124 187 83 371 -44 42 -84 4 -118 -244 -193 -335 -93 -235 197 93 -178 -79 84 147
7801 147 348 -80 20 243 -91 121 -1 19 -130 16 -20 -19 187 387 48 -71 -126 172 75 -50 58 56 -19
7824 -19 -250 -345 -334 63 -55 -175 65 205 218 164 206 -101 -88 17 -18 -19 -210 -76 -75 110 -83 -74 -152 -127 46
7849 46 -76 51 -17 -129 -97 233 136 -211 122 -102 -181 59 149 98 -101 368 78 -28 69 176 -159 -42 212
7872 212 27 -351 61 -80 92 41 8 -124 66 108 141 76 295 101 -2 197 99 85 -12 90 -61 -32 -199
7895 -199 -175 -174 67 102 -46 -30 251 -59 49 296 -80 -103 -162 158 -55 -201 130 -67 -132 141 178 217 299 -23
7919 -23 27 86 146 -142 -2 79 -141 -198 -151 151 -41 -68 -46 55 -82 215 220 45 -3 -61 8 69 -29 5 -252 9
7945 9 -46 -178 158 81 64 -151 36 306 96 148 73 -165 -135 -124 233 -217 99 -144 -285 13 -183 62 85
7968 85 88 220 125 53 215 1 136 -66 -91 -33 153 -49 -324 119 3 165 -8 319 142 76 -40 208 -150
7991 -150 -468 148 28 107 -215 -262 -167 8 65 -30 161 6 84 120 194 13 -171 4 145 -311 -47 110 159
8014 159 16 237 1 -224 188 -102 -30 -52 47 -24 52 179 5 -150 -223 -23 -80 38 180 -121 -329 27
8036 27 -131 -9 115 226 99 14 122 -113 -218 -74 -7 -354 -2 139 -37 -80 287 62 92 186 67 -69
8058 -69 231 223 -48 -177 252 -208 4 -247 60 -139 67 265 116 6 253 187 -84 -7 272 -27 94 -163
8080 -163 94 71 -90 21 -157 122 -66 -116 -13 330 -21 24 276 58 119 19 94 135 19 -88 -28 -245
8102 -245 171 -99 -141 -69 -24 20 -17 113 -33 -69 34 -149 -218 -130 -19 -119 -231 33 220 -42 58 -154 169
8125 169 164 218 41 -13 111 146 -98 -298 74 -74 -72 -124 305 -93 -158 178 4 105 147 -104 4 224 126 -198
8149 -198 -222 12 80 -80 -148 196 209 291 176 477 209 184 -8 -229 151 -55 -314 233 -364 -185 -14 17
8171 17 -197 437 328 84 23 162 -96 43 -377 100 -104 -374 -248 -161 -300 -134 203 -195 184 119 149 -52
8193 -52 227 380 -224 54 -162 -262 -45 -60 -211 -207 46 181 69 197 251 217 -37 51 6 167 49 283 -26
8216 -26 -230 -168 -262 -111 -30 147 54 199 161 233 310 249 -20 -63 401 -201 -167 -83 -13 -222 -177 -126 -183 183 -85
8241 -85 192 -74 191 203 37 80 213 59 -170 -93 -34 -480 -98 17 -159 -111 7 -53 -62 12 122 93 245 86
8265 86 40 -388 102 -83 -183 -17 -248 -49 -244 6 439 20 53 140 91 212 117 42 -173 83 -233 -116
8287 -116 144 -56 -67 -76 110 -238 28 144 149 89 99 -37 -54 103 -31 0 -220 -260 -68 19 42 252 159 -22
8311 -22 161 368 -151 -329 27 175 -207 -148 -197 -156 -59 -82 -342 -42 -91 38 -15 315 -80 155 157 -256 -128
8334 -128 -97 -83 -58 115 165 58 -59 -97 20 -23 -39 284 -103 -26 258 16 -77 245 -13 8 -121 129 -10
8357 -10 -243 -53 21 99 -82 365 -19 162 136 -223 -2 106 -223 -181 -16 -11 -133 -79 258 54 -89 326 137
8380 137 75 151 254 -96 -136 179 -112 -204 -84 -131 -120 -127 143 -77 96 237 259 230 48 4 118 -86 -47 115
8404 115 1 93 -121 -121 -189 -45 0 -131 230 121 -8 114 152 18 64 -44 -340 -257 -251 -83 -185 226 9
8427 9 79 107 77 292 207 -32 69 -4 89 137 -103 -116 -290 -247 -113 -40 -161 187 -38 -8 285 135 465 116
8451 116 50 142 -25 -459 -146 51 -170 131 -19 53 -11 98 204 157 220 136 141 -345 -18 -82 -15 -32 -224 -236
8475 -236 -159 123 -43 123 62 83 242 16 385 243 28 241 52 -83 45 -87 -118 -137 110 -189 -32 76
8497 76 114 -6 455 398 81 40 97 -93 -253 69 -219 -58 52 -140 -153 151 -27 -59 48 225 248 -12 151
8520 151 43 -53 -200 -161 -241 -9 -77 -183 19 -40 94 -80 71 157 107 26 287 222 -61 -40 -284 -392 -191
8543 -191 -244 -102 -6 -1 16 -99 -58 213 203 130 125 24 -158 -11 -30 -176 24 -64 -188 -53 105 -49 9 39 380
8568 380 61 288 160 82 -121 -120 110 -559 145 144 -232 -164 172 -141 58 136 283 -157 149 79 14 -138 55
8591 55 165 -260 -160 127 -253 38 5 343 42 282 273 156 221 84 125 -335 104 -13 -195 34 -29 -107 -30
8614 -30 349 -66 93 274 146 -40 -31 188 36 -66 206 -179 -515 -20 -233 -44 180 138 -105 164 179 -60
8636 -60 73 207 249 -151 44 -32 -126 -355 91 30 48 210 -37 178 273 212 340 109 376 68 -50 -12 73
8659 73 -54 -280 157 155 -82 -82 -2 -198 -59 119 285 71 22 228 -4 343 16 -245 -97 -199 -78 -359
8681 -359 -123 -100 -255 -77 44 -127 264 334 75 92 -2 68 -425 -64 -120 -401 -239 11 -111 34 76 191
8703 191 181 160 242 48 4 243 58 -39 83 -168 -201 -104 -131 -25 82 306 21 171 197 153 -88 276 162
8726 162 -114 -275 -44 -138 -340 -55 -242 -244 184 58 200 143 286 338 -83 129 98 -117 74 -19 -214 -158 -255
8749 -255 -36 -146 210 303 105 249 44 35 -16 445 -24 -31 97 -243 -232 -42 -102 -155 -206 33 -13 206 420 185
8773 185 160 115 231 43 134 168 109 -154 -190 -13 -273 -22 244 81 19 446 478 132 61 344 136 134 -8 15
8797 15 -366 -24 -63 -263 -102 6 34 -73 209 279 10 238 277 -78 250 83 -106 -261 -46 -133 -94 -41 61
8820 61 90 23 66 88 -31 58 421 -15 228 -151 -285 -157 -75 5 2 46 380 -223 -91 369 70 205 145 220
8844 220 -232 31 87 -260 -126 104 -421 -205 17 90 -185 257 224 126 152 76 215 -151 187 100 -294 -95
8866 -95 124 -10 -315 -174 179 -261 -12 286 112 196 271 188 50 -18 141 -264 -265 -199 -58 -167 -135 39 -60
8889 -60 110 60 -78 52 144 -101 223 78 -92 -68 -102 -224 -258 -164 -188 -279 -13 57 174 75 130 342 145 95
8913 95 186 -136 -162 -55 30 -6 14 226 177 -48 83 60 177 391 37 -201 64 233 -10 -140 66 -173 -293
8936 -293 -99 123 -210 -121 360 7 168 90 77 110 62 108 -107 -390 -219 -181 -19 -298 103 98 -58 473 133
8959 133 292 138 103 281 292 78 101 -323 -40 -179 -269 -410 -16 -155 14 252 164 75 359 295 70 275
8981 275 -202 18 -38 32 33 -131 -146 106 -151 215 142 -148 189 113 540 117 189 216 -139 120 99 -47 -137 -50
9005 -50 -157 -266 183 260 76 38 374 179 270 36 88 -64 -44 29 -171 -120 10 -264 -209 73 1 -82 204 183
9029 183 183 141 96 18 -85 -77 -253 -134 -132 -221 -399 138 -164 -26 53 253 274 -30 63 -94 30 7 -77 53 -14
9054 -14 68 -88 -122 -166 77 -105 -47 215 288 30 303 107 188 124 -63 -58 -8 121 78 -112 -55 13 -209 -9 113
9079 113 64 17 227 -119 -106 285 -8 -195 -197 -22 -330 -218 46 -274 -157 -20 -21 79 34 207 130 -71 -50
9102 -50 -322 -40 63 -9 -113 -48 177 -64 123 137 267 174 212 275 171 100 39 120 -274 32 -156 -170 -201 24
9126 24 -137 -96 265 184 -13 109 268 0 95 106 -158 -207 149 -95 -312 -163 143 -110 42 325 212 66
9148 66 218 -6 -37 178 -29 -150 -27 -19 -214 -355 36 -7 -160 19 117 94 149 305 311 14 58 95 24 -7 -33
9173 -33 -288 -260 -134 -92 -319 -36 369 89 101 288 230 -294 196 -79 -349 -76 98 -246 -219 86 153 -70
9195 -70 296 294 39 167 226 193 182 116 72 -67 -210 -230 -308 -111 -27 113 -110 462 124 -85 207 232 31 46
9219 46 170 20 -219 -165 -258 -208 -357 -105 -265 -229 288 110 96 179 260 32 110 -55 -23 -53 -183 -230 -226 -136 190
9244 190 -350 -354 48 -9 -29 221 146 123 -10 344 -54 -195 164 -141 -245 -175 -50 41 -141 54 30 75 27 237
9268 237 404 497 258 92 136 203 -61 -447 -114 -101 -155 -11 164 42 -144 26 163 254 187 36 -128 152
9290 152 24 -310 75 -5 -90 -376 3 -253 -156 -103 216 171 187 259 256 -3 13 -44 -144 21 -20 -186 -108 -89 -215
9315 -215 -107 -119 -4 -105 15 331 124 -142 27 58 -192 26 101 -215 -300 2 -96 -45 209 31 -109 164
9337 164 142 233 -188 -82 -73 -246 -120 -249 -90 -167 -36 -8 115 164 -30 379 357 184 -206 193 -80 -339 -157
9360 -157 -164 -50 -364 68 37 217 255 131 120 -58 464 82 -49 -49 -90 -7 -285 -142 -63 -322 34 55 1 10 365
9385 365 -73 45 37 271 169 24 26 -58 -65 189 -154 -77 -152 -114 -243 109 320 223 69 215 -81 69 76 48 -313
9410 -313 16 29 -359 -358 9 96 -107 438 99 152 45 289 7 -81 167 88 -367 -131 -139 -186 -352 -257 -181 -171
9434 -171 260 41 50 194 150 165 -219 298 3 -150 -71 -116 -157 -99 77 -176 -287 116 -6 1 159 322 78
9457 78 61 -5 -134 -228 -70 -135 -257 232 -111 -75 14 3 419 -138 314 168 26 121 342 -48 -32 119 -46
9480 -46 -323 -59 -262 -250 -59 -77 279 -144 134 71 -123 140 390 -91 62 -95 -151 -333 -272 -278 -220 -86 -17
9503 -17 -244 77 49 84 91 122 62 -88 -99 15 -391 -81 -38 -276 -267 -229 -172 68 64 72 -31 323 144 -80 52 -45
9529 -45 90 -234 -36 100 -360 -107 -92 123 -54 12 159 157 130 120 223 -158 168 80 -129 -5 -122 -246 0
9552 0 82 147 -33 198 222 8 152 186 208 -192 197 34 -218 -60 -127 -226 -88 27 -45 -191 129 -45 70
9575 70 215 126 104 67 -46 -239 -130 -143 -102 -92 -68 2 -102 271 304 205 -124 138 80 23 -25 -16 55 -456 158 -223
9601 -223 -26 89 -195 -131 -28 25 -15 -87 381 29 -13 56 51 -124 -240 17 -66 -176 34 -183 -187 -79 350 -58
9625 -58 74 240 71 -24 87 63 -68 -7 -157 -503 -497 -122 -294 16 103 27 242 113 221 -71 108 -192 8
9648 8 58 -114 -206 -29 51 2 -21 -121 130 134 -33 152 361 -120 -73 -70 -131 -269 -41 -213 -186 -63 -205 -208 66
9673 66 288 67 264 322 225 -10 50 210 -206 -180 53 -64 -191 64 -139 -132 167 253 175 -20 353 404 -65
9696 -65 256 176 -77 -118 -144 -178 -281 -103 -256 -219 -109 28 188 107 241 149 238 5 -104 -431 92 113 -176
9719 -176 -358 -86 -174 38 94 130 211 -53 249 117 266 411 258 -14 193 0 -307 -267 -121 -139 -104 149
9741 149 197 190 135 325 78 88 195 40 -90 7 105 -192 -59 -49 -79 31 -5 -31 136 -124 206 82 62 155
9765 155 -25 100 109 140 -21 67 37 -267 -158 98 -23 146 52 241 5 229 214 -82 -80 174 196 -115 -35 -239
9789 -239 -44 161 166 -162 70 322 412 182 79 42 145 -168 -14 -217 -154 -276 36 -222 -145 -282 -162 -12
9811 -12 150 166 150 54 30 6 57 167 -57 -108 -301 -70 -261 -17 -222 -90 -106 274 288 117 80 100 -116 30
9835 30 12 -32 61 381 -134 -162 67 -122 120 -38 193 36 -4 363 57 42 246 56 -69 -98 104 -81 -180
9858 -180 10 -63 107 -46 231 -182 209 266 89 -191 75 67 -225 -79 151 -86 -112 -13 -45 -97 -116 225 -91
9881 -91 437 85 120 101 341 -274 -165 3 -110 -197 -293 74 -66 441 204 176 27 276 178 149 67 43 -134
9904 -134 -288 -234 -180 65 -240 -217 -48 -135 152 -33 240 234 -31 -28 72 -94 -248 57 -64 -35 -21 85 171 121
9928 121 -116 327 36 -44 226 302 7 303 154 -275 120 189 -84 -98 129 -135 -268 46 151 -139 349
9949 349 329 39 175 48 182 21 16 120 -123 -235 -256 -265 -57 35 85 25 -39 416 -74 216 142 -28 26 -22
9973 -22 123 -259 -74 -18 -98 -9 131 -48 58 38 240 362 254 338 12 219 -17 -16 -281 48 -85 -328 -190
9996 -190 264 146 -150 204 14 41 187 379 83 -204 -108 -46 -215 4 -252 -142 -114 116 130 76 180 262
10018 262 185 177 155 -29 -238 24 -301 60 -187 -172 -152 -156 74 -118 21 284 -107 224 234 150 -196 127 38
10041 38 -168 -280 226 -180 71 -80 14 41 65 107 322 -119 328 316 -224 160 92 -221 -18 -196 -107 -263
10063 -263 -115 -179 0 46 164 172 280 292 184 153 -94 135 -234 -81 -284 -211 -181 189 152 -221 82 -114 24
10086 24 194 202 96 26 214 105 3 117 -106 -271 -146 315 -111 -159 414 288 -92 294 10 -31 28 166
10108 166 -33 39 -67 -271 -357 -56 133 -215 39 294 -79 75 247 -22 -51 117 223 -14 -144 26 -138
10129 -138 -281 62 -267 -203 78 191 265 56 275 204 51 -148 -79 -146 -259 135 -415 106 -29 72 113 -21
10151 -21 -68 56 206 354 107 12 -95 56 26 -31 38 -242 68 -153 -125 -20 13 -159 231 32 421 34
10173 34 73 159 77 62 132 -104 52 -126 -194 -72 -178 -14 -56 203 349 409 73 109 216 84 -252 103 -103
10196 -103 -175 -39 37 -279 -149 92 233 149 43 217 -51 -164 124 39 -77 -54 -146 -236 -246 2 -196 0
10218 0 195 -106 -37 335 185 60 -116 377 -79 195 -55 -179 -234 -225 127 -331 -102 83 8 140 144 281 289
10241 289 82 48 114 315 5 -151 -136 -148 -447 -332 -68 145 -19 8 67 127 175 321 248 -65 237 -117 -178
10264 -178 -383 52 -93 -286 -167 -177 -48 14 171 59 -100 153 175 36 -10 183 -178 -235 -77 -188 51
10285 51 -41 71 -70 45 4 -237 142 55 78 -89 156 -163 -215 -142 -65 -284 -159 -102 -60 -18 87 2 -62 398
10309 398 340 -35 -5 387 -263 5 -146 -327 -120 -163 -136 -102 -405 114 -12 -171 438 219 -26 110 241
10330 241 -198 -124 -162 -103 -71 9 49 80 206 375 -13 -1 310 154 -98 113 71 -168 -350 -59 -185 -127 30
10353 30 -32 -245 309 151 -118 -28 225 -93 199 86 -13 -322 -222 14 -190 -24 85 -103 71 156 32
10374 32 121 288 205 -92 -195 188 327 92 21 -110 -170 -119 -153 -69 -16 43 111 -139 200 -32 -33 -9 157 -248
10398 -248 -94 -56 -133 -42 -37 8 196 129 -64 97 143 398 105 117 276 1 -70 -181 -94 -236 -255 -250 -249 110 -88
10423 -88 100 273 85 137 113 264 210 -10 -164 -321 115 -77 -135 -206 -120 -265 -206 -147 -10 -14 422 80 103 389
10447 389 161 -110 -104 17 60 -216 -129 15 -45 -133 258 168 -6 242 -162 22 391 258 104 38 -119 146
10469 146 -114 -35 -205 -295 66 102 -69 -158 53 -61 297 117 -66 27 59 69 -123 -328 -108 -292 -314 127
10491 127 -122 -63 -68 -50 -31 188 66 -77 -174 15 -51 -22 -97 -45 -164 -215 -169 156 -36 65 71 57 124 356 4
10516 4 -3 -27 62 142 -201 88 -158 -228 2 13 -201 72 -44 -134 255 275 72 204 77 -10 -211 129 -23 -380
10540 -380 -121 42 -81 40 380 38 3 -29 168 30 -44 42 -67 -296 -190 -273 -239 -12 -84 -218 49 160
10562 160 -39 28 161 217 -29 -77 49 31 55 33 -220 -158 -113 -85 80 -44 50 37 -87 169 99 107 202 140 -336
10587 -336 -105 -56 -259 -171 37 -133 -232 46 -91 -219 -115 296 -96 161 221 -56 -175 58 188 -225 -186
10608 -186 -68 -10 -237 118 336 0 50 149 65 53 83 21 -128 131 23 -281 -131 -84 -170 -32 -58 125 -224
10631 -224 94 55 232 395 164 42 -37 70 60 -235 -6 -118 -238 -79 121 145 200 229 211 -54 45 230
10653 230 -150 138 -171 -394 -301 -114 -238 -50 -35 159 118 142 186 163 130 217 -63 -69 -21 -216 -181 -69 6 -33
10677 -33 -164 20 6 -165 261 -75 178 -88 337 86 -121 19 -365 -431 84 99 -23 -111 -78 -58 -10 223
10699 223 315 9 83 243 -2 -81 98 26 20 -236 -157 -116 -195 66 115 58 141 219 131 363 14 164 -180 12
10723 12 -162 -135 6 -9 -309 -200 54 -223 158 188 -26 28 170 34 79 -153 90 -58 -44 -93 -123 -76 -168
10746 -168 -52 -242 135 314 142 137 324 147 -141 191 105 -430 -111 76 -134 -297 -251 96 -21 66 327
10767 327 251 209 401 47 185 -60 -37 74 -118 -37 -54 -239 31 3 23 -101 137 -220 -13 37 50 42 -49 21
10791 21 -141 58 -435 -158 69 12 59 52 211 -30 -3 153 -64 -238 53 -14 220 -17 2 129 134 -181 -107
10814 -107 -184 -91 35 40 87 -181 67 111 -146 112 -219 -162 -249 82 -48 -214 170 -23 -71 89 -66 -102 344
10837 344 277 -149 214 -53 -160 -122 222 -158 -81 -165 214 -77 -271 -43 -77 -81 -9 173 142 201 303 163 -185
10860 -185 -109 -129 -132 -268 39 -127 7 276 -8 -31 71 13 173 163 133 -9 -240 -87 -209 -210 -4 -87 -135 -68
10884 -68 57 -17 -129 258 -96 -53 160 103 -86 -15 4 -120 -382 -39 -26 -296 -11 216 5 106 314 330
10906 330 204 184 54 -199 -216 -32 -40 22 126 76 -202 -101 183 64 193 63 107 161 38 -112 -93 -51 -3
10929 -3 149 -288 46 -72 -135 -12 264 264 180 142 -68 324 -71 151 -263 196 -20 -334 150 -268 -343 21
10951 21 57 50 -134 13 267 19 247 234 -82 8 12 13 -337 -243 -251 -26 -261 26 5 90 70 232 265 67 45 -78
10977 -78 21 197 -65 -251 12 -246 -163 -29 -106 -41 78 -106 80 207 60 380 222 72 60 -108 -398 -194
10999 -194 -360 -160 -178 -335 -33 -2 334 -56 309 100 47 90 -30 -62 55 -268 -97 -219 -113 -78 239 57
11021 57 -147 -152 -92 176 140 10 211 156 23 -309 -30 30 -36 -159 120 -1 -96 259 115 24 163 241 -184
11044 -184 -36 168 100 -116 -80 -91 -165 56 156 -109 -110 66 286 -183 133 106 -140 347 254 82 -73 71
11066 71 -98 -269 -49 -132 -347 0 25 -145 -32 218 287 41 340 1 75 22 32 155 -219 -64 5 -98
11088 -98 66 214 75 90 318 335 208 428 360 -130 -143 -157 -76 -169 58 -262 -10 193 74 22 45 166 33
11111 33 50 115 -67 -232 118 37 -119 -248 -295 -138 -58 7 111 91 77 322 243 95 33 -15 -65 -62 185 -304 -90
11136 -90 66 -127 -29 41 -17 123 84 336 84 -66 15 55 -29 39 -285 -267 -347 139 -67 -99 -40 112 -162 47
11160 47 274 -250 238 136 -85 -124 49 -139 -180 -271 -192 -148 -131 -39 85 238 155 148 -197 320 284 -74 -92 203
11184 203 -201 -117 -195 -36 -164 124 6 -35 79 264 -41 128 183 193 53 -348 94 -385 -156 -163 -199 -463
11206 -463 104 123 22 -63 102 60 6 372 33 21 -72 54 -312 119 -226 -233 -193 -260 -11 -38 77 106 285 -36
11230 -36 133 187 -132 268 -101 -123 -263 -95 -239 -185 -79 229 -65 123 155 11 269 64 38 124 90 172 0
11253 0 -192 48 -113 -396 -131 -80 174 136 73 -26 -42 74 -24 90 103 175 -41 189 26 183 -95 -101 -80 -9
11277 -9 113 -115 -46 50 230 91 393 206 236 6 189 -63 -232 -269 -176 -105 50 93 -10 -94 212 -114 77
11300 77 -44 245 280 -128 -235 6 -84 89 -52 -29 -32 -94 -230 6 150 -132 -57 251 -17 55 37 -52 -132 33
11324 33 66 -6 -131 -111 190 105 0 -118 31 179 122 150 71 -78 -152 -233 -58 -152 -54 -112 116 138 -36 -93 162
11349 162 52 -187 72 -7 -484 -120 36 -333 -21 -47 -128 67 194 86 -167 35 288 33 -71 300 -36
11370 -36 -254 -30 -48 -377 -19 152 -23 -202 -63 135 31 389 336 -72 106 59 60 -39 11 -22 -185 -202 -66
11393 -66 -81 57 279 14 -13 -116 201 15 203 52 -172 -174 2 19 -40 -116 -346 -153 -147 33 158 -72 332
11416 332 164 -77 -111 0 -4 83 203 -145 -170 -86 -161 -108 -5 121 -13 49 265 24 112 146 169 61 -123 -63
11440 -63 -465 -297 25 -311 -267 7 -64 -75 -54 91 49 62 32 176 -197 -165 -44 -331 -119 -140 -31 -309 96
11463 96 203 -160 66 252 179 101 198 82 175 137 28 -254 24 -294 -221 -287 -7 118 -296 81 235 157 25
11486 25 146 127 24 20 8 -23 133 -195 -223 -333 -99 45 75 -143 -91 -255 374 113 39 35 66 23 -86 -140 -201
11511 -201 -38 -184 26 -208 92 -21 -14 -154 136 208 96 140 23 210 -150 -11 -146 -76 5 105 -52 -84
11533 -84 89 -232 136 50 128 -198 288 -34 -396 4 -55 -230 102 78 -82 -157 -46 -193 -91 91 -143 156
11555 156 89 -80 -20 -10 -8 -156 -476 -409 -120 -17 -118 78 50 171 -52 40 337 -134 205 155 -38 -186 68
11578 68 -165 -154 -104 -157 -81 175 134 -126 225 44 124 68 -28 -94 134 -31 -125 -244 -192 -30 -323 -214 -8 84
11602 84 -16 14 131 -43 34 147 9 7 -108 -80 -152 -73 -129 -94 -91 -46 5 16 312 227 -82 310 61 17 74 111
11628 111 -98 -292 59 -255 -325 -38 56 10 145 316 13 17 264 -131 -30 153 11 -106 -27 71 -335 -381
11650 -381 -250 128 32 169 31 3 -91 161 -84 133 227 -114 -10 28 -104 -184 -24 80 99 5 -74 -31 76
11673 76 72 1 -6 98 0 30 -13 23 -38 -49 -299 104 -112 -163 75 76 274 339 103 274 -133 85 33 -122 43
11698 43 60 -195 -77 -57 -199 -14 24 286 -115 28 147 154 -134 -41 132 -57 -83 -71 -142 264 -56 -191 115
11721 115 280 -300 97 239 33 127 47 -89 -18 48 -78 -58 -13 -208 -90 -121 41 -16 -118 24 50 -194 -144
11744 -144 23 -123 -382 -127 -248 -62 -130 -47 -135 -233 92 19 -3 208 110 218 -152 -179 123 -133 32 -9 -267
11767 -267 -54 -5 4 -21 176 -12 47 212 247 204 110 245 -50 -194 2 -51 -39 -210 129 125 213 87 -181 -128
11791 -128 262 116 83 51 310 180 -466 53 124 -159 -21 17 -171 44 155 -41 283 109 -96 139 411
11812 411 172 -196 141 145 -38 -131 38 197 -240 -216 -177 -141 72 -15 27 -50 -12 -5 37 -111 -59 -126 -243 -418 -89
11837 -89 12 -126 16 360 25 -24 254 -6 325 102 -243 121 -51 -25 13 -20 54 65 125 -53 93 -39
11859 -39 -44 -109 209 185 7 -108 -114 156 -23 -245 125 -144 -64 123 123 -39 8 -158 13 -10 182 206 14 215
11883 215 42 -170 -117 -103 -291 -17 -11 304 -80 44 -91 -62 142 125 -113 84 -47 -22 145 -156 100 -179
11905 -179 -157 -12 175 86 10 163 -51 20 -160 -151 -161 51 46 66 -147 63 -67 29 110 -56 8 181 -29 -102
11929 -102 256 163 129 100 82 -14 25 -18 57 -54 1 232 -2 -3 331 -221 199 108 -159 139 251 32 -131 193
11953 193 -90 -42 -146 -149 -58 -123 124 147 189 75 335 236 -18 158 109 -233 -157 123 -59 -112 -142 -49 -262 75
11977 75 418 110 105 88 148 -177 31 56 100 82 -110 6 -76 -162 7 118 196 243 -70 -181 154 253 -142 -156
12001 -156 45 -157 -97 180 -33 66 58 -252 -38 -114 75 13 18 126 -200 4 156 75 -103 201 67 -211 24
12024 24 -35 104 -190 139 -255 -188 95 -39 93 -62 62 -104 1 -12 84 -67 -27 135 114 -112 -37 112
12046 112 -7 -50 158 142 150 1 117 -185 203 48 -93 10 -12 -274 48 208 -18 135 -8 -31 5 13 78
12069 78 110 57 -38 -272 -91 -186 -129 -135 -183 11 -154 246 -8 71 17 -104 53 73 166 90 123 -259 45 61 -369
12094 -369 128 -71 26 166 67 40 201 -76 -87 79 334 186 -71 161 -93 -69 102 69 -203 -125 1 245
12116 245 18 77 116 -27 -40 70 -120 190 -132 -89 -157 223 95 -157 118 206 138 -118 -44 19 -106 133 32
12139 32 -130 -8 44 -7 -191 -120 146 -176 101 -69 40 60 132 -225 34 -84 -10 178 -4 174 -169 -68
12161 -68 -190 131 -27 -337 -17 122 -61 218 -57 -213 -48 -197 -284 -4 -55 -287 -110 3 -89 -9 108
12182 108 169 117 24 180 -14 -24 -48 89 175 -105 -75 -131 -201 -17 227 -232 62 149 -113 16 156 164 -16 147
12206 147 42 -103 193 -111 -207 -163 -209 4 72 -156 17 7 -6 28 151 -53 114 -86 -175 -180 146 -198 -29
12229 -29 -142 -12 191 140 91 43 113 -57 310 248 111 232 -169 -107 -119 -94 184 -43 -103 -156 77 109 348 38
12253 38 262 -37 404 56 -217 -114 19 -54 -116 100 104 8 46 109 -17 -22 -88 36 214 -65 25 -151 -251 71
12277 71 58 -91 -146 274 72 149 -210 -182 -51 -18 -24 -236 19 69 135 -89 128 -242 -73 -41 -41 -151 -274 75
12301 75 32 60 38 -80 -37 171 175 247 26 188 -179 19 -8 -94 -115 -107 -307 -127 141 -242 -26 11 -15 12 8 -295
12327 -295 7 -54 14 112 -43 86 21 194 -70 65 65 177 -104 -25 29 177 -375 -88 -181 -141 127 -416 -48
12350 -48 35 78 46 6 -2 38 -300 -208 176 10 -212 167 -114 83 57 -206 -26 -334 -9 -166 178 -7 -129
12373 -129 37 51 -122 -176 40 48 24 -71 -58 -285 -157 -7 -210 97 -8 156 -107 182 47 54 -48 -80 -90
12396 -90 -27 23 -139 -192 -163 5 -109 110 250 -51 206 94 14 -100 -90 -129 -5 -115 -128 32 -26 71 -45
12419 -45 256 42 86 -83 133 126 -169 -197 223 -105 -59 -113 43 -175 -37 104 175 195 52 66 154 -54 3 -32
12443 -32 290 156 153 -181 -41 14 76 68 52 190 -310 26 -51 -71 65 197 -152 111 42 -235 -56 124 -51
12466 -51 -377 144 123 -18 -52 -112 48 137 118 12 -5 51 118 -207 -175 295 -21 -386 -21 156 38 206 200 -84
12490 -84 -179 240 389 13 13 38 275 -147 31 -110 -129 -117 85 -167 -234 135 26 95 -328 -191 -122 153 64
12513 64 222 242 64 -208 33 9 -303 -212 105 84 -358 46 90 172 181 55 64 107 -123 67 -17 170 223 -413
12537 -413 -64 138 250 31 109 -223 74 -151 -149 -60 -205 50 -67 -143 148 -91 -182 -87 32 13 -42 29 -19
12560 -19 13 75 -84 -97 -199 76 16 55 -20 -77 -207 4 -24 240 -11 127 8 38 132 80 -124 112 10 186
12584 186 -60 -82 75 -186 95 57 -207 3 70 -140 31 96 -88 -141 84 22 115 -293 115 -230 -65 -124
12606 -124 -123 -228 -65 -53 -72 -99 10 187 -129 22 17 -68 -209 -140 -237 15 -205 9 240 74 159 -165 118
12629 118 22 -21 -63 37 -272 -39 -105 -105 -224 101 -88 134 101 175 180 64 224 -27 -188 -57 -61 -63 -119 -30 44
12654 44 -7 19 -11 257 131 -143 69 -120 -147 53 198 -55 8 116 77 -19 -47 -190 -79 29 -133 85 80
12677 80 123 -120 -403 220 142 96 -75 -109 -56 -237 122 -366 -59 208 59 -188 -67 -62 47 -46 -61 77 101
12700 101 26 32 -69 128 -291 -361 -145 -2 -107 39 104 252 -30 93 -27 48 -38 -222 194 191 21 63 -39
12723 -39 24 -118 -127 -243 82 -193 -67 74 -51 94 81 -227 -292 87 -17 -141 145 -35 -124 39 11 -100
12745 -100 223 -169 -16 -120 -158 127 -20 -129 -51 -10 73 154 -34 -115 -177 -47 -34 143 89 -113 -207 146 208
12768 208 -101 -224 -34 -109 164 -239 -86 6 170 154 -152 -104 152 24 -28 -11 -113 102 -283 49 -141 -94
12790 -94 -166 11 -177 -97 -4 -97 -85 -157 261 105 -95 -11 90 -79 -7 -112 -41 -3 -39 -143 161 -73 -119 22
12814 22 -81 -27 283 30 154 -103 157 104 27 -21 101 -47 -25 -96 -55 188 76 -51 -65 -59 -80 278 -178 19
12838 19 97 -203 -153 -124 21 -199 -262 18 -103 127 14 29 110 211 -4 -35 79 -282 38 -67 -330 -92
12860 -92 -50 237 62 173 272 -75 58 -49 293 173 -6 33 222 -65 -223 11 -162 32 79 -97 68
12881 68 72 -221 41 -157 -101 -8 -41 -96 -227 -238 -62 -9 -170 13 -164 -110 64 -44 -103 -26 151 25 149 62
12905 62 -95 2 -123 -284 -56 6 201 6 -51 62 -16 315 -126 187 74 111 102 77 -65 -171 106 -5 90
12928 90 -202 -107 -42 -61 117 -55 137 36 235 -93 33 51 -182 -178 66 -68 -125 0 208 -329 135 101 -137
12951 -137 131 -25 136 202 100 140 119 6 -90 -42 85 -120 201 -127 102 -75 101 44 128 25 145 36
12973 36 88 4 -27 -278 46 -233 145 -113 -116 -116 -26 91 -188 66 -18 83 -195 -53 -58 -30 -73 81 -25 -228
12997 -228 -131 86 80 3 157 397 35 -82 -66 160 46 -96 264 -89 60 128 60 -63 -97 -45 185 -71 -154
13020 -154 144 -44 243 186 26 328 -152 124 -104 -195 -42 -185 94 -22 -82 148 37 -38 -19 -33 -50 -163
13042 -163 121 5 -24 88 132 44 -294 -153 -77 -30 50 -49 12 91 136 3 241 25 -138 -180 145 -118 -102 -266
13066 -266 -86 54 23 196 -211 -110 85 18 -70 -63 -10 -35 99 -109 -174 -133 63 -28 81 6 -76 88 -47 -107
13090 -107 -66 -213 -120 -74 12 -77 -66 -157 100 10 80 275 11 -14 246 245 98 40 29 6 -184 -97 74 -24 224
13115 224 -70 58 -139 53 195 -147 -13 63 -98 13 126 183 179 34 -144 21 -52 28 -15 -61 -14 35 198
13138 198 134 -107 -101 -83 -2 137 48 -13 -55 -27 -245 37 -53 117 8 44 197 47 -22 -153 70 -15 -23 98 -12
13163 -12 69 -96 -70 50 -167 -61 -108 93 144 -18 201 15 60 -164 -122 22 -170 81 13 -291 -39 -195
13185 -195 23 -149 -69 -23 -88 313 -25 55 -154 34 39 -111 -240 0 -88 -66 -137 -11 -216 46 250 -75 55
13208 55 237 37 2 -116 -4 258 -42 9 -176 160 -146 -107 26 -35 -57 -44 57 8 -218 -63 -16 -50 -7
13231 -7 -95 23 204 121 26 -68 -207 50 -64 179 152 -136 117 -96 307 -75 -145 151 216 103 155 175 69
13254 69 185 98 -161 -23 4 -44 78 -59 59 -162 91 17 -170 -28 32 -170 -75 40 118 -277 -144 5
13276 5 -115 48 -6 12 -126 34 -214 29 45 101 35 67 185 171 111 -120 -113 -8 -116 36 181 134 -105 -67
13300 -67 151 104 -91 -127 199 -111 -7 -28 149 123 -147 151 35 -88 5 -52 185 -238 66 -5 -34 -63 10
13323 10 -185 -76 -127 -167 146 -100 246 -73 -345 -86 29 -148 142 16 -30 -198 70 136 106 -37 -83 -75 6
13346 6 91 129 -153 133 -67 -116 -107 -147 49 -50 100 95 127 5 124 55 206 202 -4 103 -22 -98 -37 4 -274 225
13372 225 62 -71 18 292 125 15 148 100 143 -21 -123 -11 -121 113 -163 -22 -160 -45 167 -137 -115
13393 -115 289 204 100 260 -181 152 106 11 13 -331 10 82 100 59 53 -29 38 141 -107 186 43 -132 -155 -21
13417 -21 -50 52 -203 -249 -167 194 43 -171 16 73 205 -306 202 -234 26 83 77 -11 9 -246 -45 36 7 164
13441 164 -112 203 -31 49 14 193 133 125 157 -87 -43 -230 -28 -67 73 -468 24 -295 -57 84 -170 352
13463 352 194 284 -357 42 -33 -4 -47 15 133 -16 -76 6 187 -93 192 -17 63 322 -77 -183 167 -46
13485 -46 -122 -23 -54 -249 -222 -42 286 -134 -54 9 -71 -16 252 82 128 5 61 50 -156 -31 -120 -135 84 -131
13509 -131 -120 57 -59 -12 -83 145 75 49 35 -94 -34 -171 -78 104 92 68 3 -82 -27 114 432 36 28 -1 95
13534 95 20 -233 204 84 -126 -96 20 -18 33 25 -233 66 176 -49 -310 75 -26 -24 26 96 19 -164 -25 -183
13558 -183 170 -80 -298 293 -133 98 -246 -8 111 104 161 230 -90 -16 -36 -35 198 -37 -11 -37 6 -55 182 301
13582 301 -28 19 207 80 107 -48 189 178 -16 68 86 -53 -138 72 152 -41 154 131 193 -156 -94 10 -41
13605 -41 196 63 -35 99 -145 168 99 338 1 57 4 103 105 -47 232 7 94 -247 -92 -71 119 -30 182
13628 182 -135 -197 199 -188 172 -71 216 196 -259 -36 95 -64 224 -26 120 135 219 185 212 81 84 247
13650 247 -94 166 106 -65 111 -117 -80 -209 188 -62 -154 100 -24 62 78 -34 -140 -90 118 51 64 130 50
13673 50 -50 149 177 -36 87 151 234 91 -14 190 -12 -32 -168 2 48 299 220 18 -148 285 -166 -147
13695 -147 149 195 48 166 24 -198 -34 -151 132 44 55 102 -12 -63 -107 -152 -92 57 -56 -71 -51 -65 -63 119
13719 119 75 -91 -111 -16 -80 -147 183 -26 162 -113 12 377 -95 -4 286 -25 158 176 125 -76 -166 92 -123
13742 -123 41 -82 55 121 -50 -89 52 8 56 197 16 -90 -295 -12 155 227 14 -65 37 -187 61 -51
13764 -51 -137 4 244 -256 -31 -10 -16 241 -103 36 -56 -133 226 -75 128 473 197 -76 190 99 111 218 -127
13787 -127 53 -104 61 26 -176 -86 -149 67 199 -74 -114 -132 147 72 -20 -119 -14 29 -57 -160 -92 21 133
13810 133 -170 -148 -16 74 -227 -146 -195 186 -64 -130 247 -155 72 27 151 -210 17 -25 33 161 156 18 -44
13833 -44 110 13 -31 109 57 133 -2 113 26 -144 103 110 92 -200 128 -79 273 -292 -47 -9 6 217 80
13856 80 363 -355 162 -51 49 116 -110 -77 -166 38 139 29 -36 139 50 -94 243 118 -116 199 191 -44
13878 -44 124 337 -158 -116 0 68 43 -154 -86 22 -8 -390 100 245 -95 169 -235 -30 -101 49 69 -60
13900 -60 -49 71 21 -49 34 0 -248 -50 -104 -79 -93 1 -97 -58 -49 -120 -210 -154 -23 -257 21 -39 -157 -58 342 -16
13926 -16 67 73 100 91 105 -86 83 -117 -161 32 127 50 242 -77 -98 181 64 194 -168 -208 39 -67 -88 4 -69
13951 -69 -27 -156 -32 43 -113 -3 31 58 17 -137 -156 73 -221 -78 -84 -4 44 -101 19 9 11 47 30 186 -22
13976 -22 -95 110 252 117 247 2 32 10 27 26 -135 -175 92 -155 -122 260 20 131 61 -66 28 -78 -97 -227
14000 -227 33 -122 -47 -285 -84 53 114 64 116 203 80 27 -75 -229 85 -18 117 54 -109 160 -117 68
14022 68 101 168 262 235 27 -19 -87 -137 293 -104 126 10 -16 -88 -138 -1 -207 -89 -189 25 146 -119 -10
14045 -10 -308 160 121 104 -71 -46 -29 -26 0 74 269 117 -38 147 252 -210 16 -26 -70 -34 -252 202 -59 -102
14069 -102 -63 -81 21 59 -106 52 -84 -5 44 23 210 -199 46 195 -159 65 21 77 68 130 -179 121 -138
14092 -138 -160 85 -30 107 -73 -122 -35 -141 127 -146 105 -58 187 -15 -98 0 20 188 -13 -10 -112 -21 -68
14115 -68 81 -168 117 -32 -108 83 21 116 227 176 -99 -127 69 -13 104 -77 61 134 -130 -93 -377 81 -117
14138 -117 -54 -58 -136 1 31 32 33 6 -17 -55 -56 131 127 -27 -53 -12 -33 24 36 -284 164 185 -57 -37 51 71 102 -211
14166 -211 189 295 -144 -6 71 -112 -104 192 -204 -110 34 76 81 -4 -93 117 115 11 78 -117 -205 -75 -186 -20
14190 -20 92 -248 -149 320 112 -187 148 -97 -122 108 121 -30 -167 -192 -155 -110 -19 20 45 76 -67 47 19 49
14214 49 -77 -10 55 187 181 -181 -96 70 -19 -41 124 35 -103 50 -5 -94 -114 9 -164 -38 -27 -342 5 18
14238 18 -89 83 -81 -19 -45 -8 -36 77 10 1 194 269 -59 249 -102 -196 -4 161 127 -74 -249 74 30 303
14262 303 16 5 -37 66 -37 -56 82 86 -92 5 177 5 135 -195 -8 60 -17 -213 70 -158 42 19 -267
14285 -267 -37 66 -11 -21 -77 57 251 -35 -248 -151 70 28 8 97 20 54 99 101 46 -176 -23 118 16 -158
14309 -158 -56 6 128 195 27 121 44 299 -201 99 148 -49 148 16 34 -69 29 11 -94 46 95 70 243
14332 243 -36 -199 -116 12 96 52 -35 32 49 -57 43 -8 -65 -9 -104 -10 37 86 -63 -20 0 -132 -209 -76 -188
14357 -188 -238 161 31 149 -215 64 -135 91 -100 -53 77 -23 -54 43 98 -289 140 -279 -34 -115 -80 104
14379 104 -175 156 -13 -12 -129 -149 -110 -125 109 235 -215 -256 -200 8 -46 238 128 -163 4 97 -340 -141 140
14402 140 -135 -100 55 30 104 286 -6 123 168 -40 -31 99 -3 -44 67 109 -33 -96 -80 134 164 96 -157 -172
14426 -172 -67 159 -40 51 239 -105 -195 -92 86 -75 -117 -204 -32 -90 -430 -80 -206 -159 -147 -109 -37 21 230
14449 230 159 127 -94 33 -64 -122 -63 76 -58 160 -135 -104 37 82 147 32 -27 -61 -78 -125 -3 -75 40 19
14473 19 -263 32 -189 -29 149 -258 -106 -56 170 167 -120 -79 76 96 -110 80 -70 38 -71 -228 45 94
14495 94 28 -114 279 -62 71 3 101 21 -75 -204 84 -76 37 179 35 -77 77 -97 -3 -59 -2 113 -203
14518 -203 80 -59 -163 -65 -110 191 165 -142 0 -185 62 137 -28 -198 93 -286 -346 26 86 67 1 291
14540 291 84 -4 65 -104 -42 37 192 201 11 200 -51 319 29 -39 151 86 -38 -6 7 -87 -52 83 -77 -208
14564 -208 -63 -62 -72 -64 126 197 -80 -33 37 -41 42 -36 -152 -57 -117 -235 -84 1 -26 -174 73 -77 -182 57 -110
14589 -110 87 -143 202 27 -56 -112 -76 280 -63 376 -123 216 108 -160 -105 -17 128 -65 196 83 -62
14610 -62 -90 12 -238 -249 3 42 162 131 -60 -100 -60 2 88 -29 102 -208 2 -136 66 -25 -33 -228 44 149
14634 149 66 158 9 -202 173 117 77 205 44 99 -2 -94 123 -28 -270 101 -249 -136 -130 -48 -129 -18 -81
14657 -81 20 -42 84 -18 316 247 119 118 98 -192 -166 6 15 37 -45 -46 -147 -133 -52 298 9 -58 -70 2 -137 -71
14683 -71 -77 -16 -6 -7 -9 -10 -7 -35 116 -22 -137 -11 -50 -61 -20 23 -50 -115 169 112 -52 185 -134 80 92 -112 125
14710 125 26 -7 137 -129 -152 -22 6 29 -19 89 62 -276 -38 -68 3 -162 189 103 100 106 32 63 142 149 -213 96
14736 96 -34 -6 299 99 -101 4 12 -61 -26 7 52 44 190 -90 192 -145 84 271 -71 -82 -2 -38 25 77 -136
14761 -136 30 3 7 21 105 -73 -19 -60 -246 210 84 -57 75 147 -160 194 -138 -102 46 -174 231 91 -56
14784 -56 -65 -144 36 -109 171 279 -81 31 -50 143 -65 -25 27 126 -123 119 223 -189 28 -327 -53 145
14806 145 -41 128 -127 -70 -65 -90 119 -25 -238 -106 20 -81 139 -217 -44 -71 -92 -23 -129 -109 -147 -110 -212
14829 -212 138 -66 -43 120 202 -155 -109 401 32 117 -161 95 100 130 110 74 103 60 -103 2 -126 151 -272
14852 -272 -101 103 35 13 83 153 -12 47 -73 -13 -108 80 62 -36 35 -185 -111 221 55 269 -87 -101 -21 183
14876 183 228 185 42 57 -43 21 209 36 -106 115 -81 -22 -24 327 -18 -15 158 93 173 -111 -235 113 59 -197
14900 -197 -166 -85 55 -16 -138 -230 166 110 -58 -25 169 -137 -29 110 -160 -142 201 -60 75 -91 -101 78
14922 78 -83 -107 -88 -72 -4 -7 -117 215 -185 2 94 -44 141 101 -119 -153 -67 -220 -25 -5 46 -119 -93 -232
14946 -232 -77 65 223 -305 -121 -77 -119 282 -26 -201 105 20 236 -112 74 27 136 130 -173 -39 110 78
14968 78 -225 197 -179 -8 68 22 -36 -42 255 -60 -64 74 -10 -112 85 -212 -26 36 -173 -102 51 113 36 -106
14992 -106 -68 58 -34 158 -3 155 22 221 -62 101 80 -7 105 -15 -337 59 65 143 39 34 185 1 108
15015 108 36 117 87 -85 -3 -87 207 140 209 -22 -33 -75 -273 -155 -132 136 133 -233 81 274 57 107 -167 9
15039 9 -28 235 83 6 163 157 67 95 77 -31 -4 -176 -4 -120 10 14 -97 81 -30 -74 -12 -213 -101 16
15063 16 75 12 -36 -15 -46 131 64 119 -27 247 6 145 49 -243 65 211 165 -87 113 306 -92 84 264
15086 264 11 103 -179 62 55 -76 101 301 -120 95 -84 19 38 -68 6 -7 -208 -55 63 32 -22 11 44
15109 44 142 -196 191 -105 27 -49 7 176 -99 -404 28 -181 -20 -141 116 -64 93 206 -184 -206 -18
15130 -18 14 -50 56 247 -73 41 24 107 -28 -111 131 164 -157 -71 97 -128 95 -55 -219 22 -128 -54 4
15153 4 -181 -71 145 72 -33 -15 -107 25 330 150 13 -70 33 -113 -302 25 -32 -116 -8 -9 9 175 107 140
15177 140 261 -196 8 63 -33 322 92 364 115 -73 115 0 97 -11 8 -254 -92 -139 22 29 -130 0
15199 0 -77 -122 -69 6 -9 -126 -247 45 143 -41 -161 38 -194 144 104 -6 162 61 224 -80 183 -29 -354
15222 -354 -56 16 168 9 372 -34 -97 -184 137 -11 -37 112 -188 -6 246 -124 -65 243 57 -25 83 -4
15244 -4 -97 -135 -119 -372 -58 178 -132 -224 -116 238 -37 -197 -348 -161 22 -64 134 -29 -189 -23 -8 -156
15266 -156 218 140 94 -253 -62 77 -15 65 -215 51 100 -50 7 164 277 -189 144 164 -89 -347 142 192
15288 192 -7 134 -58 -231 396 154 26 -108 42 138 -10 -97 -25 -43 -26 -166 12 -175 106 -184 131
15309 131 -49 -191 -151 -229 -46 -33 172 -90 107 20 323 150 123 -69 -22 230 15 -121 -81 -246 -6 189
15331 189 -44 -320 95 -41 -46 -16 -175 -87 1 -81 -15 -220 -84 -33 -117 -198 -162 114 -107 81 139 38 74 -50
15355 -50 4 -234 195 -71 -226 -143 64 -243 -16 203 84 7 282 14 30 33 199 193 8 -203 148 34 119
15378 119 46 -198 -55 85 -130 -129 91 24 -8 30 42 -75 143 99 -49 -122 -153 -70 123 -110 57 -140 95
15401 95 168 -293 -51 44 153 173 253 -110 -151 82 16 -158 -71 -15 62 -137 183 -75 60 172 -127 -9 185
15424 185 -58 -202 142 -19 27 171 125 -154 191 -46 34 13 -23 192 123 -107 -8 -199 -63 -22 -98 -162 -76
15447 -76 14 -119 -111 134 -9 18 117 -32 115 163 -6 254 208 -81 -193 74 198 -77 -141 58 45 77 -177
15470 -177 74 188 -56 181 -108 271 114 -175 167 23 -242 148 -156 -414 5 -30 -20 94 111 257 -75
15491 -75 -80 69 -185 -241 136 -229 -267 48 129 37 -53 83 26 208 144 260 -24 -69 117 178 131 -20 -28 -7 46
15516 46 -11 29 -24 112 211 -182 -89 -5 -143 -59 -122 148 -98 -193 97 65 -150 23 6 -295 76 -40 -117 -228
15540 -228 -47 64 -134 -8 49 121 -17 -49 -62 -25 -26 -151 204 -22 -99 -13 97 -59 120 -7 33 -24 198
15563 198 -34 -74 196 153 141 -108 119 385 -196 141 1 -100 -208 -203 -235 67 -43 39 69 -49 7 78 146
15586 146 -104 64 -97 214 -14 131 82 -59 -47 -230 109 84 -36 107 -3 -122 56 77 -111 -44 108
15607 108 90 205 56 97 87 100 11 191 -145 -28 154 -37 -40 -34 147 -42 76 -71 102 51 -62 59 -37
15630 -37 -68 27 -210 8 -56 -97 42 -125 259 -205 40 108 12 132 8 -49 -238 64 -44 -183 33 -118
15652 -118 -17 55 -5 -106 -75 114 45 30 118 -51 -122 64 1 -80 67 -41 -134 -89 205 -109 82 30 -22 72
15676 72 32 -149 -54 -181 -187 -60 -271 185 -371 110 -162 -148 65 -26 -50 -219 -92 -86 79 191 49 -1 132
15699 132 30 -40 22 -61 -111 -1 194 -8 -254 99 127 -145 25 -94 49 178 -42 -132 -155 11 -102 -148
15721 -148 -167 -189 -14 -39 144 30 29 231 -5 230 -6 -8 -76 -76 180 -174 -217 167 107 -23 157 13 -37 67
15745 67 143 -80 -3 232 -71 86 -118 -176 -7 187 66 112 118 174 -7 64 43 -228 -17 29 107 73 99 -71
15769 -71 -61 47 -84 112 -219 -31 -108 -68 -110 130 106 28 63 -114 -67 94 26 95 -32 -335 -181 -147 194 58
15793 58 -34 154 93 -79 200 -122 -28 122 70 80 -137 -134 137 -202 -108 58 389 204 123 316 -37 -104 -54 0
15817 0 -209 -45 -66 -142 70 -84 -95 -271 -88 -61 84 -43 129 -80 -97 -203 -52 208 -73 18 114 -68 76
15840 76 -54 -121 -228 -50 108 -51 94 172 17 -188 -119 23 -46 58 85 33 -151 125 -77 102 -346 -200
15862 -200 30 -189 115 109 16 -86 92 99 -40 -142 -182 -91 -219 132 -182 -59 223 131 262 21 29 63 -45
15885 -45 -74 -73 -109 -49 208 98 70 -343 27 106 148 -161 -34 -23 -100 53 16 134 115 -102 -92 -46 -168 -107 -37
15910 -37 -69 79 -5 201 -42 110 349 -30 -114 20 -103 -215 -182 -131 -164 104 -183 104 57 -81 -211 145
15932 145 80 -8 -60 132 102 -121 0 240 39 -81 23 43 64 52 100 178 -84 181 -35 -121 37 16 135
15955 135 -69 43 -165 134 -7 -128 90 177 143 34 131 144 87 233 -289 -242 136 91 -220 -12 -234 33
15977 33 -87 101 -6 28 79 44 -9 -25 70 130 80 -42 -69 -144 52 -19 56 -81 69 -6 -212 -213 87 -4 95 -201
16003 -201 -139 -154 -80 34 140 -16 -29 -116 20 137 -144 88 -23 92 104 95 88 69 -87 55 198 -197 -15
16026 -15 16 -120 -22 -38 64 -49 115 31 80 95 194 280 67 238 -15 106 82 45 -5 33 -49 -194 170 -210
16050 -210 -45 -26 18 -67 11 -147 7 157 -51 -9 -48 -199 -2 89 -84 79 -62 -2 -25 -167 58 -55 -162
16073 -162 -158 -58 65 -171 -165 -236 94 -204 -68 242 -119 83 22 162 84 -99 -1 26 -1 -5 -304 -106 -189 -162
16097 -162 151 13 -151 -104 -51 -45 175 149 25 -3 -39 -70 201 -19 186 80 -65 -20 -151 -195 0 17 -53 -258
16121 -258 33 95 -159 -97 195 -116 -28 -83 -381 59 83 55 -42 194 1 28 58 -159 125 -128 -167 79 37
16144 37 -21 -153 -38 -286 -212 -68 -85 138 57 -89 79 -176 -116 -25 143 -131 -191 424 -158 110 -69 -100 24
16167 24 228 88 -43 -307 -3 325 -51 -85 -77 -76 59 24 89 16 96 146 -82 -45 234 133 -108 118 -315 -74
16191 -74 189 -16 -201 -146 35 -109 -10 -91 -240 -182 -15 -51 -156 203 126 181 -82 -122 138 -128 -161 105 23
16214 23 -152 -137 -173 -71 35 68 119 -26 -140 186 -105 114 -28 225 107 22 -42 2 42 211 -23 148 -69
16237 -69 207 204 56 155 -162 2 -65 -90 197 -77 33 212 -99 -70 -403 88 91 -125 196 220 16 16 47 62
16261 62 -66 -13 83 -104 144 -135 -24 -122 -191 128 -121 -41 50 -35 -194 249 69 -100 24 88 -50 48 86
16284 86 45 -206 -42 61 -15 -123 83 48 245 43 -95 14 203 -38 156 -142 8 -66 -34 54 48 26 67
16307 67 -131 121 -34 -15 -61 142 51 -2 47 89 92 -44 -142 -163 -50 2 63 19 -20 106 127 -146 -12 16 -49 -94
16333 -94 -177 -255 -44 256 157 -37 102 56 297 -20 157 -184 -106 -194 57 3 -44 85 -94 -154 215 24 -21
16356 -21 -46 13 80 124 -62 8 115 103 37 -48 16 -7 -6 15 -152 30 46 148 -46 -216 343 -79 3 -47 -85 151
16382 151 -80
16383h0
$$ Imaginary data points
##PAGE= N=2
##DATA TABLE= (X++(I..I)), XYDATA
0 0 0 0 0 0 0 0 0 0 0 0 0 0 -32 32 -32 32 -64 64 -96 96 -128 160 -161 193 -225 288 -321 384 -417 481 -577
31 -577 641 -737 833 -930 1057 -1186 1314 -1475 1645 -1829 2046 -2267 2501 -2772 3063 -3375
47 -3375 3724 -4105 4522 -4982 5489 -6053 6678 -7378 8173 -9072 10105 -11309 12733
60 12733 -14438 16533 -19180 22635 -27378 34299 -45406 66168 -118404 539234 636637 -666086
72 -666086 -763124 -167507 540247 505642 67036 -365197 -271848 -89327 -56427 -12555 290814
83 290814 343614 -94 -377021 -321313 97395 553365 473883 -135607 -560166 -276100 192745
94 192745 288632 79958 -117817 -214680 -151043 -30501 35829 123528 238183 91959 -233418
105 -233418 -248006 101470 303448 139063 -141806 -255039 -118623 82953 45256 -133749
115 -133749 -77879 124702 60984 -177192 -170981 86945 270129 188062 -103837 -298543 -107778
126 -107778 225016 194912 -129406 -250139 -69295 89908 35546 -128149 -141724 106702
136 106702 287506 50570 -296615 -203396 204310 356703 96260 -239818 -300787 -42067
146 -42067 209991 132163 -104931 -130119 2693 17986 -42036 6088 122994 160103 51146
157 51146 -130951 -163287 53667 237115 112564 -136441 -192583 -57793 76620 94485 5682
168 5682 -52104 14679 70647 -2452 -45010 68177 156281 60687 -89906 -111477 1125 102164
180 102164 47677 -97766 -105967 41841 98650 -14089 -86358 251 119494 121766 -3397
191 -3397 -113793 -54761 99799 113543 -36045 -127180 -63104 27626 29278 -34140 -55267 25381
203 25381 98041 20564 -106047 -63560 108491 164229 23443 -149136 -158944 4351 133060
214 133060 55861 -106402 -129764 -31961 27425 27643 32099 40995 23741 -28083 -74335 -28025
226 -28025 98045 126434 -21565 -167857 -145475 -3804 106308 81317 -55428 -135907 -51959
237 -51959 68025 79983 40834 29078 7691 -34637 -47198 -14363 44434 76291 -4707 -140484
249 -140484 -134498 22643 113828 53399 -34923 -57515 -9824 67747 83112 19827 -5967 25701
261 25701 3596 -54836 -36640 21748 25823 -9436 -51057 -73797 -10428 94989 85924 -15548
273 -15548 -35609 29048 61465 48045 15576 -27995 -23394 20603 -5463 -70311 -36461 37391
285 37391 15203 -37857 -20587 20759 47905 63396 25882 -26264 8316 61725 14052 -48842
297 -48842 -26821 -949 -17692 -23802 -32896 -49699 -3246 58620 21744 -34240 4490 53321
309 53321 38108 18385 4528 -26000 -16057 14186 -25823 -67401 -17712 17265 -35330 -55343
321 -55343 -2131 30605 34625 33646 -5651 -28321 31979 65712 -2046 -46769 -19554 -17272 -33939
334 -33939 -13676 -13435 -40117 -14645 16164 -13026 -12156 50186 55732 3156 -6726 4765 -650
347 -650 20757 25234 -41912 -72030 -9738 16064 -24235 -22002 9057 1547 4803 30410 20623
360 20623 14835 46418 29454 -31366 -20984 26935 7845 -27181 -21337 -27649 -31034 12781 29605
373 29605 -10853 -9628 33680 30377 12242 28790 24040 -4915 3470 7936 -26751 -23161 14957
386 14957 -5217 -45103 -18351 18051 12942 14114 18585 -1364 7040 43486 27085 -14726 -4487
399 -4487 8111 -21244 -25004 185 -9187 -23509 -5032 -4144 -16959 11799 39173 14495 -3035
412 -3035 10709 5577 -2182 15382 5192 -32456 -27365 -3577 -18483 -26101 3562 11626 -6962
425 -6962 -4283 3449 1901 22708 37556 4200 -24479 -9957 -3774 -15554 -5595 2051 -22174
438 -22174 -30677 -10440 -1617 5519 26225 22330 -5317 -6741 8622 9572 14224 18749 -10278 -41290
452 -41290 -28767 -5223 148 7554 7970 -13965 -22371 2421 26555 35960 33708 5736 -27809
465 -27809 -17799 14960 17535 332 -11719 -27523 -35292 -12863 15986 25390 24055 9885 -15681
478 -15681 -13991 23239 46493 35174 6912 -29844 -49415 -20465 24052 25761 -6569 -31123
490 -31123 -35139 -12532 27197 43738 28244 12745 750 -16225 -9714 22245 32546 7589
502 7589 -23595 -48330 -50441 -11099 33053 31341 -257 -23285 -27334 320 48454 57818 15962
515 15962 -18464 -21766 -19258 -7965 10748 4180 -19639 -27972 -29413 -28905 884 39351 36815 9222
529 9222 -8422 -17628 -5293 38262 51675 1224 -48260 -46811 -23713 922 17219 -2599 -31925
542 -31925 -20022 6427 4981 11776 38720 36539 5508 -12083 -20185 -16310 20909 41183 -9123
555 -9123 -66213 -59528 -15948 25957 48744 17997 -37726 -31853 24597 44124 31291 26394 7032
568 7032 -26194 -27174 -11653 -8293 8735 23162 -15091 -60586 -40356 12122 47649 63438 33519
581 33519 -37271 -53111 14513 63520 45980 6294 -37179 -65302 -32752 21579 21509 -3069 -3667
594 -3667 -11557 -27660 -3265 35336 41860 38870 25013 -28921 -59950 -7311 51558 38921 -10481
607 -10481 -56960 -74967 -22442 55887 52593 -10261 -27946 -5244 6457 22117 35096 14431
619 14431 -3376 2953 -17530 -49082 -20264 30130 24202 -13007 -39727 -50615 -12277 62553
631 62553 71401 -1341 -43212 -20228 8423 28847 36501 -410 -43386 -33056 -10046 -12622 -98
644 -98 22747 6837 -18690 -13227 -5966 4026 42473 55556 544 -48451 -35903 -2000 26750
657 26750 39407 -1173 -62423 -54968 5515 34291 29886 18002 -10405 -26314 2900 28376
669 28376 15475 9845 15637 -10462 -40122 -28135 -533 19004 30159 3957 -48338 -43043 23878
682 23878 58730 35033 1707 -22651 -26338 6583 32973 9823 -17661 -14135 -13478 -19712 -5241
695 -5241 9817 8098 12726 13674 -9850 -16966 16359 35953 16767 -5461 -18474 -26464 -9701
708 -9701 14991 6625 -15132 -13802 -8005 -7547 8793 23322 12359 2501 8130 2882 -6892 1176
722 1176 8540 -885 -9054 -15368 -26658 -17717 11271 18529 610 -8563 -4531 1666 18208 28883
736 28883 11539 -10596 -11185 -7066 -8277 -3537 -1621 -10122 -13080 -11014 -13282 -3336 21826 26759
750 26759 5840 -7942 -2973 7713 18862 17427 -5431 -25125 -20483 -10107 -5408 939 1083
763 1083 -9242 -9373 3582 10590 14812 20556 14803 -155 -2780 758 -640 -852 -2200 -14604 -21746
778 -21746 -11102 -2871 -2667 5234 11663 5372 3568 11366 13555 12190 12692 3373 -9602 -8803 -6041
793 -6041 -13290 -12284 -2764 -6052 -11580 -2032 6793 7657 14653 18783 7445 1955 8874 6384 -1478
808 -1478 -365 -5851 -20121 -16778 -5474 -7718 -6551 5747 4123 -3289 6908 17396 12975 12579
822 12579 12229 -3700 -11268 1393 478 -14078 -13395 -8991 -17055 -11758 6986 7905 1256 8454 9013
837 9013 2476 12494 19928 2923 -8517 -2376 -7875 -15454 -3900 -1404 -18015 -15459 2063 2831
851 2831 2362 14521 11256 -686 7842 15542 2961 69 5483 -9642 -20461 -5596 -564 -13062
865 -13062 -8419 1893 -5109 -1988 16049 13586 2271 9876 11401 -3357 646 10856 -4481
878 -4481 -16816 -5884 -6289 -15252 -2829 6914 -5125 -4065 11846 9241 4084 15386 11847 -6060
892 -6060 -637 8747 -6132 -12476 -189 -6246 -17978 -4146 6254 -3443 697 12586 3693 412
906 412 15481 11854 -4705 731 5800 -9403 -9736 2704 -7064 -17262 -2008 4245 -5643 2018
920 2018 13512 3297 779 13617 7172 -5024 4440 5651 -12461 -11439 1831 -6468 -12789 -128
934 -128 771 -7467 4045 13459 2504 2464 13243 3963 -6578 3490 3393 -10911 -7218 236 -11690
949 -11690 -13484 2829 3459 -4691 4614 9863 635 4909 14334 3555 -3559 4597 -1606 -15106
963 -15106 -6503 2840 -7708 -10637 -1328 -3126 -3218 10923 12700 1526 5238 11249 833 -1988
977 -1988 6528 249 -11491 -7525 -6184 -13102 -4872 6965 -422 -6562 3541 8311 7160 14358
991 14358 13124 -1283 -3240 3185 -3325 -8244 -1046 -3390 -15413 -12391 -1890 1252 6045 10765
1005 10765 3212 -1034 10226 14108 6018 4110 3302 -7257 -12513 -7311 -7193 -7918 -711 -1939 -11915
1020 -11915 -6960 8530 14709 13676 10218 1045 -2129 8000 9367 -3465 -8899 -6426 -10370 -13947
1034 -13947 -9010 -4199 390 7189 3909 -4890 1501 16297 17781 10130 2956 -6513 -9902 -1941
1048 -1941 536 -7838 -11511 -9753 -11052 -6914 3939 7997 6434 9265 7710 1526 6086 12947 6661
1063 6661 -1925 -4954 -11451 -16546 -8285 122 -1309 -4103 -6604 -9133 2732 21779 19945 2471
1077 2471 -2019 3424 4520 5364 2005 -10059 -13415 -5204 -7013 -15262 -6379 8591 8687 3452 -1240
1092 -1240 -4355 7699 27380 20139 -8053 -16486 -4469 2108 1757 -3051 -15392 -16620 -433 4038
1106 4038 -5660 1047 16030 12634 2814 1683 -129 2844 15575 10431 -15135 -22215 -8551 -2301
1120 -2301 -84 4584 -4506 -14557 -884 13799 9517 7790 12611 2381 -6335 2132 4216 -6329
1134 -6329 -4564 261 -10504 -15133 -5102 -2053 1529 15121 10636 -11435 -8598 15218 19571 8067
1148 8067 -1494 -13675 -15298 4733 10420 -11500 -18330 -1197 3789 -2358 1291 2677 3198 16297
1162 16297 15418 -10323 -15769 9868 17754 211 -12606 -18306 -15523 5919 16550 -4967 -17091
1175 -17091 2261 13218 4455 4771 7803 1539 3515 6731 -8669 -15819 2176 8280 -7811 -11773
1189 -11773 -6023 -6964 2500 17598 9421 -6049 1072 7446 913 5270 11098 -4670 -15547 -4870
1203 -4870 -1237 -7153 -1638 1528 -6805 -1112 10794 2413 -4136 12290 17916 1426 -7822 -5855
1217 -5855 -4966 4095 9800 -10409 -26070 -7715 11138 4943 -1551 1484 885 6374 15208 4719
1231 4719 -8195 3972 13476 -3738 -16762 -10613 -3800 1342 4432 -8103 -18362 375 19603
1244 19603 10972 -489 4166 5790 2766 5951 1674 -8581 -3953 872 -11611 -16517 -2270 4380
1258 4380 -1069 185 2252 146 7973 15982 6890 -908 4248 2012 -8896 -6327 -239 -4763 -8618
1273 -8618 -7606 -9743 -4912 10050 10494 -1457 495 11854 10748 4496 3064 -743 -2357 196
1287 196 -6659 -16478 -9473 3817 -362 -8696 -5129 2304 8701 13907 8882 -1273 3048 11745 4364
1302 4364 -7010 -6574 -3193 -4445 -5974 -10077 -11824 -719 9589 3080 -4358 3936 12594 11460
1316 11460 7163 1425 -2830 1253 2666 -7983 -13876 -5209 -362 -5877 -7791 -3617 1400 9169
1330 9169 10934 2552 313 9385 11053 1566 -3425 -3325 -4908 -4635 -5131 -10715 -9099 1892 3408
1345 3408 -4209 -1970 7971 10174 8667 5542 124 709 6391 614 -10591 -8758 -1353 -4537 -8780
1360 -8780 -5082 -2118 1643 7298 4553 -1550 5436 13760 6354 -2390 -1020 -780 -2770 -2385 -6461
1375 -6461 -12397 -4334 4504 -2136 -7217 2527 8778 6329 6016 3847 -797 5096 9029 -3898 -12464
1390 -12464 -2913 1457 -6082 -7275 -3306 -3296 2156 8105 720 -3165 8726 12296 1009 -1915 2216
1405 2216 -1127 -3119 -602 -7341 -11348 31 4374 -5671 -4913 6527 6522 2850 5889 3211 -857
1420 -857 6296 6377 -7685 -9182 1975 -742 -9316 -4623 -513 -2531 3074 6101 -1804 -107 11913
1435 11913 7684 -3891 -212 4043 -2797 -3741 -1557 -8875 -8614 3122 1326 -8193 -534 9396 3954
1450 3954 1902 6404 2248 269 7332 2117 -10622 -5451 3363 -5042 -10409 -2192 -293 -2258 4320
1465 4320 4738 -2303 4221 13266 3820 -4263 2890 3239 -5089 -3539 -2707 -9971 -6235 2905 -2528 -7528
1481 -7528 4237 8969 2135 3550 7652 2314 2000 7272 -1227 -10090 -2426 807 -8877 -8351 -764
1496 -764 -2818 -3221 5152 4535 282 7961 10768 487 -535 6546 1284 -6271 -2881 -4005 -10164
1511 -10164 -5144 335 -5568 -4599 5608 5102 462 6705 9476 3466 3643 5100 -3456 -5885 1407
1526 1407 -2049 -11271 -7602 -2223 -4544 -1875 4118 1623 1725 9553 8352 876 3756 7494 -65
1541 -65 -4476 -2253 -6160 -8599 -2820 -2561 -8149 -4022 3512 2258 2906 8618 6788 2309 5577 5316
1557 5316 -1685 -1645 756 -5675 -9524 -4888 -4136 -5988 -1209 1994 -8 2291 7836 5649 3744 7724
1573 7724 5346 -1893 -2109 -512 -4561 -5461 -3532 -6840 -8374 -1589 1763 616 3706 6118 3931
1588 3931 4224 7880 4318 -380 949 -510 -6291 -5988 -3608 -5515 -4483 -922 -2069 -2590 3532 7331
1604 7331 5497 5613 5305 773 20 3614 513 -5504 -5421 -4827 -6232 -3550 -695 -2739 -1047 4947
1620 4947 4144 1298 4941 6933 3707 2306 798 -4679 -5213 -237 -1193 -6182 -5323 -3616 -3037 1926
1636 1926 5982 2204 521 5803 5510 1242 2081 1887 -2835 -3142 -1361 -5896 -7266 -1098 1101 -2029
1652 -2029 -594 1323 -152 4203 10182 4595 -2649 -147 1961 -1160 -1036 -1837 -7822 -6189 1205
1667 1205 -506 -5001 335 5019 2878 3315 4548 3 670 7485 2759 -7412 -6461 -1480 -2318 -1018
1683 -1018 -165 -6075 -5483 5629 7195 -128 1446 5793 2822 1829 3272 -2084 -5566 1064 542 -8129
1699 -8129 -6819 -501 -593 483 5049 524 -2989 5068 9760 2662 45 1917 -2704 -4182 802
1714 802 -2000 -8890 -4289 1249 -2837 -2406 3897 2527 1711 8267 6316 -3067 -370 6312 1528 -3627
1730 -3627 -3193 -7090 -8185 1170 2838 -6122 -4584 4514 4903 2804 6165 3922 82 5436 5810 -4938
1746 -4938 -7278 318 -1095 -6256 -4459 -4991 -5932 3450 8354 214 -2331 6535 7720 2896 4072
1761 4072 2255 -4082 -1966 1148 -6348 -9505 -1588 -458 -5014 -1099 2881 267 3858 9679 4702
1776 4702 -542 4011 4318 -1583 -1103 -337 -7408 -8654 -1818 -2394 -4997 240 2519 -1072 3408 8857
1792 8857 4056 964 5679 4729 -2134 -2134 -2016 -6174 -4195 -360 -6580 -9061 257 4916 1538 2531
1808 2531 4617 3055 4844 8366 2004 -4202 497 1462 -5480 -6976 -4303 -4924 -2784 1345 -1492
1823 -1492 -3623 4524 9381 4308 1705 3940 2557 1527 2080 -2434 -7248 -3111 -1226 -6458 -6544 -334
1839 -334 963 312 3095 3106 2096 5806 6951 1240 -1093 1394 -524 -4764 -3515 -2833 -5302 -3426
1855 -3426 -798 -2740 -597 5229 4699 1137 3134 5069 2739 1661 837 -2646 -3213 -1033 -3689 -7421
1871 -7421 -3382 1047 -786 -1069 1529 2478 4601 6728 2953 -1229 1363 3260 -1181 -4342 -2973
1886 -2973 -3495 -3287 -1054 -2814 -3977 1937 5395 1842 149 3100 3829 3126 2552 -1333 -3891 -570
1902 -570 515 -4798 -5766 -1720 -256 -1028 800 1380 1194 5000 5730 377 -619 2540 1450 -2470 -2330
1919 -2330 -2584 -4307 -1870 -331 -3495 -1854 3409 3080 140 2805 4577 2480 2152 1528 -2693 -2692 671
1936 671 -2061 -6335 -3262 468 -1582 -1344 1698 1189 2566 6014 3011 -1619 1749 4342 -1075 -4155
1952 -4155 -2224 -3225 -3402 -325 -1900 -4810 344 5214 1235 227 4478 4447 2058 3057 466 -3948
1968 -3948 -1366 1461 -4854 -7288 -1555 -108 -2609 210 2198 622 3869 6823 2108 -574 4230
1983 4230 3362 -3262 -3009 -1456 -4475 -3982 -650 -3606 -4637 2408 4116 -528 1794 6431 3749 1950
1999 1950 3824 42 -3352 439 -221 -7196 -6335 -321 -2325 -3756 556 1649 659 5017 6318 906
2015 906 1699 6320 2139 -3809 -1448 -1327 -5167 -3541 -1922 -5800 -3992 3184 1805 -1451 3918 6848
2031 6848 2795 2831 4458 312 -801 2100 -2226 -8523 -4185 -33 -4327 -4403 147 564 1064 5564
2047 5564 4456 205 4443 7513 506 -2975 326 -1051 -4495 -2847 -3531 -7107 -2355 3185 -609
2062 -609 -2281 4058 5704 2512 4121 4204 109 663 2652 -2986 -7066 -2238 -894 -5232 -3748 -319
2078 -319 -1214 958 4918 2659 1073 5430 5711 -132 -196 2462 -1614 -4429 -2919 -4415 -5233 -856
2094 -856 638 -3409 -984 4938 4095 1474 4107 3927 1155 2517 1372 -4240 -3754 274 -2210 -6238
2110 -6238 -3304 -665 -276 1757 2821 38 1648 6530 4126 -493 610 1883 -1593 -2220 -2151 -4578
2126 -4578 -3638 203 -1164 -3805 261 3596 2078 2332 3521 1572 1444 2608 749 -3254 -1489 -402
2142 -402 -3721 -4423 -1371 -815 -901 1212 993 436 3621 5048 1422 -229 2116 720 -1924 -1940 -2543
2159 -2543 -3671 -1329 -279 -3302 -2113 2766 3400 1299 2173 2193 1349 2549 2428 -1774 -3171 -549
2175 -549 -1264 -3671 -2564 -1594 -1513 610 2215 180 467 4668 3837 577 1220 839 -1685 -1094 -173 -2970
2193 -2970 -4206 -1537 -1781 -2188 1065 2530 282 1597 4088 2535 1255 2225 586 -2153 -753 -1003
2209 -1003 -4336 -3873 -195 -1010 -2377 153 1037 868 4402 5350 790 96 2825 1511 -1554 -1411 -2519
2226 -2519 -4691 -2128 -503 -3255 -3001 2101 2239 874 2891 3548 1356 3436 4509 -719 -3700 -641
2242 -641 -1157 -3642 -2536 -2499 -4611 -1815 3197 964 -402 3671 4742 1963 2995 2938 -1429 -1081 1481
2259 1481 -2233 -6448 -3168 -1303 -2961 -785 996 -1444 199 6124 5130 525 2425 3473 0
2274 0 -133 291 -4071 -5266 -925 -1586 -5727 -2709 1441 113 1524 4802 2459 859 5346 4861 -880
2291 -880 -928 497 -3352 -3950 -683 -3242 -5630 -1189 1478 -1274 651 4587 2346 1784 5521 3564
2307 3564 -1627 401 1405 -2767 -3741 -1875 -4509 -4821 780 774 -2996 -273 4568 3050 2561 4483
2323 4483 1618 -425 3223 1777 -4771 -4416 -404 -2629 -4167 -1334 -1962 -2233 3044 4698 -85 599
2339 599 5637 3729 517 1287 -551 -3316 -828 -345 -5145 -4957 540 -426 -2441 920 2603 1083
2355 1083 3271 4975 1128 -308 2785 1107 -3013 -1692 -1222 -4250 -3281 298 -1364 -1916 1901 2075
2371 2075 -57 3031 4722 1084 123 2642 283 -2504 -1054 -2040 -4357 -1806 669 -2789 -2709 2316
2387 2316 2870 917 2208 2118 636 2716 3419 -1604 -3644 -87 -315 -3357 -2455 -1482 -2098 699 2692
2404 2692 -119 -837 3687 4287 1188 243 861 -728 -532 102 -3096 -4797 -709 383 -2301 -1126
2420 -1126 1581 1277 1608 3221 1375 235 2560 2063 -2145 -1815 -553 -2382 -2965 -1382 -1513 -1851 851
2437 851 1505 64 1794 4163 1797 -200 1422 957 -1019 -654 -1710 -3901 -2060 202 -1983 -3005
2453 -3005 729 2470 1542 2116 2310 1137 2593 3390 -777 -3053 -211 -85 -2678 -2895 -2249 -2501 47
2470 47 2260 -37 -331 3334 4416 1640 1020 1277 -191 -254 -7 -3071 -4326 -1475 -495 -2753 -1628
2487 -1628 1170 1049 1743 3528 2224 1145 3160 2547 -1508 -1229 137 -2166 -3942 -2439 -2347 -2759 -65
2504 -65 925 -905 1531 4655 2855 732 2812 2461 107 288 -805 -4062 -2868 -78 -2647 -4790
2520 -4790 -867 1118 21 1614 2759 1201 2665 4983 1487 -2024 229 1127 -2585 -3444 -2260
2535 -2260 -4066 -2754 554 -811 -2126 2274 4567 1586 1535 3947 1682 287 1513 -872 -4180
2550 -4180 -1696 -276 -4261 -4284 -103 -128 -1283 1953 2603 846 3582 4835 467 -315 2517 726
2566 726 -3748 -2320 -1622 -3552 -2297 -153 -2533 -1929 3341 3025 264 2438 4455 1479 914 1954
2582 1954 -1818 -2923 257 -950 -5219 -3176 189 -1414 -1277 1924 1220 695 4192 3769 -371 991
2598 991 3383 -300 -3039 -807 -1446 -3525 -1540 -801 -3201 -990 3317 1118 -317 3296 3663 320
2614 320 1679 1796 -1497 -1262 885 -2484 -4828 -1295 334 -2111 -1189 1435 210 1339 3903 1998
2630 1998 -804 2007 2901 -1487 -2128 -82 -1723 -2684 -578 -1578 -3132 602 2746 -152 61 3214
2646 3214 2346 417 2238 975 -1916 -485 306 -3088 -3461 -119 -767 -2373 83 1375 -31 1821
2662 1821 3250 783 195 2693 846 -2197 -918 -38 -2502 -2117 -561 -1791 -1607 1806 1417 -718
2678 -718 1197 3660 1519 800 1846 -66 -1109 414 -858 -3993 -2076 158 -1415 -1837 569 770
2694 770 523 3114 2378 -148 1258 2530 129 -1729 -703 -1411 -2500 -1290 -947 -2177 -657 1855
2710 1855 682 284 2453 2479 1184 1873 1469 -539 -860 -155 -2155 -2960 -1070 -1276 -2566 -913 1199
2727 1199 609 1230 2703 1530 1254 2834 1732 -1240 -967 138 -1768 -2813 -1954 -2537 -2297 633 671
2744 671 -695 911 3435 2583 1617 2262 763 -376 718 -86 -3360 -2606 -1103 -2155 -2136 -410 -427
2761 -427 -121 2439 3322 897 1611 3389 1309 -48 665 -772 -2980 -1583 -1351 -3191 -2555 -236 -571
2778 -571 -435 2377 2406 892 2492 3640 983 103 792 -980 -2523 -937 -1693 -4214 -2154 197 -642
2795 -642 -416 1907 1368 1176 3652 3416 43 593 1691 -452 -2103 -1208 -2461 -3658 -1001 -204 -2319
2812 -2319 -956 2386 1754 1209 2959 2266 535 1707 2246 -1574 -2400 -682 -1743 -3082 -1253 -1202 -2667
2829 -2667 152 2543 853 443 3040 2524 755 2081 1441 -1956 -1234 544 -1990 -3573 -1319 -940
2845 -940 -2072 480 1829 -431 863 3804 2388 401 1663 1317 -1158 -384 -35 -3315 -3235 433
2861 433 -1129 -2613 52 1053 63 1767 3421 766 128 2664 1367 -1596 -532 -327 -2764 -2008
2877 -2008 -38 -1850 -2704 668 1446 -420 1336 2940 337 935 2925 572 -1736 -28 -127 -2796
2893 -2796 -1563 -456 -2261 -1869 1761 1104 -884 1380 2745 846 1407 2071 -522 -1429 1068 -285
2909 -285 -3251 -1923 -139 -1655 -806 915 -303 -431 2942 2735 -25 757 2035 129 -829 43 -1902
2926 -1902 -2872 -101 47 -2185 -1244 1288 149 291 2353 1824 -35 1778 1861 -917 -660 337 -1571
2943 -1571 -2613 -595 -713 -2154 -429 1170 -8 635 2591 1200 208 2213 2103 -1000 -1043 -211 -1752
2960 -1752 -1935 -523 -1811 -2700 472 1450 -227 246 2418 1941 1570 2169 353 -1119 540 412 -2545
2977 -2545 -3064 -995 -1279 -1454 118 -237 -564 2001 3021 846 642 2312 1113 -142 143 -1196 -2542
2994 -2542 -1348 -809 -2904 -2229 271 301 79 1618 2224 1335 2012 2619 390 -54 1068 -1050 -2663
3011 -2663 -1540 -1134 -2395 -1807 -253 -663 365 2315 1975 973 2466 3154 831 -15 365 -792 -1329
3028 -1329 -1060 -2337 -3533 -1127 329 -848 -782 1179 1745 2070 2893 1441 208 1620 1721 -1598 -2524
3045 -2524 -1306 -1530 -2215 -1316 -1492 -1586 715 2239 637 833 2888 2272 1196 1507 598 -1111 -627 -396
3063 -396 -2608 -2852 -837 -726 -1558 -94 1164 658 1733 2982 1234 1116 2412 926 -1554 -920 -152
3080 -152 -2142 -2405 -1235 -1821 -1105 1040 750 -601 1650 3353 1271 702 1471 412 -439 172 -1117
3097 -1117 -3049 -1677 145 -1978 -2243 203 886 654 2063 1820 189 1272 2751 249 -1389 71
3113 71 -100 -1935 -1422 -1053 -2113 -840 1497 84 -829 1933 2611 568 1167 1705 -226 -381 556 -1093
3131 -1093 -2693 -481 -303 -2470 -1302 964 231 126 1966 982 21 2401 2065 -882 -918 983 -824
3148 -824 -2240 -909 -1220 -1994 430 1017 -1244 98 2756 1743 -232 1092 1384 -385 418 284 -2232
3165 -2232 -2094 389 -736 -2812 -731 958 17 856 2030 624 614 2293 1036 -1435 -84 687
3181 687 -1501 -2021 -535 -1328 -1164 469 246 -1123 1299 3056 939 3 1993 851 -485 225 -640
3198 -640 -2256 -1206 338 -1603 -2498 405 882 260 1011 1731 530 1728 2798 97 -1361 348
3214 348 191 -2142 -2006 -1119 -1927 -1035 635 -746 -903 1991 2915 489 1161 2261 553 61 343 -1175
3232 -1175 -2309 -847 -546 -2415 -1449 252 195 -184 1468 1630 1083 2582 2177 -128 -84 1054 -813
3249 -813 -2364 -1441 -1260 -1989 -766 -314 -1453 129 2471 1770 293 1886 2119 1135 803 159 -1570
3266 -1570 -1283 -217 -1563 -3022 -1091 36 -552 152 1143 843 1716 3151 1512 -352 741 969 -901
3283 -901 -1370 -1144 -2307 -1886 -597 -1286 -1465 552 1782 663 1055 2480 1928 915 1442 403 -1069
3300 -1069 -697 -723 -2580 -2073 -967 -890 -1322 243 925 1049 1791 2275 805 677 1880 749 -1314 -858
3318 -858 -718 -1868 -1382 -1449 -2209 -744 968 828 -311 1174 2232 1412 1544 1146 -357 -510 475 -1028
3336 -1028 -2777 -1803 -773 -1124 -975 86 -272 333 2477 1931 422 1382 2006 162 -294 -156 -1422
3353 -1422 -1911 -650 -1111 -2193 -613 392 -408 322 2084 1338 599 1328 1303 -144 -17 238 -1426 -1746
3371 -1746 -272 -1131 -1963 -544 516 -259 775 1651 468 455 2390 1314 -686 71 232 -1132 -1354
3388 -1354 -689 -1786 -1736 591 569 -1022 532 2010 665 636 1632 205 -700 1083 460 -2062 -1563 -297
3406 -297 -1368 -1446 359 -325 -545 1389 1820 216 718 2010 399 -303 537 -292 -2014 -733 -247 -1700
3424 -1700 -1310 449 72 -214 1794 1499 -40 850 2152 271 -186 667 -942 -2164 -442 -156 -2283
3441 -2283 -1434 611 -109 -200 1866 1228 225 1844 2000 -498 -583 625 -881 -1666 -741 -1109 -2536 -445
3459 -445 983 -930 -411 1815 1503 689 1913 1347 -515 383 936 -1190 -2170 -598 -1120 -2227 -455
3476 -455 81 -759 546 2310 1087 361 2001 1463 94 698 861 -1631 -1706 -395 -1498 -2121 -487
3493 -487 -558 -1227 798 1921 370 813 2529 1761 34 818 152 -1593 -980 -455 -2108 -2567 -72 -301
3511 -301 -979 697 1246 237 1217 2631 1137 322 1087 279 -1268 -705 -615 -2275 -2037 -230 -936 -1175
3529 -1175 624 1136 554 1760 2331 549 587 1712 431 -1138 -661 -985 -2100 -1159 -528 -1769 -1190
3546 -1190 814 1097 102 1312 1877 1025 1426 1414 -427 -1115 -80 -512 -2270 -1508 -1081 -1624 -780 768
3564 768 143 -168 1577 2078 975 1340 1390 17 -185 58 -1162 -2212 -908 -722 -1742 -901 393 -390
3582 -390 497 2250 1647 716 1452 1276 -213 185 303 -1514 -1903 -629 -653 -1603 -476 63 -288 698 1980
3601 1980 781 799 1935 1293 -64 19 -95 -1439 -758 -326 -1952 -1901 73 600 -346 426 1382 494 1357
3620 1357 2132 520 -481 716 354 -1395 -1206 -698 -1371 -907 159 -808 -1083 1024 1649 539 1104
3637 1104 1837 455 188 762 -257 -1784 -688 -469 -1644 -578 348 -184 -558 1458 1151 498 988
3654 988 1528 -244 104 692 -1110 -1694 -393 -393 -1590 -839 -216 -757 327 1871 510 -156 1470 1674
3672 1674 -220 48 488 -1129 -1071 36 -1236 -2184 -142 642 -552 -102 1256 524 742 2055 994
3689 994 -561 582 854 -998 -1633 -389 -1251 -1666 47 -18 -998 655 1799 622 720 2144 1203 -214
3707 -214 1053 156 -1576 -941 -259 -1829 -1906 148 -273 -1066 718 1621 503 1011 2174 690 -59 932
3725 932 281 -1605 -959 25 -1809 -1796 -246 -629 -669 1246 1152 -35 1399 2254 672 -6 1213 167
3743 167 -1430 -589 -609 -2556 -1537 373 -920 -1098 1039 1172 382 1832 1890 167 363 1759 -164
3760 -164 -1047 -170 -842 -2159 -1330 -198 -1350 -486 1151 524 145 1814 2063 446 1167 1187 -272 -868
3778 -868 2 -927 -2345 -1021 -434 -1779 -817 1211 438 159 1900 1482 363 1417 1521 -657 -757
3795 -757 145 -1122 -1936 -831 -860 -1868 -352 613 3 457 2123 1405 595 1704 1364 -334 -221 57
3813 57 -1551 -1751 -632 -1023 -1677 -336 364 -245 285 1575 917 706 2115 1014 -529 120 337 -1282
3831 -1282 -1375 -410 -1247 -1522 11 44 -659 970 1742 754 547 1396 895 -2 554 -97 -1471 -1062 -439
3850 -439 -1480 -1367 37 -203 -505 798 923 361 1254 1503 298 -410 498 13 -1242 -632 -952 -1494
3868 -1494 -1020 295 -366 -365 1126 1171 310 1244 1262 304 315 573 -658 -1395 -268 -586 -1479 -801 139 -805
3888 -805 -243 909 849 247 1271 1376 -75 236 683 -455 -1138 -266 -859 -1398 -437 5 -879 15 1447
3907 1447 497 208 1256 1265 65 264 77 -1378 -817 194 -1001 -1311 -114 -301 -449 603 1267 241
3925 241 718 1858 521 -119 544 373 -1174 -748 -408 -1575 -944 46 -442 -719 705 1030 234 1135
3943 1135 1725 582 19 797 -155 -1382 -568 -576 -1880 -1316 318 -532 -571 926 1103 193 1383 1675 249
3962 249 307 1091 -195 -1334 -552 -857 -1868 -712 -113 -1080 -489 1379 849 540 1367 1629 230 706
3980 706 1106 -570 -1237 -19 -750 -2053 -836 -163 -995 -286 1068 82 301 1734 1570 168 933 1098
3998 1098 -709 -589 -77 -1365 -2068 -746 -629 -1379 175 857 108 516 2249 1376 254 1231 998 -783
4016 -783 -350 106 -1744 -1975 -485 -691 -1563 -197 770 22 881 1941 1118 281 1688 951 -575 -197
4034 -197 -164 -1659 -1602 -472 -1048 -1681 234 667 -119 680 1901 643 848 1725 582 -656 247 125
4052 125 -1487 -1355 -595 -1740 -1748 235 0 -361 850 1504 487 786 1525 554 -469 727 55 -1540
4070 -1540 -1243 -652 -1383 -1016 -87 -404 -563 1158 1438 282 861 1780 640 54 637 -566 -1372 -490
4088 -490 -315 -1477 -1325 20 -180 -408 1056 896 126 1078 1542 152 92 506 -582 -1061 -89 -545 -1596
4107 -1596 -596 22 -536 -226 793 593 485 1229 1174 -248 213 509 -403 -972 -149 -955 -1396 -46 151
4126 151 -946 88 987 717 745 1017 919 -95 682 627 -986 -877 -405 -818 -1030 -334 -335 -591 537 927
4146 927 556 458 1275 599 94 498 37 -1108 -793 -11 -1235 -1062 -80 -176 -608 726 815 75 841 1356
4166 1356 416 -26 496 -7 -827 -386 -369 -1296 -968 8 -366 -279 728 530 238 1253 1570 215 203 717
4186 717 -202 -739 -375 -804 -1574 -499 -280 -734 -630 765 617 652 1285 1030 238 736 686 -621 -966 -202
4206 -202 -666 -1334 -361 -254 -820 -81 907 290 306 1459 1460 89 708 529 -657 -599 -149 -1123 -1389 -578
4226 -578 -160 -1024 180 1020 -26 671 1729 1144 297 953 548 -547 -481 -417 -1643 -1616 -287 -622 -928
4245 -928 -37 695 -14 946 1530 608 297 1086 478 -633 -231 -290 -1387 -1242 -368 -1272 -1447 291 559
4264 559 228 924 1590 734 1063 1657 -12 -849 -67 -283 -1534 -1323 -776 -1411 -873 183 -244 19 1287
4283 1287 1677 275 902 1695 566 -193 359 -424 -1493 -757 -601 -1569 -922 209 -17 -365 1453 1346
4301 1346 262 1191 1402 167 -198 598 -703 -1584 -823 -639 -1108 -1071 -171 -590 16 1391 737 216 1220
4320 1220 1302 211 -108 272 -829 -1172 -319 -777 -1597 -525 193 -523 -134 1147 716 476 1223 817 -275
4339 -275 295 974 -734 -1011 -249 -804 -1424 -242 -176 -728 257 1249 104 358 1606 1023 128 576 281
4358 281 -505 -626 -132 -1184 -1273 -199 -204 -773 75 955 415 616 1285 543 -69 811 176 -1019 -609 -204
4378 -204 -934 -908 -141 -489 -633 703 624 81 695 1418 502 2 557 17 -564 -316 -519 -1350 -1014 -6
4398 -6 -346 -355 727 467 210 881 933 136 251 668 -381 -679 -292 -330 -965 -659 -218 -499 -238 777 491
4419 491 98 987 1203 133 470 260 -52 -523 -143 -741 -1483 -348 146 -578 6 594 441 297 1077
4438 1077 428 247 641 361 -569 -965 -171 -852 -1216 -493 -817 -561 322 572 142 523 1410 824 196 717
4458 717 556 -392 -225 -362 -1240 -1200 -229 -386 -738 90 708 207 939 1241 709 476 926 297 -658 -238
4478 -238 -281 -1437 -1269 -580 -1044 -568 337 211 62 1027 1424 633 532 1092 142 -307 -99 -604 -1278 -754
4498 -754 -311 -1150 -871 190 238 246 949 1048 444 1228 1095 241 -9 225 -428 -1424 -590 -613 -1175 -470 321
4519 321 -200 -6 1271 1054 488 1011 1209 25 -118 234 -911 -1149 -389 -877 -1403 -489 253 -65 18
4538 18 953 850 696 1216 1126 -58 51 387 -585 -983 -468 -1004 -1290 -312 -74 -697 306 1351 847 615
4558 615 1193 1068 307 503 507 -766 -672 -76 -1225 -1422 -24 218 -574 212 1034 347 612 1301 669 -106
4578 -106 517 65 -819 -847 -249 -1012 -1063 -211 -438 -762 641 950 83 373 1523 668 352 547 39 -851
4598 -851 -260 -83 -1040 -924 -171 -304 -505 575 626 -3 990 1263 217 64 940 270 -1057 -423 -303
4617 -303 -1194 -632 -125 -606 -635 965 416 259 946 1151 -40 211 825 -251 -886 -155 -370 -937 -487
4636 -487 123 -920 -526 716 321 174 1009 656 35 436 856 -457 -615 82 -403 -827 -357 -386 -744
4655 -744 153 573 192 -28 1185 1066 96 562 299 -522 -129 10 -1037 -1267 -278 -245 -831 7 342 64
4675 64 731 1134 405 -84 763 243 -799 -481 -153 -908 -907 -177 -437 -469 217 618 118 663 1067 410 357
4696 357 720 352 -472 -133 -379 -1124 -780 -337 -767 -755 511 317 277 892 1066 546 673 791 -95 -745
4716 -745 -290 -455 -1175 -779 -386 -824 -335 332 -2 157 1092 1112 251 588 648 -37 -278 214 -851 -1224
4736 -1224 -466 -581 -1014 -398 347 120 201 1107 1007 572 934 849 124 -228 225 -710 -850 -482 -541 -1195 -554
4757 -554 228 -34 533 1132 655 498 906 849 -231 -12 -181 -749 -814 -497 -996 -1072 -274 278 -302 342 936
4778 936 368 628 946 621 -77 495 140 -1080 -896 -421 -980 -776 -328 -387 -615 724 882 267 599 1359
4798 1359 594 231 466 -150 -1017 -575 -241 -1184 -840 -90 -502 -718 371 693 345 853 1390 404 263
4817 263 550 -56 -1075 -131 -479 -1054 -655 -20 -580 -563 613 370 97 1079 939 35 40 827 77 -673
4837 -673 -103 -377 -1006 -221 -74 -789 -636 517 294 200 866 699 160 566 933 -351 -822 4 -323 -1108
4857 -1108 -379 -199 -604 -249 657 -72 -92 1283 913 -32 290 530 -339 -355 124 -626 -1055 -158 -59 -904
4877 -904 -275 685 255 236 752 616 1 515 400 -632 -79 -85 -881 -1018 38 -371 -736 330 545 -7
4897 -7 571 1151 467 136 693 541 -567 -277 -53 -1013 -727 -14 -351 -458 318 626 -17 572 995 306
4917 306 121 677 204 -669 -42 -176 -1172 -863 -82 -578 -355 484 131 17 593 855 155 170 882 33
4937 33 -449 -79 -568 -1133 -368 -147 -855 -477 272 314 33 817 1018 512 798 576 -196 -334 153 -596 -1177
4958 -1177 -303 -318 -886 -251 393 -122 20 1152 736 258 530 584 -334 -169 134 -848 -913 -520 -513 -1220 -276
4979 -276 333 235 194 770 551 532 978 258 -156 56 -164 -683 -960 -313 -418 -671 1 220 130 529 1136
5000 1136 775 547 1087 677 -194 226 -275 -746 -584 -228 -990 -1065 -41 339 -172 302 932 330 536 1129
5020 1129 439 73 675 -74 -840 -720 -519 -861 -813 -43 -102 -256 788 828 485 695 1013 599 13 450
5040 450 20 -786 -338 -655 -1237 -452 16 -611 -171 519 269 243 619 955 330 265 404 -92 -751 -247 -309
5061 -309 -1118 -548 -206 -572 -166 661 217 122 810 1115 379 599 328 -283 -188 10 -549 -1018 -318 -24 -970
5082 -970 -199 409 160 215 1043 745 -11 399 649 -95 -337 -3 -573 -806 -309 -377 -622 171 262 -130 196
5103 196 1026 586 20 480 243 -399 43 -221 -1010 -752 -7 -560 -732 152 407 41 478 778 252 285
5123 285 772 214 -341 -238 198 -633 -609 -118 -436 -323 378 182 -229 386 990 338 292 821 56 -535 217
5144 217 -29 -1029 -527 -16 -642 -415 504 -18 -36 371 828 23 472 591 29 -448 237 -326 -992 -309
5164 -309 -127 -573 -411 493 227 -83 815 867 305 450 768 -44 -128 65 -360 -639 -45 -291 -693 -133 411
5185 411 97 303 865 672 106 664 498 -326 -62 -129 -448 -723 -377 -428 -725 244 264 1 153 1013 686
5206 686 203 811 334 -214 60 -99 -904 -776 -135 -530 -772 247 212 -142 381 920 230 403 916 362
5226 362 -317 87 -248 -778 -501 -108 -698 -747 156 130 -19 513 803 361 411 781 406 76 233 -139 -745
5247 -745 -865 -321 -823 -682 -21 -150 -193 288 928 113 890 1198 -7 102 474 -155 -722 -335 -562 -741
5267 -741 -483 -55 -498 -305 607 631 352 621 775 213 553 614 -331 -747 -221 -477 -956 -387 -93 -396 99
5288 99 804 334 511 943 809 398 462 220 -679 -356 -166 -655 -619 -500 -75 -523 -130 351 116 393 726
5309 726 694 200 368 423 -263 -256 45 -667 -624 -247 -169 -385 206 572 338 481 834 542 242 473 364 -295
5331 -295 -12 105 -837 -630 -18 -742 -383 194 323 68 313 538 127 371 688 23 -339 177 -188 -556
5351 -556 -634 -261 -569 -153 372 265 215 459 544 276 197 639 47 -128 292 -312 -639 -364 -121 -244 -245 201
5373 201 -104 -115 693 536 -45 281 490 41 -300 198 -406 -615 -24 15 -543 -195 175 34 158 636 264
5394 264 212 638 397 -249 -230 248 -321 -476 142 -276 -473 208 245 -115 -122 951 528 284 725 211 -143
5415 -143 -59 87 -365 -695 -312 -348 -476 303 343 -251 348 698 375 108 527 233 -69 62 -119 -770 -553
5436 -553 -288 -587 -570 5 52 -369 596 740 138 518 364 207 -483 284 -89 -744 -502 -73 -489 -347 195
5457 195 58 -335 377 659 165 532 560 132 -220 151 -378 -780 -281 -333 -534 -343 70 32 136 572 585
5478 585 127 617 861 54 -79 423 -205 -617 -320 -273 -905 -575 92 -444 10 539 570 82 831 566 -43
5499 -43 92 498 -340 -436 -256 -258 -981 -434 -336 -204 -69 333 397 227 770 707 110 260 99 -319 -578 -206
5521 -206 -722 -872 -109 -67 -357 12 495 446 249 680 503 137 377 213 -98 -613 -228 -368 -668 -144 41
5542 41 -521 -30 637 198 439 988 672 238 276 61 -351 -304 -325 -732 -566 -41 -652 -272 285 392 -55
5563 -55 320 673 640 281 714 257 -419 -46 -65 -705 -603 -250 -138 -275 -113 38 -32 487 625 448 300
5584 300 515 34 -274 184 -184 -528 -252 -214 -395 -469 340 114 269 456 94 234 456 495 131 -124 47
5605 47 -253 -555 -29 -248 -829 -335 383 -114 360 480 501 -104 223 240 29 -207 -79 -536 -318 -203 -299
5626 -299 -487 174 369 22 225 532 452 335 412 -21 -88 230 148 -510 -496 -217 -232 -270 215 107 -64 484
5648 484 513 -15 9 740 265 46 -143 -108 -730 -287 -135 -443 -347 207 261 -314 464 590 164 79 446 220
5670 220 -51 310 -49 -604 -364 -181 -324 -281 202 52 113 511 400 338 471 466 -9 -119 99 -485 -771 174
5692 174 -260 -626 -272 98 -18 98 583 491 429 472 479 31 18 260 -247 -537 68 -348 -551 -234 9 -213
5714 -213 108 488 486 375 661 563 -2 66 274 -220 -479 30 -387 -685 -72 32 -148 -64 633 495 153 808
5736 808 619 1 209 255 -648 -102 -28 -430 -704 -234 -10 -429 39 485 222 329 531 344 25 317 16
5757 16 -398 -296 70 -496 -591 67 -192 -366 -129 242 339 278 633 251 100 486 179 -396 -203 -290 -586 -422
5779 -422 -536 -93 -551 247 318 45 453 786 320 341 416 -92 -88 -64 -101 -518 -625 -353 -320 -218 464 89 49
5802 49 488 568 83 317 253 325 -1 -153 -141 -324 -277 -319 -201 -275 301 56 332 526 501 297 321 248 -64 -39
5826 -39 84 -426 -531 184 -300 -413 -182 275 114 107 315 300 138 358 310 -225 -32 69 -45 -412 -109 -321
5848 -321 -512 164 69 22 72 659 249 54 227 550 107 25 171 -482 -374 -204 -220 -498 12 -67 90 232
5870 232 212 165 90 525 125 -22 39 -55 -591 -342 -118 -305 -369 -22 16 -50 253 499 330 420 478 231 -67
5893 -67 -281 -290 -311 -169 225 -414 -229 32 -134 -73 376 229 238 406 488 -65 -249 280 -499 -553 -251 -141 -143 45
5917 45 45 -156 107 281 136 48 278 506 -96 -134 327 -317 -539 -100 -70 -292 -189 -11 -107 50 581 376
5939 376 -110 378 198 125 344 129 -385 -381 -150 -632 -524 -3 -162 -446 414 400 -35 317 676 378 43
5960 43 133 83 -413 -382 -97 -488 -502 14 52 -32 199 467 103 276 548 330 151 222 211 -211 -310 -133 -502
5983 -502 -588 160 -67 -112 282 338 375 427 411 329 552 494 -50 -318 -2 -181 -720 -177 -200 -212 -383 99 180 9
6007 9 506 541 -108 233 426 -159 -309 -72 -146 -714 -297 59 -178 -153 402 224 -125 587 403 -53 224 451
6029 451 42 -192 161 -194 -512 -245 -151 -481 -73 275 69 158 537 434 147 275 372 -219 -249 -54 -327
6050 -327 -500 -256 -260 -340 -159 388 -28 70 307 388 214 344 367 -193 -142 37 -378 -331 -41 -451 -414 -10 88
6073 88 -153 178 278 214 96 384 75 -78 63 13 -382 -293 -19 -311 -249 -92 221 -129 221 311 -98 267
6095 267 449 242 -81 189 67 -251 -105 -59 -445 -291 60 66 113 358 516 3 66 535 101 13 144 -24
6117 -24 -357 -289 -203 -173 -390 1 -144 -118 168 459 219 381 498 58 -194 137 6 -452 -242 -181 -471 -263
6139 -263 210 -134 38 437 177 301 190 399 30 54 -57 -202 -425 -35 -218 -583 -151 92 66 47 351
6160 351 48 93 617 318 -142 136 274 -318 -178 -70 -248 -477 -96 61 -491 200 79 20 160 344 -137
6181 -137 98 44 -42 -368 -101 21 -268 -30 54 -106 -46 186 299 -159 259 466 16 83 299 62 -276 -47
6203 -47 -327 -316 -647 173 -84 -126 113 67 206 178 308 -30 112 185 -109 -356 -103 -80 -586 -282 128 -480
6225 -480 -106 372 122 158 198 378 66 34 315 -158 -67 55 -346 -548 -360 -58 -98 -9 471 40 53 307
6247 307 315 -50 214 207 -382 -330 -185 -367 -314 -200 -164 -421 -68 170 44 166 387 219 211 298 200 -136 -245 1
6271 1 -206 -220 -125 -424 -316 88 192 -204 225 625 -8 24 436 314 -175 9 81 -297 -457 -171 -130 -365
6293 -365 66 177 -198 -18 371 56 132 408 15 -131 9 209 -533 -255 121 -177 -222 54 64 -169 250
6314 250 150 19 -43 193 389 -25 272 -129 -327 -145 -47 -378 -129 -18 49 -78 192 132 -137 182 274 -38
6336 -38 63 314 21 -218 -67 -26 -460 -106 89 37 -88 185 251 -41 55 300 4 135 12 -113 -292 -52
6358 -52 -274 -221 -92 4 -222 130 68 110 -3 409 451 -177 295 -9 -195 93 -14 -229 -433 121 275 -221
6380 -221 -56 152 73 97 167 -44 42 229 251 -116 -131 -3 -25 -178 -88 -29 -186 -52 227 -49 258 298 176
6403 176 39 161 157 -168 -423 -123 -387 -134 -226 -259 -204 172 245 56 272 348 -32 14 200 -90 -270 -56 -104
6426 -104 -180 -436 -55 -71 -9 276 137 174 96 180 158 -17 254 -121 -457 -147 -276 -358 -409 84 -25 -109 38
6449 38 240 33 441 457 -91 244 -14 -128 7 154 -258 -328 -236 -130 -331 -3 357 123 -211 547 250
6470 250 30 -30 285 85 -109 -20 -538 -164 -24 -177 -337 -78 -18 199 -1 230 220 249 260 129 140 -138
6492 -138 -219 -213 -418 33 -388 -285 107 16 -59 163 530 161 230 371 -131 -228 -143 -89 -289 -182 58 -293 -335
6515 -335 224 118 -150 260 150 85 130 224 261 182 313 -274 -325 -27 -348 -157 -224 -73 221 -138 280 -78
6537 -78 -207 222 398 110 60 536 -208 -215 -12 -205 -451 -282 67 -14 -109 277 359 147 152 220 103 -194 175
6560 175 -303 -164 -90 -311 -305 -209 -24 -98 -51 97 155 150 63 167 0 234 -148 63 -235 -4 -153 -393 -230
6583 -230 -210 -253 -57 392 51 105 298 318 158 278 147 -352 -227 -130 -180 -246 32 246 -293 293 208 218 180
6606 180 158 13 -104 205 93 -339 -152 -89 -105 -102 23 93 -243 150 215 107 329 225 29 -127 93 98 11
6629 11 -2 -205 -190 -307 -69 -300 -1 -116 241 -151 0 120 210 20 340 -9 -175 11 -168 -346 -194
6650 -194 38 -101 -138 111 59 -140 494 170 360 71 252 -257 40 -54 -228 -412 -48 124 -67 47 324
6671 324 -49 206 227 150 228 222 153 -53 -137 -35 -82 -134 296 -99 12 -85 214 -3 248 149 36 -49 14 227
6695 227 -257 -305 -28 -57 -300 -281 -102 -234 -200 134 121 114 296 58 154 188 208 -101 160 -94 9 -200 -262 -91
6719 -91 -236 19 62 -69 248 343 74 20 271 270 -2 99 45 -93 -23 17 -181 -319 -24 -62 -311 259 217 -45
6743 -45 137 447 165 114 -181 -102 -347 -100 -112 -108 -245 -302 -46 -205 -81 250 38 155 387 40 257 181 -185
6766 -185 -308 289 -238 -488 11 -43 -142 173 207 208 165 91 378 -37 336 117 51 -102 -94 -200 -105 -172 -9 -176
6790 -176 -84 287 -97 -6 218 127 113 175 345 -42 -225 -175 -188 -225 -135 26 -146 97 -37 147 -166 550 193
6813 193 139 119 76 116 -44 -13 -112 -143 44 13 -165 180 208 148 -54 96 173 230 107 132 -31 -49 270 -227 -135
6838 -135 -49 -149 -123 113 166 138 -110 241 -108 88 349 62 -159 -35 187 -79 17 -254 -204 -197 131 69 -182
6861 -182 167 140 -175 57 172 39 -149 -62 -104 -154 -6 25 -262 -18 21 -119 9 98 120 -94 -133 206 144
6884 144 -100 137 124 -191 -362 -285 -108 188 89 -214 68 56 120 304 -59 309 -242 -307 184 142 -282 12
6906 12 -109 -163 -141 59 38 -67 127 180 60 214 56 46 56 14 -198 14 -119 17 -229 175 75 69 57 -40
6930 -40 -91 -75 60 110 -32 40 -165 -173 -204 -333 87 -211 -26 -18 130 184 165 103 84 311 75 103 67 7 -77 -286
6956 -286 -84 -8 -69 29 -117 31 156 392 224 83 262 -23 81 59 -12 -282 -362 -62 -204 65 -124 -143
6978 -143 127 157 252 42 258 341 58 -139 122 -71 -108 -6 -365 -25 43 80 -178 68 165 28 128 86 -76
7001 -76 -118 -38 442 -187 -145 -22 -109 -310 -204 73 -174 113 -93 128 301 284 236 69 194 234 -245 -122 -230
7024 -230 -267 13 -188 67 -217 138 130 -9 90 151 -12 -73 205 136 -10 -20 -60 -71 -307 -179 -244 -133 119 78
7048 78 -6 16 270 164 40 51 140 37 1 -122 -117 -39 -65 -391 -237 240 -39 -46 173 154 67 170 165 -301 -116
7073 -116 -98 206 -217 194 -50 -56 -110 163 -19 116 14 182 68 155 220 -4 -160 30 53 -215 144 -86
7095 -86 -248 -162 -100 -13 -25 198 251 27 81 257 -197 -49 -86 -237 56 20 -35 -195 -86 206 170 28 192 160
7119 160 -165 243 249 -190 -236 -4 -363 20 130 -31 -387 -126 57 119 -22 269 47 -75 168 45 -108
7140 -108 231 84 -118 -175 -41 -148 39 70 -4 -55 109 244 242 -118 218 -14 -82 88 -212 -366 30 -127
7162 -127 -307 20 -72 161 199 255 227 83 -37 218 -25 75 -84 131 -273 -189 2 -232 43 50 -5 -73 532
7185 532 167 97 121 -72 7 -3 -64 -316 -146 2 -320 -232 -64 -72 52 38 164 -44 43 301 166 -3 2 145
7209 145 30 -226 -54 -326 -400 -307 -165 -127 -212 -70 17 5 136 -29 207 -73 58 -257 -83 75 -195 -344
7231 -344 2 -190 -180 -13 -4 -226 -230 489 123 213 168 137 18 -108 -72 -240 -173 -32 -80 -8 -160 -6 -104 3
7255 3 102 87 161 202 -15 -36 -26 -307 -166 -120 94 -151 -279 -36 -66 -126 120 145 77 264 114 6 -82 -152 52
7280 52 -350 -28 -220 -331 -262 114 -75 55 -16 206 254 -49 359 -285 -86 289 103 -147 -101 73 -99 5
7302 5 357 82 -73 83 115 315 111 202 -49 40 -116 27 -275 4 -216 33 -126 126 -128 -420 148 -32
7324 -32 -89 84 301 -45 8 -3 -124 -52 12 114 -83 -37 166 -239 -59 340 19 -147 -67 303 11 268 76
7347 76 3 -128 -101 -63 5 41 -61 17 32 67 -110 77 -140 -112 -51 232 -203 -180 177 -78 -331 -63 -52 -44 -197
7372 -197 115 310 198 -292 75 -48 211 -44 59 -123 -10 46 -258 47 12 -131 -85 53 -83 80 304
7393 304 134 31 176 34 66 -200 -24 4 -8 60 -1 -186 22 73 244 -1 232 -87 -197 -77 139 -114
7415 -114 -227 236 -56 -240 -63 -265 -252 25 123 49 313 142 -33 240 247 94 -72 -96 -91 -93 -235 -56 -15 16
7439 16 -75 77 23 10 119 195 -174 219 5 -287 -350 27 -152 -128 92 -11 -98 38 27 -1 -8 384 107 200
7463 200 277 -31 -91 -202 98 -141 -207 -119 -2 -16 215 189 161 129 327 71 91 114 1 72 -48 -133 -168 -109 -41
7488 -41 -92 -356 -72 109 -69 263 142 162 219 202 174 -117 -110 -152 -359 26 67 -486 -190 -188 81 -25 134 -26
7512 -26 118 199 324 -16 366 256 -114 -274 -80 -273 -201 -198 20 -105 -252 115 155 39 326 32 233 237 -150
7535 -150 125 -176 -17 -292 -170 272 -13 -183 57 -56 -59 -18 134 139 139 -210 -85 49 -262 35 64 -92 -120
7558 -120 9 -56 -28 78 122 -152 76 127 41 151 25 -145 -30 122 -62 -214 -205 -57 -45 93 64 79 110 82
7582 82 -149 199 152 -112 -181 -5 -149 -192 185 51 -155 -49 174 252 7 64 -85 -3 240 254 -163 -210 28
7605 28 -254 -435 -132 -160 42 118 132 44 -68 144 -184 124 128 -40 -95 44 119 45 -15 133 -30 -321 -219 -73
7629 -73 -105 -4 238 292 84 260 178 73 -24 -98 19 -386 -16 -205 -125 66 -127 -212 332 93 111 -60 26
7652 26 18 -152 -90 71 -235 -260 -124 68 -273 319 -61 -20 -16 328 181 136 93 191 -183 50 285 -259 3 -27
7676 -27 -116 -253 32 71 22 139 212 188 -69 314 210 -92 -50 -100 -81 -78 -26 -267 -106 -1 147 -113 237 347
7700 347 314 130 199 -12 -315 217 -329 155 -36 -63 -253 -132 260 -206 87 206 78 247 287 24 233
7721 233 4 97 -361 -47 -334 -120 -171 -28 -24 83 -3 120 407 181 306 276 -11 31 153 -159 4 -14 -234
7744 -234 -338 -274 -119 -266 -132 205 -104 215 205 42 -95 -163 3 114 21 -145 -138 -131 -26 61 -293 -175 45
7767 45 140 179 220 302 276 77 51 -91 -210 218 -140 -243 93 -246 -330 47 -39 17 226 122 203 219 242 347
7791 347 -77 -109 -16 -170 -187 -86 70 -201 -20 51 76 180 39 -270 -75 154 -70 32 -49 -21 -344 -6
7813 -6 79 -365 -79 -49 -163 -143 324 276 9 24 -22 126 92 56 -99 -377 53 63 -197 -186 288 -80 65 176
7837 176 147 55 59 282 1 107 -4 16 -58 -122 -312 -173 -151 -143 -39 197 81 -194 113 211 291 -8 -140 -3
7861 -3 -176 -142 -106 -52 67 -146 -220 11 123 183 252 -68 34 200 50 343 118 -149 -224 -112 -302 -215 -165 0
7885 0 -97 -87 -25 162 102 -26 2 -122 183 52 64 67 -182 -32 -61 112 -60 219 134 -4 18 -7 14 -84 146
7910 146 -75 14 -243 48 -124 -434 -186 136 -134 -116 126 -133 38 246 253 76 -160 199 20 -344 -157
7931 -157 -143 -425 -30 72 -25 28 -54 -36 -33 206 104 187 248 80 -53 -274 -306 -168 -129 -321 39 -157 124 298
7955 298 132 -54 95 70 -110 85 81 -53 -83 83 -34 -17 51 44 9 14 -199 264 138 382 111 24 -76 -58
7979 -58 -326 -39 -66 -130 -99 83 -115 -262 23 -188 110 348 113 206 -62 18 -7 -404 36 -13 -313 -71 -69
8002 -69 -62 16 -104 160 153 261 119 182 137 293 71 6 149 124 -164 -89 -22 -112 -260 232 -82 -29 248 125 102
8027 102 270 154 20 -282 156 88 -169 -204 -206 -140 96 14 8 45 65 104 195 176 139 21 -67 89 -12 -103 -216
8052 -216 64 -177 -110 15 -81 68 172 -98 -1 223 248 140 -161 -36 -65 -148 -81 -113 -202 56 62 -52 157 -32
8076 -32 155 -28 188 130 325 -91 91 -46 -595 86 -268 -69 -114 -28 -30 170 198 -126 -19 82 -113 -126 31
8099 31 -193 -140 -323 -61 -263 -110 -120 37 -96 221 112 193 -52 174 27 -21 93 -298 -146 -176 -48 -100
8121 -100 -272 -133 146 -188 77 9 -17 -35 49 -72 -39 141 71 -203 -54 8 -141 -243 -114 114 -105 55
8143 55 99 82 -141 8 82 60 99 -60 -86 48 44 -123 -88 -115 66 38 21 45 61 110 72 -42 307 53 -311 -109
8169 -109 53 -270 -125 -59 -11 168 -6 439 -100 82 -75 -36 -2 39 97 -156 6 159 11 -34 209 -177
8191 -177 -221 -200 114 156 287 223 289 88 87 -84 -194 -151 -176 -159 -273 130 -232 -94 -181 -20 200 315 296 66
8215 66 110 110 146 -191 -42 136 -186 -196 -212 -29 -88 -109 237 181 227 -2 230 53 249 -300 -193 53 -14 -187
8239 -187 -36 -148 -210 -143 152 67 -184 155 218 169 4 64 -16 41 -225 -303 -247 -13 -216 -121 -179 77 34 147
8263 147 167 58 103 219 22 85 69 121 -106 -359 -15 173 -238 -186 -213 6 -54 71 18 269 74 77 37 -163
8287 -163 93 22 -192 -52 -34 -155 28 237 -176 280 338 -127 18 248 3 36 11 -138 -175 -218 177 -234
8309 -234 -394 55 73 -126 168 96 12 89 195 95 -65 60 52 -306 -203 72 -200 -13 -75 39 -199 -128 118
8332 118 -194 129 140 74 -20 -7 101 11 28 106 -76 -58 -3 72 5 124 140 197 84 54 -96 25 8 182 -92
8357 -92 -79 99 -140 88 123 78 -3 125 -7 -19 72 189 56 261 82 -227 -115 58 -109 -13 -234 -152 -106
8380 -106 97 96 189 99 274 208 101 -21 -46 80 -249 62 -61 -56 103 -74 -221 139 124 157 25 60 -50 221
8404 221 99 -18 2 -6 -44 -215 -383 10 -42 -88 -55 119 188 75 147 -9 40 159 -31 -60 -55 -137 -233 -276 42
8429 42 65 -35 108 227 -6 253 279 92 124 163 -96 -193 146 -151 -182 -56 -22 -139 -180 132 143 87 351 138
8453 138 207 167 0 -4 26 201 12 -243 62 -2 -230 -93 217 -215 246 294 138 174 -184 167 -167 -17 -265
8476 -265 -326 15 -139 -36 -212 -176 216 25 -9 364 290 37 312 -62 -125 -140 -110 -59 -129 -55 -18 -28 -12 -83 -16
8501 -16 176 157 186 60 236 261 -61 -137 -88 -65 12 -96 -50 -95 -120 54 0 -21 347 11 194 341 152 153 212
8526 212 -118 -224 -89 -197 -230 -391 -117 -168 26 -1 227 27 73 427 182 -4 14 -96 -111 96 -97 -44
8548 -44 -96 14 -132 92 219 153 93 183 200 76 -18 268 -66 -294 -50 -3 -294 -144 -7 -19 -155 283 37
8571 37 134 196 326 267 -11 173 -4 -72 -77 151 -473 -70 -81 152 -22 -2 107 245 133 -189 8 339 286
8594 286 180 13 -163 -77 -114 -122 74 -84 210 -116 -108 28 157 283 76 -28 70 -182 9 31 -241 -141 -66
8617 -66 100 -157 -9 179 -103 311 108 2 147 286 -148 -118 96 29 -219 -183 41 -68 -110 -67 85 4
8639 4 15 308 52 -1 185 -70 -12 -112 -5 -64 -295 -135 35 -171 165 60 156 325 233 71 16 414 227
8662 227 -18 -103 -203 -194 -198 -37 -73 -140 -131 125 75 385 -73 170 125 -51 -31 -69 -190 -380 -148 -139 -15 -281 -93
8687 -93 109 79 142 282 67 385 104 220 122 -127 141 -264 -299 -96 -79 -211 -50 235 39 172 296 170
8709 170 207 325 13 11 76 81 -285 54 -145 -106 -52 -27 32 -11 173 246 55 150 149 239 -33 -30 39 -242 -222 99 -131
8736 -131 -223 91 65 -111 80 92 243 82 307 168 189 309 -35 21 -214 37 -252 -361 -197 -176 -20 194
8758 194 107 -21 381 284 61 -37 306 93 -299 -207 -225 -276 -122 -24 202 -49 182 -7 -93 -48 13 237 15
8781 15 115 -214 -201 104 -127 -361 -244 229 -229 -32 187 -50 -86 263 256 0 117 247 12 62 59 -219 -300
8804 -300 -245 52 -237 -91 126 17 8 258 186 -22 339 263 100 -153 -111 -118 -169 -16 77 -83 73 -108 9
$$ [...]
16383C37
##END NTUPLES=NMR FID
##END=
