##TITLE=abcd
##JCAMPDX= 6.0         $$ Bruker NMR JCAMP-DX V2.0
##DATA TYPE= NMR SPECTRUM
##DATA CLASS= NTUPLES
##ORIGIN= UXNMR, Bruker Analytische Messtechnik GmbH
##OWNER= root
$$ XWIN-NMR		Version 3.5
$$ Sun Jul  6 16:43:51 2025 Russian Standard Time (UT+4h)  servis@DPX200
##.OBSERVE FREQUENCY= 200.131235884673
##.OBSERVE NUCLEUS= ^1H
##.ACQUISITION MODE= SIMULTANEOUS
##.ACQUISITION SCHEME= undefined
##.AVERAGES= 32
##.DIGITISER RES= 18
##SPECTROMETER/DATA SYSTEM= spect
##.PULSE SEQUENCE= zg
##.SOLVENT NAME= CDCl3
##.SHIFT REFERENCE= (INTERNAL, CDCl3, 0, 16.4885)
##AUDIT TRAIL= $$ (NUMBER, WHEN, WHO, WHERE, WHAT)
$$ ##TITLE= Audit trail, XWIN-NMR		Version 3.5
$$ ##JCAMPDX= 5.01
$$ ##ORIGIN= Bruker BioSpin GmbH
$$ ##OWNER= servis
$$ F:\spectra/data/av/nmr/H1/1/pdata/1/auditp.txt
$$ ##AUDIT TRAIL=  $$ (NUMBER, WHEN, WHO, WHERE, WHAT)
(   1,<2025-07-06 16:42:38.28 +0400>,<servis>,<DPX200>,
      <created by zg, POWCHK disabled, PULCHK disabled
       configuration hash MD5:
       00 E9 B6 7A A2 85 ED C7 34 08 36 98 17 FE 4E 26
       data hash MD5: 32K
       7A A2 64 60 A7 A2 C7 89 EE C1 89 90 DA EC FE 91>)
(   2,<2025-07-06 16:42:39.78 +0400>,<servis>,<DPX200>,
      <Start of raw data processing
       efp BC_mod = 2 LB = 0.05 FT_mod = 6 PKNL = 1 PHC0 = -274.4572 PHC1 = 1.101538 SI = 16K 
       data hash MD5: 16K
       8C 95 75 D8 09 97 7F AA 78 4A AA E0 E7 2B AF A1>)
$$ ##END=
$$ 
$$ hash MD5
$$ AF 24 70 C1 69 DC 7A EF 9A 5A 8E E5 FB 0E 8F F0
##$RELAX= 
##$RELAX= 
##$RELAX= 
##$RELAX= 
##$RELAX= 
##$RELAX= 
##$RELAX= 
##$RELAX= 
$$ Bruker specific parameters
$$ --------------------------
##$DU= <F:\spectra>
##$EXPNO= 1
##$NAME= <H1>
##$PROCNO= 1
##$TYPE= <nmr>
##$USER= <av>
##$AMP= (0..31)
100 100 100 100 100 100 100 100 100 100 100 100 100 100 100 100 100 100 
100 100 100 100 100 100 100 100 100 100 100 100 100 100 
##$AQSEQ= 0
##$AQ_mod= 1
##$AUNM= <au_zg>
##$AUTOPOS= <>
##$BF1= 200.13
##$BF2= 200.13
##$BF3= 200.13
##$BF4= 200.13
##$BF5= 500.13
##$BF6= 500.13
##$BF7= 500.13
##$BF8= 500.13
##$BYTORDA= 1
##$CFDGTYP= 0
##$CFRGTYP= 5
##$CHEMSTR= <none>
##$CNST= (0..31)
1 1 145 1 1 1 1 1 1 1 1 1 1 1 1 1 1 1 1 1 1 1 1 1 1 1 1 1 1 1 1 1 
##$CPDPRG= <>
##$CPDPRG1= <>
##$CPDPRG2= <>
##$CPDPRG3= <>
##$CPDPRG4= <mlev>
##$CPDPRG5= <mlev>
##$CPDPRG6= <mlev>
##$CPDPRG7= <mlev>
##$CPDPRG8= <mlev>
##$CPDPRGB= <>
##$CPDPRGT= <>
##$D= (0..31)
0 2 0 0 0 0 0 0 0 0.06 0 0 0 0 0 0 0.0002 0 0 0 0 0 0 0 0 0 0 0 0 0 0 
0 
##$DATE= 1751805757
##$DBL= (0..7)
120 120 120 120 120 120 120 120 
##$DBP= (0..7)
150 150 150 150 150 150 150 150 
##$DBP07= 0
##$DBPNAM0= <>
##$DBPNAM1= <>
##$DBPNAM2= <>
##$DBPNAM3= <>
##$DBPNAM4= <>
##$DBPNAM5= <>
##$DBPNAM6= <>
##$DBPNAM7= <>
##$DBPOAL= (0..7)
0.5 0.5 0.5 0.5 0.5 0.5 0.5 0.5 
##$DBPOFFS= (0..7)
0 0 0 0 0 0 0 0 
##$DE= 6
##$DECBNUC= <off>
##$DECIM= 32
##$DECNUC= <off>
##$DECSTAT= 4
##$DIGMOD= 1
##$DIGTYP= 9
##$DL= (0..7)
0 120 120 120 120 120 120 120 
##$DP= (0..7)
150 150 150 150 150 150 150 150 
##$DP07= 0
##$DPNAME0= <>
$$ [...]
##$SUBNAM4= <"">
##$SUBNAM5= <"">
##$SUBNAM6= <"">
##$SUBNAM7= <"">
##$SUBNAM8= <"">
##$SUBNAM9= <"">
##$SW= 20.6817932712277
##$SWIBOX= (0..15)
0 0 3 0 0 0 0 0 0 0 0 0 0 0 0 0 
##$SW_h= 4139.07284768212
##$TD= 32768
##$TD0= 1
##$TE= 0
##$TE2= 300
##$TE3= 300
##$TEG= 300
##$TL= (0..7)
0 120 120 120 120 120 120 120 
##$TP= (0..7)
150 150 150 150 150 150 150 150 
##$TP07= 0
##$TPNAME0= <>
##$TPNAME1= <>
##$TPNAME2= <>
##$TPNAME3= <>
##$TPNAME4= <>
##$TPNAME5= <>
##$TPNAME6= <>
##$TPNAME7= <>
##$TPOAL= (0..7)
0.5 0.5 0.5 0.5 0.5 0.5 0.5 0.5 
##$TPOFFS= (0..7)
0 0 0 0 0 0 0 0 
##$TUNHIN= 0
##$TUNHOUT= 0
##$TUNXOUT= 0
##$USERA1= <user>
##$USERA2= <user>
##$USERA3= <user>
##$USERA4= <user>
##$USERA5= <user>
##$V9= 5
##$VALIST= <valist>
##$VCLIST= <CCCCCCCCCCCCCCC>
##$VD= 0
##$VDLIST= <DDDDDDDDDDDDDDD>
##$VPLIST= <PPPPPPPPPPPPPPP>
##$VTLIST= <TTTTTTTTTTTTTTT>
##$WBST= 1024
##$WBSW= 30
##$XGAIN= (0..3)
0 0 0 0 
##$XL= 0
##$YL= 0
##$YMAX_a= 952103
##$YMIN_a= -805098
##$ZGOPTNS= <>
##$ZL1= 120
##$ZL2= 120
##$ZL3= 120
##$ZL4= 120
##$ABSF1= 0
##$ABSF2= 0
##$ABSG= 0
##$ABSL= 0
##$ALPHA= 0
##$AQORDER= 0
##$ASSFAC= 0
##$ASSFACI= 0
##$ASSFACX= 0
##$ASSWID= 0
##$AUNMP= <proc_1d>
##$AZFE= 0.1
##$AZFW= 0.1
##$BCFW= 0
##$BC_mod= 2
##$BYTORDP= 0
##$COROFFS= 0
##$CY= 18.4799938201904
##$DATMOD= 1
##$DC= 0
##$DFILT= <>
##$DTYPP= 0
##$F1P= 9.9274215381318
##$F2P= -0.165520771350173
##$FCOR= 1
##$FTSIZE= 16384
##$FT_mod= 6
##$GAMMA= 0
##$GB= 0
##$INTBC= 1
##$INTSCL= 4.127829e-11
##$ISEN= 128
##$LB= 0.05
##$LEV0= 0
##$LPBIN= 0
##$MAXI= 10000
##$MC2= 0
##$MEAN= 0
##$ME_mod= 0
##$MI= 50
##$NCOEF= 0
##$NC_proc= -5
##$NLEV= 6
##$NOISF1= 3.799351
##$NOISF2= 2.8
##$NSP= 0
##$NTH_PI= 0
##$NZP= 0
##$OFFSET= 16.48848
##$PC= 4
##$PHC0= -274.4572
##$PHC1= 1.101538
##$PH_mod= 1
##$PKNL= yes
##$PPARMOD= 0
##$PSCAL= 4
##$PSIGN= 0
##$REVERSE= no
##$SF= 200.130005582386
##$SI= 16384
##$SIGF1= 3
##$SIGF2= 2
##$SINO= 400
##$SIOLD= 16384
##$SREGLST= <1H.CDCl3>
##$SSB= 0
##$STSI= 16384
##$STSR= 0
##$SW_p= 4139.07284768211
##$SYMM= 0
##$S_DEV= 0
##$TDeff= 32768
##$TDoff= 0
##$TI= <>
##$TILT= no
##$TM1= 0
##$TM2= 0
##$TOPLEV= 0
##$USERP1= <user>
##$USERP2= <user>
##$USERP3= <user>
##$USERP4= <user>
##$USERP5= <user>
##$WDW= 1
##$XDIM= 16384
##$YMAX_p= 284184175
##$YMIN_p= -709811
$$ End of Bruker specific parameters
$$ ---------------------------------
##NTUPLES= NMR SPECTRUM
##VAR_NAME=  FREQUENCY,     SPECTRUM/REAL,   SPECTRUM/IMAG
##SYMBOL=    X,             R,               I
##VAR_TYPE=  INDEPENDENT,   DEPENDENT,       DEPENDENT
##VAR_FORM=  AFFN,          ASDF,            ASDF
##VAR_DIM=   16384,         16384,           16384
##UNITS=     HZ,            ARBITRARY UNITS, ARBITRARY UNITS
##FACTOR=    0.252644378177508, 1,           1
##FIRST=     3299.83951724647, 0,            0
##LAST=      -839.233330435636, 0,           0
##MIN=       -839.233330435636, -709811,     0
##MAX=       3299.83951724647, 284184175,    0
$$ Real data points
##PAGE= N=1
##DATA TABLE= (X++(R..R)), XYDATA
$$ [...]
7652A25008j27247m5384p930J87166k9284j02577J30215K5084l2985m4601j80987
$$ 125008 -2239 -47623 -55553 131613 102329 -248 129967 155051 122066 77465 -103522
7641a03522J14728j74352K14989Q6870j85138P1807N2706p8170M3590j1221p8725
$$ -103522 11206 -163146 51843 138713 -46425 25382 78088 -82 43508 32287 -46438
7630d6438J51027r9609J82567j16695j55208K96223j0598n0231r0163l5096K0185
$$ -46438 104589 4980 187547 70852 -84356 211867 201269 151038 60875 25779 45964
7619D5964j52331R3425N3907k21135K65784N9412j25701k8208J44932L8808j31813
$$ 45964 -106367 -12942 40965 -180170 85614 145026 19325 -8883 136049 174857 43044
7608D3044J08729l45087J19342J26770j06677J40371L2517m0755n8373J17676
$$ 43044 151773 -193314 -73972 52798 -53879 86492 119009 78254 19881 137557
7598A37557O1069k21880p3101K54783j19065R642K63014k21547R7720m2382M9597
$$ 137557 198626 -23254 -96355 158428 39363 49005 312019 90472 188192 145810 195407
7587A95407J03449j55140O450q9612R3320L1272J5443j38833N6541J79112j92439
$$ 195407 298856 143716 150166 60554 153874 185146 200589 61756 118297 297409 104970
7576A04970M8050k6655O0470J16039n7697l5067K4146j7781j2791o2193j0031
$$ 104970 153020 126365 186835 302874 245177 210110 234256 216475 203684 141491 131460
7565A31460K62486k26567K35M5886q428j81528K06582M8578j31544K17773k24314
$$ 131460 393946 167379 167614 213500 205072 23544 230126 278704 147160 364933 140619
7554A40619j27726J45232J46281j21094P4023k16122R8438M6556j65238R7487
$$ 140619 12893 158125 304406 183312 257335 41213 139651 186207 20969 118456
7544A18456o5822J34605P5073L8775j23464N2648q3274O0109p7779L3078N2838
$$ 118456 52634 187239 262312 301087 177623 230271 146997 207106 129327 162405 215243
7533B15243N9404K7472j31640n1844J248Q1071O0143r1239J82338j40585R117
$$ 215243 274647 302119 170479 118635 119883 200954 261097 169858 352196 211611 220728
7522B20728n5686j2464J4686o0305r2843R5625j1620m380K9644l4646o3962j15653
$$ 220728 165042 152578 167264 106959 14116 109741 98121 93741 123385 88739 24777 -90876
7510i0876K05437n3290J83302j94381J74106j95527P6858k15695J06580J19685
$$ -90876 114561 61271 244573 50192 224298 28771 105629 -110066 -3486 116199
7500A16199j04388J78566o5189m5779R0811N532l2303k08520n8327M23137k13304
$$ 116199 11811 190377 125188 79409 170220 175752 143449 -65071 -123398 299739 86435
7489H6435K16882k80688Q6412O0483j19820m4000p8304J62077P9453j35833j05223
$$ 86435 303317 22629 109041 169524 49704 5704 -72600 89477 168930 33097 -72126
7478g2126R2205j3260j08677K67797l7222L6518m2524k1040J23518k89407K5696
$$ -72126 20079 6819 -101858 165939 128717 165235 122711 101671 225189 -64218 -38522
7467c8522R9873O5461O1572j8075k21207J70835j4387j72677J12454L6534n0908
$$ -38522 61351 126812 188384 170309 -50898 119937 105550 -67127 45327 81861 30953
7456C0953K6134j09349k572J47047j49931o8956J60794n5195M2640r940J40747
$$ 30953 57087 -52262 -54834 92213 -57718 -126674 34120 -21075 21565 11625 152372
7445A52372k13629L5324J51956k91121K19258R0913l7144L5669j72715Q0425q795
$$ 152372 -61257 -25933 126023 -165098 54160 145073 107929 143598 -29117 51308 42513
7434D2513J15171k00823R7356j22124R5346l0442r3918J67530J5726L6152j42346
$$ 42513 157684 -43139 54217 -67907 27439 -3003 -96921 70609 86335 122487 -19859
7423a9859j0481L3831p838J20824k26078K62714j31707K37222j68723l9878j00562
$$ -19859 -30340 3491 -4347 116477 -109601 153113 21406 258628 89905 50027 -50535
7412e0535J65468o8390J49155o6099o5966J74004k28631Q3492l8487J27831p7036
$$ -50535 114933 46543 195698 129599 63633 237637 9006 92498 54011 181842 104806
7401A04806M3798K1249m8147j60518Q8217m28N2416J11243j21789l8007L00514
$$ 104806 148604 169853 121706 -38812 49405 48977 101393 212636 90847 52840 353354
7390C53354k76860m2156L00351j93712m0212O8259m046o6567j2980J87476n7742
$$ 353354 76494 34338 334689 140977 100765 169024 164978 98411 85431 272907 215165
7379B15165j40062L6769J73001p9319k42495J65466L5701J5675K35190j73438
$$ 215165 75103 111872 284873 205554 -36941 128525 164226 179901 415091 241653
7369B41653N5526q0830N7160k70669P7103J70516o9087k16365J78467J3752j44300
$$ 241653 297179 216349 273509 2840 79943 250459 181372 -34993 143474 157226 12926
7358A2926N9606k21001K26971M4256M5121J0625j7653j02549O9496q7453O1402
$$ 12926 72532 -148469 78502 122758 167879 178504 160851 58302 127798 40345 101747
7347A01747J9534j58040J9632o859J50106J34262m57755L15852j56771J36319
$$ 101747 121281 -36759 -17127 -23986 126120 260382 -197373 118479 -38292 98027
7337I8027O7959J82616k31321o29o2503j0136J05449j15563K00831j46327P6841
$$ 98027 165986 348602 117281 116652 54149 44013 149462 33899 234730 88403 165244
7326A65244j14983J27039q4886k00482o819J32853l514M0822q9414J03633M0349
$$ 165244 50261 177300 92414 -108068 -114887 17966 14452 55274 -34140 69493 109842
7315A09842o1539J31218k84430K02172k02102J49384j78255M85867k46183j77491
$$ 109842 48303 179521 -104909 97263 -104839 44545 -133710 352157 105974 -71517
7305g1517J46620l6272j04189Q621q743K0153J50192k15894J25668K56349j86290
$$ -71517 75103 38831 -65358 -56737 -65480 -45327 104865 -111029 14639 270988 84698
7294H4698R4496k17987J04822j24719J40875j6286l6268O3914K7025j11747K7639
$$ 84698 179194 -38793 66029 -58690 82185 65899 29631 93545 120570 8823 36462
7283C6462L6867N6100K3194p8409N3033N4316j20426r8854M792K44246n6142p8087
$$ 36462 73329 129429 152623 74214 127247 181563 61137 -37717 -32925 211321 155179 77092
7271G7092L7056j722j4325k02542K97043j73889N3856J15869j25807J64115m0327
$$ 77092 114148 112426 98101 -104441 192602 18713 72569 188438 62631 226746 186419
7260A86419O9404o0931m5701Q6645j17477K769O4243j03526J48574p6688J252
$$ 186419 255823 194892 149191 235836 118359 121128 185371 81845 230419 153731 154983
7249A54983r4338Q9874J0387r7113L3123Q8381J22303j75869p034M2144J08373
$$ 154983 60645 150519 160906 63793 96916 185297 307600 131731 124697 166841 275214
7238B75214k30133P748K8417J39969j04824O5930k1433M2063j76857J97523k75321
$$ 275214 45081 52829 81246 221215 116391 182321 160888 202951 26094 223617 -51704
7227e1704k3686K39167k91104K27310r6630J57990j08156K66979k08125n4438
$$ -51704 -75390 163777 -127327 99983 3353 161343 53187 320166 112041 57603
7217E7603k7978Q3744K6689j90856l0400P7550o3377K23104j86691J54355M1663
$$ 57603 29625 113369 140058 -50798 -81198 -3648 -67025 156079 -30612 123743 165406
7206A65406O4131j14660m8068n3032J55817O6225j05884J17339k94678K53967
$$ 165406 229537 114877 66809 13777 169594 235819 129935 247274 -47404 206563
7196B06563n7237m9646L5347l3271R4745p714m9187n451m6156R6745j57546J44837
$$ 206563 149326 99680 135027 101756 196501 188787 139600 134149 87993 184738 27192 172029
7184A72029j6623j37152O1969J29125l52415K79283q5528J85714j91269L7533
$$ 172029 155406 18254 80223 209348 -143067 136216 50688 236402 45133 82666
7174H2666l9586m5843M78R5243m5417M1632J76304k01976M8637P4705o3242n5135
$$ 82666 43080 -2763 -2285 92958 47541 89173 265477 63501 112138 186843 123601 68466
7162F8466L0500N4470o7161M6463p6699O8620j10732J13268J1282j78162K28950
$$ 68466 98966 153436 86275 132738 56039 124659 13927 127195 138477 -39685 189265
7151A89265k11727K85407j26411O32N4764k16989J3212K54230r5104J077M2164
$$ 189265 -22462 262945 136534 137166 191930 -25059 -11847 242383 147279 148356 190520
7140A90520k5176R045j29459L7045M9467j2116J44967k06315K02031k87870J11958
$$ 190520 165344 174389 44930 81975 131442 119326 264293 57978 260009 -27861 84097
7129H4097J4321J05455M9212k11943P7260J4352M366J01679j55527Q1608j82449
$$ 84097 98418 203873 253085 41142 118402 132754 137120 238799 83272 164880 -17569
7118a7569Q4537j06883K99685j40732J89471k10022J3649j62351J23559m360J66156
$$ -17569 66968 -39915 259770 119038 308509 98487 112136 -50215 73344 68984 235140
7107B35140p257l8641o652n0526M1008j25965J02503m7946j138J55658j22519
$$ 235140 227883 189242 182590 132064 173072 47107 149610 101664 100526 256184 133665
7096A33665L6964L1446q3210m3042K58314p2699k78968K43300l2486k37000K64597
$$ 133665 170629 202075 118865 75823 334137 261438 -17530 225770 193284 -43716 220881
7085B20881j06805K0960J36934j83627K52842r073p2873M3107l33516K24000J66171
$$ 220881 114076 135036 271970 88343 341185 332112 259239 302346 -31170 192830 359001
7074C59001o7672r0821J50167k28654J71773J6475M0829j13231N2309N9967k87580
$$ 359001 291329 200508 350675 122021 293794 310269 351098 237867 290176 350143 62563
7063F2563K36049J3242k2099k6144L0216R3957j0746j53482R8131q0786J36989
$$ 62563 298612 311854 289755 263611 293827 387784 377038 223556 321687 240901 377890
7052C77890j45293P4423j9612L0519J14470j04816P53p5803L707J98249k47582
$$ 377890 232597 307020 287408 317927 432397 327581 328334 252531 256238 454487 206905
7041B06905K07323l7928m3641j5775l5069L9588k2527L468o989q43J6123Q668
$$ 206905 414228 376300 332659 316884 281815 321403 298876 302344 295355 294512 310635 319303
7029C19303j45542R1249K0225Q6850r5840L4528N205k18762L18646k51918j63070
$$ 319303 173761 265010 285235 372085 276245 310773 315978 97216 415862 163944 874
7018H74L44993l35081M43912k34622K9K3898R9250k0496l5523j58822K11585O0594
$$ 874 345867 10786 454698 220076 220105 244003 343253 322757 287234 128412 339997 400591
7006D00591j02814k23634J73397L4961j14297m719o9640K94379j20527J19598
$$ 400591 297777 74143 247540 282501 168204 163485 93845 388224 267697 387295
6996C87295j32025J75417q3543M1328l3763r2990L0103J09579j93287J51947p0966
$$ 387295 255270 430687 347144 388472 354709 261719 291822 401401 208114 360061 289095
6985B89095r2201L6087M6632q2033J45270k34921K26163k3009j1546j68065J74541
$$ 289095 196894 232981 279613 197580 342850 107929 334092 311083 299537 131472 306013
6974C06013p0965M2262j19669K55712k71977k1664J04984J8150J60166k35846
$$ 306013 235048 277310 157641 413353 141376 119712 224696 242846 403012 167166
6964A67166k7213J28737M8820l8333j43150K9380J47886r0540L2371J08995j15740
$$ 167166 139953 268690 317510 279177 136027 165407 313293 222753 255124 364119 248379
6953B48379J83632k14873J49904j0950j18481J75002j79360J39256j20363p7988
$$ 248379 432011 217138 367042 356092 237611 412613 233253 372509 252146 174158
6943A74158J67109Q7871l29117J66678M6541m4428j74816N3618M1761K81698k4740
$$ 174158 341267 429138 100021 266699 313240 268812 93996 147614 189375 471073 446333
6932D46333k43241J71948n3992j00720J20040n7104L0892K41884k63646l3059
$$ 446333 203092 375040 321048 220328 340368 283264 314156 556040 292394 259335
6922B59335j739Q2908j56022N5764r263J495J45073k26545K99882j76518J62411
$$ 259335 257596 340504 184482 240246 230983 232478 377551 151006 450888 274370 436781
6911D36781n9896j81687J385J15465Q543j4794j32285J7299J39721n5527l4802
$$ 436781 376885 195198 196583 312048 320591 305797 173512 190811 330532 275005 240203
6900B40203j82061K04851j11648K04299m6193j14100L9846K38631l80982J45874
$$ 240203 58142 262993 151345 355644 309451 195351 235197 473828 92846 238720
6890B38720J00251N4504j32436N0258J59008k52427j6977N8786K36564k93328
$$ 238720 338971 393475 261039 311297 470305 217878 200901 259687 496251 202923
6880B02923L2506R7054K51103l97639J84815r3239J02528q4248O8517k9390K40958
$$ 202923 235429 332483 583586 185947 370762 277523 380051 295803 364320 334930 575888
6869E75888j40795J12647j98760j23680O8504K57519j92036L8039Q249k0181m5043
$$ 575888 435093 547740 348980 225300 293804 551323 359287 397326 405575 385394 340351
6858C40351J9290P4642l4488O9115m0450j47118K11399p2623j72427o2377J59247
$$ 340351 359641 434283 399795 468910 428460 281342 492741 420118 247691 185314 344561
6847C44561n2194J72384m5119j99299J45912Q5744l0022O2640L5777n9015m1180
$$ 344561 292367 464751 419632 220333 366245 451989 421967 484607 520384 461369 420189
6836D20189J5192j03523K50054q5250J67703M3835j94367o5429J59336K42290
$$ 420189 435381 331858 581912 496662 664365 708200 513833 448404 607740 850030
6826H50030j47047o1489r4136j12781K36367r6017R6278R9105j19655j27354J48545
$$ 850030 702983 641494 547358 434577 670944 574927 671205 770310 650655 523301 671846
6815F71846J41364k23567J29056O6510m3530j5836j05000J97573n5082j99810
$$ 671846 813210 589643 718699 785209 741679 725843 620843 818416 763334 563524
6805E63524J28643k7620O9612R0119M1814j19986q9415K35372k21507P7460M6554
$$ 563524 692167 664547 734159 824278 866092 746106 656691 892063 670556 748016 794570
6794G94570r950J00942M153K6555R5470k09671r6996K24958j27197N4507l0794
$$ 794570 784620 885562 889715 916270 1011740 802069 705073 930031 802834 857341 826547
6783H26547M3063j06412j5840J33308k9001j41103J18086J39657q3709K17600
$$ 826547 869610 763198 747358 880666 851665 710562 828648 968305 884596 1102196
6773A102196j50934r5057P2146N7949M3740j11004L51842l21146J33335j98054
$$ 1102196 951262 856205 928351 986300 1030040 919036 1270878 949732 1083067 885013
6763H85013J73541J26004J9964m4471K40940j13903q3636r8089j59089O3539p3223
$$ 885013 1058554 1184558 1204522 1160051 1400991 1287088 1203452 1105363 946274 1009813 936590
6752I36590O3171Q3421Q1393p3696k25994Q2407Q8924k3413K22400p5527K47018
$$ 936590 999761 1083182 1164575 1090879 864885 947292 1036216 1012803 1235203 1159676 1406694
6741A406694j0775p3984M9188L5831R16J30057J75527j90330K18367K39024j80361
$$ 1406694 1395919 1321935 1371123 1406954 1407870 1537927 1713454 1523124 1741491 1980515 1800154
6730A800154k03389k39617q1678j10249j97384J83765j06635R9946o6615q8051
$$ 1800154 1596765 1357148 1275470 1165221 967837 1151602 1044967 1144913 1078298 990247
6720I90247K85115j63545o7832J13235p126k9070J65635J4562j10382p5386r154
$$ 990247 1275362 1111817 1043985 1157220 1150094 1121024 1286659 1301221 1190839 1115453 1106299
6709A106299Q6782J53037N434J12331j63937J08837l48513n9404J54838k41608
$$ 1106299 1193081 1346118 1351552 1463883 1299946 1408783 1060270 1000866 1155704 914096
6699I14096L1671R7164j14145j7526j14904K36930l67326K80454l8733P1132l0901
$$ 914096 945767 1042931 928786 911260 796356 1033286 665960 946414 907681 978813 947912
6688I47912j33183P1043j32887j45862K44896l0943J13647m2535p135P9638L6049
$$ 947912 814729 885772 752885 607023 851919 820976 934623 892088 884953 964591 1000640
6677A000640o6066J61556l18009L20788l98020J6563l8900L22281k28845P9158
$$ 1000640 934574 1096130 778121 1098909 700889 717452 678552 1000833 771988 851146
6667H51146p5509r780J3348n5594O9634O894j6449M2984l6769R9930M6457j27075
$$ 851146 775637 765857 779205 723611 793245 800139 783690 826674 789905 889835 936292 809217
6655H09217l1815J01077p2082J52563j34976J84998K4381k7957k75952O9707M7372
$$ 809217 777402 878479 806397 958960 823984 1008982 1033363 1005406 729454 799161 846533
6644H46533N4736j3451j52270j16835P6311Q3878m4058K042M9901O7083J35501
$$ 846533 901269 887818 735548 618713 695024 778902 734844 736886 786787 853870 989371
6633I89371l34157o5796J68693p5479o1924J56853J12612j13812J2699J5316j52150
$$ 989371 655214 589418 758111 682632 620708 777561 890173 776361 789060 804376 652226
6622F52226J44886P6382j16878J03415r7674K67944M4980J60005j61623j28593
$$ 652226 797112 873494 756616 860031 762357 1030301 1075281 1235286 1073663 945070
6612I45070p9835P1835q4549M7741k12944J04973K5375k1606j58264J20524j15633
$$ 945070 865235 937070 852521 900262 687318 792291 817666 796060 637796 758320 642687
6601F42687l393M838k1147j7269O0688J08073j69502K88851j32523k03547K42941
$$ 642687 639294 644132 622985 605716 666404 774477 604975 893826 761303 557756 800697
6590H00697j92630P977L38661j87385j33397j4724J78016m1006P3735k20063J25142
$$ 800697 608067 616044 954705 767320 633923 619199 797215 756209 829944 609881 735023
6579G35023M7410j15202J95680k22753q701P6884q7151J79192J5683j37134J52665
$$ 735023 782433 667231 862911 640158 631457 708341 621190 800382 816065 678931 831596
6568H31596j80618Q8599n8539q6616J95195j11667K6933R1336j37097J05316K5882
$$ 831596 650978 739577 681038 594422 789617 677950 704883 796219 659122 764438 790320
6557G90320N3786k35647J9864R7938J17435Q0621j60041J13585k77252J56141
$$ 790320 844106 608459 628323 726261 843696 924317 764276 877861 600609 756750
6547G56750j43173L8175K98679k92520J21466k04441K38800p7482j34247m1158
$$ 756750 613577 651752 950431 657911 779377 574936 813736 736254 602007 560849
6537E60849K12737j04583J34140j8734o9651m9059j7175K09032k31230O8373O0503
$$ 560849 773586 669003 803143 784409 714758 665699 648524 857556 626326 694699 755202
6526G55202l7368k8424J19707j66831P6077J54462q0324L5764j13791J73022j12393
$$ 755202 717834 689410 809117 642286 718363 872825 792501 828265 714474 887496 775103
6515G75103P4584j27334J04407N2065m3285j42717J64089L1312L7961k78087J24860
$$ 775103 849687 722353 826760 878825 835540 692823 856912 888224 926185 648098 772958
6504G72958R4155j97244J18149j5033J33938j09279j15874m730J24229j36754
$$ 772958 867113 669869 788018 772985 906923 797644 681770 677040 801269 664515
6494F64515K09194k14856J7618J70170j22996M2613J51665j36107J76692l7123
$$ 664515 873709 658853 676471 846641 723645 766258 917923 781816 958508 921385
6484I21385M0547K7638k67506l3841Q2636l9287R1793J15695l0316j34291L5852
$$ 921385 961932 989570 722064 688223 770859 731572 823365 939060 908744 774453 810305
6473H10305j8371J29493l1172j9715J03406k15378n5445J44569j4983r1133J03787
$$ 810305 791934 921427 890255 870540 973946 758568 703123 847692 832709 741576 845363
6462H45363j80229q5947L62901j78460N0783k0122n8902N7665L513m408j8639
$$ 845363 665134 579187 942088 763628 814411 794289 735387 793052 796565 792157 773518
6451G73518k2917J00377N6847r3388J5991o253j58488N6345J52083l4302p1839
$$ 773518 750601 850978 907825 814437 830428 824175 665687 722032 874115 839813 767974
6440G67974N8736j23776K13149j31236O3429k9142j02584L7705j72875J93750
$$ 767974 826710 702934 916083 784847 848276 819134 716550 754255 581380 775130
6430G75130K8895K84O3880p9441O3947j27537N1807j4652J94173p8759m9435M3360
$$ 775130 804025 804309 868189 788748 852695 725158 776965 762313 956486 877727 828292 871652
6418H71652q9947O4868M021r911j06270J36523r9629M5598n5843k1536K9908P7161
$$ 871652 781705 846573 850594 840683 734413 870936 771307 816905 761062 739526 769434 846595
6406H46595j43803p1310K19145n723j22069J08552j86930J58546q4527O6116P2994
$$ 846595 702792 631482 850627 844904 722835 831387 644457 803003 718476 784592 857586
6395H57586j72920K4830J74542q606k16395J67170k58884J48841J84983j85500
$$ 857586 684666 709496 884038 875432 659037 826207 567323 716164 901147 715647
6385G15647R901p3262j34214K83619n6191P4498l2322j30195R3934j73271J08170
$$ 715647 725548 652286 518072 801691 745500 819998 787676 657481 751415 578144 686314
6374F86314K7523R0581j04547j67786J84140o9262K70192k84268J97954o9753
$$ 686314 713837 804418 699871 532085 716225 646963 917155 632887 830841 761088
6364G61088P7936l20343R6066J2216n8237L33393j37458r0867Q3746P5822j2902
$$ 761088 839024 518681 614747 626963 568726 902119 764661 673794 757540 833362 820460
6353H20460l5092j24912J71299j4486P5561l1216k3241J03943J27789o8727J18945
$$ 820460 785368 660456 831755 817269 892830 861614 838373 942316 1070105 1001378 1120323
6342A120323r1278O1656m0207K57645j46542J67134L1915R0753O2709J84869J03125
$$ 1120323 1029045 1090701 1050494 1308139 1161597 1328731 1360646 1451399 1514108 1698977 1802102
6331A802102J65627J34344M16149K95813M72693P98858O99689N40541J66072j209476
$$ 1802102 1967729 2102073 2518222 2814035 3286728 4085586 4785275 5325816 5491888 4282412
6321D282412q31781o53065j68607l50420l07775j80958K19200k84400j06725Q021
$$ 4282412 3450631 2797566 2628959 2278539 1970764 1789806 2009006 1724606 1617881 1625902
6311A625902j40781j75422j49422P8757r0936L3480l7105K3030J44179j81156
$$ 1625902 1485121 1309699 1160277 1239034 1148098 1181578 1144473 1167503 1311682 1130526
6301A130526n4566J05299k67725j1047J73693j22797M3322k011o881j69326O4807
$$ 1130526 1075960 1181259 913534 902487 1076180 953383 996705 994694 987813 818487 883294
6290H83294Q3242p5985j0742P808J25007M8682k89613J72260j33768O2354j23656
$$ 883294 966536 890551 879809 887617 1012624 1061306 771693 943953 810185 872539 748883
6279G48883J74567r2970p0388K11280J967l21093J81553Q9410p6415K0236p0418
$$ 748883 923450 830480 760092 971372 973339 652246 833799 923209 846794 867030 796612
6268G96612J80607j28431J09011j65444J17667r5499J24087p2893N9450Q5777
$$ 796612 977219 848788 957799 792355 910022 814523 938610 865717 925167 1010944
6258A010944j94299N3385n0111J49928p7334M050o3328J92951L4677j21201m6871
$$ 1010944 816645 870030 819919 969847 892513 896563 833235 1026186 1060863 939662 892791
6247H92791j3254l2103R2641J18847j2129P24M8931m0551j14978J15660L0273
$$ 892791 879537 847434 940075 1058922 1046793 1047517 1096448 1055897 940919 1056579 1086852
6236A086852L9562l2797J04462q4159m762r1443l4449j06343m551P5797K02641
$$ 1086852 1126414 1093617 1198079 1113920 1109158 1017715 983266 876923 872372 948169 1150810
6225A150810J05003k25382j25223J50204q8562K8148l4040Q9444J97238l2960
$$ 1150810 1255813 1030431 905208 1055412 966850 994998 960958 1050402 1247640 1214680
6215A214680r1618l4441o014p7129K83081M5329o1395J27960k15718J94504j83828
$$ 1214680 1123062 1088621 1082607 1005478 1288559 1333888 1272493 1400453 1184735 1379239 1195411
6204A195411Q8569J97521q9930m31903L46480j18584j23647J14524J9158l9830
$$ 1195411 1283980 1481501 1391571 959668 1306148 1187564 1063917 1178441 1197599 1157769
6194A157769P9774Q0877p8008l3048L53036k70552P7875j06438J57318j59672
$$ 1157769 1237543 1318420 1240412 1207364 1560400 1289848 1367723 1261285 1418603 1258931
6184A258931j16504m1085J95557j86932K17091o0024R408M6935M9742j79923J22242
$$ 1258931 1142427 1101342 1296899 1109967 1327058 1267034 1276442 1323377 1373119 1193196 1315438
6173A315438r4977O4876j3103O4146r5887J78441M6397M2861J45104k38938l36
$$ 1315438 1220461 1285337 1272234 1336380 1240493 1418934 1465331 1508192 1653296 1414358 1414022
6162A414022K696K30941j72989J05311N3320k04340p3418Q2280J58704j21346
$$ 1414022 1416718 1647659 1474670 1579981 1633301 1428961 1355543 1437823 1596527 1475181
6152A475181j32930l7234P6823n7005K49643l01367K03312M5263j09878j05014
$$ 1475181 1342251 1305017 1381840 1324835 1574478 1273111 1476423 1521686 1411808 1306794
6142A306794J13709P999J15687k02180K49715j4184k00013J60623j9417l14862
$$ 1306794 1420503 1428502 1544189 1342009 1591724 1577540 1377527 1538150 1518733 1203871
6132A203871L49665q9025j22848N1388J25787j50965l9006J46303q2109j38993
$$ 1203871 1553536 1464511 1341663 1393051 1518838 1367873 1328867 1475170 1393061 1254068
6122A254068J41335J7267j59391Q2240N4087j36951o0087J37388n3252J3956j13185
$$ 1254068 1395403 1412670 1253279 1335519 1389606 1252655 1192568 1329956 1276704 1290660 1177475
6111A177475K41590q8171l5953j00245L9920J38978j85985J9296L8458J27601
$$ 1177475 1419065 1330894 1294941 1194696 1234616 1373594 1187609 1206905 1245363 1372964
6101A372964Q5946j78624J79644j52106O8361K2338j88718J11437Q9875q6437
$$ 1372964 1458910 1280286 1459930 1307824 1376185 1398523 1209805 1321242 1411117 1324680
6091A324680O0913K1299R4327j95281q8448j6705N9537M8643M5976R2409k3919
$$ 1324680 1385593 1406892 1501219 1305938 1217490 1200785 1260322 1308965 1354941 1447350 1423431
6080A423431o140q8144J06243O0012K3811l6612j11276J55074J6695j71867O7743
$$ 1423431 1417291 1329147 1435390 1495402 1519213 1482601 1371325 1526399 1543094 1371227 1438970
6069A438970K29136k37578j7594K06639j98920Q9001J0438J86479j18297k4187
$$ 1438970 1668106 1430528 1412934 1619573 1420653 1509654 1520092 1706571 1588274 1564087
6059A564087r6362l9507L29249j80362K8984O9478P4085j10115J05371J3411l5379
$$ 1564087 1467725 1428218 1757467 1577105 1606089 1675567 1749652 1639537 1744908 1758319 1722940
6048A722940r187J38679l91172Q1717J66659R3391j92539m0829J12472j64515
$$ 1722940 1713753 1852432 1461260 1542977 1709636 1803027 1610488 1569659 1682131 1517616
6038A517616Q767J98772M4741k52490L20001n7928j31695k6680K2595J76959k45519
$$ 1517616 1526383 1725155 1769896 1517406 1837407 1779479 1647784 1621104 1643699 1820658 1575139
6027A575139J85737n0952K72869k75443q055m5349j9817K14273L8913r3375m0147
$$ 1575139 1760876 1709924 1982793 1707350 1699295 1653946 1634129 1848402 1887315 1793940 1753793
6016A753793N7930J60185n8226J6323M0931l18729K62418k13486K04936n8137
$$ 1753793 1811723 1971908 1913682 1930005 1970936 1652207 1914625 1701139 1906075 1847938
6006A847938K16422j89890j863M8386K5804j2970j49151K76832j74514K07663
$$ 1847938 2064360 1874470 1872607 1920993 1946797 1933827 1784676 2061508 1886994 2094657
5996B094657p8037K01023q4793j13384K93676r9424L4575P8793j58724J51738
$$ 2094657 2016620 2217643 2132850 2019466 2313142 2213718 2248293 2327086 2168362 2320100
5986B320100r5148Q3908M5030l6622K26644j43688J38132J03513L9367p6175J88188
$$ 2320100 2224952 2308860 2353890 2317268 2543912 2400224 2538356 2641869 2681236 2605061 2793249
5975B793249J23052J06919l9807M9053J74611j16256m07L2704J44617j73248k1984
$$ 2793249 2916301 3023220 2983413 3032466 3207077 3090821 3090414 3123118 3267735 3094487 3072503
5964C072503N578k9278l3215n4110N0781N5366l2335J65094k3989m8657K70628
$$ 3072503 3078081 3048803 3015588 2961478 3012259 3067625 3035290 3200384 3176395 3127738 3398366
5953C398366j65508K01503O9223K6945K20333j11564L46121Q4567p8922M04843
$$ 3398366 3232858 3434361 3503584 3530529 3750862 3639298 3985419 4069986 3991064 4395907
5943D395907N5716J0310O2793k1568O012q9274O6713j41048N8524O0029m0253
$$ 4395907 4451623 4461933 4524726 4503158 4509170 4419896 4486609 4345561 4404085 4464114 4423861
5932D423861R0943j1005p1304J04039J15275J8053J68169r5153K73832J06117
$$ 4423861 4514804 4503799 4432495 4536534 4651809 4669862 4838031 4742878 5016710 5122827
5922E122827P7030K08951M19186n9403N41017K28804K88368L89580L77763O21833
$$ 5122827 5199857 5408808 5827994 5768591 6309608 6538412 6826780 7216360 7594123 8215956
5912H215956M46776M17309Q33703O36545L34516O53075P43932N26741O61092N11882
$$ 8215956 8662732 9080041 9913744 10550289 10884805 11537880 12281812 12808553 13469645 13981527
5902A3981527L04509j37383p9989m8572m90123l21905p06085k36734k97868k78595
$$ 13981527 14286036 14148653 14068664 14020092 13529969 13208064 12501979 12265245 11967377 11688782
5892A1688782n559l09075p1200K54355K41792J11559K73819K99163O40735N38774
$$ 11688782 11683223 11374148 11302948 11557303 11799095 11910654 12184473 12483636 13124371 13663145
5882A3663145P58800O39113R95839J045811J176076J548296J317296J161782J013864
$$ 13663145 14421945 15061058 16056897 17102708 18278784 19827080 21144376 22306158 23320022
5873B3320022Q98083M55066J22229j75341o33755q92998q59783j129255r24708
$$ 23320022 24218105 24673171 24795400 24620059 23986304 23093306 22233523 21104268 20179560
5864B0179560j240191j033120o38046q60344o32568n47614k23892l13027j66899
$$ 20179560 18939369 17906249 17268203 16407859 15775291 15227677 15003785 14690758 14523859
5855A4523859j83207m3837M07350K33724N0015K57221N37710N24869L62127Q61679
$$ 14523859 14340652 14296815 14704165 14937889 14987904 15245125 15782835 16307704 16669831 17531510
5845A7531510N37219O99842N30403L16791P4459j07110l33034n00273q49043q08475
$$ 17531510 18068729 18768571 19298974 19615765 19690224 19583114 19250080 18749807 17900764 17092289
5835A7092289q28859p95611q26986l87081n94449o41919m55744m96037j70074
$$ 17092289 16263430 15467819 14640833 14253752 13659303 13017384 12561640 12065603 11895529
5826A1895529l53275j64643k03057q5869j99107l78636K31157l20539K6508O5918
$$ 11895529 11542254 11377611 11174554 11088685 10889578 10510942 10742099 10421560 10448068 10513986
5816A0513986j14736j52243L4088j16266K30335J1633O3626j18699j27078J42312
$$ 10513986 10399250 10247007 10281095 10164829 10395164 10406797 10470423 10351724 10224646 10366958
5806A0366958r0383L02999l00307J95176P0813m0819m7890L19433K8501P2654
$$ 10366958 10276575 10579574 10279267 10474443 10545256 10504437 10456547 10775980 10804481 10877135
5796A0877135L5374K56544j48117N3003K60068J01195N8625K30635K0284K75894
$$ 10877135 10912509 11169053 11020936 11073939 11334007 11435202 11493827 11724462 11744746 12020640
5786A2020640K17926Q5217J17756L11820M10403l4324L65240K39902M80162K14702
$$ 12020640 12238566 12323783 12441539 12753359 13163762 13129438 13494678 13734580 14214742 14429444
5776A4429444L64505M84469L70647M80118L34900M03194N50722M90593P87521
$$ 14429444 14793949 15278418 15649065 16129183 16464083 16867277 17417999 17908592 18696113
5767A8696113O15049P66801N81000P94825N54145Q19573Q65826O36557M38564
$$ 18696113 19311162 20077963 20658963 21453788 22007933 22827506 23693332 24329889 24768453
5758B4768453O05390M05498N14935K94009N05495N73009L44977P36440O09713
$$ 24768453 25373843 25779341 26294276 26588285 27093780 27666789 28011766 28748206 29357919
5749B9357919O08491Q01354R67425J000410J122287J331645J317509J222794J283014
$$ 29357919 29966410 30767764 31735189 32735599 33857886 35189531 36507040 37729834 39012848
5740C9012848J530294J242429J483420J267857J783581J172211J213995J448595
$$ 39012848 40543142 41785571 43268991 44536848 46320429 47492640 48706635 50155230
5732E0155230J423023J459953J671427J915242K375978K668870L392801L883020
$$ 50155230 51578253 53038206 54709633 56624875 59000853 61669723 65062524 68945544
5724F8945544M639706N923266O668258P629419Q195326Q938415R389806R601054
$$ 68945544 73585250 79508516 86176774 93806193 102001519 110939934 120329740 129930794
5716A29930794R459456P891011N941963L333622N59640j655868l998329o055131
$$ 129930794 139390250 147281261 153223224 156556846 157116486 155460618 151462289 145407158
5708A45407158p161356o636426o567107n641456m821174m292936k957167j998894
$$ 145407158 138245802 131609376 125042269 119400813 114579639 110286703 107329536 105330642
5700A05330642q64275O83103J753542L086848M162403N692882P776756R294376
$$ 105330642 104466367 105149470 106903012 109989860 114152263 119845145 127621901 136916277
5692A36916277J1324852J2912015J4920037J6893953J8247231J8827996J8222757
$$ 136916277 148241129 161153144 176073181 192967134 211214365 230042361 248265118
5685B48265118J6667330J2946230O305497j298733p942346j2680023j6467734
$$ 248265118 264932448 277878678 284184175 282885442 274943096 262263073 245795339
5678B45795339j7961895j7682275j6600489j5398185j3787235j2010016j0228490
$$ 245795339 227833444 210151169 193550680 178152495 164365260 152355244 142126754
5671A42126754q230309o539271m806672l325367j934436o32490L14706J251457
$$ 142126754 133896445 127357174 122550502 119225135 117290699 116658209 116972915 118224372
5663A18224372K567822L885868N501678O837275Q201215R342624J0125772R615201
$$ 118224372 120792194 124678062 130179740 137017015 145218230 154560854 164686626 174301827
5655A74301827R010095O601097L035036j139116m854818q178780j1025315j2085859
$$ 174301827 183311922 189913019 192948055 191808939 186954121 178775341 167750026 155664167
5647A55664167j2360436j1442415j0781269r548714q589075p088852n935881m700009
$$ 155664167 143303731 131861316 121080047 111531333 102942258 95853406 89917525 85217516
5639H5217516m079858l110641k651059j780178j686538q55182n70059q6324J61057
$$ 85217516 81137658 78027017 75375958 73595780 71909242 71054060 70484001 70397677 70558734
5630G0558734P01845R16762J353214J821856J570753K194011K421371K410187
$$ 70558734 71260579 72177341 73530555 75352411 76923164 79117175 81538546 83948733
5622H3948733K660865K241572K308063K262518J881328J651241J296428J576731
$$ 83948733 86609598 88851170 91159233 93421751 95303079 96954320 98250748 99827479
5614I9827479J012580J272228J371724J266514J234582K041310J985869K660882
$$ 99827479 100840059 102112287 103484011 104750525 105985107 108026417 110012286 112673168
5606A12673168K564039L175942L279785L357231L632812L433984L237827K519911
$$ 112673168 115237207 118413149 121692934 125050165 128682977 132116961 135354788 137874699
5598A37874699K158881J475513J081087p227q75444j652654j940711k732766l455894
$$ 137874699 140033580 141509093 142590180 142582953 141707509 140054855 138114144 135381378 131925484
5589A31925484l707733l611450l674355l770200l643192l602908l094226k642483
$$ 131925484 128217751 124606301 120931946 117161746 113518554 109915646 106821420 104178937
5581A04178937k373021j953349j240175q33541p64501l32358p27535o21796p12664
$$ 104178937 101805916 99852567 98612392 97778851 97014350 96681992 95954457 95332661 94619997
5572I4619997j226283j614955j498369j956826k318250k581255k561897k588675
$$ 94619997 93393714 91778759 90280390 88323564 86005314 83424059 80862162 78273487
5564G8273487k330835k415364k172215k037081k029090k100491j849595k244955
$$ 78273487 75942652 73527288 71355073 69317992 67288902 65188411 63338816 61093861
5556F1093861k083980k152979k018671k183011j872908j974900j633597j543776
$$ 61093861 59009881 56856902 54838231 52655220 50782312 48807412 47173815 45630039
5548D5630039j121049j279850p89109p68906o04897l58003k68640L7137j56893
$$ 45630039 44508990 43229140 42440031 41671125 41066228 40708225 40439585 40476722 40319829
5539D0319829K89583M19794N49840O36242R33620R49083J078054J267959J045736
$$ 40319829 40609412 41029206 41579046 42215288 43148908 44097991 45176045 46444004 47489740
5530D7489740J243761J008091J131848J025020J097284J031756J405882J371051
$$ 47489740 48733501 49741592 50873440 51898460 52995744 54027500 55433382 56804433
5522E6804433J938886K142547K212454K391672K241527K382118K175788J861597
$$ 56804433 58743319 60885866 63098320 65489992 67731519 70113637 72289425 74151022
5514G4151022J436274Q95462J173137Q11305N85635O34869M71656Q21490J024489
$$ 74151022 75587296 76482758 77655895 78467200 79052835 79687704 80159360 80980850 82005339
5505H2005339J454006J673263K347585K473608K967041L431490L410951M253236
$$ 82005339 83459345 85132608 87480193 89953801 92920842 96352332 99763283 104016519
5497A04016519M089137L811207M283059M055328L739320L201301K291044J790791
$$ 104016519 108105656 111916863 116199922 120255250 123994570 127195871 129486915 131277706
5489A31277706N34508k41656j397406k040455k543946k669408l524748l415840
$$ 131277706 131812214 131570558 130173152 128132697 125588751 122919343 119394595 115978755
5481A15978755l205294k878606k710363k571965j924114j674362j439876j524830
$$ 115978755 112773461 109894855 107184492 104612527 102688413 101014051 99574175 98049345
5473I8049345j158179j493354j605597j620951j812665k201618k880523k847202
$$ 98049345 96891166 95397812 93792215 92171264 90358599 88156981 85276458 82429256
5465H2429256l359239l513307l817335l465878l705327l770769l330044l037725
$$ 82429256 79070017 75556710 71739375 68273497 64568170 60797401 57467357 54429632
5457E4429632l090151k758355k387909k597976k096068j909747j782543j532550
$$ 54429632 51339481 48581126 46193217 43595241 41499173 39589426 37806883 36274333
5449C6274333j470601j283278j234532r63114j319544r03790r76116o93573r57505
$$ 36274333 34803732 33520454 32285922 31322808 30003264 29099474 28123358 27429785 26472280
5440B6472280p56954p41753o77621p20010m07068n92792o10067l52382n22382
$$ 26472280 25715326 24973573 24295952 23575942 23168874 22576082 21966015 21613633 21091251
5431B1091251n08881n14174k21704m27439l15129l14027n2261l68587l57537k9050
$$ 21091251 20582370 20068196 19846492 19419053 19103924 18789897 18737636 18369049 18011512 17982462
5421A7982462l10456l86576m04183k68942m09075k20528l94228j08999m86700
$$ 17982462 17672006 17285430 16881247 16612305 16203230 15982702 15588474 15479475 14992775
5412A4992775k39542K905l97587l1219m54222n052j84877k27315j56038j87301
$$ 14992775 14753233 14756138 14358551 14327332 13873110 13868058 13683181 13455866 13299828 13112527
5402A3112527j91217j72679N2714j33435j78343J27943l73021K00186q7432k6826
$$ 13112527 12921310 12748631 12801345 12667910 12489567 12617510 12244489 12444675 12357243 12330417
5392A2330417L6964l33960o997j63844j64186o8014p4321k53833j80525L4504
$$ 12330417 12367381 12033421 12026424 11862580 11698394 11630380 11556059 11302226 11121701 11156205
5382A1156205j71052j93400j10517K1333l973l55027L4410p3848j11277N9542
$$ 11156205 10985153 10791753 10681236 10702569 10698596 10343569 10377979 10304131 10192854 10252396
5372A0252396K2174k65320q8916J14216j73659J44921k1123l34520l5156K2614
$$ 10252396 10274570 10009250 9920334 10034550 9860891 10005812 9984689 9650169 9615013 9637627
5362I637627N234K8192R404j11590k38155P6976Q1828k02472L5249R2972n1471
$$ 9637627 9642861 9671053 9680457 9568867 9330712 9407688 9489516 9287044 9322293 9415265 9363794
5351I363794K0392j82372J82833m5799J2533P0613k1880R799J7221J82806j36016
$$ 9363794 9384186 9201814 9384647 9338848 9351381 9421994 9400114 9409913 9427134 9609940 9473924
5340I473924P8463k0503M8783j82251j1106O1772P7365r2573M5544R1346R4397
$$ 9473924 9552387 9531884 9580667 9398416 9387310 9449082 9526447 9433874 9479418 9570764 9665161
5329I665161k5452O0111J4638J64305k3579R3792J60282j08795K53104n4057J56587
$$ 9665161 9639709 9699820 9714458 9878763 9855184 9948976 10109258 10000463 10253567 10199510 10356097
5318A0356097L99614K6219K42640J64231K98364L12742K71614L85869L83308L04092
$$ 10356097 10755711 10781930 11024570 11188801 11487165 11799907 12071521 12457390 12840698 13144790
5308A3144790O01867N14637L77728N00213N66700N65474L57153O09042M25241
$$ 13144790 13746657 14261294 14639022 15139235 15705935 16271409 16628562 17237604 17662845
5299A7662845L27711L01302N7425M30497j0725L62186L86499J29737J47653L48338
$$ 17662845 17990556 18291858 18349283 18779780 18769055 19131241 19517740 19647477 19795130 20143468
5289B0143468K79690N53944M16261M48280O99929M87704O26865M94323N02516
$$ 20143468 20423158 20977102 21393363 21841643 22541572 23029276 23656141 24150464 24652980
5280B4652980O57482L52409J5152K77602J9359k54949j61683p62075l45987q14355
$$ 24652980 25310462 25662871 25678023 25955625 25974984 25720035 25558352 24796277 24450290 23635935
5270B3635935o54078l68140r81390m84297n09580m35629l39512l13127j22629
$$ 23635935 22981857 22613717 21632327 21148030 20638450 20202821 19863309 19550182 19427553
5261A9427553k47509R9686q8773j64838P5706k45163j72365k97007k90342k03029
$$ 19427553 19180044 19279730 19190957 19026119 19101825 18856662 18684297 18387290 18096948 17893919
5251A7893919l97393n00679m86754n16307l80909o63785n11566l08656n35012
$$ 17893919 17496526 16995847 16509093 15992786 15611877 14948092 14436526 14127870 13592858
5242A3592858l59155l63035l22400o23193j32463k63115l01501k08816m86606
$$ 13592858 13233703 12870668 12548268 11925075 11792612 11529497 11227996 11019180 10532574
5233A0532574j31099q7061R5023o06781j334j87623j61057k02743q7665j86145
$$ 10532574 10401475 10314414 10409437 9802656 9801322 9613699 9452642 9249899 9162234 8976089
5223H976089k27992M1527k09837J59143m59977J02098Q095k35142R2146j53581
$$ 8976089 8748097 8789624 8579787 8738930 8278953 8381051 8389146 8154004 8246150 8092569
5213H092569r295j81892l1309J17107k03422p4729J05449l3166j61756m4603k8645
$$ 8092569 8083274 7901382 7870073 7987180 7783758 7709029 7814478 7781312 7619556 7574953 7546308
5202G546308p6597K001L4092l05319J46230j46763J24218J65023j49282j58637
$$ 7546308 7469711 7471712 7505804 7200485 7346715 7199952 7324170 7489193 7339911 7181274
5192G181274M475M0522J23884j3214N7819n9706J5061j44396l955k8364n9426
$$ 7181274 7185749 7226271 7350155 7336941 7394760 7335054 7350115 7205719 7201764 7173400 7113974
5181G113974R6614o8516o6628N5520J20220n7113j48804O9450K60930j23510q4554
$$ 7113974 7210588 7142072 7075444 7130964 7251184 7194071 7045267 7114717 7375647 7252137 7167583
5170G167583P2639j2362K23917k80327R2151J15632j20591J91356J9129Q5506
$$ 7167583 7240222 7227860 7451777 7171450 7263601 7379233 7258642 7449998 7469127 7554633
5160G554633k8841K16956j02662j20653P2748J79558m1414m9354L9683P150J99560
$$ 7554633 7525792 7742748 7640086 7519433 7592181 7771739 7730325 7680971 7720654 7727804 7927364
5149G927364m4168j1070k0398K07763K17444l2480N9867J7565K39291P3155j0761
$$ 7927364 7883196 7872126 7851728 8059491 8276935 8244455 8304322 8321887 8561178 8634333 8623572
5138H623572M79605J08098K5143L40085J83836L46199O19804k8466K95538M43529
$$ 8623572 9103177 9211275 9236418 9576503 9760339 10106538 10726342 10697876 10993414 11436943
5128A1436943J9246J22063K2140P8764l79449N3213n9795R9755N7999m5886P4707
$$ 11436943 11456189 11578252 11600392 11679156 11299707 11352920 11293125 11392880 11450879 11404993 11479700
5117A1479700N5690K73966J51498J94499K58656J73753L15475L13808M66049L49875
$$ 11479700 11535390 11809356 11960854 12155353 12414009 12587762 12903237 13217045 13683094 14032969
5107A4032969P93210N07236O47043Q49467N31414R21154P25323N25570Q24851
$$ 14032969 14826179 15333415 15980458 16829925 17361339 18282493 19007816 19533386 20358237
5098B0358237N76355M17764J03318J02011k47128l96602j34016j95575j91866
$$ 20358237 20934592 21352356 21455674 21557685 21310557 20913955 20779939 20584364 20392498
5089B0392498J78886K04818L78955M41803L90382R07247J056844J081555J090291
$$ 20392498 20571384 20776202 21155157 21596960 21987342 22894589 23951433 25032988 26123279
5080B6123279J464626J557627K431196K733146L219444M119791M632386L694151
$$ 26123279 27587905 29145532 31576728 34309874 37529318 41649109 46281495 49975646
5072D9975646J552966M59742j667121k948915k429442j744166j313286q63093
$$ 49975646 51528612 51988354 50321233 47372318 44942876 43198710 41885424 41022331
5064D1022331r20519m63054m70960m97727p7274R6366j23081J89527P57147J223735
$$ 41022331 40101812 39638758 39167798 38670071 38592797 38689163 38566082 38755609 39512756 40736491
5054D0736491J618539K359920K519084L168976M070239N134202O338789P830866
$$ 40736491 42355030 44714950 47234034 50403010 54473249 59607451 65946240 73777106
5046G3777106Q472891P799343O191952N744317N051751L034154l155983r732258
$$ 73777106 82249997 90049340 96241292 101985609 107037360 110071514 106915531 97183273
5038I7183273j1270979q908430n882693m358796l247733k366219j479461j319388
$$ 97183273 85912294 77003864 71121171 66762375 63514642 61148423 59668962 58349574
5030E8349574j361937j308001n79255J26259L63061J115780J346558J818171K322051
$$ 58349574 56987637 55679636 55100381 55226640 55589701 56705481 58052039 59870210 62192261
5021F2192261L911150M651910O119844P704766Q601485P857932P672386Q908176
$$ 62192261 66103411 70755321 76875165 84579931 93181416 101039348 108711734 117619910
5013A17619910R858148P279641r33311q583005j1198218j3413404j2399571r255091
$$ 117619910 127478058 134757699 133824388 125241383 114043165 100629761 88230190 78975099
5005G8975099o678659n205950l972198l115154k513062j736878j404128j011236
$$ 78975099 72296440 67090490 63118292 60003138 57490076 55753198 54349070 53337834
4997E3337834j154357k09609k04048m67737J45523K59820R72289J590294K727574
$$ 53337834 52183477 51973868 51769820 51302083 51447606 51707426 52679715 54270009 56997583
4988E6997583L490130M658356O373731Q008708P578441M679933R13086k860123
$$ 56997583 60487713 65146069 71519800 79528508 87106949 91786882 92699968 89839845
4980H9839845p407219r225253r271114p163077n464015m282098l117942k762356
$$ 89839845 82432626 73207373 63936259 56773182 51309167 47027069 43909127 41146771
4972D1146771j985473k108872j395879j288111r73942m80507j029118j121645
$$ 41146771 39161298 37052426 35656547 34368436 33394494 32913987 31884869 30763224
4964C0763224p32954q42892o62388l01849J05947J06000L93324R24868J004533
$$ 30763224 30030270 29187378 28524990 28223141 28329088 28435088 28828412 29753280 30757813
4955C0757813J701669J873443J277892Q1818r64458k158921k870568k901414k050664
$$ 30757813 32459482 34332925 35610817 35692635 34728177 32569256 29698688 26797274 24746610
4946B4746610j459939j208765j000695o27082q32203n39058o13275o92018n18905
$$ 24746610 23286671 22077906 21077211 20450129 19617926 19078868 18465593 17773575 17254670
4937A7254670j89067l61983m03346l41797l18204k30196k37725l09393j70224
$$ 17254670 17065603 16703620 16300274 15958477 15640273 15410077 15172352 14862959 14692735
4928A4692735l04265j45617j69579k78265m32266J75273l00536j94171n1463O8424
$$ 14692735 14388470 14242853 14073274 13795009 13362743 13538016 13237480 13043309 12991846 13060270
4918A3060270l21489k08251r775j77911j2039j91737p2565m3652j28893K64682
$$ 13060270 12738781 12530530 12520755 12342844 12330805 12139068 12066503 12022851 11893958 12158640
4908A2158640k90194j44082K96738J1274l54307j37145J40609o1810J05055o2085
$$ 12158640 11868446 11724364 12021102 12032376 11678069 11540924 11681533 11619723 11724778 11662693
4898A1662693K9753q941j1916j9228j04602o0110j54907J79899J07278q8091J01799
$$ 11662693 11692446 11683505 11671589 11652361 11547759 11487649 11332742 11512641 11619919 11531828 11633627
4887A1633627j56690J75046j24086J68224J48730o424n7913L5995j3956J68174
$$ 11633627 11476937 11651983 11527897 11696121 11844851 11838427 11780514 11816509 11802553 11970727
4877A1970727k3117J98961k1846J27145J49050k8745J18230K34882J41370M8754
$$ 11970727 11947610 12146571 12124725 12251870 12400920 12372175 12490405 12725287 12866657 12915411
4867A2915411K45203L8752J71890K57261K36229M7843M06184K83639M03728J74229
$$ 12915411 13160614 13199366 13371256 13628517 13864746 13912589 14318773 14602412 15006140 15180369
4857A5180369K82489K98037M30980M49378M69112L68260M79495O66438M04008
$$ 15180369 15462858 15760895 16191875 16641253 17110365 17478625 17958120 18624558 19028566
4848A9028566P90976P12588P47674M25791J035662Q45316J101899R64144R20147
$$ 19028566 19819542 20532130 21279804 21705595 22741257 23586573 24688472 25652616 26572763
4839B6572763P35901R10856Q07020J219378J034577J256618J383684J639803J198395
$$ 26572763 27308664 28219520 29026540 30245918 31280495 32537113 33920797 35560600 36758995
4830C6758995O09113P20985J150371R13685J582688J526178J782001J676484J185814
$$ 36758995 37368108 38089093 39239464 40153149 41735837 43262015 45044016 46720500 47906314
4821D7906314J041004J043682J010470J377726J855623K074950K581560K467641
$$ 47906314 48947318 49991000 51001470 52379196 54234819 56309769 58891329 61358970
4813F1358970K592035L157403L631089L977419M412752M195903M238951M496087
$$ 61358970 63951005 67108408 70739497 74716916 79129668 83325571 87564522 92060609
4805I2060609N208876N963440O717984P082607P345205O583052N439238M356041
$$ 92060609 97269485 103232925 109950909 117033516 124378721 130961773 136401011 140757052
4797A40757052L703533L918092L658063M008058M242844N357010N874547O829473
$$ 140757052 144460585 148378677 152036740 156044798 160287642 165644652 171519199 178348672
4789A78348672Q932040J1605729J3788322J2882956O652708l386397o777716l751830
$$ 178348672 187280712 198886441 212674763 225557719 232210427 228824030 222046314 218294484
4781B18294484N22798M150973O346912Q106674R475445R936725Q662548O333585
$$ 218294484 218817282 222968255 229315167 237421841 246897286 256834011 265496559 271830144
4773B71830144L370944M28002j912576m369166p851829j0635874j0621923r170153
$$ 271830144 275201088 275629090 273716514 269347348 261495519 250859645 240237722 231067569
4765B31067569p373148o312153l608977m45026K533566M164517J495404q183271
$$ 231067569 223694421 217382268 213773291 213328265 215861831 220026348 221521752 213338481
4757B13338481j5569887j4539088j0513152p476013n249956m244228m014606l579583
$$ 213338481 197768594 183229506 172716354 165240341 159990385 155746157 151731551 148151968
4749A48151968l017329k917054l354522l543767m082343n304876o419636p003405
$$ 148151968 145134639 142217585 138863063 135319296 131236953 125932077 119512441 112509036
4741A12509036o868584n861178n167047m680566m437771m150776m020646l870869
$$ 112509036 105640452 99779274 94612227 89931661 85493890 81343114 77322468 73451599
4733G3451599l995338l172585k514813k279052j911832j922984j808756j222398
$$ 73451599 69456261 66283676 63768863 61489811 59577979 57654995 55846239 54623841
4725E4623841j215020q60194o44028j045768j482794j278818j681843j498559
$$ 54623841 53408821 52548627 51904599 50858831 49376037 48097219 46415376 44916817
4717D4916817j315118j207448j105945p55399j185799j314205j746247j544264
$$ 44916817 43601699 42394251 41288306 40532907 39347108 38032903 36286656 34742392
4709C4742392j445950j005720q20492q46280n65372r31792o69616r94123j114272
$$ 34742392 33296442 32290722 31470230 30623950 30058578 29126786 28457170 27463047 26348775
4700B6348775p24543p81992j018193o24464p33738m94561o29148l74632n25261
$$ 26348775 25624232 24842240 23824047 23199583 22465845 21971284 21342136 20967504 20442243
4691B0442243k19707n54172m55390l16168o41164l07472k81140m18439l87675
$$ 20442243 20222536 19668364 19212974 18896806 18255642 17948170 17667030 17248591 16860916
4682A6860916l11178k75044l21591j75434k92173k79103l72929j03348l56510
$$ 16860916 16549738 16274694 15953103 15777669 15485496 15206393 14833464 14730116 14373606
4673A4373606j67526l66879l14762j70710j61460j34787k02702k05483K0888j41835
$$ 14373606 14206080 13839201 13524439 13353729 13192269 13057482 12854780 12649297 12670185 12528350
4663A2528350l9569k69112o9711l03810J00027j51514n5853r9353l4758R8067
$$ 12528350 12488781 12219669 12149958 11846148 11946175 11794661 11738808 11639455 11604697 11702764
4653A1702764l40585j23938l64628l9925l17551l0543j06878k60460k40530l4874
$$ 11702764 11362179 11238241 10873613 10833688 10516137 10485594 10378716 10118256 9877726 9842852
4643I842852l70227R2034l71569o2436N6699k50211k28526N3252j39733k84475
$$ 9842852 9472625 9564659 9193090 9130654 9187353 8937142 8708616 8761868 8622135 8337660
4633H337660j92160O2741K1789r2951j64388j18593L4807m037l96283q5597P9448
$$ 8337660 8145500 8208241 8230030 8137079 7972691 7854098 7888905 7884868 7488585 7402988 7482436
4622G482436j60821j5215l876j85318j17225k73851J35750j98393M5794j70800
$$ 7482436 7321615 7306400 7302524 7117206 6999981 6726130 6861880 6663487 6709281 6538481
4612F538481K6703n4882k7788k87599k6396n5401J28023j311l15487O5070l6943
$$ 6538481 6565184 6510302 6482514 6194915 6168519 6113118 6241141 6239830 5924343 5989413 5952470
4601E952470j84957J31391P3871j28473j75636R8316o1930j5279L1925k4434j21418
$$ 5952470 5767513 5898904 5972775 5844302 5668666 5766982 5705052 5689773 5721698 5697264 5575846
4590E575846j2845j60548O4083p3465K03790m35664K08343j24344Q8760l99845
$$ 5575846 5563001 5402453 5466536 5393071 5596861 5161197 5369540 5245196 5333956 4934111
4580D934111M12336k44087Q1373k17926Q2800j48508M3747J995j28027J17055
$$ 4934111 5346447 5102360 5183733 4965807 5048607 4900099 4943846 4945841 4817814 4934869
4570D934869k74968J3204j2445O6503k05937k3317R9400n9170P3105J3648n7874
$$ 4934869 4659901 4673105 4660660 4727163 4521226 4497909 4597309 4538139 4611244 4624892 4567018
4559D567018Q8169N2503k4230k32129m088L18312k02027J99670j52966O0963r5087
$$ 4567018 4655187 4707690 4683460 4451331 4447243 4765555 4563528 4763198 4610232 4671195 4576108
4548D576108M959p3138J55778j59701j99544O9190m3392L6482P1018j12695M0924
$$ 4576108 4581067 4507929 4663707 4504006 4304462 4373652 4330260 4366742 4437760 4325065 4365989
4537D365989j6691m3039P0088J17350k79946K3091J18429K58167j39210q8346
$$ 4365989 4349298 4306259 4376347 4493697 4213751 4236842 4355271 4613438 4474228 4385882
4527D385882J09615K7092q998j74900M7651j31763m5494J8920l0423o0846J70366
$$ 4385882 4495497 4522589 4513591 4338691 4386342 4254579 4209085 4228005 4197582 4136736 4307102
4516D307102n7719j75727J79804k68211K32132l98008L36670K0444J34515k77730
$$ 4307102 4249383 4073656 4253460 3985249 4217381 3819373 4156043 4176487 4311002 4033272
4506D033272L13795j77982P1153l5953q9593L348n1956j01721J64674j27281m2950
$$ 4033272 4347067 4169085 4240238 4204285 4114692 4118040 4066084 3964363 4129037 4001756 3958806
4495C958806k45455J32381p5428K9239j98348R7703M834L4576j74179J68376n0272
$$ 3958806 3713351 3845732 3770304 3799543 3601195 3698898 3703732 3738308 3564129 3732505 3682233
4484C682233O7455m6148K97877m4745m7106k33247J02191R1955l34451K92364
$$ 3682233 3749688 3703540 4001417 3956672 3909566 3676319 3778510 3870465 3536014 3828378
4474C828378k48284J9166o5516j23615J72283r7824o7359J70483j55691k00944
$$ 3828378 3580094 3599260 3533744 3410129 3582412 3484588 3417229 3587712 3432021 3231077
4464C231077O0350Q4502p0776j74592J83117r1070J19883J66589j23488K14256
$$ 3231077 3291427 3375929 3305153 3130561 3313678 3222608 3342491 3509080 3385592 3599848
4454C599848l18979J76528q7740J08653j59090L8254k5724K13415j31651k027
$$ 3599848 3280869 3457397 3369657 3478310 3319220 3357474 3331750 3545165 3413514 3411487
4444C411487N3154P5736M3292k80651L8791M3584k50720K98992k64592K63991
$$ 3411487 3464641 3540377 3583669 3303018 3341809 3385393 3134673 3433665 3169073 3433064
4434C433064j12766J18201l32954L46831r4453j56913L36968K5087j23472O5817
$$ 3433064 3320298 3438499 3105545 3452376 3357923 3201010 3537978 3563065 3439593 3505410
4424C505410J7085o9793q6593J55943q8909K4446K48303o2444j54623L38925k5626
$$ 3505410 3522495 3452702 3366109 3522052 3433143 3457589 3705892 3643448 3488825 3827750 3802124
4413C802124p0017q5011J6708J1312K56488p1192j45710M13454l05518Q7833J22742
$$ 3802124 3732107 3647096 3663804 3675116 3931604 3860412 3714702 4128156 3822638 3910471 4033213
4402D033213k11299J09903N1728R452l4113P4161K33322J29615o8953j14326J58519
$$ 4033213 3821914 3931817 3983545 3992997 3958884 4033045 4266367 4395982 4327029 4212703 4371222
4391D371222R6338K00309L5860L18723n61104K41906P4530j0623J61510k17006
$$ 4371222 4467560 4667869 4703729 5022452 4461348 4703254 4777784 4767161 4928671 4711665
4381D711665O4829K83438j15384m702K26573j2635O9308L196q2167L74586N2644
$$ 4711665 4776494 5059932 4944548 4939846 5166419 5153784 5223092 5226288 5144121 5518707 5571351
4370E571351p5279K25237l1113L1775K05943n2985K07351L02040K37595J41686
$$ 5571351 5496072 5721309 5690196 5721971 5927914 5874929 6082280 6384320 6621915 6763601
4360F763601j55751K57693j10896O2151j53906J38658P8460R5514r1786J52899
$$ 6763601 6607850 6865543 6754647 6816798 6662892 6801550 6880010 6975524 6883738 7036637
4350G036637M9983J71632J01445j15771L78372P9857L0908L3277J74015M60501
$$ 7036637 7086620 7258252 7359697 7243926 7622298 7702155 7733063 7766340 7940355 8400856
4340H400856J66914L48575J52492l7958M96903K28936L29302L67621N05477N1516
$$ 8400856 8567770 8916345 9068837 9030879 9527782 9756718 10086020 10453641 10959118 11010634
4330A1010634L63491N31129N14481M83824N59569P71760P37766P99430J073070
$$ 11010634 11374125 11905254 12419735 12903559 13463128 14234888 14972654 15772084 16845154
4321A6845154R68050J049629J327142J495999J520434J860020J500558J509724
$$ 16845154 17813204 18862833 20189975 21685974 23206408 25066428 26566986 28076710
4313B8076710J130714K45585p23365j905245k477920k339182j869292j511907
$$ 28076710 29207424 29453009 28729644 26824399 24346479 22007297 20138005 18626098
4305A8626098j429905j247685r71436j031295p12711p22206m52785o70096o83781
$$ 18626098 17196193 15948508 14977072 13945777 13233066 12510860 12058075 11387979 10704198
4296A0704198l03032n42542m03089l61202l27926k70575l79219k16081m97681
$$ 10704198 10401166 9858624 9455535 9094333 8766407 8495832 8116613 7900532 7402851
4287G402851p3412k55656r7700k52292m27801K35171m32019L1011l06242J17903
$$ 7402851 7329439 7073783 6976083 6723791 6295990 6531161 6099142 6130153 5823911 5941814
4277E941814m77188K9903q3540k36573j19747r8742m7720l15217j17293M0686
$$ 5941814 5464626 5494529 5410989 5174416 5054669 4955927 4908207 4592990 4475697 4516383
4267D516383k58247K4435K9715r6379l27878Q7075j40646J89215k94462j2957
$$ 4516383 4258136 4282571 4312286 4215907 3888029 3975104 3834458 4023673 3729211 3716254
4257C716254k41304Q8075j632Q5570j90526j60637j10569J36854m6569r3161j81822
$$ 3716254 3474950 3563025 3561393 3646963 3456437 3295800 3185231 3322085 3275516 3182355 3000533
4246C000533M6510k65786J30233N4959q2923k322R2281j27914J5340j26652r1232
$$ 3000533 3047043 2781257 2911490 2966449 2883526 2881204 2973485 2845571 2860911 2734259 2643027
4235B643027N2641j0700L8307p7668n6826j1232M9873q8663p7063K05886L7441
$$ 2643027 2695668 2684968 2723275 2645607 2588781 2577549 2627422 2538759 2461696 2667582 2705023
4224B705023m34017J51233J12602m9401j84590k8823J74959k27078J66539p5646
$$ 2705023 2271006 2422239 2534841 2485440 2300850 2272027 2446986 2219908 2386447 2310801
4214B310801j1316L2372k2975k6646L4698j07229k2402j06925Q7033L3873L142
$$ 2310801 2299485 2331857 2308882 2282236 2316934 2209705 2187303 2080378 2167411 2201284 2204426
4203B204426p0549l10429M40577j82775j57490R3207M338j12427R1638r3970j65303
$$ 2204426 2133877 1823448 2264025 2081250 1923760 2016967 2021305 1908878 2000516 1906546 1741243
4192A741243J12187j75573J66814J72915j7317J9528k29832l5595J50932J468
$$ 1741243 1853430 1677857 1844671 2017586 2000269 2019797 1789965 1754370 1905302 1906770
4182A906770K6710j90505j3031J32057k17589j47415K27495K1777m6720j37007
$$ 1906770 1933480 1742975 1729944 1862001 1644412 1496997 1724492 1746269 1699549 1562542
4172A562542J77648j53892Q0789j2334j46461j3785K03645j10667j40194J8925
$$ 1562542 1740190 1586298 1667087 1654753 1508292 1494507 1698152 1587485 1447291 1466216
4162A466216N805K26396j70944J16358j39758k65057L67893j14203q3880Q1566
$$ 1466216 1472021 1698417 1527473 1643831 1504073 1239016 1606909 1492706 1408826 1490392
4152A490392M0725r4633J27271J40879j71270r1467o0759J16994r8723J49587
$$ 1490392 1531117 1436484 1563755 1704634 1533364 1441897 1381138 1498132 1399409 1548996
4142A548996o6178j72648L14168j35501p3774l1506m6502O6773j2088J8066R2477
$$ 1548996 1482818 1310170 1624338 1488837 1415063 1383557 1337055 1403828 1391740 1409806 1502283
4131A502283O1090N6335k40247L2566M7250l7923p7401L67075k33910K12313L1842
$$ 1502283 1563373 1619708 1379461 1412027 1459277 1421354 1343953 1711028 1477118 1689431 1721273
4120A721273j61530M11389O1783l68956K22898l813Q2145J38056K051P2345j51100
$$ 1721273 1559743 1971132 2032915 1663959 1886857 1883044 1965189 2103245 2105296 2177641 2026541
4109B026541Q1875p2154p3907j95572N5572J55534k10019J92734l2206l6067L3795
$$ 2026541 2108416 2036262 1962355 1766783 1822355 1977889 1767870 1960604 1928398 1892331 1926126
4098A926126j6503O6151j76117J47862k5292j54125K24866k42946L0809L36543
$$ 1926126 1909623 1975774 1799657 1947519 1922227 1768102 1992968 1750022 1780831 2117374
4088B117374J48210l7567J27290K46425l836K07225K31963l8545j09776o373j50710
$$ 2117374 2265584 2228017 2355307 2601732 2597896 2805121 3037084 2998539 2888763 2882390 2731680
4077B731680j10562j80149Q8367K3089L0197K793J75885l36177J54818j8604j09902
$$ 2731680 2621118 2440969 2529336 2552425 2582622 2585415 2761300 2425123 2579941 2561337 2451435
4066B451435r6795J38581j09024K65747j84346l6542J23026K4349J22789J56504
$$ 2451435 2354640 2493221 2384197 2649944 2465598 2429056 2552082 2576431 2699220 2855724
4056B855724K57955o1435J01244j04789J95507j6899O5991J04191j30774J43833
$$ 2855724 3113679 3052244 3153488 3048699 3244206 3227307 3293298 3397489 3266715 3410548
4046C410548J20221r6941K2756K06539R8073j9753q5441L44364j62053J1365j26749
$$ 3410548 3530769 3433828 3456584 3663123 3761196 3741443 3656002 4000366 3838313 3849678 3722929
4035C722929L6284J33912K5444j84270J01075K32739R1148j54265N5372J17790
$$ 3722929 3759213 3893125 3918569 3734299 3835374 4068113 4159261 4004996 4060368 4178158
4025D178158J18482L81680j42528M13614R2415K23786K30485J18149M09055o0762
$$ 4178158 4296640 4678320 4535792 4949406 5041821 5265607 5496092 5614241 6023296 5962534
4015E962534j47930m48362k36036j86926m7809m39752j4383J34007k28976j201
$$ 5962534 5814604 5366242 5130206 4943280 4895471 4455719 4441336 4575343 4346367 4345166
4005D345166J04528j60916J67737K39611O896J05990j1510m5844J32824j1941
$$ 4345166 4449694 4288778 4456515 4696126 4703022 4809012 4797502 4751658 4884482 4872541
3995D872541J27779j75160K83246k24160J73929j66947k570k07923l10436M5274
$$ 4872541 5000320 4825160 5108406 4884246 5058175 4891228 4888658 4680735 4370299 4415573
3985D415573l20739k73131q3234p5506j89529J28791j46341o01K20209j58370
$$ 4415573 4094834 3821703 3738469 3662963 3473434 3602225 3455884 3455283 3675492 3517122
3975C517122n1165k17477j4844n9727r4544M260l42742J40409j95386q5335j80874
$$ 3517122 3465957 3248480 3233636 3173909 3079365 3083625 2740883 2881292 2685906 2600571 2419697
3964B419697l18083J55570r5063j62267J00354j47205R285k75982n0468K28340
$$ 2419697 2101614 2257184 2162121 1999854 2100208 1953003 1962288 1686306 1635838 1864178
3954A864178k39925L15907l33239j08968R6014j63305J7425m7766J663p6377k0908
$$ 1864178 1624253 1940160 1606921 1497953 1593967 1430662 1448087 1400321 1401984 1325607 1304699
3943A304699j20652q1406N9581J07j13643J41137l1306k09461K8554l2201J1467
$$ 1304699 1184047 1102641 1162222 1162329 1048686 1189823 1158517 949056 977610 945409 956876
3932I56876R1887R5150k69829N2108J52306m36230M2004K17177J08410j50224
$$ 956876 1048763 1143913 874084 926192 1078498 642268 684272 901449 1009859 859635
3922H59635j72806J60164j9300j14702k7401J56322n4234p5120l1679r3872R9084
$$ 859635 686829 846993 827693 712991 685590 841912 787678 712558 680879 587007 686091
3911F86091J43563k31385L6379m5936O7595j45167K15589k48194J87680n903k50977
$$ 686091 829654 598269 634648 588712 656307 511140 726729 478535 666215 660312 409335
3900D09335Q0447L6423J18252l3050l7010j48323r021J08365q316J23130k14277
$$ 409335 489782 526205 644457 611407 574397 426074 417053 525418 517102 640232 425955
3889D25955J71588l82478L28757k52139J35330p3551k7613n715J43729o4107k6985
$$ 425955 597543 215065 543822 291683 427013 353462 325849 320134 463863 399756 372771
3878C72771K8416j33028K23605l08092L7920J68242j55006K9139J3699o9191K02774
$$ 372771 401187 268159 491764 183672 221592 389834 234828 263967 277666 208475 411249
3867D11249k50616J13552R2605M0439K10094l05687N4641M2148P7946j37366j2640
$$ 411249 160633 274185 366790 407229 617323 311636 366277 408425 486371 349005 336365
3856C36365J12738J07355r5847J13048k44536Q1935j26891j61854J1795J30568
$$ 336365 449103 556458 460611 573659 329123 411058 284167 122313 134108 264676
3846B64676k5342J22562k21598r0843K48668j02332l9851K26855j99458m6200
$$ 264676 239334 361896 140298 49455 298123 195791 155940 382795 183337 137137
3836A37137J24972p4852j51967O1969O0561j3327r8399J83298o4135j34419P2546
$$ 137137 262109 187257 35290 97259 157820 144493 46094 229392 165257 30838 103384
3825A03384N9357j27101J03322q6647J66318j49351p4931J01264j65018O0340
$$ 103384 162741 35640 138962 52315 218633 69282 -5649 95615 -69403 -9063
3815i063O1069J78020n7491j11147k2706j29059J45980j92752O3135O4268J78086
$$ -9063 52006 230026 172535 61388 38682 -90377 55603 -137149 -74014 -9746 168340
3804A68340j25307L576J22069J14082j75605j02964K22417q3919K2235j72780
$$ 168340 43033 46609 168678 282760 107155 4191 226608 142689 164924 -7856
3794g856n0298J34524n2690K6899q4690M1768K16141k6733k53836L5788j07139
$$ -7856 -58154 76370 23680 50579 -34111 7657 223798 197065 -56771 -20983 -128122
3783a28122L33741m9494j2994l2273o059K9954n1489K2902N6244j28904P7661
$$ -128122 205619 156125 143131 110858 104799 134753 83264 106166 162410 33506 111167
3772A11167J7205N8254J7549j20835K15133j56193j74869J57498J31548q8485
$$ 111167 128372 186626 204175 83340 298473 142280 -32589 124909 256457 167972
3762A67972j01589N8113j252j63164J74331O2995k5696N1140j87320J84508k05034
$$ 167972 66383 124496 123244 -39920 134411 197406 171710 222850 35530 220038 15004
3751A5004M6438L8226O4079k3596p1433K21462M897j93314K55599l4467k70001
$$ 15004 61442 99668 163747 140151 68718 290180 295077 101763 357362 322895 52894
3740E2894R1800J65716j48209K1837p5313J07175p4156j08882J27056l2856M0054
$$ 52894 144694 310410 162201 184038 108725 215900 141744 32862 159918 127062 167116
3729A67116r4337J1517L0799r6294P2707m853L5919L6997j00111M5154Q0049j40928
$$ 167116 72779 84296 115095 18801 91508 86655 122574 159571 59460 104614 184663 43735
3717D3735K11602j25978Q2054k1652j15550Q4438n1938J59318p3984q5995J50035
$$ 43735 255337 129359 211413 189761 74211 158649 106711 266029 192045 106050 256085
3706B56085r8036r3852O4117j12341j37534L34664k12364O1742n2027j05442K56403
$$ 256085 158049 64197 128314 15973 -121561 213103 739 62481 10454 -94988 161415
3695A61415k39790O5350j8596R7195j88343j7267K35819j19933k7568l4937j41341
$$ 161415 -78375 -13025 -31621 65574 -122769 -140036 95783 -24150 -51718 -86655 -227996
3684b27996L04088j9231k07997L83985k72351k1201J56558j20566J17284l3440
$$ -227996 76092 56861 -151136 232849 -39502 -60703 95855 -24711 92573 59133
3674E9133j66956J72974J882k13475J20696n862M4365j18854P9439J05492n8615
$$ 59133 -107823 65151 67033 -146442 -25746 -31608 12757 -106097 -26658 78834 20219
3663B0219j04895n7927r712K0753P0984j64396R4786p8119J07067J73667k67666
$$ 20219 -84676 -142603 -152315 -131562 -60578 -224974 -130188 -208307 -101240 72427 -195239
3652a95239K01861J35042k10969O564K33652k50093o4896K08128l32806L57781
$$ -195239 6622 141664 -69305 -62741 170911 -79182 -144078 64050 -268756 89025
3642H9025k01282p0088Q1788j8204P9759j36467O5383l4912o7082J85881o9779
$$ 89025 -112257 -182345 -100557 -118761 -39002 -175469 -110086 -144998 -212080 -26199 -95978
3631i5978J39397j55980M3426J09782j10929Q7514j29882N8488j76440K62085
$$ -95978 43419 -112561 -69135 40647 -70282 17232 -112650 -54162 -230602 31483
3621C1483j43106J02886n0010K03655q2499k9154L65607k25714l73615L51736
$$ 31483 -111623 -8737 -58747 144908 62409 33255 398862 173148 -200467 151269
3611A51269n9610K71482l87304J4839J98361j98722j2325K18281p448q5384j04697
$$ 151269 91659 363141 -24163 -9324 189037 -9685 -22010 196271 188823 103439 -1258
3600a258J63955j74589P2074L6248n8030M3933j31172K8299q9131M2914J25976
$$ -1258 162697 -11892 60182 96430 38400 82333 -48839 -20540 -109671 -66757 59219
3589E9219j78094R6701Q0214Q6981l20847K09559l8867J4985j6820J32927j06275
$$ 59219 -118875 -22174 58040 145021 -175826 33733 -5134 9851 -6969 125958 19683
3578A9683K78918j56776j99107Q6898N4827J0883J10018k71790J03724J52308
$$ 19683 298601 141825 -57282 29616 84443 95326 205344 -66446 37278 189586
3568A89586K5132j58116r352K68268k05664J9346J14144m1603J64870j4937J6181
$$ 189586 214718 56602 47250 315518 109854 129200 243344 201741 366611 351674 367855
3557C67855k17326L52429j1425K58945K9349k4624o5710m21320J20218q7259j79624
$$ 367855 150529 502958 491533 750478 779827 755203 689493 268173 388391 301132 121508
3546A21508Q6215J78658j98145O9818l05578L27025j56589K2744j41355J15217
$$ 121508 207723 386381 188236 258054 -47524 279501 122912 145656 4301 119518
3536A19518J39641j42576L1608K0913q3758j45035K91262l3773K8418n2127J19655
$$ 119518 259159 116583 148191 169104 85346 -59689 231573 197800 226218 174091 293746
3525B93746j32058j90150J70672J27604j03266N5815j50112J47301J29807l70375
$$ 293746 161688 -28462 142210 269814 166548 222363 72251 219552 349359 -21016
3515b1016L43045o4166J4226M0316j88435J21137K709j16454K37616l05139K99179
$$ -21016 322029 257863 272089 312405 123970 245107 247816 131362 368978 63839 363018
3504C63018j54229K8703J25311p2688j36509O9441p3812J8894n3897K74043k1785
$$ 363018 208789 237492 362803 290115 153606 223047 149235 168129 114232 388275 366490
3493C66490P713p7856O2031K6967k4694m8086K8602o4803n6402J2058J22384J10684
$$ 366490 374203 296347 358378 385345 360651 312565 341167 276364 219962 232020 354404 465088
3481D65088j23634r6867N5102J92641p1557J07797j00549o0543N7692l305N3227
$$ 465088 341454 244587 299689 492330 420773 528570 428021 367478 425170 421865 475092
3470D75092o3131P8068m8475n3118r101J20113n7032J14226J52L4242j22339P7479
$$ 475092 411961 490029 441554 388436 379335 499448 442416 556642 556794 591036 468697 546176
3458E46176R0327k2079n0894k1849n6659J84629K42401l29302M9929p6774j07938
$$ 546176 636503 614424 563530 541681 485022 669651 912052 582750 632679 555905 447967
3447D47967J89675J52907q3960L7431N1881o958k763N0636p4017N4795K22797
$$ 447967 637642 790549 706589 744020 795901 788943 786180 836816 762799 817594 1040391
3436A040391J6947k67976R1957J46589J05074R851J19487r6362K22533p469l1415
$$ 1040391 1057338 789362 881319 1027908 1132982 1142833 1262320 1165958 1388491 1381022 1349607
3425A349607p9681J22948J78617q1032J10958Q181O9598n7433L46291O255O8130
$$ 1349607 1269926 1392874 1571491 1490459 1601417 1609598 1679196 1621763 1968054 1974309 2042439
3414B042439j16569J83083L466J94309K58270J19505K47685k2780L25738J17194
$$ 2042439 1925870 2108953 2112419 2306728 2564998 2684503 2932188 2909408 3235146 3352340
3404C352340M00886K5648N79555J07298K31179P88967M03664M73068N40749J138019
$$ 3352340 3753226 3778874 4358429 4465727 4696906 5485873 5889537 6362605 6903354 8041373
3394H041373P19545J294223R00533Q34580R46807J260999J483060K072669K535760
$$ 8041373 8760918 10055141 10955674 11790254 12737061 13998060 15481120 17553789 20089549
3385B0089549K793919M110551N185690O756361P936595P785789O240380K8247
$$ 20089549 22883468 26994019 32179709 38936070 46872665 54658454 60898834 60927081
3377F0927081q981921j3011015q267914n534305l373670k560943k099128j434298
$$ 60927081 51945160 38934145 30666231 25131926 21758256 19197313 17098185 15663887
3369A5663887j040702q34569m89917r01843n69147j79838q55688n37892q64453
$$ 15663887 14623185 13788616 13298699 12396856 11827709 11647871 10792183 10254291 9389838
3360I389838m41940l19051m78108r5699l15028l58524n7340K2251j00332j97570
$$ 9389838 8947898 8628847 8150739 8055040 7740012 7381488 7324148 7346399 7246067 7048497
3350G048497L05528M0490J6985L61661J54322O7516N90269M43421K29701M81241
$$ 7048497 7354025 7394515 7411500 7773161 7927483 7994999 8585268 9028689 9258390 9739631
3340I739631M29664O67210J075254J051761J236031J383288K203927K529820J277285
$$ 9739631 10169295 10836505 11911759 12963520 14199551 15582839 17786766 20316586 21593871
3331B1593871J122535K351735K802733L688770M220528N095396P574161J1283906
$$ 21593871 22716406 25068141 27870874 31559644 35780172 40875568 48449729 59733635
3323E9733635J5165394J6893875K9803938J8475336k1876431l8335646j9072919
$$ 59733635 74899029 91792904 121596842 140072178 118195747 79860101 60787182
3316F0787182j0911062p503308o049128m462446l275624k126287j671308j441760
$$ 60787182 49876120 42372812 36323684 31861238 28585614 26459327 24788019 23346259
3308B3346259j122990r32247j767814k342603j555196j381728r91334j027238
$$ 23346259 22223269 21291022 19523208 17180605 15625409 14243681 13252347 12225109
3300A2225109p57024q01427p06674m97259n08838m90152m88154l06953m32355
$$ 12225109 11468085 10666658 9959984 9462725 8953887 8463735 7975581 7668628 7236273
3291G236273k20841m45331l52240j3758l47608m31595P5768l23982n99918O0939
$$ 7236273 7015432 6570101 6217861 6204103 5856495 5424900 5500668 5176686 4576768 4637707
3281D637707k05355j95301l33632q8078j24141o2022k05201j71215J14390l67985
$$ 4637707 4432352 4237051 3903419 3815341 3691200 3629178 3423977 3252762 3367152 2999167
3271B999167k16253J86596m8229m5829j20861r411k00759k24837J56717J20238
$$ 2999167 2782914 2969510 2921281 2875452 2754591 2745180 2544421 2319584 2476301 2596539
3261B596539k37023k48576L8825J9133p3025p4934Q318l7104r7095J2726j09817
$$ 2596539 2359516 2110940 2149765 2168898 2095873 2020939 2029257 1992153 1895058 1907784 1797967
3250A797967J55647j48667j04635j4131j13255k8790k4066l3786k6644K01912
$$ 1797967 1953614 1804947 1700312 1686181 1572926 1544136 1520070 1486284 1459640 1661552
3240A661552k37783M4554j62412r8392K25270j75236o1734Q5464k8134L0841q114
$$ 1661552 1423769 1468323 1305911 1207519 1432789 1257553 1195819 1281283 1253149 1283990 1275876
3229A275876j49227J74395j50199k06864J75900l0030K0882j41257r0460p7157
$$ 1275876 1126649 1301044 1150845 943981 1119881 1089851 1110733 969476 879016 801859
3219H01859M4617K11735j44189O1462j35200m4637J88505k08355L823R5488M2914
$$ 801859 846476 1058211 914022 975484 840284 795647 984152 775797 779620 875108 918022
3208I18022p2088j53235R6038j26294M6669j86884L83641l67720J48851O5905
$$ 918022 845934 692699 788737 662443 709112 522228 905869 538149 687000 752905
3198G52905j75298K9601m2387O1409j27926j30865J88309K6952m4359q3369k5011
$$ 752905 577607 607208 564821 626230 498304 367439 555748 582700 538341 454972 429961
3187D29961J38055j26106j42269O0385n5796K19016m7948r5550Q2944j47691O8532
$$ 429961 568016 441910 299641 360026 304230 523246 475298 379748 462692 315001 383533
3176C83533j16618J08894L182j2729K7810J02914k50573L2325J13390j09137L5907
$$ 383533 266915 375809 378991 366262 394072 496986 246413 278738 392128 282991 318898
3165C18898j92532m1157K17169r0052J17947N037o4942O3582k26538K08687q8213
$$ 318898 126366 85209 302378 212326 330273 335310 270368 333950 107412 316099 227886
3154B27886j80394J69096J8565L2237K5438j1162Q0418j12952j92520M37756o5408
$$ 227886 47492 216588 235153 267390 292828 281666 362084 249132 56612 494368 428960
3143D28960j16181r8717K47188o1590j77005N9742N0822j97055J70884r6040N5240
$$ 428960 312779 214062 461250 399660 222655 282397 333219 136164 307048 211008 266248
3132B66248K4306m28133J05048J887R1145O1224k24184K11197j91048k4973R6606
$$ 266248 290554 -137579 -32531 -30644 60501 121725 -102459 108738 -82310 -107283 -10677
3121a0677K34002k03459p9440J29969M4900j03269m3491O234j39408L59366l7205
$$ -10677 223325 19866 -59574 70395 115295 12026 -31465 -25231 -164639 194727 157522
3110A57522k83365Q0469J7802N1776O3074p535p0824n7793K34467m5529j72347
$$ 157522 -125843 -45374 -27572 24204 87278 79743 8919 -48874 185593 140064 -32283
3099c2283M1137n5622J26057l5004O3110M6102m523R1063j52407l1152J04308
$$ -32283 8854 -46768 79289 44285 107395 153497 148974 240037 87630 56478 160786
3088A60786J40765l3825L15268Q473K4364j12945k97379j3956k7954O7803J0601
$$ 160786 301551 267726 582994 591467 615831 502886 205507 191551 163597 231400 242001
3077B42001k71502M6070p6805J43356m7651R711j73289P2513J59838j23710j73472
$$ 242001 -29501 16569 -60236 83120 35469 45180 -128109 -55596 104242 -19468 -192940
3066a92940L0408J16457k1922k03874m0971J95778Q5182p4717k7794J57722p2647
$$ -192940 -162532 -46075 -67997 -271871 -312842 -117064 -31882 -106599 -134393 23329 -49318
3055d9318O8084k01262Q9666J02289j87802o5805K00315j57898R1479o1577K04004
$$ -49318 18766 -182496 -92830 9459 -178343 -244148 -43833 -201731 -110252 -171829 32175
3044C2175l57216J03237O5007j94339J62970j15933J51041r4104K04096j31416
$$ 32175 -325041 -221804 -156797 -351136 -188166 -304099 -153058 -247162 -43066 -174482
3034a74482J35179n5188j21279N5832n7333L838L985M0090o0392J54318N427k81287
$$ -174482 -39303 -94491 -215770 -159938 -217271 -213433 -209448 -169358 -229750 -75432 -70005 -351292
3022c51292N2795K48628k51659J03389P6220r852q7280L8049J32825j04088L7775
$$ -351292 -298497 -49869 -301528 -198139 -121919 -131771 -219051 -181002 -48177 -152265 -114490
3011a14490o8427j71549L51741j82737m6202p6037Q643Q9561p1955o3897r6325
$$ -114490 -182917 -354466 -2725 -185462 -231664 -307701 -299058 -209497 -281452 -345349 -441674
3000d41674O7306J57934n6353o4419K00213q2938Q4098k13899O0107J56055j44047
$$ -441674 -374368 -216434 -272787 -337206 -136993 -219931 -135833 -349732 -289625 -133570 -277617
2989b77617L38942j79135j61166J57295q2938r43j2779L3223j38679j26844K35699
$$ -277617 61325 -117810 -278976 -121681 -204619 -205562 -218341 -185118 -323797 -450641 -214942
2978b14942J9766l8423n6417l370J83481j93744K09566J3926k05153o5013L6537
$$ -214942 -195176 -233599 -290016 -293386 -109905 -303649 -94083 -80157 -285310 -350323 -313786
2967c13786J9917J28237j99843J19448R4225o9291R1560p9750L8459p8646j40415
$$ -313786 -293869 -165632 -365475 -246027 -151802 -221093 -129533 -209283 -170824 -249470 -389885
2956c89885K53252p1528k38334J02666J76823q6867k9863J0047J01911j93968
$$ -389885 -136633 -208161 -446495 -343829 -167006 -253873 -283736 -273689 -171778 -365746
2946c65746K10212m2908J1238l07330K04812K4862J26450l59693L25592o7806
$$ -365746 -155534 -198442 -187204 -494534 -289722 -264860 -138410 -498103 -172511 -240317
2936b40317l2023L3076j55807J07163Q4351K3766P431P1144q5757K8339j34837
$$ -240317 -272340 -239264 -395071 -287908 -203557 -179791 -172360 -101216 -186973 -158634 -293471
2925b93471j54311J49208J00447q714q7926j14187L10229j68026j38257J85914
$$ -293471 -447782 -298574 -198127 -206841 -294767 -408954 -98725 -266751 -405008 -219094
2915b19094J8363l9285j0789j19396j924L0286k3172J22986J11494j90127J62941
$$ -219094 -200731 -240016 -250805 -370201 -372125 -341839 -365011 -242025 -130531 -320658 -157717
2904a57717j72086K26775Q4199q3189j81648L5024P641k23522L46951m6073j33097
$$ -157717 -329803 -103028 -18829 -102018 -283666 -248642 -241001 -464523 -117572 -163645 -296742
2893b96742J8755p1340o5604K51035j60416M5173J65894j60616j6167K7179j9879
$$ -296742 -277987 -349327 -414931 -163896 -324312 -279139 -113245 -273861 -290028 -262849 -282728
2882b82728J14232n6740r0190L6337J20340L0926k18863J21902N2153k25520R9709
$$ -282728 -168496 -225236 -315426 -279089 -158749 -127823 -346686 -224784 -172631 -398151 -298442
2871b98442J45788j48245n2792J35458M1888j34711l8617o720R3583Q3752j20131
$$ -298442 -152654 -300899 -353691 -218233 -176345 -311056 -349673 -356393 -262810 -179058 -299189
2860b99189J12548n333l5336r0932J28938Q2278j36721l1900P5098n4j81955J04408
$$ -299189 -186641 -191974 -227310 -318242 -189304 -107026 -243747 -275647 -200549 -200603 -382558 -278150
2848b78150j0099p5940L1454N5120m1960J22091j56774J60223k12208J57146j07927
$$ -278150 -288249 -364189 -332735 -277615 -319575 -197484 -354258 -194035 -406243 -249097 -357024
2837c57024K06124p1754P2680j18261l9232j3723J49247j77333j2008R1682Q9415
$$ -357024 -150900 -222654 -149974 -268235 -307467 -321190 -171943 -349276 -361284 -269602 -180187
2826a80187J5131l1518j11751l3323m5762K49438k48779R7613L1148n9569m3424
$$ -180187 -165056 -196574 -308325 -341648 -387410 -137972 -386751 -289138 -257990 -317559 -360983
2815c60983L5936j13485J63473N1379M2574j81256L26833l77002O6303k0980K01323
$$ -360983 -325047 -438532 -275059 -223680 -181106 -362362 -35529 -412531 -346228 -367208 -165885
2804a65885j81236p593P1498r4856N9360N8986J09522l13227K28242k1820j28194
$$ -165885 -347121 -354714 -283216 -378072 -318712 -259726 -150204 -463431 -235189 -257009 -385203
2793c85203J77229k32520J95514J49392j19434j1870r4693J61693m2851l0227
$$ -385203 -207974 -440494 -244980 -95588 -215022 -226892 -321585 -159892 -202743 -232970
2783b32970n2397j42875K7825J72546P0787j58238o0468J42230j59795L304K84681
$$ -232970 -285367 -428242 -400417 -227871 -157084 -315322 -375790 -233560 -393355 -390051 -105370
2772a05370k12987M12407k80870N3370r238K8870j00490J32628J6656l26119P8977
$$ -105370 -318357 94050 -186820 -133450 -142688 -113818 -214308 -81680 -65024 -391143 -312166
2761c12166k8818J48588m8461j42988J78765k86244K09145L1216r2631K0946P7472
$$ -312166 -340984 -192396 -240857 -383845 -205080 -491324 -282179 -250963 -343594 -322648 -245176
2750b45176k4323j28286l771j9476r4918R6961K46554L4510o155k24003J87834
$$ -245176 -269499 -397785 -401556 -421032 -515950 -418989 -172435 -137925 -144080 -368083 -180249
2739a80249j24243j33185K32602j70808J39211l265k6775p4521n5423J21763k05214
$$ -180249 -304492 -437677 -205075 -375883 -236672 -239937 -266712 -341233 -396656 -274893 -480107
2728d80107K71648L8213j47445Q1646m9137O0051l7640j66824J76444m8553p047
$$ -480107 -208459 -170246 -317691 -236045 -285182 -225131 -262771 -429595 -253151 -301704 -308751
2717c08751n668J56657j34705k298n1657n6849O1895M2051k8986K08457R250j69918
$$ -308751 -314419 -157762 -292467 -294765 -346422 -403271 -341376 -299325 -328311 -119854 -110604 -280522
2705b80522j03040j63523J61659J12696p9441J2111j32022Q7814l514J7243l1958
$$ -280522 -383562 -547085 -385426 -272730 -352171 -340060 -472082 -384268 -387782 -370539 -402497
2694d02497r414P5224K9835J9927K0275j97190J55734p5585O6080j5502j2622
$$ -402497 -411911 -336687 -306852 -286925 -266650 -463840 -308106 -383691 -317611 -333113 -345735
2683c45735n6636J61923K2769j69411j00724J49851L47J55615j05023J0866j59262
$$ -345735 -402371 -240448 -217679 -387090 -487814 -337963 -337616 -182001 -287024 -276158 -435420
2672d35420J26174L6599N910k8274M2037j80280m1122K74079m4254R4091j92315
$$ -435420 -309246 -272647 -266737 -295011 -252974 -433254 -474376 -200297 -244551 -150460 -342775
2661c42775N2102o3498R0331J4978K8847n2404j19396J34206J4398n4952j54102
$$ -342775 -290673 -354171 -263840 -248862 -220015 -272419 -391815 -257609 -243211 -298163 -452265
2650d52265K30860r1383j48054n620J55443M7040J46752j99584O1934j32578J7987
$$ -452265 -221405 -312788 -460842 -466462 -311019 -263979 -117227 -316811 -254877 -387455 -369468
2639c69468l9567J91396l43183J04939L43664j15279j32462R6069J96187k39148
$$ -369468 -409035 -217639 -560822 -455883 -112219 -227498 -359960 -263891 -67704 -306852
2629c06852J38605n8741j35576P2844o0163l358j07784J09840P802l5971O9764
$$ -306852 -168247 -226988 -362564 -289720 -349883 -353241 -461025 -351185 -343383 -379354 -309590
2618c09590j30909K39396j00463J49365j50962q1280J61667j2274Q7894j51560
$$ -309590 -440499 -201103 -301566 -152201 -303163 -384443 -222776 -235050 -147156 -298716
2608b98716O018J2467N0269J2365r2940k7832q809m2571l8955L11187k29964J40559
$$ -298716 -292698 -280231 -229962 -217597 -310537 -338369 -347178 -389749 -428704 -117517 -347481 -206922
2596b06922j209N3063l41639K13647n2665J08921j70457m3818K77241l65615K25630
$$ -206922 -208131 -155068 -496707 -283060 -335725 -226804 -397261 -441079 -163838 -529453 -303823
2585c03823P9528r2223O1376o6318O4007k8787j43842J92465j82194R3853J29937
$$ -303823 -224295 -316518 -255142 -321460 -257453 -286240 -430082 -237617 -419811 -325958 -196021
2574a96021j56864l4820N0072o0393J16937O4167j57532J69679r5600j14496j01593
$$ -196021 -352885 -387705 -337633 -398026 -281089 -216922 -374454 -204775 -300375 -414871 -516464
2563e16464K48426O6965j33679J16668m4960n7882J28618j6940m0946j14626J3200
$$ -516464 -268038 -201073 -334752 -218084 -263044 -320926 -192308 -209248 -250194 -364820 -351620
2552c51620k6902l1668K27161Q5549p9341O2791k83188M1935O7180n6636n4883
$$ -351620 -378522 -410190 -183029 -97480 -176821 -114030 -397218 -355283 -288103 -344739 -399622
2541c99622k4459J50973O8767p1499j8435R9729l63818L95362l47367K53204j77320
$$ -399622 -424081 -273108 -204341 -275840 -294275 -194546 -558364 -163002 -510369 -257165 -434485
2530d34485J73095j54331m1858J87098j12276M420P9720j29008J69698l04332
$$ -434485 -261390 -415721 -457579 -270481 -382757 -378337 -298617 -427625 -257927 -562259
2520e62259K16981J36391j62401O6844M2876J24768n7063l44215K34552M1866
$$ -562259 -345278 -208887 -371288 -304444 -261568 -136800 -193863 -538078 -303526 -261660
2510b61660j3729M4093j33782J39145j1410j09163p0239J91173m6679p3742J37158
$$ -261660 -275389 -231296 -365078 -225933 -237343 -346506 -416745 -225572 -272251 -345993 -208835
2499b08835m9991P5413L7614j61848J50488r1278J9735J35701k66837J00960M5560
$$ -208835 -258826 -183413 -145799 -307647 -157159 -248437 -228702 -93001 -359838 -258878 -213318
2488b13318n9607j16106L57863l04677P2627M8315l8480q3110J29264j98224M3451
$$ -213318 -272925 -389031 -31168 -335845 -263218 -214903 -253383 -336493 -207229 -405453 -362002
2477c62002l3030N2792j3803J74370m9135j25423Q0827L925j14934J11125j33548
$$ -362002 -395032 -342240 -356043 -181673 -230808 -356231 -275404 -271479 -386413 -275288 -408836
2466d08836J64716O5463j17857J33339j31914n4095L0182J2723m3532J07711j06620
$$ -408836 -244120 -178657 -296514 -163175 -295089 -349184 -319002 -306279 -349811 -242100 -348720
2455c48720N0205k07065K60180r2154K50414k73775O9417N1565O4048j06986p0164
$$ -348720 -298515 -505580 -245400 -337554 -87140 -360915 -291498 -239933 -175885 -282871 -353035
2444c53035j20749K74308M9061L9078k11765P9450L0129k13739L1921j5561J33919
$$ -353035 -473784 -199476 -150415 -111337 -323102 -243652 -213523 -427262 -395341 -410902 -276983
2433b76983L6681j26735J98630O8281j2375k24336J42856r6261r7351l0406R2470
$$ -276983 -240302 -367037 -168407 -100126 -112501 -336837 -193981 -290242 -387593 -417999 -325529
2422c25529K1488m6119K36722j77274k58641K91254J4112k61557K32418k40328
$$ -325529 -304041 -350160 -113438 -290712 -549353 -258099 -243987 -505544 -273126 -513454
2412e13454L29219p9952J47162j41641l09918K53615J89055j74633O7517j24110
$$ -513454 -184235 -264187 -117025 -258666 -568584 -314969 -125914 -300547 -233030 -357140
2402c57140J06373L0689k54722J10742M0862J42938j69223J73002j79083o2277
$$ -357140 -250767 -220078 -474800 -364058 -323196 -180258 -349481 -176479 -355562 -417839
2392d17839R1332J96653k53729o448J367O0023R0308m1646o3809J11457j75193
$$ -417839 -326507 -129854 -383583 -390031 -388664 -328641 -238333 -279979 -343788 -232331 -407524
2381d07524J66716K9587M7350j01041Q0759o667O6016k23510K55761j85436J9237
$$ -407524 -240808 -211221 -163871 -264912 -184153 -190820 -124804 -348314 -92553 -277989 -258752
2370b58752j6800j20304q5336J53307j2738J77681o0663j8904j39210K3934k185
$$ -258752 -275552 -395856 -481192 -327885 -340623 -162942 -223605 -242509 -381719 -357785 -359970
2359c59970n2419J49433j22042p0754O6313j4110k1856R3230o0504Q8556j07888
$$ -359970 -412389 -262956 -384998 -455752 -389439 -403549 -425405 -332175 -392679 -304123 -412011
2348d12011L13043k50155J81139j78393K97215k91544N5922r051j0714J68210
$$ -412011 -98968 -349123 -167984 -346377 -49162 -340706 -284784 -293835 -304549 -136339
2338a36339l70900L30895l9310j34934j2657j0143J77975N6399j47199R9522L2725
$$ -136339 -507239 -176344 -215654 -350588 -363245 -373388 -195413 -139014 -286213 -186691 -153966
2327a53966j64824j692O378k1411m336J62635j63530p9202N5859Q6668j44110
$$ -153966 -318790 -320482 -314104 -335515 -339851 -177216 -340746 -419948 -364089 -277421 -421531
2316d21531M2569J36180q8681N7498j36592J15720J3512l3698j7093N2095n965
$$ -421531 -378962 -242782 -331463 -273965 -410557 -294837 -281325 -315023 -332116 -280021 -285986
2305b85986L0960l3240p8327J66383j78960J1992K1728R793R3967j36868j90157
$$ -285986 -255026 -288266 -366593 -200210 -379170 -367178 -345450 -335657 -241690 -378558 -568715
2294e68715L79132p4882k4379k1216J71702j72565k27583L29544j14028p2571
$$ -568715 -189583 -264465 -288844 -310060 -138358 -310923 -538506 -208962 -322990 -395561
2284c95561N1337m894J10376o6770Q5073J2148k53236K30083J76421m73360K73406
$$ -395561 -344224 -349118 -238742 -305512 -220439 -208291 -461527 -231444 -55023 -528383 -254977
2273b54977J2879j44649K0202j1289j31391K00666L5690q3429R0831j6030j93821
$$ -254977 -242098 -386747 -366545 -377834 -509225 -308559 -272869 -356298 -265467 -281497 -475318
2262d75318J09490J10830k08716K35530o3092o1681O8008J1779r3668J43235k01758
$$ -475318 -365828 -254998 -463714 -228184 -291276 -352957 -284949 -273170 -366838 -223603 -425361
2251d25361K06772o0370p4620P1319p2811K46366j15714q3618R8582m5612o3022
$$ -425361 -218589 -278959 -353579 -282260 -355071 -108705 -224419 -308037 -209455 -255067 -318089
2240c18089P3728Q4084r5036j42803O8015m2621P6458J7086K59j87054K52429
$$ -318089 -244361 -160277 -255313 -398116 -330101 -372722 -296264 -279178 -278919 -465973 -213544
2229b13544k40918J06557J16630k26462J83643N6056k0750j86487M2591P2252
$$ -213544 -454462 -347905 -231275 -457737 -274094 -218038 -238788 -425275 -382684 -310432
2219c10432m4189R328N1982J83251k93947K95523k06121Q5045L9897n4135K05689
$$ -310432 -354621 -345293 -293311 -110060 -404007 -108484 -314605 -229560 -189663 -243798 -38109
2208c8109k38505P6284j67284r7370P4438M8787J7804q3102k6848K52412p7183
$$ -38109 -276614 -200330 -367614 -464984 -390546 -341759 -323955 -407057 -433905 -181493 -258676
2197b58676J3838j13414k6198m8045J60234p0085J1149J32799j91696J7277m7649
$$ -258676 -244838 -358252 -384450 -432495 -272261 -342346 -331197 -198398 -390094 -372817 -420466
2186d20466J95345m1301l4488p4076J69207r5642j39098q5340K28717J13102j62458
$$ -420466 -225121 -266422 -300910 -374986 -205779 -301421 -440519 -525859 -297142 -184040 -346498
2175c46498M670J34504r5246n0915k8016N7857m3094l6459K09116j9531N4485
$$ -346498 -341828 -207324 -302570 -353485 -381501 -323644 -366738 -403197 -194081 -213612 -159127
2164a59127q954j03512j4855j20452K94205j46632o8123J34106j24661J7754L7230
$$ -159127 -168081 -271593 -286448 -406900 -112695 -259327 -327450 -193344 -318005 -300251 -263021
2153b63021n161J0428j22649J91837k00703J89081k38112j4974J23695m1482p5484
$$ -263021 -268182 -257754 -380403 -188566 -389269 -200188 -438300 -453274 -329579 -371061 -446545
2142d46545K53862l18614L56382j62931p4660J9043O7078l6185J6792q6300K1711
$$ -446545 -192683 -511297 -154915 -317846 -392506 -373463 -306385 -342570 -325778 -412078 -390367
2131c90367J32820r3242J64577M780n2171j15140O3853j48764J95342k39923K87888
$$ -390367 -257547 -350789 -186212 -181432 -233603 -348743 -284890 -433654 -238312 -478235 -190347
2120a90347n9080m3782J28219k52036K47608k73591J24739o1558J76366Q1882
$$ -190347 -249427 -293209 -164990 -417026 -169418 -443009 -318270 -379828 -203462 -121580
2110a21580j43707j15395J28363q5305q8129J28941J12950j91571N4130j43117
$$ -121580 -265287 -380682 -252319 -337624 -425753 -296812 -183862 -375433 -321303 -464420
2100d64420J1571K99405m4207P5378j83154P2898k65405K05354M5621j63656m2566
$$ -464420 -452849 -153444 -197651 -122273 -305427 -232529 -497934 -292580 -246959 -410615 -453181
2089d53181R5602L13428j90208j92803K03679j46414K47979k30496J44794l0211
$$ -453181 -357579 -44151 -234359 -427162 -223483 -369897 -121918 -352414 -207620 -237831
2079b37831K2515P0399j35029O1287N9525m2805j48427L7620M5396m5405l6103
$$ -237831 -215316 -144917 -279946 -218659 -159134 -201939 -350366 -312746 -267350 -312755 -348858
2068c48858o5471M3861J4616N4956k1438K22777j20354j71822m5474J34734p3566
$$ -348858 -414329 -370468 -355852 -300896 -322334 -99557 -219911 -391733 -437207 -302473 -376039
2057c76039k0491M4865p8824L97278l30713j12863J56890J25628j80666J07526
$$ -376039 -396530 -351665 -430489 -33211 -363924 -476787 -319897 -194269 -374935 -267409
2047b67409j66405J54690N0047j04321k4794J90258j85518r7839K21388n7249
$$ -267409 -433814 -279124 -229077 -333398 -358192 -167934 -353452 -451291 -229903 -287152
2037b87152l5955J28925r3795l1487K29037k06800n4186J21874n9170O7173j14946
$$ -287152 -323107 -194182 -287977 -319464 -90427 -297227 -351413 -229539 -288709 -221536 -336482
2026c36482N8231Q6231p1659M0331L8825j05297p1789J56419k07530l5635J05751
$$ -336482 -278251 -192020 -263679 -223348 -184523 -289820 -361609 -205190 -412720 -448355 -342604
2015c42604K21314j62443M1847j22721l1951Q1670M0546r9828J04520j32858P2389
$$ -342604 -121290 -283733 -241886 -364607 -396558 -314888 -274342 -374170 -269650 -402508 -330119
2004c30119R1170k1971Q1413j91339J45531N27k05052J62133M661j11256K27441
$$ -330119 -238949 -260920 -179507 -370846 -225315 -224788 -429840 -267707 -263046 -374302 -146861
1993a46861K1888l05495L25048j61327r8016J46276j94888J2865N5730J46465
$$ -146861 -124973 -430468 -105420 -266747 -364763 -218487 -413375 -400510 -344780 -198315
1983a98315j40273L3985M5514n5797j3654K6003j42272J89351k35476P4925P6011
$$ -198315 -338588 -304603 -259089 -314886 -328540 -302537 -444809 -255458 -490934 -416009 -339998
1972c39998p283n392p7812K3107O3964P5357j3805M040q781j57336K00168l6224
$$ -339998 -347281 -352673 -430485 -407378 -343414 -268057 -281862 -277822 -286603 -443939 -243771 -279995
1960b79995K7637J40323j48633M2108L9884j76945J02983M9454j04492L1921J8458
$$ -279995 -252358 -112035 -260668 -218560 -178676 -355621 -252638 -203184 -307676 -275755 -257297
1949b57297J39235k59677P6155j0350J8700l0661l5610R1513J31877j88439Q0658
$$ -257297 -118062 -377739 -301584 -311934 -293234 -323895 -359505 -267992 -136115 -324554 -243896
1938b43896j13245L7171o9384L1147K8897n7499K6262N5190j9970J87682k79163
$$ -243896 -357141 -319970 -389354 -358207 -329310 -386809 -360547 -305357 -325327 -137645 -416808
1927d16808K90485k39701p5226K09771k3757l7256m2176K01682l38506P7405j40585
$$ -416808 -126323 -366024 -441250 -231479 -255236 -292492 -334668 -132986 -471492 -394087 -534672
1916e34672J72440J27558q1916N2850K5123j39715J58894k57041K17540j60841
$$ -534672 -362232 -234674 -316590 -263740 -238617 -378332 -219438 -476479 -258939 -419780
1906d19780O7302J4756J14867J4900n9145j77970J76210J4676N6207j46604k5876
$$ -419780 -352478 -337722 -222855 -207955 -267100 -445070 -268860 -254184 -197977 -344581 -370457
1895c70457k20609L71040r71l0600q0568L5533M7396j03996j2553K8957N4536
$$ -370457 -591066 -220026 -220997 -251597 -332165 -296632 -249236 -353232 -365785 -336828 -282292
1884b82292O9935k3594r7127N932R0596j25941J75500j90730o8013K43497n0091
$$ -282292 -212357 -235951 -333078 -327146 -236550 -362491 -186991 -377721 -445734 -202237 -252328
1873b52328K3575O2406k4563l9476k3221p9443m9331J2229J5074L7478R2240r0379
$$ -252328 -228753 -166347 -190910 -230386 -253607 -333050 -382381 -370152 -355078 -317600 -225360 -315739
1861c15739R3426M5324n2373o3663N2860j23600l5434R087R2376K11823k77345
$$ -315739 -222313 -176989 -229362 -293025 -240165 -363765 -399199 -390112 -297736 -85913 -363258
1850c63258J48961j22636o2710P2936K28234k76664L3769M3562k6606k7137J54254
$$ -363258 -214297 -336933 -399643 -326707 -98473 -375137 -341368 -297806 -324412 -351549 -197295
1839a97295k87171K44508k13555N3168j8567J13080L0671l3290j03340K1191j31694
$$ -197295 -484466 -239958 -453513 -400345 -418912 -305832 -275161 -308451 -411791 -390600 -522294
1828e22294M2552Q0812J99914j17589L7086J40112j22424k5702j47878R0578k6170
$$ -522294 -479742 -398930 -199016 -316605 -279519 -139407 -261831 -287533 -435411 -344833 -371003
1817c71003K19408j33466P0968m5179j06405J9224j7092O4274q6914J34488j19471
$$ -371003 -151595 -285061 -214093 -259272 -365677 -346453 -363545 -299271 -386185 -251697 -371168
1806c71168O2776L6633K0167j21655K3593n7384J89472j38509R3326q9468p7541
$$ -371168 -308392 -271759 -251592 -373247 -349654 -407038 -217566 -356075 -262749 -352217 -429758
1795d29758K98955k43769K9097j29847N9587O9466K5126J27489m7828j41695J33850
$$ -429758 -130803 -374572 -345475 -475322 -415735 -346269 -321143 -193654 -241482 -383177 -249327
1784b49327O0366k23437P3008l87Q6755J20344k29747K09005k10897R8085o3635
$$ -249327 -188961 -412398 -339390 -339777 -253022 -132678 -362425 -153420 -364317 -266232 -329867
1773c29867o2518r895J62569L3824j53516J38859o0305j05782L1657J44612j08972
$$ -329867 -392385 -402280 -239711 -205887 -359403 -220544 -280849 -386631 -354974 -210362 -319334
1762c19334o7547J06560k9978k82239J26663K26199j451j15625L510P6578K11208
$$ -319334 -386881 -280321 -310299 -592538 -465875 -239676 -241127 -356752 -353242 -276664 -65456
1751f5456k71675L5372N0332j59513O4072m9543N7767j51788N6200J67232J28843
$$ -65456 -337131 -301759 -251427 -410940 -346868 -396411 -338644 -490432 -434232 -267000 -138157
1740a38157j65463j722N9493j97838J03958J1670j28708K925J64433L5734r5909
$$ -138157 -303620 -305342 -245849 -443687 -339729 -328059 -456767 -453842 -289409 -253675 -349584
$$ [...]
##END NTUPLES=NMR SPECTRUM
##END=
