##TITLE=abcd
##JCAMPDX= 6.0         $$ Bruker NMR JCAMP-DX V2.0
##DATA TYPE= NMR FID
##DATA CLASS= NTUPLES
##ORIGIN= UXNMR, Bruker Analytische Messtechnik GmbH
##OWNER= root
$$ XWIN-NMR		Version 3.5
$$ Thu Jun 26 18:03:05 2025 Russian Standard Time (UT+4h)  servis@DPX200
##.OBSERVE FREQUENCY= 200.131235884673
##.OBSERVE NUCLEUS= ^1H
##.DELAY= (6, 6)
##.ACQUISITION MODE= SIMULTANEOUS
##.ACQUISITION SCHEME= undefined
##.AVERAGES= 32
##.DIGITISER RES= 18
##SPECTROMETER/DATA SYSTEM= spect
##.PULSE SEQUENCE= zg
##.SOLVENT NAME= CDCl3
##.SHIFT REFERENCE= (INTERNAL, CDCl3, 0, 16.5164)
##AUDIT TRAIL= $$ (NUMBER, WHEN, WHO, WHERE, WHAT)
$$ ##TITLE= Audit trail, XWIN-NMR		Version 3.5
$$ ##JCAMPDX= 5.01
$$ ##ORIGIN= Bruker BioSpin GmbH
$$ ##OWNER= servis
$$ F:\spectra/data/av/nmr/H1/1/audita.txt
$$ ##AUDIT TRAIL=  $$ (NUMBER, WHEN, WHO, WHERE, WHAT)
(   1,<2025-06-26 18:01:35.35 +0400>,<servis>,<DPX200>,
      <created by zg, POWCHK disabled, PULCHK disabled
       configuration hash MD5:
       00 E9 B6 7A A2 85 ED C7 34 08 36 98 17 FE 4E 26
       data hash MD5: 32K
       C4 75 3A EC 41 7E B7 CB 55 A0 05 34 38 31 F8 30>)
$$ ##END=
$$ 
$$ hash MD5
$$ 5E 81 02 B8 36 31 80 48 C9 3E 76 F2 40 CF AB 15
##$RELAX= 
##$RELAX= 
##$RELAX= 
##$RELAX= 
##$RELAX= 
##$RELAX= 
##$RELAX= 
##$RELAX= 
$$ Bruker specific parameters
$$ --------------------------
##$DU= <F:\spectra>
##$EXPNO= 1
##$NAME= <H1>
##$PROCNO= 1
##$TYPE= <nmr>
##$USER= <av>
##$AMP= (0..31)
100 100 100 100 100 100 100 100 100 100 100 100 100 100 100 100 100 100 
100 100 100 100 100 100 100 100 100 100 100 100 100 100 
##$AQSEQ= 0
##$AQ_mod= 1
##$AUNM= <au_zg>
##$AUTOPOS= <>
##$BF1= 200.13
##$BF2= 200.13
##$BF3= 200.13
##$BF4= 200.13
##$BF5= 500.13
##$BF6= 500.13
##$BF7= 500.13
##$BF8= 500.13
##$BYTORDA= 1
##$CFDGTYP= 0
##$CFRGTYP= 5
##$CHEMSTR= <none>
##$CNST= (0..31)
1 1 145 1 1 1 1 1 1 1 1 1 1 1 1 1 1 1 1 1 1 1 1 1 1 1 1 1 1 1 1 1 
##$CPDPRG= <>
##$CPDPRG1= <>
##$CPDPRG2= <>
##$CPDPRG3= <>
##$CPDPRG4= <mlev>
##$CPDPRG5= <mlev>
##$CPDPRG6= <mlev>
##$CPDPRG7= <mlev>
##$CPDPRG8= <mlev>
##$CPDPRGB= <>
##$CPDPRGT= <>
##$D= (0..31)
0 2 0 0 0 0 0 0 0 0.06 0 0 0 0 0 0 0.0002 0 0 0 0 0 0 0 0 0 0 0 0 0 0 
0 
##$DATE= 1750946494
##$DBL= (0..7)
120 120 120 120 120 120 120 120 
##$DBP= (0..7)
150 150 150 150 150 150 150 150 
##$DBP07= 0
##$DBPNAM0= <>
##$DBPNAM1= <>
##$DBPNAM2= <>
##$DBPNAM3= <>
##$DBPNAM4= <>
##$DBPNAM5= <>
##$DBPNAM6= <>
##$DBPNAM7= <>
##$DBPOAL= (0..7)
0.5 0.5 0.5 0.5 0.5 0.5 0.5 0.5 
##$DBPOFFS= (0..7)
0 0 0 0 0 0 0 0 
##$DE= 6
##$DECBNUC= <off>
##$DECIM= 32
##$DECNUC= <off>
##$DECSTAT= 4
##$DIGMOD= 1
##$DIGTYP= 9
##$DL= (0..7)
0 120 120 120 120 120 120 120 
##$DP= (0..7)
150 150 150 150 150 150 150 150 
##$DP07= 0
##$DPNAME0= <>
##$DPNAME1= <>
##$DPNAME2= <>
##$DPNAME3= <>
##$DPNAME4= <>
##$DPNAME5= <>
##$DPNAME6= <>
##$DPNAME7= <>
##$DPOAL= (0..7)
0.5 0.5 0.5 0.5 0.5 0.5 0.5 0.5 
##$DPOFFS= (0..7)
0 0 0 0 0 0 0 0 
##$DQDMODE= 0
##$DR= 18
##$DS= 0
##$DSLIST= <SSSSSSSSSSSSSSS>
##$DSPFIRM= 0
$$ [...]
##$SUBNAM0= <"">
##$SUBNAM1= <"">
##$SUBNAM2= <"">
##$SUBNAM3= <"">
##$SUBNAM4= <"">
##$SUBNAM5= <"">
##$SUBNAM6= <"">
##$SUBNAM7= <"">
##$SUBNAM8= <"">
##$SUBNAM9= <"">
##$SW= 20.6817932712277
##$SWIBOX= (0..15)
0 0 3 0 0 0 0 0 0 0 0 0 0 0 0 0 
##$SW_h= 4139.07284768212
##$TD= 32768
##$TD0= 1
##$TE= 0
##$TE2= 300
##$TE3= 300
##$TEG= 300
##$TL= (0..7)
0 120 120 120 120 120 120 120 
##$TP= (0..7)
150 150 150 150 150 150 150 150 
##$TP07= 0
##$TPNAME0= <>
##$TPNAME1= <>
##$TPNAME2= <>
##$TPNAME3= <>
##$TPNAME4= <>
##$TPNAME5= <>
##$TPNAME6= <>
##$TPNAME7= <>
##$TPOAL= (0..7)
0.5 0.5 0.5 0.5 0.5 0.5 0.5 0.5 
##$TPOFFS= (0..7)
0 0 0 0 0 0 0 0 
##$TUNHIN= 0
##$TUNHOUT= 0
##$TUNXOUT= 0
##$USERA1= <user>
##$USERA2= <user>
##$USERA3= <user>
##$USERA4= <user>
##$USERA5= <user>
##$V9= 5
##$VALIST= <valist>
##$VCLIST= <CCCCCCCCCCCCCCC>
##$VD= 0
##$VDLIST= <DDDDDDDDDDDDDDD>
##$VPLIST= <PPPPPPPPPPPPPPP>
##$VTLIST= <TTTTTTTTTTTTTTT>
##$WBST= 1024
##$WBSW= 30
##$XGAIN= (0..3)
0 0 0 0 
##$XL= 0
##$YL= 0
##$YMAX_a= 3085005
##$YMIN_a= -2559198
##$ZGOPTNS= <>
##$ZL1= 120
##$ZL2= 120
##$ZL3= 120
##$ZL4= 120
##$ABSF1= 10
##$ABSF2= 0
##$ABSG= 5
##$ABSL= 3
##$ALPHA= 0
##$AQORDER= 0
##$ASSFAC= 0
##$ASSFACI= 0
##$ASSFACX= 0
##$ASSWID= 0
##$AUNMP= <proc_1d>
##$AZFE= 0.1
##$AZFW= 0.1
##$BCFW= 1
##$BC_mod= 2
##$BYTORDP= 0
##$COROFFS= 0
##$CY= 19
##$DATMOD= 1
##$DC= 2
##$DFILT= <>
##$DTYPP= 0
##$F1P= 11.0000007629395
##$F2P= -0.999999237060547
##$FCOR= 0.5
##$FTSIZE= 0
##$FT_mod= 4
##$GAMMA= 1
##$GB= 1
##$INTBC= 1
##$INTSCL= 1
##$ISEN= 128
##$LB= 0.05
##$LEV0= 0
##$LPBIN= 0
##$MAXI= 10000
##$MC2= 0
##$MEAN= 0
##$ME_mod= 0
##$MI= 0
##$NCOEF= 0
##$NC_proc= 0
##$NLEV= 6
##$NOISF1= 0
##$NOISF2= 0
##$NSP= 1
##$NTH_PI= 0
##$NZP= 0
##$OFFSET= 16.51637
##$PC= 1
##$PHC0= -274.9141
##$PHC1= 1.101538
##$PH_mod= 0
##$PKNL= yes
##$PPARMOD= 0
##$PSCAL= 4
##$PSIGN= 0
##$REVERSE= no
##$SF= 200.13
##$SI= 16384
##$SIGF1= 0
##$SIGF2= 0
##$SINO= 400
##$SIOLD= 16384
##$SREGLST= <1H.CDCl3>
##$SSB= 0
##$STSI= 0
##$STSR= 0
##$SW_p= 4139.07284768211
##$SYMM= 0
##$S_DEV= 0
##$TDeff= 0
##$TDoff= 0
##$TI= <>
##$TILT= no
##$TM1= 0
##$TM2= 0
##$TOPLEV= 0
##$USERP1= <user>
##$USERP2= <user>
##$USERP3= <user>
##$USERP4= <user>
##$USERP5= <user>
##$WDW= 1
##$XDIM= 8192
##$YMAX_p= 0
##$YMIN_p= 0
$$ End of Bruker specific parameters
$$ ---------------------------------
##NTUPLES= NMR FID
##VAR_NAME=  TIME,          FID/REAL,        FID/IMAG
##SYMBOL=    X,             R,               I
##VAR_TYPE=  INDEPENDENT,   DEPENDENT,       DEPENDENT
##VAR_FORM=  AFFN,          ASDF,            ASDF
##VAR_DIM=   16384,         16384,           16384
##UNITS=     SECONDS,       ARBITRARY UNITS, ARBITRARY UNITS
##FACTOR=    0.0002416,     1,               1
##FIRST=     0,             0,               0
##LAST=      3.9581328,     0,               0
##MIN=       0,             -2559198,        0
##MAX=       3.9581328,     3085005,         0
$$ Real data points
##PAGE= N=1
##DATA TABLE= (X++(R..R)), XYDATA
$$ plain form
0 0 0 0 0 0 0 0 0 0 0 0 0 0 0 0 0 0 0 0 0 0 -27 17 -17 32 -32 32 -32 36 -42 49 -50 57 -73 79 -85 94 -100 117 -128
39 -128 138 -153 171 -187 204 -225 247 -272 297 -325 363 -394 441 -487 536 -605 686 -768 878
58 878 -1018 1192 -1412 1722 -2157 2802 -3847 5675 -9360 18453 -50892 401113 3085005 2700723
72 2700723 -1024669 -2545754 -1051326 604945 1252024 439536 -22613 51341 -708176
81 -708176 -904985 -286044 748551 1486376 259962 -1263870 -1292742 -168697 1243701
90 1243701 925992 -382974 -628930 -350624 37240 56455 -57138 507827 397784 -454407
100 -454407 -730636 -257721 688738 636485 -368138 -471348 30801 280910 -42343 -475727
110 -475727 151984 754530 180358 -680562 -847072 198018 1109966 462145 -614554 -879643
$$ packed form
0@%%%%%%%%%%%%%%%%%%%%k7M4l4M9o4O4o4O8p8R1r9J07j30J52j64J79j94K17k45
39a28K66k91L24l58L91m29M72n19N69o22O88p57Q35r28J023j141J291j454J646
58H78j896K210k604L134l879M959o649R522j5035K7813o9345M52005K683892l84282
72B700723l725392j521085J494428J656271O47079q12488m62149P3954p59517
81g08176j96809O18941J034595P37825j226414j523832k8872J124045J412398
90A243701l17709j308966k45956K78306L87864J9215j13593N64965j10043q52191
100d54407k76229M72915R46459n2253j004623j03210N02149K50109l23253m33384
110d75727O27711O02546n74172q60920j66510J045090R11948o47821j076699k65089
$$ plain form
120 -879643 -53257 871367 464304 -412044 -506367 31424 440890 14999 -338618 126486
130 126486 394647 7617 -515618 -322956 555271 657005 -174507 -717420 -361094 519541
140 519541 697531 -4865 -506076 -407899 85695 380951 194338 35877 -89585 -279053
150 -279053 -256192 28577 463566 446081 -218023 -626989 -299775 374665 586483 29974
160 29974 -420964 -256436 89295 169659 -47082 -44056 213155 121188 -267089 -412289 -9740
171 -9740 509177 349944 -247113 -468809 -134415 295926 236241 -99365 -122399 57123 66807
182 66807 -175730 -272117 113262 439393 185342 -341592 -492964 -27162 421466 302444
192 302444 -69505 -259326 -162627 -11019 25445 132363 228834 69364 -241905 -375798
$$ packed form
120h79643Q26386R24624m07063q76348r4323N37791M09466m25891l53617M65104
130A26486K68161l87030n23235J92662Q78227J01734q31512n42913L56326Q80635
140E19541J77990p02396n01211R8177M93594K95256j86613j58461j25462j89468
150b79053K2861K84769M34989j7485o64104m08966L27214O74440K11818n56509
160B9974m50938J64528L45731Q0364k16741L026K57211r1967l88277j45200M02549
171i740N18917j59233n97057k21696L34394M30341n9685l35606k3034J79522R684
182F6807k42537r6387L85379L26131k54051n26934j51372M65802M48628j19022
192C02444l71949j89821R6699J51608L6464J06918R6471j59470l11269j33893
$$ plain form
202 -375798 -53309 398772 371029 -78376 -413224 -244257 190436 295073 70856 -101793
212 -101793 -93331 -21029 -51694 -37859 139636 199114 2750 -243904 -209255 135082 299955
223 299955 67228 -213752 -191802 97666 212438 1275 -151141 -44635 132604 96462
233 96462 -113031 -129390 56649 146304 38783 -119678 -85413 72943 82164 -26714 -72332
244 -72332 16544 95715 -11776 -122210 -35496 118945 122516 -72193 -185602 -26742 152591
255 152591 115164 -70658 -152031 -20451 93141 48987 -31538 -36994 22377 7464 -73184
266 -73184 -32651 90438 104029 -43287 -173640 -71889 130008 153543 -12722 -158003 -94868
277 -94868 69849 100601 12996 -51863 -31554 12931 -10699 -30455 26997 75447 22175 -93353
$$ packed form
202c75798L22489M52081k7743m49405l34848J68967M34693J04637k24217j72649
212a01793Q462P2302l0665J3835J77495N9478j96364k46654L4649L44337J64873
223B99955k32727k80980K1950K89468J14772k11163j52416J06506J77239l6142
233I6462k09493j6359J86039Q9655j07521j58461L4265J58356R221j08878m5618
244g2332Q8876P9171j07491j10434Q6714J54441L571j94709j13409J58860J79333
255A52591l7427j85822q1373J31580J13592m4154q0525n456N9371j4913q0648
266g3184M0533J23089J3591j47316j30353J01751K01897K3535j66265j45281O3135
277i4868J64717L0752q7605o4859K0309M4485k3630j9756N7452M8450n3272j15528
$$ plain form
289 -93353 -98117 43886 121390 33144 -88517 -82606 37828 83836 3451 -58648 -17780 54789
301 54789 36525 -43332 -47125 23356 61588 15432 -50293 -30518 32317 30941 -17999 -28277
313 -28277 22738 45684 -12381 -59501 -18837 61818 71675 -19064 -84022 -31971 57286 65702
325 65702 -9151 -55486 -19556 23409 15818 -10366 390 27156 1488 -45343 -29036 37527
337 37527 61878 3129 -61540 -42879 27960 56534 9558 -42755 -30191 11606 19686 -2348
349 -2348 -12583 4915 12675 -10438 -25198 -1466 32105 21737 -24339 -36040 2122 32634
361 32634 14278 -25945 -24678 12935 23009 -7699 -27885 -2968 26357 11737 -18746 -18979 6763
374 6763 20402 3593 -13715 -5706 7433 4307 -8869 -8702 9011 14050 -3463 -20270 -10465
$$ packed form
289i3353m764J42003P7504q8246j21661N911J20434M6008q0385o2099M0868P2569
301E4789j8264p9857l793P0481L8232m6156o5725J9775O2835j376m8940j0278
313b8277N1015K2946n8065m7120M0664Q0655R857r0739o4958N2051Q9257Q416
325F5702p4853m6335L5930M2965p591k6184J0756K6766k5668m6831J6307O6563
337C7527K4351n8749o4669J8661P0839K8574m6976n2313J2564M1797Q080k2034
349b348j0235J7498P760k3113j4760K3732L3571j0368m6076j1701L8162L0512
361C2634j8356m0223J267L7613J0074l0708k0186K4917K9325j4620l0483k33K5742
374F763J3639j6809j7308Q009J3139l126j3176J67J7713N039j7513j6807R805
$$ plain form
387 -10465 19352 23307 -7194 -25595 -6184 22079 18223 -9240 -16199 1076 11726 3379 -6344
400 -6344 1114 7369 -4848 -13111 -377 18386 15201 -10810 -23677 -5260 20268 22486 -1084
413 -1084 -20003 -13214 4923 14531 8004 -2270 -4120 -5379 -9289 -4487 10802 19788 3583 -21865
427 -21865 -19779 7476 23362 9372 -11013 -9564 1854 876 -5069 -485 10441 8489 -8298
440 -8298 -16718 -6861 8666 13466 3729 -7696 -9010 -1915 3707 694 -1288 5784 9060 -2902
454 -2902 -17833 -14039 8000 20702 8054 -12193 -16613 -4598 6223 8088 7722 4877 -3739 -11070
468 -11070 -9095 1583 10719 10734 4242 -4920 -13777 -15936 -3153 18771 25392 5842 -20123 -26654
482 -26654 -8104 19853 31283 14687 -15124 -29634 -16964 8530 24446 20876 4474 -15436
$$ packed form
387a0465K9817L955l0501j8401J9411K8263l856k7463o959J7275J0650q347r723
400f344P458O255j2217q263J2734J8763l185k6011j2867J8417K5528K218k3570
413a084j8919O789J8137R608o527j0274j850j259l910M802J5289Q986j6205k5448
427b1865K086K7255J5886j3990k0385J449J1418r78n945M584J0926j952j6787
440h298q420R857J5527M800r737j1425j314P095N622l013j982P072L276j1962
454b902j4931L794K2039J2702j2648k0247m420J2015J0821J865l66k845q616p331
468a1070J975J0678R136J5o492r162q857k159J2783K1924O621j9550k5965o531
482b6654J8550K7957J1430j6596k9811j4510J2670K5494J5916l570j6402j9910
$$ plain form
494 -15436 -30027 -23905 10428 44530 37639 -9730 -49408 -39285 10548 50604 41135 -6750 -44130
507 -44130 -38212 32 33547 34839 7562 -21295 -30280 -18434 4733 27255 31965 10213 -24399
520 -24399 -41896 -20158 25205 48202 21665 -27010 -46468 -20158 20994 36853 15894 -16251
532 -16251 -27147 -12945 5223 11976 10965 9065 3128 -11700 -23798 -13620 17295 34440 13475
545 13475 -24254 -35914 -8644 25766 28516 -470 -23590 -16101 6740 14935 3783 -7557 -3238
558 -3238 8957 8024 -9502 -18368 -2203 19255 17090 -6658 -21503 -10198 9755 12344 -554
571 -554 -6258 1843 7610 -295 -12946 -12124 8451 27591 16857 -18714 -37718 -13099 29674 41046
585 41046 7456 -33248 -36100 -2222 28208 27180 4935 -13062 -16171 -10893 -3818 8268 22587
$$ packed form
494a5436j4591O122L4333L4102o891m7369l9678J0123M9833M0056r469m7885l7380
507d4130N918L8244L3515J292k7277k8857q985J1846K3167K2522M710k1752l4612
520b4399j7497K1738M5363K2997k6537m8675j9458K6310M1152J5859k0959l2145
532a6251j0896J4202J8168O753j011j900n937j4828j2098J0178L0915J7145k0965
545A3475l7729j1660K7270L4410K750k8986k3120P489K2841Q195j1152j1340M319
558c238J2195r33j7526q866J6165K1458k165k3748j4845J1305J9953K589j2898
571e54n704Q101N767p905j2651Q22K0575J9140j0734l5571j9004K4619M2773J1372
585D1046l3590m0704k852L3878L0430j028k2245j7997l109N278P075J2086J4319
$$ plain form
598 22587 22416 -3990 -36654 -36987 3975 47338 43087 -10331 -55684 -41596 15069 50167 31387
611 31387 -12052 -34168 -23342 -74 15483 20240 16195 1072 -20899 -31915 -15593 20245
623 20245 43095 24570 -23209 -51196 -26355 27130 52648 23533 -27037 -46101 -18094 21795
635 21795 33675 13877 -11203 -20679 -14585 -3284 7042 13938 14253 3145 -15549 -24503 -8542
648 -8542 21640 31826 5492 -29549 -29679 5129 30425 17605 -11717 -20812 -5084 10323 8344
661 8344 -2713 -5596 1894 8316 3574 -6846 -9008 1132 10074 5686 -4539 -5931 1674 4678
675 4678 -1779 -6770 -1272 7341 6596 -2792 -9057 -5885 3693 11611 9541 -4330 -16334 -11975 6747
690 6747 18827 10014 -8452 -14533 -5064 3960 4031 2862 5183 4341 -4665 -12570 -7394 9640 19930
$$ packed form
598B2587j71k6406l2664l33M0962M3363m251n3418m5353J4088N6665L5098j8780
611C1387m3439k2116J0826K3268J5557M757m045j5123k1971j1016J6322L5838
623B0245K2850j8525m7779k7987K4841N3485K5518k9115n0570j9064K8007L9889
635B1795J1880j9798k5080r476O094J1301J0326O896L15j1108j8694q954J5961
648h542L0182J0186k6334l5041j30L4808K5296j2820k9322r095J5728J5407j979
661H344j1057k883P490O422m742j0420k162J0140Q942m388j0225j392P605L004
675D678o457m991N498Q613p45r388o265L172R578P918k070j3871j2004M359J8722
690F747J2080q813j8466o081R469R024P1j169K321q42r006p905N176J7034J0290
$$ plain form
705 19930 8801 -14904 -24790 -8005 18436 24878 4970 -18154 -20430 -3955 10453 12519 7014
718 7014 -556 -8737 -12883 -6145 9641 18134 7637 -11913 -18468 -6500 9829 15162 8040 -5272
732 -5272 -14458 -11842 2134 14434 12975 -1006 -12313 -10200 1039 9167 8052 808 -6221 -6738
746 -6738 -1410 2924 3353 2847 1478 -3142 -7746 -4617 5416 10643 3613 -7374 -8078 1161 6218
761 6218 2134 -1993 -727 544 -1947 -3470 531 5143 3104 -3197 -5625 -1078 3893 4115 791
776 791 -2941 -3651 169 3645 1932 -1750 -1997 -177 -288 -833 1482 2972 -1061 -5445 -2332 5785
792 5785 6420 -1663 -6193 -1477 3647 2767 -350 -830 -219 -1051 -1416 -158 2010 2406 -785 -4077 -3487
809 -3487 1558 5517 3065 -3697 -5661 52 4711 2503 -2163 -2053 659 470 -1943 -1194 2571 3467
$$ packed form
705A9930j1129k3705r886J6785K6441O442j9908k3124k276J6475J4408K066n505
718G014p570q181m146O738J5786Q493j0497j9550o555J1968J6329N333p122j3312
732e272r186K616J3976J2300j459j3981j1307K113J1239Q128j115p244p029n17
746f738N328M334M29n06j369m620m604L129J0033N227p030j0987p04R239N057
761F218m084m127J266J271k491j523M001M612k039o301k428M547M971K22l324
776G91l732p10L820L476j713l682k47J820j11n45K315J490m033m384L113Q117
792E785O35q083m530M716N124q80l117m80O11q32l65J258K168L96l191l292N90
809c487N045L959k452o762j964N713M659k208m666J10K712j89k413P49L765Q96
$$ plain form
825 3467 -1035 -4565 -1375 3739 3459 -721 -2164 -269 1439 225 -1435 -336 2012 1711 -1742 -4018
841 -4018 -1611 2973 3821 -563 -4054 -1934 2386 2359 -689 -881 721 -189 -2265 -1138 2626 3117 -810
858 -810 -3929 -1962 2137 3177 730 -2065 -1982 476 2159 1071 -490 -45 371 -772 -1622 100 2286
875 2286 1188 -2191 -3011 144 2954 1451 -1615 -1842 557 1719 -60 -1310 -54 1596 539 -1635
891 -1635 -1386 996 1705 -270 -1676 -777 885 979 -251 -828 343 1294 269 -1418 -1084 1322 1891
908 1891 -415 -2501 -946 1617 1325 -941 -1464 -50 668 -48 -330 401 839 -18 -1073 -360 1524
925 1524 1709 -570 -2328 -1122 1459 1904 -393 -2116 -928 950 1081 -130 -256 215 81 -839 -961
942 -961 845 2345 1011 -2376 -2833 444 2781 1324 -1613 -1841 82 627 -31 -64 1319 1077 -816
$$ packed form
825C467m502l530L190N114k80m180j443J895J708j214j660J099K348l01l453k276
841d018K407M584Q48m384l491K120M320k7l048j92J602r10k076J127L764M91l927
858h10l119J967M099J040k447k795Q3K458J683j088j561M45M16j143q50J722K186
875B286j098l379q20L155K810j503l066k27K399J162j779j250J256J650j057k174
891a635K49K382P09j975j406Q99J662R4j230n77J171R51j025j687L34K406N69
908A891k306k086J555K563k92k266n23J414P18p16k82P31M38q57j055P13J884
925A524J85k279j758J206K581M45k297j723J188J878J31j211j26M71j34r20j22
942i61J806J500j334l387m57L277K337j457k937k28J923N45o58l3J383k42j893
$$ plain form
959 -816 -1928 -534 1528 2139 389 -1927 -2238 211 1571 703 -431 -77 11 -1078 -1458 438 2827
976 2827 2030 -1471 -3042 -752 2351 2239 -101 -1513 -1123 -341 -334 -31 989 1595 -264 -2267 -1388 1180
994 1180 2255 1165 -793 -1286 -456 426 404 -186 361 427 -443 -1533 -974 869 1783 360 -1129 -272
1012 -272 883 -258 -1479 596 2814 1522 -2176 -3412 -606 2665 2638 -152 -2286 -1545 167 501
1028 501 277 932 1791 707 -2250 -3223 102 4318 3716 -1298 -4712 -2985 1236 3442 1973 -294
1044 -294 -1465 -1688 -1660 263 2962 3174 130 -3222 -2950 -50 2296 2562 1263 -782 -3177 -3703 -269
1061 -269 4372 4696 -47 -4855 -4814 238 5096 4296 -920 -3814 -1855 929 982 -154 797 2371 254
1078 254 -4115 -3885 1911 6349 3018 -3906 -5925 -957 4367 3577 -689 -2575 -678 721 -120 -1007
$$ packed form
959h16j112J394K062O11j750k316l11K449J360q68j134L54Q8j089l80J896K389
976B827p97l501j571K290L103j12k340j412L90P82PL03J020O06j859k003Q79K568
994A180J075j090j958m93Q30Q82k2n90N47O6q70j090N59J843R14j423j489Q57
1012b72J155j141j221K075K218j292l698j236K806L271k7k790k134P41J712L34
1028E01k24O55Q59j084k957r73L325M216o02n014l414J727M221K206j469k267
1044b94j171k23K8J923K699K12l044l352K72K900K346K66j299k045k395n26L434
1061b69M641L24m743m808M1N052M858q00n216k894J959K784N3j136R51J574k117
1078B54m369K30N796M438l331o924k019M968N324p90m266j886J897J399q41q87
$$ plain form
1094 -1007 72 1230 902 -961 -2168 -715 1636 2018 412 -1539 -1668 -129 1132 1220 851 -195
1110 -195 -1208 -949 596 1087 -429 -1283 405 2228 504 -2536 -2571 1520 3874 955 -3139 -2731 1229
1127 1229 3316 536 -2534 -1575 1621 1619 -1832 -2573 967 3992 1825 -3177 -4522 -514 4184 3896
1143 3896 -810 -3466 -1737 1422 1747 238 -246 411 -485 -2030 -944 2261 3239 467 -2364 -2287 -723
1160 -723 1082 2271 2255 202 -2965 -3669 -247 3969 3421 -1018 -4339 -2390 1841 3267 606 -1885
1176 -1885 -1092 710 132 -1625 -448 2777 3339 -913 -5110 -3075 3160 5493 568 -4503 -2831 2041
1192 2041 2933 -266 -2006 144 1916 -160 -2141 -744 2375 2177 -752 -2681 -1573 963 1915 405
1208 405 -864 -528 63 -206 -287 614 1189 111 -1404 -836 1221 1581 -774 -2111 -208 2128 1156 -1728
$$ packed form
1094a007J079J158l28j863j207J453K351L82j606j951j29J539J261Q8l69j046
1110a95j013K59J545M91j516q54J688J823j724l040l5M091K354k919m094M08L960
1127A229K087k780l070R59L196kl451p41L540L025k167n002j345M008M698k88
1143C896m706k656J729L159L25j509m84O57q96j545J086L205R78k772k831P7J564
1160g23J805J189j6k053l167p04L422M216n48m439l321J949M231J426k661k491
1176a885P93J802n78j757J177L225N62m252m197K035O235K333m925n071J672M872
1192B041Q92l199j740K150J772k076j981J397L119j98k929j929J108K536R52j510
1208D05j269L36N91k69q1R01N75j078j515N68K057L60k355j337J903K336r72k884
$$ plain form
1226 -1728 -1959 1003 2693 289 -2570 -1453 2151 2080 -1050 -2120 760 2627 319 -2835 -2333 1440
1242 1440 3132 623 -2545 -2062 963 2233 330 -1532 -713 1047 810 -1095 -791 1451 1685 -1006
1258 -1006 -2786 -1091 1950 1967 -387 -1538 -391 817 -160 -873 351 1694 426 -1762 -1650 1114
1274 1114 2468 307 -2203 -1539 914 1358 -164 -450 373 906 -437 -1612 -630 1673 2044 -201 -2071
1291 -2071 -1059 1493 1683 -654 -1844 -168 1329 414 -1217 -422 1218 804 -1122 -1951 358 2075
1307 2075 876 -1395 -1295 711 1437 -214 -1527 -426 1279 676 -801 -676 613 1021 -296 -1098
1323 -1098 -412 902 1095 -145 -929 -62 1027 528 -977 -1005 543 1226 -419 -1415 26 1507 577
1340 577 -1389 -1093 835 1306 -201 -1078 -149 961 384 -1089 -866 548 1023 -135 -1107 -510 963
$$ packed form
1226a728k31K962J690k404k859J117L604p1l130j070K880J867k308l154N02L773
1242A440J692k509l168M83L025J270j903j862Q19J760k37j905L04K242K34k691
1258a006j780J695L041J7k354j151J147J208r77p13J224J343j268k188J12K764
1274A114J354k161k510O64K453M44j522k86Q23N33j343j175R82K303L71k245j870
1291b071J012K552J90k337j190J676J497r15j631P95J640m14j926q29K309J717
1307B075j199k271J00K006P26j651j313J101J705o03j477J25J289M08j317q02
1323a098O86J314J93j240p84Q67J089m99j505k8J548O83j645r96J441J481r30
1340E77j966K96J928M71j507q77R29J110n77j473K23J414M75j158r72N97J473
$$ plain form
1357 963 965 -504 -1077 -109 1074 808 -611 -955 322 1141 77 -1148 -587 955 974 -979 -1289 412
1375 412 1458 -57 -1391 -436 1020 743 -549 -625 305 840 -44 -791 -438 537 658 -164 -825 -204 603
1394 603 524 -497 -666 427 996 21 -988 -418 918 655 -808 -916 241 1108 257 -986 -521 797
1412 797 707 -529 -985 115 962 196 -811 -427 641 664 -183 -799 -343 593 568 -257 -721 47 846 315
1432 315 -668 -531 626 760 -210 -763 22 820 121 -710 -504 547 718 -188 -669 -155 526 403 -404
1451 -404 -374 253 611 -112 -624 -120 389 360 -348 -721 -14 706 177 -602 -344 222 482 -89 -619 -127 822
1472 822 337 -585 -607 523 719 -165 -743 -207 525 258 -305 -544 186 415 45 -284 -253 295 472 -19
1492 -19 -457 -20 499 369 -392 -529 176 504 114 -336 -15 342 222 -391 -154 440 511 -70 -345 -89 517
$$ packed form
1357I63Kj469n73R68J183k66j419l44J277Q19j064j225N61J542J9j953l10J701
1375D12J046j515j334R55J456k77j292p6R30N35q84p47L53R75J21q22o61O21Q07
1394F03p9j021j69J093N69r75j009N70J336k63j463j08J157Q67q51j243M65J318
1412G97r0j236m56J100Q47p66j007L84J068K3q47o16M56R36k5q25m64P68P99n31
1432C15r83J37J157J34r70n53P85P98o99q31K06J051J71r06m81N14O81j23q07
1451d04L0O27L58p23n12N04N09k9p08l73P07P20n29p79K58N66K60n71n30M92R49
1472H22m85r22k2J130J96q84n78N36P32k67n63k39P30K29l70l29L1N48J77m91
1492a9m38M37N19j30p61j37P05L28l90m50L21L57j20o13K37N94P1n81k75K56O06
$$ plain form
1513 517 239 -376 -451 127 361 10 -392 -129 207 191 -169 -458 59 502 485 -398 -605 151 636 137 -596
1534 -596 -334 547 293 -433 -378 296 583 -87 -360 -273 333 271 7 -247 -89 225 183 -204 -300 95 307 -12
1556 -12 -648 -187 490 457 -320 -326 233 551 32 -399 -178 531 406 -313 -498 -12 430 189 -377 -428 72 228
1578 228 136 -214 15 194 154 -111 -287 -51 393 351 -418 -522 102 432 1 -372 80 334 -58 -403 -74
1599 -74 560 309 -269 -556 -85 387 178 -177 -173 7 211 35 -320 -150 375 340 -262 -528 -72 574 451
1620 451 -223 -495 -79 432 159 -360 -185 249 124 -169 -417 20 458 152 -257 -305 235 231 -2 98 136
1641 136 22 -128 -40 42 218 -24 -276 -126 76 286 -80 -306 -86 313 182 -196 -377 138 511 216 -380
1662 -380 -436 177 379 125 -472 -237 424 471 -326 -597 107 528 376 -331 -335 21 361 292 -208 -289 -94 23
$$ packed form
1513E17k78o15p5N78K34l51m02K63L36j6l60k89N17M43j7q83k07P56M85m99p33
1534e96K62Q81k54p26N5O74K87o70k73Q7O06o2k64k54J58L14m2l87r6L95K12l19
1556a2o36M61O77l3p77oN59L18n19m31K21P09j25p19j85M86M42k41n66n1N00J56
1578B28r2l50K29J79m0k65j76K36M44m2p69j04O24L30m31l73M52K54l92l45L29
1599g4O34k51n78k87M71M72k09l55MJ80K04j76l55J70N25l5o02k66M56O46j23
1620D51o74k72M16N11k73n19J75M34j25k93k48M37M38l06m09m8N40mk33J00L8
1641A36j14j50Q8Q2J76k42k52J50K02K10l66k26K20L99j31l78j81N15L73k95n96
1662c80n6O13K02k54n97K35O61M7p97k71P04M21j52p07mL56L40o9n00q1J95J17
$$ plain form
1684 23 115 -41 -2 65 114 -125 -421 127 351 176 13 38 155 17 -217 91 210 -147 -521 -350 499 548
1706 548 -209 -639 -146 464 217 -317 -156 188 432 -32 -492 -250 210 490 118 -590 -400 510 937 146
1726 146 -782 -458 377 496 -175 -393 361 604 -82 -689 -165 313 250 -342 -321 208 89 143 -23 13 -112
1747 -112 -130 31 248 131 120 -36 -143 -200 84 205 -152 -358 10 470 125 -361 -335 288 414 -131 -606
1768 -606 53 805 268 -542 -588 143 435 -116 -480 -222 469 311 -15 -318 -69 232 187 -10 -371 265 516
1789 516 42 -407 -243 270 200 -186 -495 3 261 258 -181 -173 154 138 -226 -264 270 432 15 -314 -342 139 336
1812 336 -199 -482 50 480 321 -249 -288 457 354 -49 -535 134 665 393 -394 -582 15 398 246 -448
1832 -448 -188 233 380 -185 -448 45 515 356 -323 -553 8 603 172 -523 -554 393 448 -208 -543 95 684
$$ packed form
1684B3R2j56L9O7M9k39k96N48K24j75j63K5J17j38k34L08J19l57l74J71Q49M9
1706E48p57m30M93O10k47n34J61L44K44m64m60K42M60K80l72p08J90R10M27p91
1726A46r28L24Q35J19o71k18P54K43o86o07N24M78o3n92K1N29j19N4j66L6j25
1747a12j8J61K17j17j1j56j07n7K84J21l57k06L68M60l45m86K6O23J26n45m75
1768f06O59P52n37q10m6P31K92n51l64K58O91j58l26l03K49L01m5j97l61O36K51
1789E16m74m49J64N13p0l86l09M98K58lm39QL27j6l64l8N34J62m17l29k8M81J97
1812C36n35k83N32M30j59n70l9P45j03m03m86O69N31k72p87j88N97L83j52o94
1832d48K60M21J47n65k63M93M70j59o79k30N61N95m31o95l1R47N5o56l35O38N89
$$ plain form
1853 684 233 -469 -331 438 355 -205 -260 213 453 83 -315 -196 11 209 -8 -202 -99 182 182 -234 -470
1874 -470 112 625 358 -598 -375 619 768 -450 -720 -97 600 178 -633 -317 505 667 -170 -536 60 576
1894 576 356 -149 -322 22 416 223 -502 -465 91 499 27 -412 -254 458 473 -285 -668 309 676 48 -556
1915 -556 -126 540 301 -547 -415 269 446 -230 -602 -28 593 416 -311 -352 154 504 154 -428 -323 270
1935 270 611 -87 -687 -266 481 467 -371 -621 217 649 115 -612 -285 415 495 -120 -472 -50 524 177 -465
1956 -465 -452 211 488 -88 -497 -56 423 303 -247 -410 154 460 119 -324 -228 389 382 -124 -552 -104 292
1977 292 90 -426 -243 322 439 -215 -569 -20 430 231 -396 -323 235 439 -28 -722 -221 329 265 -350 -544
1998 -544 99 543 128 -393 -206 387 292 -244 -340 21 469 200 -367 -524 62 389 -72 -419 -189 404 418
$$ packed form
1853F84m51p02J38P69q3n60n5M73K40l70l98J19K07J98k17j94J03K81%m16k36
1874d70N82N13k67r56K23R94J49j218k70O23O97m22q11L16Q22J62q37l66N96N16
1894E76k20n05j73L44L94j93p25L7N56M08m72m39J58P12J5p58l83R77L67o28o04
1915e56M30O66k39q48J32O84J77o76l72N74O21j77p27m1N06L50l50n82J05N93
1935B70L41o98o00M21P47j4q38k50Q38M32n34p27L27P00Q0o15l52M22N74l47o42
1956d65J3O63K77n76m09M41M79j20n50j63N64L06l41m43R6O17pn06m28M48L96
1977B92k02n16J83N65J17o54l54N49M50j99o27P3N58K04m67o94N01N50o4o15j94
1998e44O43M44m15n21J87N93r5n36r6L61M48k69n67j57N86L27m61l47K30N93J4
$$ plain form
2019 418 -195 -358 142 303 118 -394 -271 248 191 -78 -532 -23 223 148 -250 -151 425 382 -157 -323 85
2040 85 322 111 -370 -112 260 333 -167 -472 -71 344 172 -358 -426 56 529 113 -480 -308 456 524 -40
2061 -40 -591 -100 572 294 -400 -612 12 358 66 -386 -204 274 326 -61 -320 81 463 76 -141 -230 22
2082 22 150 -105 -377 -174 245 23 -182 -205 124 262 -2 -357 -54 456 279 -329 -356 326 349 -113 -392
2103 -392 -265 334 317 -122 -245 21 489 307 -253 -303 28 337 244 -328 -390 166 338 -180 -532 -168 256
2124 256 160 -120 -357 40 350 99 -234 107 215 165 -191 -207 95 162 -173 -245 -53 151 79 -97 -5 125
2146 125 163 80 -214 12 120 490 26 -342 -80 384 260 -420 -324 112 396 -110 -371 -169 381 280 -68
2167 -68 -297 11 231 238 -125 -228 32 255 -23 -172 -104 58 16 -16 -64 81 279 -18 0 -37 89 109 -116
$$ packed form
2019D18o13j63N00J61j85n12J23N19n7k69m54N09K46p5l98R9N76m3n39j66M08
2040H5K37k11m81K58L72P3n00l05M01M15j72n30o8M82M73m16n93J72P64O8n64
2061d0n51M91O72k78o94k12O24L46k92m52J82M78N2l87k59M01L82l87k17q9K52
2082B2J28k55k72K03M19k22k05k3L29J38k64l55L03N10j77o08k7O82K3m62k79
2103c92J27N99j7m39j23K66M68j82n60n0L31L09r3n72o2N56J72n18l52L64M24
2124B56r6k80k37L97L10k51l33L41J08n0l56j6L02O7l35p2J92K04p2j76R2J30
2146A25L8q3k94K26J08L70m64l68K62M64j24o80R6M36K84n06k61K02N50j01l48
2167f8k29L08K20Pl63j03K60K23k78j49O8J62m2l2m8J45J98k97J8l7J26K0k25
$$ plain form
2190 -116 -245 129 198 -110 -343 -83 377 285 -355 -229 182 259 -52 -95 -141 247 284 -29 -293 -274 197 388
2212 388 -195 -320 9 404 159 -273 -286 246 205 -155 -170 66 174 159 -153 -122 -28 32 -67 -53 -97 -21 -115 -118 52
2237 52 92 165 70 -165 37 123 181 -150 -198 41 231 62 -416 -57 363 249 -168 -360 199 537 114 -358
2259 -358 -69 201 171 -152 -225 -73 95 155 113 -213 -248 291 496 -57 -278 65 479 172 -215 -66 219 76
2281 76 -302 -162 119 157 -245 -106 191 112 -119 -85 1 229 191 -7 -17 63 198 81 -157 -364 -28 181 190
2304 190 -215 -155 83 257 -72 -401 -56 377 270 -148 -322 293 289 -81 -411 -41 307 151 17 -154 -43
2325 -43 -1 43 -175 -278 61 292 217 -201 -197 116 228 -209 -260 72 302 -34 -113 26 146 73 -216 39 88
2348 88 298 93 -86 62 335 313 -330 -320 -57 363 211 -328 -279 212 310 11 -364 -306 331 371 44 -312
$$ packed form
2190a16j29L74O9l08k33K60M60r2o40J26M11P7l11m3m6L88L7l13k64J9M71J91
2212C88n83j25L29L95k45m32j3N32m1l60j5K36J08j5l12L1R4O0r9J4m4P6r4lJ70
2237E2M0P3r5k35K02Q6N8l31m8K39J90j69m78L59M20j14m17j92N59L38m23m72
2259c58K89K70l0l23p3J52J68O0m2l26l5N39K05n53k21L43M14l07l87J49K85j43
2281G6l78J40K81L8m02J39K97p9k31L4Q6K28l8j98j0Q0J35j17k38k07L36K09R
2304A90m05O0K38J74l29l29L45M33j07m18j74O15ml70l30L70L48j56j34j71J11
2325d3M2M4k18j03L39K31p5m18ML13J12m37n1L32K30l36p9J39J20p3k89K55M9
2348H8K10k05j79J48K73k2o43J0K63M20j52n39M9M91R8k99l75N8O37M0l27l56
$$ plain form
2370 -312 39 244 -119 -402 -200 143 178 22 -14 -40 6 130 -75 -247 34 179 162 7 -145 144 144 -288
2392 -288 -473 45 358 87 -297 -2 311 -40 -519 -177 102 352 82 -163 158 107 41 -253 -237 -42 224
2413 224 173 -65 -312 -95 341 159 -284 -172 211 416 49 -353 -44 466 180 -411 -335 192 266 -243 -241 53
2435 53 225 -57 -210 -65 266 189 -81 134 -9 72 162 -50 -241 -185 89 181 -235 -151 184 496 -69 -397
2457 -397 10 551 398 -361 -311 126 368 -103 -428 -30 304 186 -103 -292 36 217 60 -169 -134 -45 228
2478 228 134 -221 -48 115 196 -243 -266 39 271 157 -226 -152 108 73 -172 -173 42 114 43 -135 -32 230 154
2501 154 -195 -132 32 224 214 -9 -199 65 293 -42 -262 -19 261 251 -116 -262 33 221 -96 -249 -90
2522 -90 140 222 -162 -154 85 178 65 -168 -66 168 290 71 -243 -173 159 170 -107 -271 -112 134 -27 -359
$$ packed form
2370c12L51K05l63k83K02L43L5j56l6k6M6J24k05j72K81J45j7j55j52K89%m32
2392b88j85N18L13k71l84K95L13l51m79L42K79K50k70k45L21n1o6k94J6J95K66
2413B24n1k38k47K17M36j82m43J12L83K05l67m02L09N10k86n91P6N27P4n09KK94
2435E3J72k82j53J45L31p7k70K15j43Q1R0k12j91N6K74R2m16Q4L35L12n65l28
2457c97M07N41j53p59N0M37K42m71l25L98L34j18k89j89L28J81j57k29L5Q9K73
2478B28r4l55J73J63Q1m39k3L05K32j14l83P4K60l5k45jK15P2p1j78J03K62p6
2501A54l49O3J64J92j0k23j90K64K28l35k20K43K80j0l67j46K95J88l17j53J59
2522i0K30Q2l84QK39R3j13k33J02K34J22k19l14P0L32J1k77j64J59K46j61l32
$$ plain form
2544 -359 -191 342 244 -223 -219 89 394 130 -75 -58 148 199 -130 -93 67 130 51 -107 -153 -48 232 191 -178
2567 -178 -212 111 363 -179 -183 88 255 22 -384 -227 245 214 -424 -403 72 216 -12 -167 -30 171 251 36
2589 36 -187 -67 214 259 -122 -224 -89 177 90 -141 -272 230 332 -80 -250 46 373 163 -144 -233 105
2610 105 310 20 -157 21 192 -106 -169 -157 112 224 52 -242 -34 241 273 -54 -253 15 236 71 -168
2631 -168 -166 145 286 -79 -285 -35 321 245 -190 -151 157 391 95 -231 -46 281 171 -193 -263 -85 143 191
2653 191 -113 -296 -5 418 265 -251 -105 95 240 11 -195 -23 212 33 -228 18 214 73 -36 -110
2673 -110 26 217 43 -157 -29 260 141 -73 -159 55 206 158 -214 -231 106 265 176 -282 -149 202 257 -90
2695 -90 -353 -118 271 155 -169 -225 136 176 -49 -171 -67 59 111 -16 -47 52 136 220 -7 -41 150 118 117 -139
$$ packed form
2544c59J68N33r8m67ML08L05k64k05J7K06N1l29L7J60O3p9j58m6J05K80m1l69
2567a78l4L23K52n42mK71J67k33m06J57M72l1o38K1M75J44k28j55J37K01Q0k15
2589C6k23J20K81M5l81j02J35K66q7k31j31N02J02m12j70K96L27k10l07q9L38
2610A05K05k90j77J78J71k98o3J2K69J12j72k94K08K75L2l27j99K68K21j65k39
2631a68KL11J41l65k06K50L56p6m35L9L08K34k96l26J85L27j10l64p0J78K28M8
2653A91l04j83K91M23j53n16J46K00J45k29k06J72K35j79k61K46J96j41j09p4
2673a10J36J91j74k00J28K89j19k14q6K14J51m8l72j7L37J59q9m58J33L51N5l47
2695i0k63K35L89j16l24n6L61M0k25j22J04J26N2j27l1R9Q4Q4k27l4J91l2jk56
$$ plain form
2719 -139 -90 185 -35 -64 -175 202 85 -67 -142 142 204 92 -126 -166 329 233 -5 -157 172 228 26 -266
2741 -266 -135 72 349 24 -182 -234 116 321 145 -62 -258 301 250 -170 -355 49 240 -58 -419 -200 29
2762 29 81 15 -86 129 66 -70 40 47 60 -100 6 -69 -108 138 171 -184 -193 68 156 -66 -242 2 219 158 -138
2787 -138 -143 165 196 4 -279 -108 319 151 -34 -168 -16 219 102 -189 10 58 314 64 -9 -183 -24 348
2809 348 71 -185 -154 54 47 -93 -192 -18 17 77 -90 51 201 -35 -20 50 140 97 42 159 110 94 44 -57 -242
2834 -242 144 224 28 -199 17 194 207 -19 -214 57 252 99 -226 -127 81 149 164 -166 -96 68 121 -16
2856 -16 -113 67 222 106 -153 -266 79 168 154 -143 71 111 152 67 -152 -104 19 -30 -176 71 228 107 -61
2879 -61 -176 96 58 -56 -14 25 -65 -81 -61 -52 -11 23 -16 -89 -134 13 356 91 -310 -217 309 172 -132 -110 47
$$ packed form
2719a39M9K75k20k9j11L77j17j52p5K84O2j12k18m0M95r6k38j52L29N6k02k92
2741b66J31K07K77l25k06n2L50K05j76k07j96N59n1m20j85M04J91k98l61K19K29
2762B9N2o6j01K15o3j36J10PJ3j60J06p5l9K46L3l55rK61Q8k22j76K44K17o1k96
2787a38nL08L1j92k83J71M27j68j85j34J52K35j17k91J99M8K56k50p3j74J59L72
2809C48k77k56L1K08pj40r9J74L5O0j67J41J50k36J5P0R0m3n5J17m9j6n0j01j85
2834b42L86Q0j96k27K16J77J3k26j95K71J95j53l25R9K08O8J5l30P0J64N3j37
2856a6r7J80J55j16k59j13L45Q9j4k97K14M0M1q5k19M8J23m9j46K47J57j21j68
2879f1j15K72l8j14M2L9r0j6K0RM1L4l9p3m5J47L43k65m01R3N26j37l04K2J57
$$ plain form
2904 47 255 -59 -201 -142 144 114 -8 -105 156 64 7 -25 69 77 86 -110 9 141 -22 -96 28 -79 -166 79 151
2929 151 -168 -50 190 276 -77 -284 -26 399 31 -252 -66 64 170 -198 -248 91 111 -57 -93 34 101 143
2951 143 29 28 -137 -26 32 260 67 30 86 -32 -175 -261 -86 137 -80 -111 -10 310 163 -159 -196 227 132
2974 132 -102 -279 60 322 -31 -314 21 129 0 -41 -21 70 42 161 103 -37 -91 86 359 13 -246 -20
2996 -20 393 105 -348 -165 97 144 24 -190 109 314 9 -256 -41 205 60 82 -47 110 -67 23 18 -37
3018 -37 66 11 -86 86 49 125 150 73 -215 61 223 114 -200 -51 271 65 -192 -293 89 187 16 -286 -92
3041 -92 92 104 -89 -30 -5 57 -28 29 -108 65 56 -17 -198 -101 175 150 51 -208 85 121 88 -31 -31 137 148 -140
3067 -140 -53 64 87 91 -112 -99 2 119 28 6 -68 -4 65 -141 -78 33 291 19 -150 -59 119 256 -68 -265
$$ packed form
2904D7K08l14j42N9K86l0j22r7K61r2n7l2R4QRj96J19J32j63p4J24j07q7K45P2
2929A51l19J18K40Q6l53k07K58M25l68k83J86J30J06l68n0L39K0j68l6J27O7M2
2951A43j14jj65J11N8K28j93l7N6j18j43q6J75K23k17l1J01L20j47l22l7M23r5
2974A32k34j77L39K62l53k83L35J08j29m1K0R1k8J19n8j40n4J77K73l46k59K26
2996b0M13k88m53J83K62M7j20k14K99K05l05k65K15K46j45K2j29J57j77R0nn5
3018c7J03n5r7J72l7P6K5p7k88K76J62j09l14J49L22k06k57j01L82R8j71l02J94
3041i2J84J2j93N9K5O2q5N7j37J73rp3j81R7K76k5r9k59K93L6l3j19%J68J1k88
3067a40Q7J17K3Mk03J3J01J17r1k2p4O4O9k06O3J11K58k72j69R1J78J37l24j97
$$ plain form
3091 -265 -53 203 96 -254 -113 255 237 -150 -16 -58 47 -20 -11 -33 -55 2 25 -147 -14 27 50 -11 -146 39
3115 39 141 188 -132 -159 153 208 -233 -156 105 114 92 -129 -55 98 31 13 -297 -17 175 6 4 -124 106 86 111
3140 111 -72 -99 42 173 81 -164 -170 140 144 -72 -100 8 160 -60 -150 -54 235 114 -68 -123 17 66 -41 -77
3164 -77 -69 67 116 -145 29 -31 67 16 -140 -12 60 135 35 -63 -22 52 35 -190 -101 53 196 -3 -178 -53 123
3189 123 169 -19 -61 20 78 48 -3 -47 97 -4 16 -169 -40 10 196 -76 -76 80 72 99 -65 191 17 166 -44
3214 -44 -84 118 105 -113 -63 -79 130 96 -91 -50 -82 87 27 -85 -131 74 101 1 -122 -105 141 156 -116 -186 3
3239 3 -30 -37 89 -69 57 16 -26 21 62 99 31 -185 -106 55 95 113 -126 -49 100 143 -161 -60 166 141 -35 -222
3265 -222 49 125 126 -94 -184 -92 184 -133 -153 -253 -9 202 18 -151 -105 106 184 -185 -32 -6 116 113 -175 -109
$$ packed form
3091b65K12K56j07l50J41L68j8l87J34m2J05o7Rk2k2N7K3j72J33M1K3o1j35J85
3115C9J02M7l20k7L12N5m41P7K61Rk2k21P4J53o7j8l10K80J92j69kj28K30k0K5
3140A11j83k7J41J31r2k45oL10Mk16k8J08J52k20r0R6K89j21j82n5J40M9j07l6
3164g7QJ36M9k61J74o0R8n1j56J28P2P5j00r8M1P4j7k25Q9J54J43j99j75J25J76
3189A23M6j88m2Q1N8l0n1m4J44j01K0j85J29N0J86k72%J56qK7j64K56j74J49k10
3214d4m0K02j3k18N0j6K09l4j87M1l2J69o0j12m6K05K7j00j23J7K46J5k72p0J89
3239Cl3pJ26j58J26m1m2M7M1L7o8k16P9J61M0J8k39P7J49M3l04J01K26k5j76j87
3265b22K71P6Jk20r0R2K76l17k0j00K44K11j84j69M6K11P8l69J53K6J22lk88O6
$$ plain form
3289 -109 3 163 -105 -171 -119 115 50 -98 6 50 96 46 39 31 46 36 41 -15 -146 74 43 -70 50 60 94 -100
3315 -100 -95 65 224 -2 -257 -24 178 207 -43 -287 34 76 25 -143 -237 -12 24 1 -146 49 97 65 -65
3338 -65 -106 124 129 33 -137 -145 103 83 -1 -199 -88 188 38 -13 -80 36 -1 69 44 26 89 156 -2 -73 37 5
3364 5 -79 16 -48 -17 59 140 -62 -28 26 37 -59 -170 190 23 61 -185 -104 159 58 -87 -70 -88 0 -62 -40 -17 88
3391 88 54 82 -134 17 130 39 -96 -115 7 185 56 -70 -36 94 62 2 -80 14 193 139 -86 22 107 102 -74
3416 -74 -129 -104 -96 78 -82 -66 36 12 -77 -13 -48 118 156 -31 -3 -153 143 1 -129 -114 29 73 -72 -132 -23
3441 -23 2 6 -167 -59 95 147 65 75 55 99 68 -271 -137 -104 4 -26 -39 10 125 -8 26 94 53 79 231 -140
3467 -140 41 30 114 -28 -61 -99 151 119 57 -30 -87 133 117 -25 -67 76 7 -73 -3 43 153 54 -50 -142 -59 3
$$ packed form
3289a09J12J60k68o6N2K34o5j48J04M4M6n0pqJ5j0Nn6j31K20l1j13J20J0L4j94
3315a00NJ60J59k26k55K33K02K9k50k44L21M2n1j68r4K25L6k3j47J95M8l2j30
3338f5m1K30Nr6j70qK48k0q4j98J11K76j50n1o7J16l7P0k5j8O3O7j58p1J10l2
3364Eq4R5o4L1P6Q1k02L4N4J1r6j11L60j67L8k46Q1K63j01j45J7j8Q8o2K2K3J05
3391H8l4K8k16J51J13r1j35j9J22J78j29j26L4J30l2o0q2R4J79n4k25J08Q5nj76
3416g4n5K5QJ74j60J6J02k4q9O4l5J66L8j87K8j50K96j42j30J5J43M4j45o0J09
3441b3K5Mj73J08J54N2q2J0k0M4l1l39J34L3J08l0j3M9J15j33L4O8m1K6J52l71
3467a40J81j1Q4j42l3l8K50l2o2q7n7K20j6j42m2J43o9q0P0M6J10r9j04r2Q3O2
$$ plain form
3493 3 15 137 29 2 -83 -50 32 56 194 -13 84 66 56 53 -59 -73 -12 147 134 -189 -142 81 152 -69 -216 -25
3519 -25 97 10 -97 -23 178 123 -123 -103 8 12 9 -38 25 -36 45 -53 -108 -14 -101 93 187 22 -88 47 42 -64 -178
3546 -178 92 48 105 -66 -7 2 7 -71 -97 217 152 18 -191 52 182 -31 -143 -26 30 92 -22 -55 -55 -37 -37 -118
3572 -118 -27 -55 81 136 123 -45 5 181 35 11 -4 -20 -24 -42 15 -37 77 62 54 -24 113 108 -7 85 -22 26 39
3599 39 19 -31 88 -63 -44 32 -109 -6 -74 28 23 -92 126 75 -42 65 80 53 -20 -108 7 171 92 -35 36
3624 36 -75 123 -27 -105 -92 128 193 82 -58 71 83 43 -72 -41 89 12 -48 -28 18 -8 -61 42 169 62
3648 62 -6 78 -36 -34 67 47 40 -54 -41 141 -4 -94 -44 77 166 -108 -227 -46 153 40 8 -22 5 6 -7 -83 -6
3675 -6 99 32 -49 -51 24 -105 71 33 4 -125 88 114 13 -109 117 140 -49 -72 72 75 -1 -215 -40 -12 -20 -174
$$ packed form
3493CJ2J22j08k7q5L3Q2K4J38k07R7j8j0lj12j4O1J59j3l23M7K23P1k21j47J91
3519b5J22q7j07P4K01n5k46K0J11Mlm7O3o1Q1r8n5R4q7J94R4j65j10J35nj06j14
3546a78K70m4N7j71N9RNp8k6L14o5j34k09K43J30k13j12J17N6O2j14l3%J8%q1
3572a18R1k8J36N5j3j68N0J76j46k4j5j6mj8N7n2J14j5qp8J37nj15R2j07M8J3
3599C9k0n0J19j51J9P6j41J03o8J02nj15K18n1j17J07J5k7p3q8J15J64p9j27P1
3624C6j11J98j50p8J3K20O5j11j40J29J2m0j15L1J30p7o0K0M6k6n3J03J27j07
3648F2o8Q4j14KJ01k0pr4J3J82j45r0N0J21Q9k74j19J81J99j13l2l0K7Jj3p6P7
3675fJ05o7q1kP5j29J76l8k9j29K13K6j01j22K26K3j89k3J44Lp6k14J75K8qj54
$$ plain form
3701 -174 -64 140 -22 34 -80 73 56 -120 -46 -121 -12 124 143 -58 88 20 74 -62 48 12 103 72 -5 -117
3725 -117 2 78 27 -114 -152 33 14 59 -121 34 69 44 -33 156 79 147 72 -1 81 78 -54 -61 28 36 14 -20 -87 35
3753 35 81 73 -90 -65 75 114 67 -79 -151 -24 -44 -50 -36 24 -18 -56 -121 -18 -42 174 90 -81 20 43 72 23 5
3780 5 243 10 -99 50 5 83 137 80 -19 50 134 138 49 36 -18 151 50 -22 109 23 -21 -130 -111 -167 -29 3 -69
3807 -69 -100 -11 27 -20 -40 -35 -20 43 -78 -82 56 116 79 -132 10 70 82 -58 34 82 47 -36 51 92 116 173 23 110
3835 110 -61 57 53 42 -168 -10 132 19 -146 -64 25 147 20 -152 47 56 19 11 19 33 -13 -16 -52 85 81 23 -157
3862 -157 -69 40 13 45 48 73 7 111 -112 -40 -5 76 20 -46 7 52 89 -28 25 118 101 -49 -66 150 108 12 -81
3889 -81 -94 -1 57 119 -36 -43 -45 -75 14 -20 111 11 -10 -10 -18 30 36 58 -100 12 2 49 -28 40 -3 20 -16 -113 82 51
$$ packed form
3701a74J10K04j62N6j14J53j7j76P4p5J09J36J9k01J46o8N4j36J10l6R1l1p7j12
3725a17J19P6n1j41l8J85j9M5j80J55L5k5p7J89p7O8p5p3Q2lj32pQ9Qk2l4o7J22
3753C5M6qj63K5J40L9m7j46p2J27k0oJ4O0m2l8o5J03k4K16q4j71J01K3K9m9j8
3780EK38k33j09J49m5P8N4n7r9O9Q4Mq9j3n4J69j01p2J31q6m4j09J9n6J38L2p2
3807f9l1Q9L8m7k0NJ5O3j21mJ38O0l7k11J42O0J2j40R2M8l5q3Q7M1K4N7j50Q7
3835A10j71J18mj1k10J58J42j13j65Q2Q9J22j27j72J99Rl7qQJ4m6ll6J37mn8j80
3862a57Q8J09k7L2LK5o6J04k23P2L5Q1n6o6N3M5L7j17N3R3j7j50j7K16m2r6r3
3889h1j3R3N8O2j55pkl0Q9l4J31j00k1%qM8OK2j58J12j0M7p7O8m3K3l6r7J95l1
$$ plain form
3919 51 25 -102 74 129 83 63 7 -89 65 81 -115 -143 -81 -115 106 -1 -163 36 48 135 -27 -14 81 30 4 -41
3945 -41 30 135 74 116 -181 41 -59 10 33 -35 155 67 24 -22 38 2 1 60 35 -7 -41 20 162 -22 -13 28 28 6
3973 6 80 59 -27 -24 35 206 -19 -187 -101 21 130 -23 -65 51 -33 55 31 -104 19 122 47 -46 -155 -3 65
3998 65 -122 1 -89 65 -4 17 -83 -52 -24 -77 23 -1 113 -62 17 -37 -22 -20 89 -78 0 -45 10 37 -71 -38
4024 -38 47 125 -11 32 171 -33 95 -81 15 100 107 -67 -99 5 36 34 -28 134 67 72 26 101 -49 21 94 99 -220
4051 -220 -113 86 186 -135 -123 -25 111 2 -152 -92 -14 18 43 -43 108 -26 26 -53 45 -6 -147 56 79 -5
4075 -5 -85 55 44 50 -56 12 98 73 -59 29 -36 48 79 7 162 85 -140 27 169 91 -187 -197 153 -8 -158 -11
4101 -11 112 163 -76 -143 -8 -45 70 -4 42 97 53 10 18 -97 -163 -67 -44 1 -42 -6 79 -10 -63 -48 -32 55 93 16
$$ packed form
3919E1k6j27J76N5m6k0n6r6J54J6j96k8O2l4K21j07j62J99J2Q7j62J3R5n1k6m5
3945d1P1J05o1M2k97K22j00O9K3o8J90q8m3m6O0l6jN9k5m2l4O1J42j84RM1%k2
3973FP4k1q6LN9J71k25j68Q6J22J09j53m2J16q4Q8k4j35J23J03p5r3j09J52O8
3998F5j87J23r0J54o9K1j00L1K8n3J00k4J14j75P9n4J5KJ09j67P8m5N5K7j08L3
4024c8Q5P8j36M3J39k04J28j76R6Q5Pj74l2J04L1ko2J62o7Nm6P5j50P0P3Nl19
4051b20J07J99J00l21J2R8J36j09j54O0P8L2K5q6J51j34N2p9R8n1j41K03K3q4
4075eq0J40j1Oj06O8Q6k5j32Q8o5Q4L1p2J55p7k25J67J42p8k78j0L50j61j50J47
4101a1J23N1k39o7J35l7J15p4M6N5m4m3Qj15o6R6K3M5m3L6Q5q9n3J5J6Q7L8p7
$$ plain form
4129 16 -47 78 14 10 -77 31 -33 -73 -15 -26 135 -72 -69 -21 38 165 -62 -41 57 34 -97 -144 -89 48 109 102 -13
4156 -13 -123 -16 126 160 0 -42 -24 105 -23 -17 -23 120 38 -124 -31 115 82 125 51 70 56 -17 -25 188 97 42 -118
4183 -118 -59 103 36 5 -36 75 -52 -46 23 50 -18 93 105 59 -84 71 54 -38 -48 -59 86 89 -75 -88 36 14
4209 14 -38 26 27 96 104 -142 36 202 34 27 -65 -85 53 -47 85 87 40 -100 -96 55 -18 51 29 48 105 -257 0
4236 0 130 68 10 -39 98 -103 -272 -142 79 139 -164 7 44 113 23 21 104 5 79 44 27 -32 12 -77 -7 1 28 95
4264 95 18 4 -81 -4 93 99 80 7 185 72 3 -60 -7 -54 -54 114 27 97 -184 -89 61 112 5 -68 134 113 -60
4291 -60 88 -20 67 -40 25 99 1 -34 -44 -12 71 -86 -70 16 26 29 22 -68 59 5 -19 -30 1 81 -28 -69 -26 69
4319 69 81 -47 -107 -3 78 16 61 44 1 94 62 19 15 -14 -126 -45 -17 11 31 -42 -86 18 33 10 -33 -26 202 14
$$ packed form
4129A6o3J25o4mq7J08o4m0N8j1J61k07LM8N9J27k27K1R8k3j31m7N5J37O1pj15
4156a3j10J07J42L4j60m2J8J29j28OoJ43q2j62R3J46l3M3p4J9j4p3qK13r1n5j60
4183a18N9J62o7l1m1J11j27OO9K7o8J11J2m6j43J55j7r2j0j1J45Lj64j3J24k2
4209A4n2O4JO9Qk46J78J66j68pr2k0J38j00J32Km7j40MJ51p3O9k2J9N7l62K57
4236@J30o2n8m9J37k01j69J30K21O0l03J71L7O9r0kQ3r9P4l5j7n9M4q9P0QK7O7
4264I5p7j4q5P7R7Oj9p3J78j13o9o3N3m7%J68q7P0k81R5J50N1j07p3K02k1j73
4291f0J48j08Q7j07O5P4r8l5j0L2Q3j57J6Q6J0Lpr0J27n4k4j1L1Q0j09m1M3R5
4319F9J2j28o0J04Q1o2M5j7m3R3l2m3mk9j12Q1K8K8K0p3m4J04J5k3m3PK28j88
$$ plain form
4347 14 -114 -61 5 95 66 -5 -75 -111 66 98 -98 0 33 71 -26 -105 93 -11 22 -58 -38 72 -87 -23 32 37 -33
4374 -33 -49 25 -4 171 61 -17 -123 -23 13 88 42 79 -71 38 94 -73 29 119 49 -48 -51 -120 56 89 -68 -75
4400 -75 7 146 -17 -45 12 -47 -83 -32 71 -20 40 100 -45 -114 -147 52 78 47 -180 181 -25 46 -14 -78 -46 -94
4426 -94 -2 -11 79 11 86 143 131 4 24 -126 -37 73 -127 -59 7 -52 61 48 -4 54 110 -155 3 45 39 -62 47
4453 47 -26 10 99 136 41 26 -112 90 0 -7 -7 86 14 -209 67 -42 -65 -39 37 -51 -122 4 42 1 2 -70 -30 -21 -89
4482 -89 -44 95 -7 -96 -29 -19 48 36 -23 94 20 -73 -1 6 99 65 -64 -95 -73 15 15 34 49 87 54 130 116 -56 97
4511 97 -38 -65 -111 25 33 83 -28 -82 26 9 48 -99 60 81 118 13 -75 85 28 76 31 -125 -48 -100 157 45
4537 45 -144 -23 55 37 11 228 95 -81 -1 0 74 -71 40 -79 -53 36 -83 144 -80 9 -32 7 103 -52 165
$$ packed form
4347A4j28N3O6R0k9p1p0l6J77L2j96R8L3L8r7p9J98j04L3q0K0J10j59O4N5Np0
4374c3j6P4k9J75j10p8j06J00L6P5m6L7j50J09N6j67J02R0p0r7lo9J76L3j57p
4400g5Q2J39j63k8N7n9l6N1J03r1O0O0j45o9l3J99K6l1k27L61k06P1o0o4L2m8
4426i4R2rR0o8P5N7j2j27K0j50Q9J10k00O8O6n9J13j3n2N8N6k65J58M2oj01J09
4453D7p3L6Q9L7r5j5j38K02r0p%R3p2k23K76j09k3K6P6q8p1J26L8m1Jp2M0Ro8
4482h9M5J39j02q9O7J0O7j2n9J17p4r3P2PR3l4j29l1K2Q8%J9J5L8l3P6j4j72J53
4511I7j35k7m6J36QN0j11n4J08j7L9j47J59K1L7j05q8J60n7M8m5j56P7n2K57j12
4537D5j89J21P8j8k6K17j33j76Q0JP4j45J11j19K6Q9j19K27k24Q9m1L9R6j55K17
$$ plain form
4562 165 14 25 -53 -80 132 -8 -172 -83 47 39 -29 -158 -70 5 -101 -110 25 95 53 -61 -15 -10 43 26 86 -37
4588 -37 -109 -39 -45 127 37 -132 -13 114 17 12 148 149 -5 -41 124 84 27 -38 -12 -40 -34 -98 146 152 -102 -108 34 109
4616 109 47 45 -17 47 -8 -34 -66 -83 -167 -108 54 50 -31 7 38 140 -29 -154 -13 -15 82 -26 -19 -32 -165 -27 -82 97
4644 97 115 -18 32 -54 74 -130 20 -11 58 9 4 51 -11 38 -19 100 -71 23 66 -56 -33 -4 -17 68 -153 5
4670 5 -62 26 92 120 108 -34 7 -54 -115 -104 -59 39 8 36 -35 -20 -24 16 20 0 30 113 78 -101 -81 -10 -6 67 54 -15 71
4701 71 18 -42 -99 -7 -21 -52 71 37 95 179 62 -6 61 48 -42 -108 -22 67 -89 -106 -11 96 -156 -113 0 143 92
4728 92 55 -57 44 -48 -181 -81 -40 -74 -69 30 106 48 -94 59 69 33 -55 85 128 9 -105 81 91 19 -116
4753 -116 43 88 74 -43 66 95 -89 -64 -60 163 43 -173 -40 66 117 -164 -87 49 -13 -103 -147 -27 104 -133
$$ packed form
4562A65j51J1p8k7K12j40j64Q9J30qo8j29Q8P5j06rJ35P0m2j14M6NN3j7O0j23
4588c7p2P0oJ72r0j69J19J27r7nJ36Jj54l6J65m0n7o5K6k8Oo4K44Ok54oJ42P5
4616A09o2ko2O4n5k6l2j7q4N9J62mq1L8L1J02j69j25J41kR7j08Pj3j33J38n5J79
4644I7J8j33N0q6J28k04J50l1O9m9nM7o2M9n7J19j71R4M3j22K3K9j3Q5k21J58
4670Eo7Q8O6K8j2j42M1o1o1J1M5R8l1K8p1J5mM0Mk0L0Q3l5j79K0P1MP3j3o9Q6
4701G1n3o0n7R2j4l1J23l4N8Q4j17o8O7j3r0o6Q6Q9j56j7R5J07k52M3J13J43n1
4728I2l7j12J01r2j33J00M1l4NR9P6n8j42J53J0l6q8J40M3j19j14J86J0p2j35
4753a16J59M5j4j17J09K9j84K5MK23j20k16J33J06N1k81P7J36o2r0m4J20J31k37
$$ plain form
4777 -133 73 141 80 -73 27 185 74 -134 52 94 59 -154 -132 23 80 54 -62 92 173 2 -1 186 52
4800 52 30 53 13 80 -62 -15 -58 -44 -55 50 26 49 58 -204 98 59 -118 51 -3 43 -53 -71 -60 28 6 -72 -94 -21
4828 -21 3 -22 -38 137 68 -28 111 22 67 -111 69 -78 -66 -114 55 37 -10 -29 -91 24 -90 175 112 -40 9
4853 9 5 -83 -3 -21 34 20 55 42 24 -89 44 -45 -94 -126 -123 9 24 29 -127 73 14 111 20 -17 24 22 14 -29 -41 59
4883 59 -20 81 -60 -62 19 119 -49 90 -103 55 44 23 -7 -55 104 -3 -38 48 72 57 -1 -7 2 -41 -117 -85 -79 39
4911 39 47 5 -57 -33 -11 -47 -51 13 -67 -29 22 99 -76 131 11 -76 58 23 18 38 -31 -38 -15 135 125 -118 27 123 55
4940 55 45 -55 -54 46 57 24 35 34 -31 76 96 -18 -46 -17 -47 -16 24 127 35 57 -123 43 81 -16 98 -21 49
4967 49 89 -29 -44 1 -34 -24 7 -152 80 11 -49 -8 60 -91 -8 11 76 40 17 57 13 -15 92 -12 -163 55
$$ packed form
4777a33K06O8o1j53J00J58j11k08J86M2l5k13K2J55N7k6j16J54Q1j71lJ87j34
4800E2k2K3m0O7j42M7m3J4j1J05k4K3Rk62L02l9j77J69n4M6r6j8J1Q8k2p8k2P3
4828b1K4k5j6J75o9r6J39q9M5j78J80j47J2m8J69j8m7j9o2J15j14K65o3j52M9
4853Imq8Q0j8N5j4L5j3j8j13J33q9m9l2LJ32J5Nj56K00n9R7r1l7M1kqm3j2J00
4883E9p9J01j41kQ1J00j68J39j93J58j1k1l0m8J59j07l5Q6K4j5n8oRm3p6L2OJ18
4911C9Qm2o2K4K2l6mO4q0L8N1P7j75K07j20q7J34l5nK0o9pK3J50j0k43J45R6o8
4940E5j0j00JJ00J1l3J1jo5J07K0j14k8K9l0L1M0J03r2K2j80J66L8r7J14j19P0
4967D9M0j18j5M5l5J0L1j59K32o9o0M1O8j51Q3J9O5l6k3M0m4k8J07j04j51K18
$$ plain form
4993 55 -25 -5 -95 -53 -38 142 153 -17 -34 81 152 47 23 135 -30 -34 62 -66 -85 20 45 113 135 59 27 -105
5019 -105 -6 -73 -108 8 57 16 42 26 25 36 8 -22 -59 -19 42 -82 181 87 -24 39 63 105 126 -33 -22 -29 60 20
5047 20 -44 133 75 103 3 15 52 60 105 -58 9 51 81 55 -67 -11 -7 -71 -91 -59 63 54 73 39 51 2 30 -31 -66
5076 -66 136 -23 -58 57 -63 119 -83 27 79 -11 -3 -61 206 40 154 105 55 93 -89 -47 28 9 -111 31
5100 31 -2 -6 -48 28 1 -117 78 211 1 86 -18 -3 70 22 68 26 -67 24 -33 -50 -63 10 100 -21 -48 36 104 27
5128 27 59 42 14 56 -16 -5 -165 46 -57 47 -8 -115 0 -74 107 -96 41 181 -4 25 -20 60 -70 -38
5152 -38 -41 -29 31 -89 -25 -72 -30 28 21 79 77 -9 152 20 6 -8 -3 90 -16 -82 -3 -3 14 57 86 -62 160 59 -40
5181 -40 44 24 -4 9 -45 -23 -48 80 50 102 23 49 -20 -16 -115 -130 -115 152 23 104 12 -92 -25 -40 32 -80 70 7
$$ packed form
4993E5q0K0r0M2J5J80J1j70j7J15P1j05k4J12j65mR6j28j9J05K5O8K2p6l2j32
5019a05R9o7l5J16M9m1K6j6jJ1k8l0l7M0O1j24K63r4j11O3K4M2K1j59J1pQ9m0
5047B0o4J77n8K8j00J2L7QM5j63O7M2L0k6j22N6Mo4k0L2J22rJ9l4J2m9K8o1l5
5076f6K02j59l5J15j20J82k02J10N2r0Qn8K67j66J14m9n0L8j82M2P5j9j20J42
5100C1l3mm2P6k7j18J95J33k10Q5j04J5P3m8M6m2r3R1n7j7j3P3R0j21k7Q4O8p7
5128B7L2j7k8M2p2J1j60K11j03J04n5j07J15p4J81k03J37J40j85K9m5Q0j30L2
5152c8lJ2O0j20O4m7M2N8pN8kq6J61j32j4j4NR3j06o6P9%J7M3K9j48K22j01r9
5181d0Q4k0k8J3n4K2k5J28l0N2p9K6o9Mr9j5J5K67j29Q1r2j04O7j5P2j12J50o3
$$ plain form
5209 7 -43 83 -114 -64 -11 6 -93 -36 -135 2 93 41 -80 26 49 -26 -5 103 101 88 7 1 114 -1 -55 40 123 169
5237 169 -73 -91 13 -12 105 23 -47 20 -13 56 -58 90 16 14 -33 18 10 79 138 26 68 -32 -17 36 -28 6 -74
5264 -74 -39 -5 -88 10 39 96 -9 40 78 -7 1 75 -85 -21 -14 7 -10 -56 -28 -60 145 36 -69 -94 60 -44 -29 88
5292 88 85 -8 -58 -47 -10 99 -81 61 -16 51 5 -85 13 0 -67 1 127 5 -12 -67 73 36 -97 -42 86 10 -58
5319 -58 77 57 -66 -113 -124 9 12 71 26 110 71 62 10 81 37 -112 -80 -4 -8 6 61 -57 15 -27 -38 -41 82 4 13 44
5349 44 43 -9 -14 26 118 69 -185 51 -92 112 -110 61 -14 -19 20 67 161 81 84 85 -8 -102 2 62 19 25 -27 16 -24 130
5379 130 -19 -74 -16 -3 -2 -4 146 -155 -47 9 -52 -48 88 -140 64 -133 -45 41 115 7 26 5 50 -75 41 107
5405 107 60 -17 -75 -50 -54 0 12 31 -35 52 35 17 57 9 -72 149 -39 26 46 11 46 1 -44 -32 -72 -3 -45 45 16
$$ packed form
5209Gn0J26j97N0N3J7r9N7r9J37R1n2j21J06K3p5K1J08kj3q1oJ13j15n4R5Q3M6
5237A69k42j8J04k5J17q2p0O7l3O9j14J48p4km7N1qO9N9j12M2j00J5N3o4L4q0
5264g4L5L4q3R8K9N7j05M9L8q5QP4j60O4PK1j7m6K8l2K05j09j05k5J54j04J5J17
5292H8lr3n0J1L7J09j80J42p7O7m6r0R8j3o7O8J26j22j7n5J40l7j33N5J28p6o8
5319e8J35k0j23m7j1J33LN9m5Q4l9rn2P1m4j49L2P6mJ4N5j18P2m2j1lJ23p8RL1
5349D4jn2nM0R2m9k54K36j43K04k22J71p5nL9M7R4q0LJr3r4J04O0m3On2M3m0J54
5379A30j49n5N8J3JkJ50l01J08N6o1MJ36k28K04j97Q8Q6P4j08J9k1M5j25J16O6
5405A07m7p7n8K5mN4J2J9o6Q7j7j8M0m8q1K21j88O5K0l5L5m5m5J2m0O9m2R0k9
$$ plain form
5434 16 53 -142 165 -44 -7 31 132 -17 -28 -56 -82 -84 9 66 9 -10 -81 -17 43 -23 -87 58 43 -16 32 -14 115
5461 115 78 -100 64 87 -17 -178 91 -23 81 -81 74 120 -2 52 1 29 -41 12 -147 -12 -48 -53 -23 -65
5485 -65 40 -23 -103 58 -63 -18 36 -19 -176 52 4 99 -65 2 -44 0 -109 43 108 55 16 29 -49 -44 29 78 56
5512 56 170 93 46 -1 119 -104 26 -31 33 -51 -69 111 -38 170 144 62 -59 -105 13 55 -75 64 -85 -24
5536 -24 -3 -119 51 39 15 -62 -101 -26 -38 32 -56 -40 111 95 94 23 -37 20 75 91 -102 -68 80 75 44 27 90 70 32
5565 32 -57 -48 29 -10 21 23 63 77 -9 -84 7 -81 -34 -22 -56 83 49 71 -7 -13 66 -16 16 -146 70 54 57 -63 55 1
5595 1 -137 -101 45 43 -71 37 -85 90 50 -42 21 115 -52 61 -100 0 4 134 10 5 114 34 -2 21 107 34
5621 34 60 7 108 -39 -106 -62 -100 -108 73 -43 -10 21 -52 -42 -25 -57 -94 115 22 -9 44 86 46 -9 29 -26 128 -25
$$ packed form
5434A6L7j95L07k09L7L8J01j49j1k8k6kR3N7n7j9p1O4O0o6o4J45j5n9M8m6J29
5461A15l7j78J64K3j04j61K69j14J04j62J55M6j22N4n1K8p0N3j59J35l6nL0m2
5485f5J05o3q0J61j21M5N4n5j57K28m8R5j64O7m6M4j09J52O5n3l9J3p8NP3M9k2
5512E6J14p7m7m7J20k23J30n7O4q4j8J80j49K08k6q2j21m6J18M2j30J39j49O1
5536b4K1j16J70j2k4p7l9P5j2P0q8J6J51j6jp1o0N7N5J6j93L4J48nl1j7O3k0l8
5565C2q9RP7l9L1KM0J4q6p5R1q8M7J2l4J39l4K2p8oP9q2L2j62K16j6Lj20J18n4
5595Aj38L6J46kj14J08j22J75m0r2O3R4j67J13j61J00MJ30j24nJ09q0l6K3Q6p3
5621C4K6n3J01j47o7M4l8qJ81j16L3L1p3J0J7l2l7K09r3l1N3M2m0n5L8n5J54j53
$$ plain form
5649 -25 50 -19 -85 0 40 -37 -62 38 -49 -14 149 67 -23 42 64 51 -4 -21 -14 129 -45 14 134 65 53 18 -6 9
5677 9 -115 -60 39 -88 -56 112 80 12 -132 -129 -46 -82 17 -61 41 124 65 44 -61 -7 45 1 -54 54 -21 133 35
5704 35 -11 69 78 60 12 61 -56 15 44 -32 -34 89 70 33 -29 83 -55 -3 -38 27 -81 -29 -3 -29 69 53 -72 105
5732 105 66 67 169 75 -90 92 -4 -5 12 22 16 -46 85 -11 18 3 115 -15 78 25 61 -41 1 -5 -19 -55 -43 52
5760 52 164 -6 -18 15 17 86 69 17 -50 15 -60 7 -51 66 11 -65 24 -129 -111 -1 -77 -64 56 93 20 10 82 132
5788 132 -41 43 5 38 71 80 26 -8 25 23 29 0 -44 52 107 -3 26 25 20 39 8 86 66 29 27 -63 -12 -12 -123 85 68
5819 68 54 -45 23 2 -43 -121 -7 85 66 66 129 -13 31 11 -34 -24 35 113 18 121 -68 70 -92 78 138 -24 13
5846 13 -136 14 -37 91 57 10 18 7 96 -67 11 -104 4 109 82 -4 -62 -14 44 104 36 -4 -78 18 -19 6 54
$$ packed form
5649b5P5o9o6Q5M0p7k5J00q7L5J63q2r0O5K2j3n5j7PJ43j74N9J20o9j2l5k4J5
5677Ij24N5R9j27L2J68l2o8j44LQ3l6R9p8J02Q3n9k1j05N4N2m4n5J08p5J54r8
5704C5m6Q0Rj8m8M9j17P1K9p6kJ23j9l7o2J12j38N2l5O5j08N2K6k6R8j6j25J77
5732A05l9JJ02r4j65J82r6jJ7J0oo2J31r6K9j5J12j30R3n3L6j02M2oj4l6J2R5
5760E2J12j70j2L3KO9j7n2o7O5p5O7n8J17n5p6Q9j53J8J10p6J3J20L7p3j0P2N0
5788A32j73Q4l8L3L3Rn4l4L3kOk9m4R6N5j10K9jnJ9l1P8k0l7kr0N1%j11K08j7
5819F8j4r9O8k1m5p8J14R2j9%O3j42M4k0m5J0N9P8r5J03j89J38j62J70O0j62L7
5846A3j49J50n1J28l4m7Qj1Q9j63P8j15J08J05k7q6n8M8N8O0o8m0p4R6l7K5M8
$$ plain form
5873 54 197 -59 86 24 -5 9 40 85 -47 -22 64 97 -20 -22 -84 86 -188 -20 26 -40 45 -43 49 25 -25 38 7
5900 7 -68 98 23 -28 -12 -59 -29 41 74 -32 -13 -14 -31 -101 10 20 -51 41 29 69 -63 82 -41 -11 -59 -39 -19 -50
5928 -50 -137 -27 -58 6 -78 -59 -30 19 56 1 -59 75 -64 77 -72 -4 -13 10 50 2 66 -35 92 -39 8 -36 46
5955 46 -36 -10 -115 -25 14 23 12 90 -80 -98 78 -72 25 -57 13 -12 -50 0 -31 41 -97 -20 175 -11 -20 -22 202 57
5983 57 97 34 27 132 -9 6 38 13 25 -83 -3 -53 12 22 -13 31 -76 -29 162 67 40 55 -8 91 27 -85 -37 -21
6011 -21 35 -16 9 -2 -39 5 -54 -55 45 34 -58 39 30 20 60 13 76 46 -7 7 114 -53 15 -47 61 -69 71 39
6039 39 78 93 -50 106 19 -7 -21 -29 62 38 -55 4 -21 27 117 -69 -7 22 -88 -16 -41 7 -23 86 61 -4 21 62
6067 62 -197 -3 13 -62 40 1 18 -103 120 -21 -53 70 45 13 26 -74 143 -23 -8 -48 57 90 35 85 58
$$ packed form
5873E4J43k56J45o2k9J4L1M5j32K5Q6L3j17ko2J70k74J68M6o6Q5q8R2k4n0O3l1
5900Gp5J66p5n1J6m7L0P0L3j06J9jj7p0J11J0p1R2j2M0j32J45j23L0m8K0K0l1
5928e0q7J10l1O4q4J9K9M9L7n5o0J34j39J41j49O8rK3M0m8O4j01J27j31M7m4Q2
5955D6q2K6j05R0L9Rj1P8j70j8J76j50R7q2P0k5l8N0l1P2j38P7J95j86rkK24j45
5983E7M0o3pJ05j41J5L2k5J2j08Q0n0O5J0l5M4j07M7J91r5k7J5o3R9o4j12M8J6
6011b1N6n1K5j1l7M4n9jJ00j1r2R7rj0M0m7O3l0n3J4J07j67O8o2J08j30J40l2
6039C9L9J5j43J56q7k6j4qR1k4r3N9k5M8R0j86O2K9j10P2k5M8l0J09k5o5K5M1
6067F2k59J94J6p5J02l9J7j21K23j41l2J23k5l2J3j00K17j66J5m0J05L3n5N0k7
$$ plain form
6092 58 -11 41 -34 35 87 -55 -34 -4 -53 -12 -13 -4 -13 7 -34 -140 -41 -3 -44 -98 -55 33 68 -39 -11 -58 0 73 101 10
6122 10 13 -72 114 -23 -2 120 62 -47 96 52 38 12 40 30 33 17 2 38 24 9 -53 -60 124 35 73 14 13 131 102
6151 102 24 98 11 113 -106 90 75 -2 8 -62 3 -63 -8 43 -71 19 59 -2 35 94 101 -46 -34 54 39 56 -100
6178 -100 -56 -31 -23 52 -78 -116 72 58 140 81 -74 77 15 138 9 52 -93 -69 21 -71 -66 42 -50 2 -91 -60 -65
6205 -65 -38 31 38 34 -74 116 107 -13 105 -9 -96 -12 17 -154 -9 -75 22 9 50 59 -91 -53 -129 -79 62 -114 68
6232 68 30 -63 -17 96 36 -39 38 -25 142 59 61 24 58 102 -6 54 -69 68 2 -50 -135 -41 -41 -112 65 6 32 -80
6260 -80 47 73 -77 22 -16 -41 89 31 60 -97 81 -6 -187 -17 89 70 18 30 169 12 -43 90 22 -25 -59
6285 -59 29 -62 13 105 96 -46 18 11 -94 93 -6 -38 14 -88 57 -98 -60 65 -74 14 10 -57 75 23 -45 23 -95
$$ packed form
6092E8o9N2p5O9N2j42K1L0m9M1jRrK0m1j06R9L8m1n4M3Q8L5j07K8m7N8P3K8r1
6122A0Lq5J86j37K1J22n8j09J43m4j4k6K8j0Lj6j5L6j4j5o2pJ84q9L8n9jJ18k9
6151A02p8P4q7J02k19J96j5p7J0p0O5o6N5N1j14R0M0o1L7N9Pj47J2Q8j5J7j56
6178a00M4K5QP5j30l8J88j4Q2n9j55J51o2J23j29M3j45K4R0r2NJ08r2N2r3L1n
6205f5K7O9Pmj08J90rj20J18j14q7Q4K9j71J45o6R7j3M1Rj50L8p6N0J41j76J82
6232F8l8r3M6J13o0p5P7o3J67q3Kl7L4M4j08O0j23J37o6n2q5R4%p1J77n9K6j12
6260h0J27K6j50R9l8k5J30n8K9j57J78q7j81J70J06j9n2J2J39j57n5J33o8m7l4
6285e9Q8r1P5R2rj42O4pj05J87r9l2N2j02J45j55L8J25j39Q8mo7J32n2o8O8j18
$$ plain form
6312 -95 -108 18 -14 -77 55 99 -51 30 5 49 -16 84 49 44 47 47 27 22 -50 -66 170 7 -34 30 -3 12 -55 3 57
6341 57 -69 13 -105 41 6 -47 100 8 -13 -17 -18 4 17 -18 14 27 -35 -3 -48 41 5 69 51 49 88 53 80 60 64 113
6371 113 58 56 89 -102 -89 -4 98 25 78 88 -30 73 22 13 189 -8 -16 58 37 18 40 42 70 -12 -36 -112 24 -15
6399 -15 -93 -114 -3 -44 -145 69 87 3 25 61 -35 72 62 -29 -9 -70 -8 64 -11 65 1 -21 71 35 -24 69 61 119 -114
6428 -114 46 133 24 -3 -30 17 -164 61 -34 24 -81 -42 -21 80 23 4 -41 0 -25 7 -26 38 21 9 86 -21
6454 -21 90 -76 24 -41 77 -1 -71 82 36 27 99 139 72 34 -59 -60 149 82 74 51 64 36 -166 -101 -22 -9 -3 47 79
6483 79 9 -65 -35 -50 -130 -26 -16 -2 9 38 -2 21 -8 -14 -74 65 58 -38 23 -12 -5 51 25 56 67 4 25 -141 -34 136
6513 136 12 -9 7 96 32 91 64 -36 -58 -44 86 41 12 -72 65 49 -147 -3 32 0 -12 94 26 13 -10 -50
$$ packed form
6312i5j3J26l2o3J32M4j50Q1k5M4o5J00l5nL%k0np2j6K36j63m1O4l3J5o7N8N4
6341E7j26Q2j18J46l5n3J47r2k1mjK2J3l5L2J3o2L2m5Q9l6O4j8kL9l5K7k0MM9
6371A13n5kL3j91J3Q5J02p3N3J0j18J03n1rJ76j97qP4k1j9K2KK8q2k4p6J36l9
6399a5p8k1J11m1j01K14J8q4K2L6r6J07j0r1K0o1O2P2p5P6o4k2R2l6n9R3qN8k33
6428a14J60Q7j09k7k7M7j81K25r5N8j05L9K1J01n7j9m5M1k5L2l3O4j7j2P7j07
6454b1J11j66J00o5J18p8p0J53m6rP2M0o7l8r3jK09o7qk3J3k8k02O5P9J3ON0L2
6483G9p0p4L0j5q0J04J0J4J1K9m0K3k9oo0J39pr6O1l5PN6k6L1J1o3K1j66J07J70
6513A36j24k1J6Q9o4N9k7j00k2J4J30m5k9q4J37j6j96J44L5l2j2J06o8j3k3m0
$$ plain form
6539 -50 -32 -45 78 78 90 34 62 -127 -64 -131 -62 16 -52 11 -145 -41 13 68 -71 -18 116 -20 -19 -77 -36 56 34 -68
6567 -68 -6 -58 27 -1 84 37 26 16 11 118 -105 139 -24 -33 -18 28 72 44 -69 -7 38 -27 -21 -35 77 66 -121 -61
6595 -61 -47 -65 15 18 81 47 72 3 4 -39 53 30 -53 129 -65 -18 12 66 -33 -41 4 48 -13 -33 -16 -5 -68 7 -6 25 46
6626 46 116 -46 -47 -74 -113 -61 -30 74 3 -14 -131 -41 -19 44 2 64 40 67 -37 44 -28 41 -95 76 -19 -115 -30 -32
6654 -32 20 11 -28 116 -25 -40 -92 -92 -49 -86 5 -6 -22 15 -69 22 61 27 -19 -15 -65 118 33 8 42 2 -105 -28 -112 34
6684 34 69 90 158 20 -74 141 -1 -14 92 -42 24 -36 -67 -16 47 92 -41 28 42 28 -141 19 -45 -42 37 34 8
6711 8 121 53 -24 82 71 46 106 11 74 82 10 56 -41 88 38 23 35 1 -48 -26 -60 -72 78 -41 -15 83 -26 40
6739 40 -33 106 -66 -65 -25 120 -41 38 -29 -105 3 5 36 51 -49 17 99 -65 3 -27 -20 -14 15 -28 104 113 19 -28 -88
$$ packed form
6539e0J8j3J23%J2n6K8j89O3o7O9P8o8O3j56J04N4N5j39N3J34j36Jn8M1R2k2j02
6567f8O2n2Q5k8Q5m7j1j0nJ07k23K44j63rJ5M6M4k8j13O2M5o5Oj4J12j1j87O0
6595f1J4j8Q0LO3l4K5o9Jm3R2k3q3J82j94M7L0N4r9qM5M4o1k0J7J1o3P5j3L1K1
6626D6P0j62jk7l9N2L1J04p1j7j17R0K2O3m2O2k4K7j04Q1p2O9j36J71r5r6Q5k
6654c2N2rl9J44j41j5n2%M3l7R1j1j6L7q4R1L9l4m6Mn0J83q5k5L4m0j07P7q4J46
6684C4L5K1O8j38r4K15j42j3J06j34O6o0l1N1O3M5j33O9J4j4j69J60o4LP9lk6
6711HJ13o8p7J06j1k5O0r5O3Qp2M6r7J29n0j5J2l4m9K2l4j2J50j19K6R8j09O6
6739D0p3J39j72JM0J45j61P9o7p6J08KL1J5j00O6Q2j64O8l0POK9m3J32Rr4m7o0
$$ plain form
6768 -88 -15 -54 125 37 -26 -17 -23 46 -36 -22 -49 -120 -14 -38 -34 -83 -10 -9 142 20 64 1 -23 -39 -61 1 -102 -55 -30 -29
6798 -29 -67 -6 -8 80 36 116 -27 65 -24 -3 8 -8 -9 -19 19 -42 14 -14 34 45 44 1 134 -16 -23 -73 35 84 -165 10
6828 10 -2 -156 -49 83 56 42 175 -11 -35 36 10 45 -7 -4 -63 46 -31 18 -30 101 -4 -49 -199 -66 -65 50
6854 50 99 4 -50 -52 4 -53 75 2 0 40 -45 20 -47 207 76 -81 3 10 -118 62 -17 -56 56 115 -153 15 -26
6881 -26 -22 44 -25 39 139 -27 -22 -13 -15 -26 -20 81 33 -48 -3 58 89 -27 23 -16 70 120 88 9 -2 -62 89 64 39 -64
6911 -64 18 -44 -52 38 70 25 -1 -14 43 -17 -82 1 74 -26 6 86 -132 -63 42 -45 -13 -18 37 -31 111 -48 -85 67
6939 67 5 -9 -21 50 -166 -32 -12 -93 17 -77 58 -29 3 61 113 -45 48 58 125 14 12 -18 -48 -51 25 141 -94
6966 -94 62 54 -4 2 5 76 -7 -85 43 89 -8 15 108 -55 104 1 -55 -6 34 -7 68 35 60 -74 57 167 22
$$ packed form
6768h8P3l9J79q8o3RoO9q2J4k7p1J06k4Mm9P3JJ51j22M4o3k4j6k2O2j03M7K5J
6798b9l8O1kQ8m4Q0j43R2q9K1J1j6jj0L8o1N6k8M8J1jm3J33j50pn0J08M9k49J75
6828A0j2j54J07J32k7j4J33j86k4P1k6L5n2Ln9J09p7M9m8J31j05m5j50J33JJ15
6854E0M9r5n4kN6n7J28p3kM0q5O5o7K54j31j57Q4Pj28J80p9l9J12N9k68J68m1
6881b6MO6o9O4J00j66NRkj1OJ01m8q1M5O1L1j16N0l9Q6N0l2p9j1o0J51k5k5j03
6911f4Q2o2qR0L2m5k6j3N7o0o5Q3P3j00L2Q0k18O9J05q7L2nN5o8J42j59l7J52
6939F7o2j4j2P1k16J34K0q1J10r4J35q7L2N8N2j58R3J0O7j11kl0l0lP6J16k35
6966i4J56qn8OLP1q3p8J28M6r7K3R3j63J59j03n6M9M0m1P5l3K5j34J31J10j45
$$ plain form
6993 22 -53 45 62 42 80 -78 40 -79 -80 -52 40 79 74 50 49 -74 -77 28 64 -5 -37 -57 68 27 -20 88 51 13 -60
7022 -60 28 89 -35 26 -12 56 27 -154 -25 102 34 0 139 87 -70 -68 66 -8 -123 -77 127 91 137 47 3 156
7048 156 41 71 26 -91 38 -59 14 -40 12 80 -22 -69 -76 48 -98 -39 -34 102 -46 11 -4 -59 -99 -29 -70 7 75
7075 75 -17 -89 20 17 -126 68 -50 -1 -15 45 -94 0 11 -62 38 96 -8 -18 69 -3 -40 -57 25 27 61 -22 74 64
7103 64 85 57 114 118 11 -28 -57 100 -43 -67 -52 -25 20 -92 -9 108 4 -23 15 -102 69 81 -53 75 -73
7128 -73 -34 78 -55 -42 48 29 6 43 46 32 60 132 -58 86 57 66 -32 27 61 -21 104 -122 11 66 60 26 4 47
7156 47 -165 79 12 -4 -35 -58 -54 47 -9 88 -43 21 40 -55 11 131 -26 -139 35 -30 -57 95 -30 92 27
7181 27 -25 81 -45 17 99 45 -126 69 113 147 -7 -1 41 -21 107 86 5 -13 15 -44 -12 8 -1 -59 -53 -25 -27 16 -82
$$ packed form
6993B2p5R8J7k0L8j58J18j19jK8R2L9nk4jj23lJ05L6o9l2k0J25m1m7J08l7l8p3
7022f0Q8O1j24O1l8O8k9j81J29J27o8l4J39n2j57KJ34p4j15M6K04l6M6r0m4J53
7048A56j15L0m5j17J29r7P3n4N2O8j02m7pJ24j46N9NJ36j48N7j5n5m0P0m1P7O8
7075G5r2p2J09lj43J94j18M9j4O0j39R4J1p3J00N8j04j0Q7p2l7j7Q2KL4q3R6j0
7103F4K1k8N7Mj07l9k9J57j43k4J5K7M5j12Q3J17j04k7L8j17J71J2j34J28j48
7128g3L9J12j33J3R0j9k3L7Lj4K8P2j90J44k9Rr8N9L4q2J25k26J33N5ol4k2M3
7156D7k12K44o7j6l1k3MJ01n6R7j31O4J9r5O6J20j57j13J74o5k7J52j25J22o5
7181B7n2J06j26O2Q2n4j71J95M4L4j54OM2o2J28k1q1j8K8n9L2K0rn8OK8kM3r8
$$ plain form
7210 -82 -17 -46 -30 39 -57 40 29 151 -87 -74 -36 -45 -7 -65 11 37 -12 -11 12 77 -18 -20 10 9 6 98 77 49 133 44 94 5
7242 5 20 45 85 -1 88 -68 69 57 -1 -66 76 62 -21 69 0 10 -12 -49 -83 43 80 29 45 73 10 -54 69 -11
7270 -11 -18 112 -40 63 -71 55 -177 -25 49 -92 49 12 46 -163 -18 56 28 36 112 78 -11 48 59 29 27 -111
7296 -111 27 26 -85 47 25 -58 23 57 39 17 23 -16 57 -38 -1 -61 117 5 -14 -66 5 -91 2 -47 14 -45 -108 122
7324 122 -111 -21 18 -81 -35 32 17 57 11 69 26 111 6 -60 -49 -22 -70 -45 28 40 -123 20 53 -1 -68 -12 -128
7351 -128 -3 7 -30 -61 34 47 34 108 130 -43 -59 56 25 -22 -4 -66 21 -62 -134 42 -178 -2 11 24 -53 56
7377 56 47 -55 -3 -166 99 47 -57 -20 -73 -49 28 -22 89 -46 195 51 -53 25 -57 -35 39 18 -129 -68 -65 -32
7403 -32 -69 -56 3 56 144 21 -86 -6 -18 54 -129 -43 -2 53 -23 -108 -94 -56 -129 -181 0 -21 -3 -11 -16 -4 -37 69 40
$$ packed form
7210h2O5k9J6O9r6R7j1J22k38J3L8rL8n8P6K6m9JK3O5r5kL0jlR2k1k8Q4q9N0q9
7242EJ5K5M0q6Q9j56J37j2n8o5J42j4q3R0o9J0k2l7l4J26L7n1J6K8o3o4J23q0
7270a1pJ30j52J03j34J26k32J52P4j41J41l7L4k09J45P4k8QP6l4q9N9J1l0kj38
7296a11J38jj11J32k2q3Q1L4j8k2Ol9P3r5L7o0J78j12j9n2P1r6R3m9O1n9o3K30
7324A22k33R0L9r9M6O7j5M0m6N8m3Q5j05o6J1K7m8K5P3J2j63J43L3n4o7N6j16
7351a28J25J0l7l1R5J3j3P4K2j73j6J15l1m7J8o2Q7q3p2J76k20J76J3J3p7J09
7377E6rj02N2j63K65n2j04L7n3K4P7n0J11j35K41j44j04P8q2K2P4k1j47O1LL3
7403c2l7J3N9N3Q8j23j07Q0j2P2j83Q6M1N5p6q5J4L8p3n2J81k1J8qnJ2l3J06k9
$$ plain form
7432 40 -46 -73 61 -5 14 -12 -72 -71 -156 77 168 44 -32 48 -41 4 -6 -2 -28 -13 -23 -54 -4 -136 -46 -70 -22 -4 -34
7461 -34 -35 -32 -6 -63 -48 85 -94 -41 69 -19 88 -31 -46 65 -48 17 43 28 -96 21 4 -38 -80 -50 27 76 31
7488 31 203 52 33 9 -48 -78 -102 -6 99 -182 -1 10 147 104 3 57 -20 -42 31 8 34 -6 -93 14 87 22
7514 22 -48 -109 -73 132 -31 112 -40 -161 -7 -69 35 -41 -42 -49 -45 116 -108 -56 -105 86 20 41 55 -38 117 74
7540 74 -77 -85 -35 30 16 114 -136 72 77 -105 36 -27 -73 -10 83 -25 -66 122 13 -63 -7 -44 -41 113 -42 53 -34
7567 -34 -7 -39 -32 20 -1 36 27 27 -10 20 -51 -25 -59 24 22 -71 -86 -45 105 78 -78 -13 -65 -79 54 52 3 27 90 -91 -100
7598 -100 22 -37 12 4 -22 -39 69 135 -38 1 -18 -133 -65 -50 94 173 3 -78 128 40 -48 -66 -7 -27 60 51 -65
7625 -65 -41 -122 -30 46 -28 9 -85 -72 97 30 -152 -21 1 -57 -5 -32 83 32 -24 -110 124 -92 -2 -69 72 94 -61
$$ packed form
7432D0q6k7J34o6J9k6o0Jq5K33R1j24p6Q0q9M5j0Mk6J5j0l1N0j32R0k4M8J8l0
7461c4jLK6n7J5J33j79N3J10q8J07j19j5J11j13O5K6j5j24J17j7m2m2L0P7M9m5
7488C1J72j51j9k4n7l0k4R6J05k81J81J1J37m3j01N4p7k2P3k3K6m0q7J07P3o5
7514B2p0o1L6K05j63J43j52j21J54o2J04p6jpMJ61k24N2m9J91o6K1J4r3J55m3
7540G4j51qN0O5j4R8k50K08Nj82J41o3m6O3R3j08m1J88j09p6N6l7LJ54j55R5q7
7567c4K7l2PN2k1L7r%l7L0p1K6l4Q3kr3j5M1J50k7j56O5n2j4J33km9K4O3j81r
7598a00J22n9M9qk6j7J08O6j73L9j9j15O8J5J44P9j70q1K06q8q8j8N9k0Q7rj16
7625f5K4q1R2P6p4L7r4J3J69o7j82J31K2n8N2k7J15n1n6q6K34k16R0o7J41K2j55
$$ plain form
7652 -61 66 15 44 -58 -29 11 -7 8 28 -62 105 -30 88 -24 11 -24 25 65 30 -79 35 80 52 -133 -13
7677 -13 4 -135 -101 -62 14 15 -133 5 34 -59 81 61 -20 27 34 18 86 25 -8 -76 -148 -55 -20 33 126 39 34 -73 9
7706 9 31 -35 84 183 -5 52 -2 -108 111 -3 -42 -23 -85 52 26 54 -43 85 67 -67 34 25 26 70 -97 -80 32
7733 32 7 -9 -12 -18 133 51 74 90 52 152 9 27 8 93 55 -6 -134 3 149 33 22 -8 -78 10 4 100 66 8
7761 8 94 75 -65 62 -28 74 50 57 -32 20 -56 -66 48 -127 42 -53 32 -62 51 15 -71 -55 13 61 -73 -11 -53
7788 -53 10 -58 6 83 -34 52 24 20 69 37 91 61 -18 -47 9 34 100 -83 -26 -1 39 36 44 -31 144 14 1 -61 -78 84
7818 84 5 -85 9 96 -73 -7 41 74 70 -21 -92 -29 -140 3 -51 133 101 85 101 -27 -70 -4 10 49 -11 2 17 -105
7846 -105 -35 94 56 -37 -32 -19 -32 -8 -58 -97 83 56 59 45 -69 -15 -45 -148 83 -18 -110 33 59 28 -112 -144 4
$$ packed form
7652f1J27n1K9j02K9M0j8J5K0r0J67j35J18j12L5l5M9M0l5j09J14M5k8j85J20
7677a3J7j39L4L9P6Jj48J38K9r3J40k0q1M7Pj6O8o1l3o8p2R3L5N3R3q7nj07Q2
7706IK2o6J19R9j88N7n4j06K19j14l9J9o2J37k6K8r7J28j8j34J01rJM4j67J7J12
7733C2k5j6loJ51q2K3J6l8J00j43J8j9Q5l8o1j28J37J46j16j1l0p0Q8oR6l4n8
7761HQ6j9j40J27r0J02k4Pq9N2p6j0J14j75J69r5Q5r4J13l6q6J6O8M8j34O2m2
7788e3O3o8O4P7j17Q6k8mM9l2N4l0p9k9N6K5O6j83N7K5M0lQp5J75j30j3o2j7J62
7818H4p9r0R4Q7j69O6M8L3mr1p1O3j11J43n4J84l2j6J6j28m3O6J4L9o0J3J5j22
7846a05P0J29l8r3NJ3j3K4n0l9J80k7Lj4j14N4l0j03K31j01r2J43K6l1j40l2J48
$$ plain form
7873 4 50 80 58 38 30 -9 -58 -43 -111 87 9 21 45 53 1 70 72 -42 33 73 -65 -29 68 71 47 149 44 -86 -18 -60
7903 -60 -32 102 -132 108 -33 -67 70 8 93 84 -29 50 36 82 28 30 -22 101 43 30 73 148 -39 -26 70 -117 -4
7930 -4 72 61 -81 27 18 21 40 27 16 46 -86 83 63 53 -45 -71 11 36 13 -117 14 21 -15 -35 19 114 -97 48
7958 48 80 21 37 102 -33 33 5 3 -15 -29 61 41 39 -71 9 -45 126 -77 -159 -98 -81 16 -3 39 -3 -36 3 -60 39
7987 39 130 -10 60 -152 21 18 -134 69 -30 32 38 120 35 -4 -111 -1 55 76 -103 -74 -144 -4 -74 151 -43 36
8013 36 81 16 37 -16 -23 35 -1 41 50 -52 46 -72 -37 -104 -42 -25 61 28 9 -25 -47 -25 -106 -38 4 -1 -49 104 4 -30
8043 -30 -22 135 -106 165 135 66 73 -11 93 -55 74 23 94 1 152 11 -55 -12 -72 -3 -81 9 97 9 5 -39 -190
8070 -190 -92 0 -94 -26 -15 78 -38 -58 -30 -33 -107 -5 81 -8 22 -7 57 -81 -37 36 -28 17 -118 -26 13 -37 77 17
$$ packed form
7873DM6L0k2k0ql9m9J5o8J98p8J2K4Qn2O9Kj14P5M0j38L6R7Lk4J02j05j30O8m2
7903f0K8J34k34K40j41l4J37o2Q5rj13P9j4M6n4Kn2J23n8j3M3P5j87J3R6j87J13
7930dP6j1j42J08rLJ9j3j1L0j32J69k0j0r8k6Q2K5k3j30J31Pl6k0N4R5k11J45
7958D8L2n9J6O5j35O6k8kj8j4R0k0kj10Q0n4J71k03q2O1J7R7j9M2m2l3L9o3R9
7987C9R1j40P0k12J73lj52K03r9O2OQ2q5l9j07J10N6K1j79K9p0J40p0K25j94P9
8013C6M5o5K1n3pN8l6M2Rj02R8j18L5o7O2J7Q6l3j9l4k2K2q1O8M2nm8J53j00l4
8043c0QJ57k41K71l0o9Pq4J04j48J29n1P1r3J51j41o6M3o0O9p8R0Q8q8mm4j51
8070a90R8R2r4O8J1R3j16k0K8lp4J02Q6q9L0k9O4j38M4P3o4M5j35R2L9n0J14o0
$$ plain form
8098 17 -64 71 -91 -87 16 27 45 61 -12 79 97 20 75 8 81 18 2 -43 50 93 -75 76 42 6 90 72 -53 63
8126 63 -51 -159 55 58 4 23 -10 -40 -41 -35 -35 -1 121 21 -99 -111 -98 43 133 162 -23 19 -22 239 -7 70 9
8153 9 104 -32 58 -37 -13 77 -100 104 -101 50 -52 31 12 33 81 -15 85 146 42 -62 2 -62 -49 62 23 9
8179 9 -16 39 49 90 -3 52 -54 7 30 -27 -102 13 55 -24 -34 38 58 8 45 -57 -62 20 -25 12 68 105 -124 75 25
8208 25 -11 -16 37 -126 76 26 -82 -83 80 -53 -58 110 -24 -19 -26 -61 11 68 -13 -8 -54 -99 58 53 82 -19 63 77 -72
8237 -72 48 19 27 -44 -9 -14 110 -111 56 34 -35 10 -4 9 118 13 -50 131 -108 54 -22 50 -8 12 128 -12
8263 -12 -66 68 9 -53 -14 -34 97 -1 -59 -52 62 40 -33 -80 -1 34 66 10 -45 -28 -3 49 78 -47 43 140 42 -30 -33
8292 -33 -38 20 49 55 -28 -105 38 -80 -32 -78 62 60 -77 63 80 -62 52 -64 -55 66 8 -1 -8 -38 -3 -67 -36 -25 -63
$$ packed form
8098A7q1J35j62MJ03J1J8J6p3R1J8p7N5o7P3o3j6m5R3M3j68J51l4l6Q4j8j25J16
8126F3j14j08K14Ln4J9l3l0jO%L4J22j00j20j2J3J41R0K9j85M2m1K61k46P7o1
8153IR5j36R0r5K4R0j77K04k05J51j02Q3j9K1M8r6J00O1j04j04O4o4J3J11l9j4
8179Ik5N5J0M1r3N5j06O1K3n7p5J15M2p9j0P2K0n0L7j02nQ2m5L7N6L7k29J99n0
8208B5l6nN3j63K02n0j08jJ63j33nJ68j34Npl5P2N7q1Nm6m5J57nK9j01Q2J4j49
8237g2J20k9Qp1L5nJ24k21J67k2o9M5j4J3J09j05o3J81k39J62p6P2n8K0J16j40
8263a2n4J34n9o2L9k0J31r8n8PJ14k2p3m7P9L5L2n6n5J7K5N2K9j25R0R7r8p2l
8292c3nN8K9Oq3p7J43j18M8m6J40kj37J40J7j42J14j16RJ21n8rpl0L5o4L1J1l8
$$ plain form
8321 -63 49 82 71 -45 -16 58 -66 -69 46 44 -16 -1 24 85 -64 -15 163 32 84 28 -53 67 -15 -102 22 159
8347 159 -6 -11 52 157 -18 38 8 -116 -3 -57 45 23 31 93 -51 -16 85 -82 -9 -162 103 15 0 -154 -106
8372 -106 95 8 -7 36 -77 -14 132 -30 -26 31 -38 87 21 111 -74 -38 -1 -198 -15 33 -43 -12 72 27 -28 -33 -62
8399 -62 -12 35 8 66 -4 -33 -20 -109 69 -30 11 105 -83 70 13 106 -10 29 27 -120 55 41 65 -28 -8 80 -62
8426 -62 31 45 95 17 -53 -14 135 -54 -43 -119 -24 130 60 -67 147 -63 59 -48 -14 34 -50 1 -103 -36 -22 20
8452 20 95 -38 -9 65 85 -56 -16 82 6 39 -28 -21 -46 28 -88 34 49 -32 -21 153 -22 34 -15 79 -5 160 -65
8479 -65 -3 -98 5 -10 -56 161 -22 97 43 -67 10 -46 142 -51 -51 -17 -27 109 29 -21 -98 -38 -131 -36 -97 -88 -112
8506 -112 35 -63 -17 46 -16 -19 93 74 20 -40 77 -99 -28 5 33 -35 23 -54 -40 4 19 72 74 30 45 22 5 -22 69
$$ packed form
8321f3J12L3j1j16K9P4j24lJ15ko0J5K5O1j49M9J78j31N2n6q1J20q2q7J24J37
8347A59j65nO3J05j75N6l0j24J13n4J02k2QO2j44L5J01j67P3j53K65q8j5j54M8
8372a06K01q7j5M3j13O3J46j62MN7o9J25o6R0j85L6L7j97J83M8p6L1Q4m5n5nk9
8399f2N0M7k7N8p0k9J3q9J78r9M1R4j88J53n7R3j16L9kj47J75j4K4r3K0Q8j42
8426f2R3J4N0p8p0L9J49j89J1p6R5J54p0j27K14k10J22j07L4M8q4N1j04O7J4M2
8452B0P5j33K9P4K0j41M0R8p6L3o7Pk5P4j16J22J5q1J1J74j75N6m9R4q4J65k25
8479f5O2r5J03j5m6K17j83J19n4j10P7n6J88j93%L4j0J36q0n0p7O0r3R5o1Rk4
8506a12J47r8M6O3o2lJ12j9n4o0J17j76P1L3K8o8N8p7J4M4J5N3Km4J5k3j7k7R1
$$ plain form
8535 69 137 12 -45 34 53 -11 62 89 87 -32 -36 77 85 -41 -72 114 -4 54 76 -25 -54 -50 93 -6 16 39 24 14
8563 14 -1 -6 88 9 34 27 25 -51 88 10 140 -58 25 -3 -51 -50 -44 -67 -77 106 -82 -11 26 -87 -40 48 5 105 119
8592 119 -97 38 18 1 40 73 -38 -40 -134 -38 23 -23 -59 -53 42 -11 -33 -85 94 46 105 -41 27 -6 -70 2 -35 61
8620 61 -94 69 159 34 59 30 -5 -109 33 40 1 7 56 95 -83 -10 6 -54 -23 -4 -7 -105 58 39 2 -58 14 -120
8648 -120 -116 -15 52 105 -73 31 -37 -29 85 26 56 38 -30 -87 -62 47 17 7 -17 -107 -79 58 93 84 -40 39 74 -8
8676 -8 106 86 30 -132 -52 -16 110 33 81 -36 9 -78 -144 8 72 -1 92 -7 -39 38 27 -10 128 152 -146 39 -53
8703 -53 -41 15 13 -40 88 -50 -52 -9 95 -16 -62 -32 -60 87 40 -3 18 -77 66 87 -16 74 -34 -40 21 21 -50 -62
8731 -62 79 49 1 -8 51 14 6 60 1 -97 -224 -61 -111 50 -42 21 -3 41 -90 2 27 -78 -74 -70 -49 -58 13 -10 55 37
$$ packed form
8535F9O8j25n7P9J9o4P3K7kj19mJ13Qj26l1J86j18N8K2j01k9MJ43r9K2K3j5j0
8563A4j5nR4p9K5pkp6J39p8J30j98Q3k8m8JOk3j0J83j88P1L7j13M7Q8m3J00J4
8592A19k16J35k0j7L9L3j11kr4R6O1m6l6OR5n3k2n2J79m8N9j46O8l3o4P2l7R6
8620F1j55J63R0j25K5k9l5j04J42Pl9OM9L9j78P3J6o0L1J9lr8J63j9l7o0P2j34
8648a20MJ01O7N3j78J04o8QJ14n9L0j8o8n7K5J09l0j0k4r0K8J37L5rj24P9L5q2
8676hJ14k0n6j62Q0L6J26p7M8j17M5q7o6J52O4p3R3r9l2P7j1l7J38K4k98J85r2
8703e3J2N6kn3J28j38kM3J04j11m6L0k8J47m7m3K1r5J43K1j03R0j08oO1%p1j2
8731f2J41l0m8rN9l7qN4n9r8j27J63n0J61r2O3k4M4j31R2K5j05MMK1rP1k3O5j8
$$ plain form
8761 37 -64 73 -118 -6 -49 -146 -60 72 56 19 43 -135 -11 70 71 27 -82 41 130 -53 16 39 -70 -31 -28 57
8787 57 77 85 -13 -56 97 -17 73 5 6 16 -32 -68 86 -22 142 -46 -14 -56 41 -28 -59 -22 -84 -61 -14 36 -25 -7
8815 -7 55 -15 -100 0 42 94 78 112 54 -71 -53 26 -32 -23 -46 32 -4 -21 -55 27 -21 45 55 -14 48 -9 -49 14 81 98
8845 98 52 -22 68 -77 20 49 -71 19 -60 53 -63 69 188 57 -12 -140 25 -42 15 -45 2 -13 19 1 3 -188
8871 -188 -1 -142 -76 3 67 0 -70 5 -24 84 -5 -49 61 -70 4 18 -55 -113 -86 8 69 -61 27 18 28 35 -17 28
8899 28 -107 -7 -69 -76 -138 177 72 -183 29 -69 -79 31 -176 -4 -9 -34 -6 -8 -15 50 -14 35 55 17 -113 -52 99
8926 99 -2 33 97 -4 -65 -16 112 48 21 -7 -14 56 -86 24 -15 36 5 -49 22 13 -48 169 95 -45 -36 -80 -10 47
8954 47 -11 -3 -58 -73 -70 47 13 21 -4 27 -12 7 -54 -73 -108 -69 20 -14 -62 19 -30 43 94 -1 -27 -41 61 -15 -114 10
$$ packed form
8761C7j01J37j91J12m3r7Q6J32j6l7K4j78J24Q1Jm4j09J23Q9j83O9K3j09L9LQ5
8787E7K0Qr8m3J53j14R0o8JJ0m8l6J54j08J64j88L2m2R7o9l1L7o2K3M7N0o1J8
8815gO2p0q5J00M2N2j6L4n8j25J8P9n8Rk3P8l6j7l4Q2m8O6J0o9O2n7m0O3O7J7
8845I8m6p4R0j45R7K9j20R0p9J13j16J32J19j31o9j28J65o7N7o0M7j5L2j8Kj91
8871a88J87j41O6P9O4o7p0P5k9J08q9m4J10j31P4J4p3n8K7R4O1j30Q8rJ0Pn2M5
8899B8j35J00o2po2L15j05k55K12r8j0J10k07J72nk5K8kpO5o4M9K0l8j30O1J51
8926I9j01L5O4j01o1M9J28o4k7k8pP0j42J10l9N1l1n4P1ro1K17p4j40Rm4P0N7
8954D7n8Qn5j5LJ17l4Qk5L1l9J9o1j9l5L9Q9l4m8Q1m9P3N1r5k6j4J02p6r9J24
$$ plain form
8984 10 -51 -82 90 -28 1 111 -20 -9 -42 -49 43 -30 39 57 126 83 25 24 -52 -32 -24 101 6 30 8 -72 -60 32 -76
9013 -76 75 -9 -14 -17 101 10 84 -47 120 -80 -4 179 52 67 57 75 -28 -68 -50 -66 -99 6 -107 13 12 -19
9039 -19 -66 -24 13 45 -68 -91 54 -118 -29 9 -10 12 85 -158 -33 25 67 -42 23 -38 -69 0 -2 22 -98 44 77
9066 77 -53 -57 -6 -3 63 -118 -7 55 -83 -15 -22 -65 -93 34 58 -20 63 -109 15 -58 -38 -45 -35 -133 8 51 -26 68
9094 68 -6 38 66 -57 -105 -35 56 -16 15 6 1 -50 -95 -2 -32 41 7 -73 91 36 73 -72 128 76 -52 157 -65 60
9122 60 -46 3 19 49 -34 75 -1 -26 -159 -52 10 -100 1 133 -16 39 -40 -85 73 8 -51 37 -3 -39 -49 -140
9148 -140 -127 -31 37 -33 58 -40 -27 114 -10 16 72 8 36 167 -46 122 56 -45 21 -79 68 106 -135 -3 45
9173 45 59 36 -58 -48 -57 -60 33 -31 -46 -11 51 31 -175 43 -33 -43 22 -26 -40 -2 -51 -130 -36 -88 -105 30 30 -134 -43 30
$$ packed form
8984A0o1l1J72j18K9J10j31J1l3pR2p3O9J8O9m3n8jp6K0QJ25r5K4k2q0J2R2j08
9013g6J51q4nlJ18r1P4j31J67k00P6J83j27J5j0J8j03m0J8j6l3J05j13J20jl1
9039a9m7M2L7L2j13k3J45j72Q9L8j9K2P3k43J25N8M2j09O5o1l1O9kK4j20J42L3
9066G7j30mN1LO6j81J11O2j38O8pm3k8J27K4p8Q3j72J24p3K0pJ0r8J41M3p7R4
9094F8p4M4K8j23m8P0R1p2L1rnn1m5R3l0P3l4q0J64n5L7j45K00n2j28K09k22J25
9122F0j06M9J6L0q3J09p6k5j33J07O2j10J01J32j49N5p9m5J58o5n9Q8m0l6j0r1
9148a40J3R6O8p0R1r8J3J41j24K6N6o4K8J31k13J68o6j01O6j00J47L8k41J32M8
9173D5J4k3r4J0rlR3o4j5L5O2k0k06K18p6j0O5m8j4L8m9p9R4n2j7J35%j64R1P3
$$ plain form
9203 30 38 101 -82 -81 -31 28 55 114 4 -99 -13 27 -18 -21 71 43 57 28 2 -151 -48 -51 -46 -32 72 -53 89 3 -131
9232 -131 40 -65 -15 50 17 -131 58 -21 -104 -44 16 -12 -59 -7 -17 -66 27 15 30 -23 132 -86 -82 -50 -21 53 48 -89
9260 -89 -56 61 -100 77 -116 -58 25 -18 -123 -30 13 48 59 -24 41 -53 38 -20 27 66 6 2 -151 -129 -74 73 -46
9287 -46 11 65 -4 79 0 92 -50 30 -79 51 18 112 35 82 9 22 -38 -43 -58 -21 114 55 -15 -48 62 -27 -36 -90 -23
9316 -23 55 -36 -52 13 -3 -6 37 88 -40 -91 74 26 -10 53 -14 -49 -69 -93 -28 35 -81 42 -32 -130 115 9 17 -40
9344 -40 17 -89 30 35 -46 -12 -5 94 -142 75 57 -40 39 -14 -66 -28 126 32 93 -90 -111 -22 16 6 -44 83 8 -57
9372 -57 18 7 -12 -83 -187 -75 6 -42 -67 -62 -37 -51 -134 104 -52 -115 24 -31 7 17 -32 -33 -1 -53 -17 -27 -145 63
9400 63 -28 -47 6 -34 -2 83 -7 -98 -53 -55 6 -34 16 -59 -23 39 5 -22 34 58 -57 -57 -177 47 6 33 50 66 104 43
$$ packed form
9203C0QO3j83JN0N9K7N9j10j03Q6M0m5lR2k8J4k9k6j53J03lNJ4J04j25J42q6j34
9232a31J71j05N0O5l3j48J89p9q3O0O0k8m7N2j0m9R3j2J5n3J55k18ML2K9P4nj37
9260h9L3J17j61J77j93N8Q3m3j05R3M3L5J1q3O5r4R1n8M7L9o0mj53K2N5J47j19
9287d6N7N4o9Q3p9R2j42Q0j09J30l3R4p7M7p3J3o0nj5L7J35n9p0l3J10q9rn4O7
9316b3P8r1j6O5j6lM3N1j28n1J65m8l6O3o7l5k0k4O5O3j16J23p4r8K45j06Qn7
9344d0N7j06J19Nq1L4PR9k36K17j8r7P9n3n2L8J54r4O1j83k1Q9L8j0n0J27p5o5
9372e7P5j1j9p1j04J12Q1m8k5NK5j4q3K38j56o3J39n5L8J0m9jL2n2L6j0j18K08
9400F3r1j9N3m0L2Q5r0r1M5kO1m0N0p5L6O2l4k7N6K4j15%j20K24m1K7J7J6L8o1
$$ plain form
9430 43 123 -44 27 -138 -21 -61 17 101 59 74 -53 13 35 109 4 -12 64 60 -101 0 31 -81 23 -48 -58 51
9456 51 -67 -37 -135 42 -23 -49 -70 -36 -84 -168 -55 5 68 -55 86 -105 -124 49 -16 94 69 42 -20 52 93 -115
9482 -115 -41 27 -66 29 7 14 -67 -14 162 -49 162 -39 50 -81 58 14 -23 147 13 9 -107 -7 -81 -14 -6 -42
9508 -42 -15 31 -57 33 65 -3 128 0 -35 171 49 0 -37 -45 45 -28 96 46 103 -75 64 26 30 54 4 30 -9 0
9536 0 -88 57 45 28 -33 102 -96 4 -44 7 99 -4 1 105 30 109 -141 74 -67 96 16 -57 29 14 -24 -1
9562 -1 -37 -72 121 -28 -6 -1 16 -66 -36 -11 0 -19 -46 4 32 -63 -13 -25 -58 66 -37 10 39 17 69 -38 16 79 26
9591 26 -7 47 48 -29 -23 68 7 -68 -23 -17 16 -42 -121 43 -63 166 44 3 -88 -5 179 162 28 5 -46 -20 -29 -32 -55 -27
9621 -27 76 -66 15 -68 -67 -77 43 -109 0 -6 -63 70 -49 -69 -63 -61 -85 4 -7 -113 103 33 87 -46 -45 -48 -124 63
$$ packed form
9430D3Q0j67P1j65J17m0P8Q4m2J5j27O6K2P4j05j6P6mj61J01L1j12J04p1j0J09
9456E1j18L0r8J77o5k6k1L4m8q4J13O0O3j23J41j91j9J73o5J10k5k7o2P2M1k08
9482a15P4O8r3R5k2Pq1N3J76k11K11k01Q9j31J39m4l7J70j34mj16J00p4O7Ql6
9508d2K7M6q8R0L2o8J31j28l5K06j22m9l7qR0p3J24n0N7j78J39l8MK4n0K6l9R
9536@q8J45j2j7o1J35j98J00m8N1R2j03NJ04p5P9k50K15j41J63q0p3Q6j5l8K3
9562al6l5J93j49K2NJ7q2L0K5J1j9k7N0K8r5N0j2l3J24j03M7K9k2N2j07N4O3n3
9591B6l3N4Jp7OR1o1p5M5OL3n8p9J64j06K29j22m1r1Q3J84j7j34k3n1K6rlk3K8
9621b7J03j42Q1q3Jj0J20j52J09on7J33j19k0OKk4Q9j1j06K16p0N4j33Jlp6J87
$$ plain form
9649 63 -33 -24 73 -149 -56 -11 22 64 -36 18 37 -197 -74 2 85 130 99 -52 -10 64 -58 -40 -38 34 30 -3 85 99 3
9678 3 23 -31 -8 -115 -21 8 -15 -12 -22 6 42 6 -49 30 -24 43 116 49 -8 -39 -130 -53 2 -27 44 -93 -42 -58 -2 23
9708 23 -59 81 -39 -68 -103 -43 95 -101 0 -68 -66 80 58 -44 51 -30 -127 81 -70 -13 -27 -64 -161 99 52 108
9734 108 98 73 42 45 -24 11 146 -67 95 -1 -43 16 19 -22 17 -13 46 65 85 90 -15 61 -26 -51 -7 43 43 35 -20 -93
9764 -93 -83 -14 -35 118 66 42 -20 -21 12 -12 3 38 2 -16 -81 72 -18 66 102 96 64 -55 88 177 25 -44 -23 15 -16
9793 -16 59 -27 0 72 133 94 -31 -90 -6 74 -36 9 56 -7 8 -62 48 -121 -59 -43 72 -127 60 1 -101 47
9819 47 -72 -35 11 -1 49 -15 -75 122 -139 38 -19 -45 69 87 -131 72 -62 68 -9 -22 -80 -22 -82 17 -64 31
9845 31 -76 135 -13 30 -135 38 108 -16 -60 -4 2 -96 77 19 -90 -61 0 106 33 5 37 -79 112 44 74
$$ packed form
9649F3r6RR7k22R3M5L3M2j00N4J9k34J23P6Q3M5l1j51M2P4j22J8KP2ml3Q8J4r6
9678CK0n4K3j07R4K9k3Lj0K8L6l6n5P9n4O7P3o7n7l1r1P7N5k9P1j37N1j6N6K5
9708B3q2J40j20k9l5O0J38j96J01o8KJ46k2j02R5q1r7K08j51N7j4l7r7K60m7N6
9734A08j0k5l1Lo9L5J35k13J62r6m2N9Lm1L9l0N9J9K0Nj05P6q7k5M4N0%qn5p3
9764i3J0O9k1J53n2k4o2jL3k4J5L5l6j8o5J53r0Q4L6ol2j19J43Q9j52o9K1L8l1
9793a6P5q6K7P2O1l9j25n9Q4Q0j10M5M7o3J5p0J10j69O2J6J15j99J87n9j02J48
9819D7j19L7M6j2N0o4o0J97k61J77n7k6J14J8k18K03j34J30p7j3n8N8o0R9q1R5
9845C1j07K11j48M3j65J73P0j24m4N6Or8J73n8j09K9O1J06p3k8L2j16J91o8L0
$$ plain form
9870 74 -57 -96 8 90 25 -13 12 -52 -38 -61 -52 2 120 -11 -13 29 -30 51 -40 -8 24 -26 2 -5 -103 47 28 -11 33
9899 33 -97 -11 -72 -30 -40 -9 -118 6 14 11 -24 36 111 45 109 87 105 16 -12 50 36 78 -103 -10 39 142 -8 -37
9927 -37 36 110 55 37 15 -65 0 -35 -27 38 3 22 -6 7 26 -61 66 -21 -27 -228 -56 42 -16 -69 34 -26 41 -2 -34
9956 -34 7 65 91 69 114 -20 -33 -15 42 43 26 23 25 41 19 -22 73 93 51 -43 63 -13 -123 54 -54 67 148 -48
9984 -48 46 -21 -62 -80 -106 -61 71 -7 -65 -51 -21 -15 123 31 -66 -47 -2 -37 76 -162 22 -89 25 -51 -17 84 8
10011 8 -101 -52 81 -89 -74 46 24 8 89 -85 -85 -4 30 45 20 21 84 -85 26 61 -14 0 28 -9 1 -17 -75 -9
10039 -9 71 -29 19 13 10 47 -79 102 -41 -119 -45 -93 32 24 -11 138 -9 -59 -34 -21 -134 9 -13 -25 98 99 -4
10066 -4 -58 20 104 60 -20 -37 78 -1 -27 -7 3 110 5 -19 34 -18 52 53 -61 23 -30 -116 110 -21 -5 33 82 -42
$$ packed form
9870G4j31l9J04Q2o5l8K5o4J4k3RN4J18j31kM2n9Q1r1L2L2n0K8pr8J50j9l9M4
9899C3j30Q6o1M2j0L1j09J24Qll5O0P5o6O4k2J8q9k8O2j4M2j81R3M9J03j50k9
9927c7P3P4n5j8k2q0O5l5QO5l5J9k8J3J9q7J27q7ok01J72R8n8n3J03o0O7m3l2
9956c4M1N8K6k2M5j34j3J8N7Jj7lKJ6k2m1R5K0m2r4J06p6j10J77j08J21Q1j96
9984d8R4o7m1j8k6M5J32p8n8J4L0OJ38r2r7J9M5l5J13k38J84j11J14p6L4J01p6
10011Hj09M9J33j70J5J20k2j6Q1j74%Q1L4J5k5JO3j69J11L5p5J4K8l7J0j8n8O6
10039iQ0j00M8olL7j26J81j43p8P4m8J25ql5J49j47n0K5J3j13J43k2j2J23Jj03
10066dn4P8Q4m4q0j7J15p9k6K0J0J07j05k4N3n2P0Jj14Q4n3q6K26j31J6L8M9j24
$$ plain form
10094 -42 -8 44 1 -37 14 22 -40 -91 -29 -23 -15 72 -90 -25 -65 -2 -7 -21 40 -61 48 63 102 -14 71 -63 55 15 -32
10123 -32 -93 2 -199 -99 61 -73 -9 83 -41 -28 89 13 -113 110 102 22 -7 8 68 12 -51 -45 -32 67 -106 -79
10149 -79 9 6 98 77 14 -66 159 -108 7 121 37 75 -60 47 -80 7 -72 -16 43 13 26 -19 -3 -21 -10 34 94
10176 94 -33 -21 -3 14 44 28 -85 32 28 -110 -13 -76 -75 -28 -23 -40 9 -59 13 117 -89 61 -62 11 -22 -45 5
10203 5 -42 50 10 -24 21 9 -60 -17 -4 68 -75 3 -61 1 3 18 108 16 -4 80 -10 -108 3 2 -97 9 55 167 -18
10232 -18 -19 -78 35 21 100 -27 21 10 18 35 -89 -30 19 -17 57 -12 6 15 32 -19 -46 -68 -41 -70 -22 67 115 -11 -101
10261 -101 -14 -46 51 148 24 -39 -6 -87 -106 -19 -8 -7 -28 27 109 -54 136 138 -27 -42 87 -66 113 56 -69 -109
10287 -109 -68 116 -76 43 89 -86 -5 33 103 98 -76 116 -35 -172 -73 -43 46 -40 18 -28 -37 -19 89 -3 -41 6
$$ packed form
10094d2L4N2m3l8N1Qo2n1O2OQQ7j62O5m0O3nj4O1j01J09J5L9j16Q5j34J18m0m7
10123c2o1R5k01J00J60j34O4R2j24J3J17p6j26K23qq0k9J5O0n6o3OJ3R9j73K7
10149g9Q8lR2k1o3q0K25k67J15J14q4L8j35J07j27Q7p9N6N9l0J3m5J6j8J1M4O0
10176I4j27J2J8J7L0j6j13J17mj38R7o3JM7Nj7M9o8P2J04k06J50j23P3l3k3N0
10203Em7R2m0l4M5j2o9M3J3P2j43P8o4O2KJ5R0r2k0Q4r0r8J11jr9J06M6J12j85
10232a8jn9J13j4P9j27M8j1QJ7j24N9M9l6P4o9J8RJ7n1k7k2K7k9M8Q9M8j26r0
10261a01Q7l2R7R7j24o3L3q1j9Q7J1Jk1N5Q2j63J90Kj65j5J29j53J79n7j25m0
10287a09M1J84j92J19M6j75Q1L8P0nj74J92j51j37R9L0Q9q6N8m6rJ8J08r2l8M7
$$ plain form
10313 6 -19 72 55 57 -12 -29 62 -30 137 7 38 57 17 -121 45 -19 -82 -52 -75 55 56 1 -55 108 -135 -32 105
10340 105 105 41 -90 -70 168 -7 16 0 -70 -50 45 51 -58 20 -18 -64 2 -20 -51 50 -1 37 20 -10 2 70 76 32
10368 32 66 166 71 -11 121 3 -15 91 84 -79 -31 2 37 32 -75 21 -23 32 99 94 3 14 -43 -22 -10 -31 14 -12
10396 -12 -53 -50 73 86 -23 57 -43 -5 63 34 110 -102 86 -23 -42 -65 8 55 36 24 50 22 55 43 0 -78 -22
10423 -22 -14 11 3 0 25 31 25 -24 -40 -115 89 125 -29 111 51 -74 20 -10 36 44 -40 59 -73 -58 25 -60 6 46 -105 30
10453 30 69 40 6 95 57 23 -73 58 -32 1 130 65 -1 -57 13 48 -29 -79 60 -122 20 -59 -41 -12 53 151 5
10480 5 60 50 34 -10 16 -20 -5 75 67 -83 54 21 63 -60 -66 -91 42 -66 12 -39 -14 -4 -22 56 63 -7 -9 68 7 26
10510 26 51 -5 -33 -37 -41 14 41 21 85 21 36 56 -84 36 -6 11 85 -19 10 3 17 10 18 65 51 107 187 52 -33 -12
$$ packed form
10313Fk5R1j7Ko9j7R1r2J67j30L1J9m0j38J66o4o3L0k3J30Jn5n6J63k43J03J37
10340A05%o4j31K0K38j75K3j6p0K0R5Oj09P8l8m6O6k2l1J01n1L8j7l0J2O8Om4
10368C2L4J00r5q2J32j18j8J06pj63M8L3L5nj07R6m4N5O7nr1J1n7K1J2k1M5k6
10396a2m1LJ23J3j09Q0j00L8O8k9P6k12J88j09j9k3P3M7j9j2K6k8L3j2m3p8N6
10423b2QK5qlK5Oom9j6p5K04L6j54J40o0j25R4l0M6Qq4R9j32J5Q3q5O6M0j51J35
10453C0L9k9l4Q9l8l4r6J31r0L3J29o5o6n6P0L5p7n0J39j82J42p9J8K9O5R8j46
10480EN5j0j6m4K6l6J5Q0qj50J37l3M2j23ok5J33j08P8n1K5J0j8P8Pp0kP7o1J9
10510B6K5n6k8mmN5K7k0O4o4J5K0j40J20m2J7P4j04K9pJ4pQM7j4N6Q0j35q5K1
$$ plain form
10540 -12 -29 58 36 -11 -64 -1 -63 -40 149 -31 80 40 -54 32 -82 -26 47 23 -28 47 -37 130 35 -17 38 19 -5
10567 -5 141 90 95 124 15 13 43 -59 -43 27 0 71 -86 -62 37 11 -52 -22 -5 25 38 52 120 102 13 -47 43 -57 15
10596 15 -45 43 78 33 39 148 -74 15 -51 62 -65 -150 71 56 69 -38 -34 -62 74 112 -16 -13 30 -99 -22 -74 6
10623 6 -45 27 -16 24 74 6 72 18 -102 -97 -104 -11 -95 -29 -7 83 -22 35 71 -38 36 26 87 -46 78 -43 -23 -36
10651 -36 60 -187 48 -31 -63 151 17 -66 49 30 -89 -16 -35 -120 88 20 -3 -20 -61 -20 -101 53 -19 -77 5 59
10677 59 33 63 78 60 194 59 -37 21 66 63 12 -78 31 -63 -114 -6 -106 7 -28 12 7 27 -55 15 96 -54 50
10704 50 -38 -39 -38 -44 39 80 -59 -13 3 -71 -9 -98 -139 -44 -91 -122 14 88 -40 -18 30 25 23 -22 -133 1 4 160 -41
10733 -41 -92 -25 104 -18 -156 -69 55 45 -21 8 -94 31 81 31 -5 23 -58 4 97 -72 -19 147 48 54 -8 100
$$ packed form
10540a2j7Q7k2m7n3O3o2K3J89j80J11m0r4Q6j14N6P3k4n1P5q4J67r5n2N5j9k4
10567eJ46n1NK9j09kL0j02J6P0k7P1j57K4R9k6o3L0J7L0J3J4O8j8q9o0R0j00P2
10596A5o0Q8L5m5OJ09k22Q9o6J13j27q5K21j5J3j07Mk8J36L8j28LM3j29P7n2Q0
10623Fn1P2m3M0N0o8O6n4j20NpR3q4O6K2R0j05N7L6j09P4j0O1j33J24j21K0j3
10651c6R6k47K35p9l2K14j34q3J15j9j19P3j9q5K08o8k3j7m1M1q1J54p2n8Q2N4
10677E9k6L0J5j8J34j35r6N8M5ln1r0J09r4n1J08j00J13l5M0nK0q2P0Q1j50J04
10704E0q8jJoQ3M1j39M6J6p4O2q9m1R5m7l1J36P4j28K2M8nkm5j11J34LJ56k01
10733d1n1O7J29j22j38Q7J24j0o6K9j02J25N0n0l6K8q1O2R3j69N3J66r9Oo2J08
$$ plain form
10759 100 9 21 61 37 -67 -15 -7 -115 -86 18 -30 -20 -25 96 -39 -22 72 -24 74 9 10 8 -74 0 -20 -42 17 53 14
10788 14 40 65 64 -43 9 5 -162 25 -57 64 -52 -53 -151 -22 118 84 15 -107 13 -7 -76 -50 -3 -83 50 -21
10814 -21 -57 -97 -40 -36 32 175 1 74 -34 -34 -110 -20 56 -56 25 87 -29 7 123 50 -62 -47 -45 -40 -125 25 -135
10841 -135 1 5 -85 5 33 -71 -20 -52 -55 85 -18 57 59 21 -85 12 -72 28 97 -5 92 57 -31 -46 104 85 -114
10868 -114 -89 -33 -70 32 49 -22 38 12 5 37 48 -35 82 -25 9 40 31 130 130 5 -36 -7 126 -67 -53 -77 13 -13
10896 -13 -55 26 82 8 -68 -11 -1 1 57 35 37 74 -57 114 -86 -98 14 -8 6 -57 -2 42 43 97 -51 107 -66 -75
10924 -75 18 -86 45 -71 -78 -14 -33 3 83 0 80 48 -48 109 -10 38 85 3 7 -50 11 -26 -116 -9 2 -7 41 82
10952 82 18 -5 52 57 -55 6 87 55 74 -88 14 -40 -139 -5 -113 65 29 -14 28 -18 -109 59 35 77 80 11 44
$$ packed form
10759A00r1J2M0k4j04N2Qj08K9J04m8J0nJ21j35J7R4r6R8o5Jkq2P4k0k2N9L6l9
10788A4K6K5jj07N2mj67J87q2J21j16jr8J29J40l4o9j22J20k0o9K6M7q0J33p1
10814b1l6m0N7MO8J43j74P3j08%p6R0P6j12Q1O2j16L6J16p3j12J5KNq5J50j60
10841a35J36Mr0R0K8j04N1l2lJ40j03P5Kl8j06R7q4J00O9j02R7l5q8j5J50j9j99
10868a14K5N6l7J02J7p1O0k6pL2J1q3J17j07L4L1rR9%j25m1K9J33j93J4k4R0k6
10896a3m2Q1N6p4p6N7J0KN6k2KL7j31J71k00j2J12k2J4o3N5M4JN4j48J58j73r
10924g5R3j04J31j16pO4j9L6Q0q3Q0l2r6J57j19M8M7q2Mn7O1l7r0J07J1rM8M1
10952H2o4k3N7Nj12O1Q1l2J9j62J02n4r9J34j08J78l6m3M2m6r1J68k4M2Lo9L3
$$ plain form
10979 44 64 72 68 11 -52 138 -53 -78 -69 55 44 -86 79 119 19 2 14 -81 -176 53 53 73 -34 4 -91 -38 110
11006 110 -9 71 15 130 59 -86 -5 79 -28 -14 -41 -48 28 51 -26 -113 -69 41 -57 28 131 -18 41 27 -74 92
11032 92 15 -64 -45 53 -18 128 34 -37 11 169 -70 -62 100 15 -45 1 -6 -50 -77 -73 9 50 6 76 -68 -182 -33 112
11060 112 187 13 71 -143 56 30 35 26 -54 -9 -48 -7 -60 7 44 -20 32 55 103 39 105 38 -69 46 20 106 71 94
11088 94 23 -51 71 -20 146 -9 -44 -168 8 -79 65 -5 52 -40 41 39 -82 -29 -43 -58 16 62 -34 71 6 71
11114 71 13 -75 -66 -40 -42 84 -8 -6 -57 -21 -44 -44 -74 44 -43 -46 -2 -45 47 77 11 16 32 -14 -71 149 20 -20 -69 -125 35
11145 35 79 92 63 -139 -59 82 -136 51 -32 -31 -18 36 -112 73 -32 -22 7 -61 -5 -3 30 98 113 -41 -16 87
11171 87 8 85 -70 15 -64 -21 61 -76 84 49 -51 84 160 148 -22 53 -8 -48 90 66 14 24 114 -23 49 -146
$$ packed form
10979D4K0Qmn7o3J90j91k5RJ24j1j30J65M0j00j7J2r5r5K29%K0j07L8r5N3J48
11006A10j19Q0n6J15p1j45Q1Q4j07J4k7pP6K3p7q7M4J10r8Q5J03j49N9j4j01J66
11032I2p7p9J9R8p1J46r4p1M8J58k39QJ62q5o0M6pm4k7MQ2M1m4P0j44j14J49J45
11060A12P5j74N8k14J99k6Nrq0M5l9M1n3O7L7o4N2K3M8o4O6o7j07J15k6Q6l5K3
11088I4p1p4J22r1J66j55l5j24J76q7J44p0N7r2Q1kj21N3j4j5P4M6r6J05o5O5
11114G1n8q8RK6kJ26r2Kn1L6k3%l0J18q7lM4m3R2L0o6NJ6m6n7K20j29m0m9n6J60
11145C5M4J3k9k02Q0J41k18J87q3JJ3N4j48J85j05J0K9o8N6KL3O8J5j54K5J03
11171H7p9P7j55Q5p9M3Q2j37J60l5j00J35P6j2j70P5o1m0J38k4n2J0R0j37P2j95
$$ plain form
11197 -146 -102 25 -51 -135 28 -96 99 20 133 -51 -130 22 -13 27 23 36 -45 6 -9 49 -78 -16 74 5 89 2
11223 2 -15 51 28 12 60 -30 -25 -60 -66 42 24 28 19 54 95 56 -188 -125 -150 -30 51 74 134 -78 8 -63 108 -38 -157
11252 -157 66 127 -12 -6 -58 -3 93 -37 -68 70 13 -68 -18 -54 84 -63 -45 29 27 -60 -23 69 56 -17 -28 12 -78
11279 -78 -60 151 30 38 -18 -37 26 17 32 -136 41 0 -22 4 62 -87 -27 -77 -107 -42 -38 -32 42 -96 125 -82 -110 15
11307 15 57 -21 -42 94 -10 48 67 49 -72 4 -103 30 90 -22 -73 -20 -62 -119 74 88 -61 -10 23 -25 -78 64
11333 64 -49 107 41 112 0 36 -20 -130 48 -31 76 -18 -6 54 9 -97 -25 -78 -40 -19 57 -13 -111 21 120 -89
11359 -89 4 80 -55 48 10 23 -30 -144 -11 -14 37 86 48 18 -69 -151 -55 148 18 39 -56 5 -68 8 56 -16 -43
11386 -43 -35 -83 -61 87 23 -90 16 -41 70 38 26 -87 79 -24 8 37 9 -18 80 -12 -43 -15 -2 29 -42 89
$$ packed form
11197a46M4J27p6q4J63j24J95p9J13j84p9J52l5M0mJ3q1N1j5N8j27O2R0o9Q4q7
11223Bj7O6k3j6M8r0Nl5oJ08j8MrL5M1l9k44O3k5J20Q1K3O0k12Q6p1J71j46j19
11252a57K23O1j39On2N5R6j30l1J38n7q1N0l6J38j47J8P4kq7L7R2j3p3j1M0r0
11279g8J8K11j21Qn6j9O3rJ5j68J77m1k2K6N8j49O0n0l0O5MOP4j38K21k07k8J25
11307A5M2p8k1J36j04N8J9j8j21P6j07J33O0j12n1N3m2n7J93J4j49N1L3m8n3J42
11333F4j13J56o6P1j12L6n6j10J78p9J07r4J2O0m5j06P2n3L8K1P6p0r8J32R9k09
11359h9R3P6j35J03l8J3n3j14J33lN1M9l8l0q7q2R6K03j30K1r5O1p3P6M8p2k7
11386d3Qm8K2J48o4j13J06n7J11l2j2j13J66j03L2K9k8k7R8r2l1K8J3L1p1J31
$$ plain form
11412 89 -79 -26 -40 -36 -41 -88 6 95 -12 -6 -16 45 70 -37 22 46 -56 -26 2 -38 -25 49 -77 81 31 -25 -30 76
11440 76 64 -151 3 -64 -117 -40 -13 47 -24 5 25 28 16 29 -1 -36 -52 -103 -28 54 139 48 114 -37 -63 51 111 -24
11468 -24 32 -104 -30 136 35 14 -13 62 -17 -29 46 -45 -131 -57 6 -114 -72 3 -100 -32 -51 -101 19 29 8 -124
11494 -124 72 -25 18 35 -33 22 -84 76 -51 128 49 64 -78 -94 111 51 28 -16 -42 38 105 -53 27 -62 -11
11519 -11 69 64 56 61 23 -16 37 9 -25 -54 27 113 56 46 -11 -66 89 -57 -27 25 -123 -50 7 -14 -76 -3 -40 36 60 18
11549 18 76 49 134 34 10 11 63 38 51 87 -59 97 31 -35 21 -130 -32 -61 32 -72 50 80 120 -162 -108 4
11575 4 -12 52 -47 49 -22 -66 73 -107 65 -12 -22 -44 -133 -4 -31 -66 -23 44 -1 48 92 52 -46 -40 -4 102 -68 13
11603 13 26 -22 11 19 1 2 52 118 -45 -45 77 20 -83 -27 6 69 70 -57 127 -46 21 38 41 -59 -51 -83 -130 13 11
$$ packed form
11412H9j68N3j4Mnm7R4Q9j07Oj0O1K5j07N9K4j02L0K8m0J3P4j26J58n0n6nJ06
11440G6j2k15J54o7n3P7K7O0p1K9K0Lj2J3l0l5j6n1P5Q2Q5r1O6j51k6J14O0j35
11468b4N6j36P4J66j01k1k7P5p9j2P5r1q6P4O3j20M2P5j03O8j9n0J20J0k1j32
11494a24J96r7M3J7o8N5j06J60j27J79p9J5j42j6K05o0k3m4k6Q0O7j58Q0q9N1
11519a1Q0nqNl8l9N3k8l4k9Q1Q6n7j0n7n5J55j46L0N2j48P3N7k1o2P3l7P6K4m2
11549A8N8k7Q5j00k4JN2k5J3L6j46J56o6o6N6j51R8k9R3j04J22L0M0k82N4J12
11575Dj6O4r9R6p1m4J39j80J72p7j0k2q9J29k7l5M3O7m5M9M4m0r8OL6J06j70Q1
11603A3J3m8L3Qj8JN0O6j63%J22n7j03N6L3O3Jj27J84j73O7J7Lj00Ql2m7J43k
$$ plain form
11632 11 -30 112 -12 -17 -11 66 8 -92 -1 -67 20 -84 31 61 143 33 -88 -63 25 -17 38 -123 8 36 -23 -16 24
11659 24 2 39 -29 116 -31 27 131 86 27 96 -136 -21 54 35 -7 76 -35 -26 3 -68 109 -15 -73 72 -123
11684 -123 69 36 36 22 110 -25 74 -7 106 67 -1 22 44 16 -11 -18 90 74 -22 79 17 -7 85 -32 33 61 -41
11711 -41 -63 31 -30 18 121 107 21 102 19 -39 53 5 -102 -77 -67 104 -16 9 -166 0 -22 29 -19 -26 -70 -80 -62
11738 -62 21 -35 18 -45 -98 -28 -90 -52 -78 60 -50 -6 -65 49 -92 -7 92 -1 -14 8 -19 -26 103 25 -11 97 -17
11765 -17 -68 14 80 66 -40 -147 4 127 -103 28 -18 26 57 -2 -31 112 20 -83 75 -28 33 -66 -7 23 12
11790 12 66 1 -46 138 -7 -31 -132 -76 -30 10 -72 -40 77 -96 68 -57 -60 22 22 -20 -61 79 -61 -93 8 138
11816 138 -11 1 -112 -56 24 43 -48 -33 122 -113 -54 -51 27 -5 -65 -28 -2 -11 -64 47 7 1 -40 103 79 78 65 94
$$ packed form
11632A1m1J42j24nOP7n8j00R1o6Q7j04J15L0Q2j10j21K5Q8m2N5j61J31K8n9PM0
11659B4k2L7o8J45j47N8J04m5n9O9k32J15P5j9m2Q3j11RK9p1J77j24n8J45j95
11684a23J92l3%j4Q8j35R9q1J13l9o8K3K2k8k7pJ08j6r6J01o2k4R2j17O5K8j02
11711d1k2R4o1M8J03j4q6Q1q3n8R2m8j07K5J0J71j20K5j75J66k2N1m8pm4j0J8
11738f2Q3n6N3o3n3P0o2L8k6J38j10M4n9J14j41Q5R9r3j3K2k7pJ29p8l6J08j14
11765a7n1Q2O6j4j06j07J51J23k30J31m6M4L1n9k9J43r2j03J58j03O1r9N9L0j1
11790A2N4o5m7J84j45k4j01N6M6M0q2L2J17j73J64j25lQ2%m2m1J40j40l2J01J30
11816A38j49J2j13N6Q0J9r1J5J55k35N9LP8l2o0L7K6rn3J11m0om1J43k4jj3K9
$$ plain form
11844 94 12 14 12 52 180 -38 46 29 -35 -115 17 15 87 -57 19 25 151 62 -27 78 -34 1 -14 -50 -82 -23 28 -90
11872 -90 23 -40 19 -109 115 -71 -75 -94 -36 4 -115 -65 14 40 -56 21 75 -54 -112 26 -22 26 -61 91 -49 -21
11898 -21 38 -4 24 -52 -23 -82 31 104 5 170 17 -47 22 59 -90 36 -72 -10 -23 -54 -21 -15 60 69 -9 -21 138
11925 138 61 -27 66 59 -23 24 -43 -47 -47 11 -88 -41 -77 -43 -33 103 0 -1 -44 39 3 -74 98 -103 1 45 26 25 7
11954 7 4 -36 52 -7 4 -19 -62 -22 45 11 -32 6 -23 -41 -28 43 62 -20 -29 0 103 -72 29 -23 -13 -97 -40 77 -10
11983 -10 -71 72 -35 25 -33 -87 54 72 -27 -53 31 -32 68 150 -5 -57 -68 -24 -51 142 -20 -9 -46 49 51 -118
12009 -118 102 -10 -52 26 109 -31 176 137 -26 94 14 49 57 -39 55 81 35 3 132 -109 -36 30 53 37 -25 92
12035 92 -40 77 -18 -65 41 12 6 -10 -82 -68 2 -112 33 73 -12 -78 -6 51 4 2 -83 62 75 97 -33 -26 -97 -68
$$ packed form
11844I4q2KkM0J28k18Q4j7o4q0J32kP2j44P6OJ26q9q9J05j12L5j5l6l2N9N1j18
11872i0J13o3N9j28K24j86mj9N8M0j19N0P9K6r6P7N4j29n8J38m8M8q7J52j40K8
11898b1N9m2K8p6K9n9J13P3r9J65j53o4O9L7j49J26j08O2j3l1L3OP5Rp8j2J59
11925A38p7q8R3pq2M7o7m%N8r9M7l6L4J0J36j03jm3Q3l6p7J72k01J04M4j9jj8
11954Glm0Q8n9J1k3m3M0O7l4m3L8k9j8J3P1J9q2rK9J03j75J01n2J0q4N7J17q7
11983a0o1J43j07O0n8n4J41J8r9k6Q4o3J00Q2j55n2j1M4k7J93j62J1l7R5Kj69
12009a18K20j12m2P8Q3j40K07l9j63J20q0L5Qr6R4K6m6l2J29k41P3O6K3j6o2J17
12035I2j32J17r5m7J06k9oj6p2J4P0j14J45M0q5o6P2N7m7kq5J45J3K2j30Pp1K9
$$ plain form
12063 -68 65 76 -106 33 -103 29 -19 -102 -55 11 -14 49 148 65 -97 -11 10 52 -96 -3 53 7 92 52 -53 -2
12089 -2 -21 -13 35 27 -16 42 43 -20 -53 -24 -24 57 -8 -78 -26 -85 -63 5 50 -20 41 -34 -133 -44 72 -19 -8 -15 -32 -98 29 31
12121 31 19 33 52 19 85 50 -12 -52 27 -31 3 -71 -64 -58 87 25 -89 78 -17 30 24 -36 80 7 2 -40 44 61 -15 21
12151 21 -73 126 3 -39 -105 -2 44 44 -68 -8 122 55 -38 -17 24 -46 -42 7 -24 31 -29 -138 60 17 77 5 51
12178 51 29 15 -47 -49 115 -34 -1 37 -45 23 40 -10 -112 -91 -9 -12 -5 -9 -14 -12 -76 -13 -10 -24 36 -9 18 -20 -37 51 -188
12209 -188 3 -20 0 -41 -56 25 -122 -151 37 -61 -46 -24 28 15 56 -56 -67 -45 139 -45 24 -33 -82 23 -6 163
12235 163 30 -7 29 84 4 90 54 28 79 -94 11 8 9 72 63 -78 -57 -93 75 12 -66 -51 -57 -79 -47 -86 26 80
12263 80 89 97 -30 -18 -65 83 -17 7 59 -64 71 45 -93 -22 -51 80 -57 -47 -16 24 115 105 12 100 -49 50
$$ packed form
12063f8J33J1j82J39j36J32m8q3M7O6k5O3R9q3j62Q6K1M2j48R3N6m6Q5m0j05N1
12089bj9QM8qm3N8Jo3l3K9%Q1o5p0N2n9K2O8M5p0O1p5r9Q9J16r1J1pj7o6J27K
12121C1j2J4J9l3O6l5o2m0P9n8L4p4POJ45o2j14J67r5M7oo0J16p3nm2Q4J7p6L6
12151B1r4J99j23m2o6J03M6%j12O0J30o7r3K1M1p0MM9l1N5o0j09J98m3O0p2M6
12178E1k2j4o2kJ64j49L3L8q2O8J7n0j02K1Q2lPmnKo4O3Lj4O0m5K7l8j7Q8k39
12209a88J91k3K0m1j5Q1j47k9J88r8J5K2N2j3M1j12j1K2J84j84O9n7m9J05k9J69
12235A63j33l7L6N5q0Q6l6k6N1j73J05lJO3rj41K1l6J68o3p8J5ok2L2l9J12N4
12263H0RQj27J2m7J48j00K4N2j23J35k6j38P1k9J31j37J0L1M0R1j0r3Q8j49R9
$$ plain form
12289 50 -15 -5 -48 24 22 -48 -48 -32 -4 -34 135 63 -104 43 -121 -18 -25 -109 21 21 106 -24 16 35 26 -81 -15 -67
12317 -67 14 2 7 100 -55 194 -60 -23 -30 -13 20 -138 107 82 -93 63 80 -2 -44 14 18 -44 118 37 140 54 -113
12344 -113 -103 68 52 35 -83 43 -89 -48 -51 -7 -55 111 -6 6 8 -49 -52 -114 -17 27 31 41 99 -87 -21 16 2 -90
12372 -90 70 87 -78 45 -20 34 -47 101 97 -6 79 -3 11 -12 14 -11 81 113 -1 48 -99 -94 4 -54 -23 14 47
12399 47 74 109 -102 -38 -7 -15 -85 85 -32 13 71 -164 52 106 86 -71 38 -100 -83 47 69 -60 44 -21 60
12424 60 -3 -70 -20 91 6 -26 4 -59 -47 6 -73 -4 50 -13 -44 6 105 100 -10 -50 84 -83 55 60 -49 -27 119
12451 119 -105 -45 -38 -93 38 54 -16 -62 35 14 70 60 53 -62 -9 23 71 -49 -101 93 96 32 -11 72 -46 33 -7 11
12479 11 51 10 13 38 -132 35 -82 81 18 -44 -40 137 8 35 43 27 14 -29 -10 65 60 -36 -146 73 -30 -201 -4
$$ packed form
12289E0o5J0m3P2kp0%J6K8l0J69p2j67J47j64J03pq4J30%Q5j30M0J9rj07O6n2
12317f7Q1j2NR3j55K49k54L7pJ7L3j58K45k5j75J56J7q2m2N8Mo2J62q1J03q6j67
12344a13J0J71j6j7j18J26j32M1lM4m8J66j17J2Kn7lo2R7M4MJ0N8j86O6L7j4r2
12372i0J60J7j65J23o5N4q1J48mj03Q5q2J4k3K6k5R2L2j14M9j47NR8n8L1L7L3
12399D7K7L5k11O4L1qp0J70j17M5N8k35K16N4k0j57J09j38J7J30K2j29J04o5Q1
12424F0o3o7N0J11q5l2L0o3J2N3p9O9N4o3l1N0R9nj10m0J34j67J38Nj09K2J46
12451A19k24O0Pn5J31J6p0m6R7k1N6j0pj15N3L2M8j20n2J94Lo4m3Q3j18P9m0J8
12479A1M0m1LK5j70J67j17J63o3o2MJ77j29K7Qj6j3m3J9P5nr6j10K19j03j71J97
$$ plain form
12506 -4 -15 131 19 18 5 64 -15 -13 -60 -4 -116 -73 -17 56 -61 82 -20 51 97 -21 -30 -72 89 -25 68 35 64
12533 64 11 22 114 -14 -34 94 -17 -58 -39 57 -41 18 -90 76 -56 -41 -99 34 4 -8 -18 54 -8 -54 90 21
12559 21 -45 -33 -36 -62 -40 -49 -89 6 19 -15 194 -82 70 -6 60 -54 -63 -115 -4 43 27 47 50 44 -64 36 -86 -43
12587 -43 21 108 47 -93 46 67 -41 115 -86 -93 -103 -61 -64 0 -89 -66 117 -19 -60 -60 59 -59 11 54 1 86 -34
12614 -34 66 59 -27 -31 108 -6 51 -18 32 -33 52 -13 -16 -9 -123 64 97 95 8 46 -81 -16 -56 -95 -23 189 55 -49
12642 -49 16 -30 -76 -128 48 15 55 77 -95 -26 -31 -65 114 -64 89 68 7 26 30 38 -60 -154 33 5 57 8 -23 44
12670 44 -1 -8 9 153 0 -50 25 86 94 -65 -6 -96 118 0 -40 85 -16 -27 50 -120 27 4 -24 -48 -89 -6
12696 -6 8 -22 34 -11 41 116 69 -25 47 36 37 -9 -128 -31 -92 -8 96 -79 38 -40 -25 -17 -111 -36 86 140 30 -64
$$ packed form
12506dj1J46j12jj3N9p9Km7N6j12M3N6P3j17J43j02P1M6j18rm2J61j14R3l3K9
12533F4n3J1R2j28k0J28j11m1J9R6r8N9j08J66j32J5n8J33l0j2j0P2o2m6J44o9
12559B1o6J2lk6K2rm0R5J3l4K09k76J52p6O6j14rn2J11M7j6K0Loj08J00j22M3
12587d3O4Q7o1j40J39K1j08J56k01pj0M2lO4q9K3J83j36m1%J19j18P0M3n3Q5j20
12614c4J00pq6mJ39j14N7o9N0o5Q5o5lPj14J87L3kq7L8j27O5m0l9P2K12j34j04
12642d9O5m6m6n2J76l3M0K2j72O9nl4J79j78J53k1o1J9MQr8r4J87k8N2m9l1O7
12670D4m5pJ7J44j53n0P5O1Qj59N9r0K14j18m0J25j01j1P7j70J47k3k8k4m1Q3
12696fJ4l0N6m5N2P5m7r4P2j1Jm6j19R7o1Q4J04j75J17p8J5Qr4P5J22N4j10r4
$$ plain form
12724 -64 -80 -75 -17 14 15 -161 -3 46 27 65 -50 -120 -17 -33 56 69 9 99 -95 -46 3 44 -113 -72 104 90 -41
12751 -41 13 98 41 -39 15 -57 -57 -48 -52 77 22 -100 -62 1 135 -124 57 -59 70 -120 -55 12 63 51 5 69 11
12778 11 -101 -29 23 59 -77 -52 21 -29 31 -74 -168 34 -63 -48 95 -19 -28 9 19 6 -50 -92 55 28 -87 -92 55
12805 55 68 1 -6 33 -29 18 23 62 -40 131 -36 -2 17 127 101 12 38 -140 17 -238 -9 7 -26 153 -148 86
12831 86 -38 -190 48 -68 -21 54 -69 -41 -84 -37 79 132 121 51 4 -80 -34 125 51 30 168 67 -82 27
12855 27 -2 -77 -20 114 5 -176 -58 5 -35 -58 -35 -11 -73 28 -76 -46 -23 -1 43 29 17 72 -53 38 94 -62
12881 -62 91 -148 -4 41 -22 4 23 131 8 -72 47 6 89 -30 157 -70 58 -56 -41 42 -34 -73 70 28
12905 28 91 -172 36 68 -67 -63 -34 38 4 41 60 31 -47 -107 77 -23 -58 -93 -45 -55 -61 -85 -4 103 -61 46 -44
$$ packed form
12724f4j6NN8L1Jj76J58M9j9L8j15p0J03j6Q9J3o0R0j94M9M9M1j57M1J76j4j31
12751d1N4Q5n7q0N4p2%RmJ29n5j22L8O3J34k59J81j16J29j90O5O7N1j2m6O4n8
12778A1j12P2N2L6j36K5P3n0O0j05r4K02r7J5J43j14rL7J0j3n6m2J47k7j15nJ47
12805E5J3o7pL9o2M7NL9j02J71j67L4J9J10k6q9K6j78J57k55K29J6l3J79l01K34
12831H6j24j52K38j16M7P5j23K8m3M7J16N3j1p0m7q4M6J59p4k1J38j01j49J09
12855B7k9p5N7J34j09j81J18O3m0k3K3K4o2J01j04L0K3K2M4j4j2N5j25R1N6j56
12881f2J53k39J44M5o3K6J9J08j23q0J19m1Q3j19J87k27J28j14J5Q3p6l9J43m2
12905B8O3k63K08L2j35MK9P2l4L7J9k9p8o0J84j00l5l5M8j0ok4Q1J07j64J07r0
$$ plain form
12932 -44 -49 -83 81 52 68 -82 58 76 104 40 -35 54 80 -9 -5 -53 62 77 60 53 -44 37 -53 -95 93 -25 -126 -93
12960 -93 -47 -64 71 18 28 -33 20 -2 -71 -82 21 -18 -17 28 -22 42 -18 -116 -13 21 -45 2 -17 161 55 62 -26 3
12988 3 46 14 -33 139 45 41 -18 33 28 87 -46 -6 14 -11 12 33 -19 -17 146 -103 27 -26 117 -155 -47 31 48 -35
13016 -35 -22 -75 -19 -15 -30 -130 -31 40 -70 3 -89 -37 -59 -26 -43 -18 132 74 24 -98 -17 0 84 111 -18 126 53
13043 53 14 -11 -56 -6 83 0 53 -2 -44 71 38 40 -45 13 19 50 -5 -63 -29 -107 -131 -34 -171 6 80 -27 -10 104
13071 104 19 30 33 -113 68 52 -41 -77 20 -131 16 42 4 -19 -34 -82 -1 -29 -66 -20 -13 -71 22 -11 58 -12 93 20
13099 20 -193 45 -105 18 39 38 -29 11 129 48 -17 -108 72 -3 88 66 -19 -92 -11 14 -99 114 62 -47 -40 25
13125 25 -20 -59 37 31 25 -42 43 -29 -16 7 -41 52 10 -43 24 -65 -51 -30 -79 220 -80 -54 -92 -22 -28 133 71 105 21 -3
$$ packed form
12932d4nl4J64k9J6j50J40J8K8o4p5Q9K6q9Mm8J15J5j7pr7Q1r0m2J88j18j01L3
12960i3M6j7J35n3J0o1N3k2o9j1J03l9JM5n0O4o0r8J03L4o6M7j9J78j06Pq8K9
12988CM3l2m7J72r4mn9N1nN9j33M0K0k5K3K1n2KJ63k49J30n3J43k72J08P8J7q3
13016c5J3n3N6Mj5j00R9P1j10P3r2N2k2L3j7K5J50n8n0j22Q1J7Q4K7j29J44p3
13043E3l9k5m5N0Q9q3N3n5m2J15l3Kq5N8OL1n5n8L4p8k4R7j37J77P4j07J7J14
13071A04q5J1Lj46J81j6r3l6R7j51J47K6l8k3j5m8Q1k8l7M6Pn8R3l3O9p0J05p3
13099B0k13K38j50J23K1jo7M0J18q1o5r1J80p5R1k2q5p3Q1K5j13K13n2j09PO5
13125B5m5l9R6ooo7Q5p2J3K3m8R3m2n3O7q9J4K1m9K99l00K6l8P0oJ61o2L4q4k4
$$ plain form
13155 -3 -71 50 -82 65 -27 -141 -31 -193 11 60 -68 99 3 -89 31 -71 67 60 11 -96 25 70 -50
13178 -50 33 81 -82 -53 31 -56 -29 48 9 4 33 -91 -8 -87 11 48 -36 -35 -5 24 13 5 44 2 92 26 80 -49 7 -16
13208 -16 7 89 22 10 36 -35 -24 11 131 -98 47 10 -59 -104 -55 29 -54 62 -36 -39 -24 21 -72 90 34 61 -28 -112
13236 -112 -16 18 95 63 -7 47 65 11 33 17 41 77 -15 -1 -45 65 -91 -62 10 -63 -64 -43 -85 -23 -50 -27 101 -67
13264 -67 -29 41 -52 55 25 53 100 -115 -2 -105 -59 -39 34 -53 -57 79 -23 45 30 -107 -49 38 -18 59 8 -113
13290 -113 18 60 92 39 56 -3 -8 -124 -115 120 -23 101 18 6 -35 31 -26 -42 18 -3 82 -68 -92 58 58 13 45
13317 45 -55 15 55 -36 136 35 -45 60 -73 -47 -88 129 86 44 2 -81 -58 -68 -9 14 -119 -30 50 -57 -8 9
13343 9 -66 -69 12 -5 52 -53 -66 30 -35 -62 81 26 -21 -8 107 100 52 17 7 -30 -48 -118 -177 48 -7 -26 56 -25 -63
$$ packed form
13155co8J21j32J47r2j14J10j62K04M9j28J67r6r2J20j02J38pm9j07J21M5j20
13178e0Q3M8j63K9Q4q7K7P7l9nK9j24Q3p9R8L7q4JL0K9j1qL9m2R0o6N4j29N6k3
13208a6K3Q2o7j2K6p1J1L5J20k29J45l7o9m5M9Q4q3J16r8lJ5M5r3J62n6K7q9q4
13236a12R6L4P7l2p0N4J8n4K2j6K4L6r2J4m4J10j56K9P2p3jK1m2O2k7K3J28j68
13264f7L8P0r3J07l0K8M7k15J13j03M6K0P3q7mJ36j02O8j5j37N8Q7n6P7n1j21
13290a13J31M2L2n3J7n9nj16RK35j43J24q3j2m1O6n7j6O0k1Q5j50k4J50%m5L2
13317D5j00P0M0r1J72j01q0J05j33K6m1K17m3m2m2q3K3j0N9K3j33Q9Q0j07M9J7
13343Ip5lQ1j7N7j05j3R6o5k7J43n5m7J3J15pm8l5j0l7j8p0n9K25n5j9Q2q1l8
$$ plain form
13372 -63 -9 45 135 -104 11 31 54 -48 -82 11 44 51 -9 -31 -8 -84 103 16 -22 -28 4 -59 14 25 138 82 18 52
13400 52 20 -104 13 -45 51 -24 4 89 3 81 -72 -50 -11 -40 -20 -68 -68 -112 -117 39 -84 -20 -93 120 18 101 71
13427 71 72 27 136 39 -3 46 -28 -56 77 -22 -58 80 11 22 -1 1 -35 76 -63 45 11 -58 -22 132 143 -163 -101
$$ packed form
13372f3N4N4R0k39J15K0K3j02l4R3L3Po0k2K3p6J87q7l8oL2o3P3J1J13n6o4L4
13400E2l2j24J17n8R6p5K8Q5q6P8j53K2L9k9K0m8%m4nJ56j23O4p3K13j02Q3l0
13427G1Jm5J09r7m2M9p4k8J33r9l6J38o9J1k3Kl6J11j39J08l4o9L6J54J1l06O2
$$ [...]
16383A58
##END NTUPLES=NMR FID
##END=
