##TITLE=abcd
##JCAMPDX= 6.0         $$ Bruker NMR JCAMP-DX V2.0
##DATA TYPE= NMR FID
##DATA CLASS= NTUPLES
##ORIGIN= UXNMR, Bruker Analytische Messtechnik GmbH
##OWNER= root
$$ XWIN-NMR		Version 3.5
$$ Thu Jun 26 18:30:25 2025 Russian Standard Time (UT+4h)  servis@DPX200
##.OBSERVE FREQUENCY= 200.131235884673
##.OBSERVE NUCLEUS= ^1H
##.DELAY= (6, 6)
##.ACQUISITION MODE= SIMULTANEOUS
##.ACQUISITION SCHEME= undefined
##.AVERAGES= 32
##.DIGITISER RES= 18
##SPECTROMETER/DATA SYSTEM= spect
##.PULSE SEQUENCE= zg
##.SOLVENT NAME= CDCl3
##.SHIFT REFERENCE= (INTERNAL, CDCl3, 0, 16.5164)
##AUDIT TRAIL= $$ (NUMBER, WHEN, WHO, WHERE, WHAT)
$$ ##TITLE= Audit trail, XWIN-NMR		Version 3.5
$$ ##JCAMPDX= 5.01
$$ ##ORIGIN= Bruker BioSpin GmbH
$$ ##OWNER= servis
$$ F:\spectra/data/av/nmr/H1/1/audita.txt
$$ ##AUDIT TRAIL=  $$ (NUMBER, WHEN, WHO, WHERE, WHAT)
(   1,<2025-06-26 18:29:50.34 +0400>,<servis>,<DPX200>,
      <created by zg, POWCHK disabled, PULCHK disabled
       configuration hash MD5:
       00 E9 B6 7A A2 85 ED C7 34 08 36 98 17 FE 4E 26
       data hash MD5: 32K
       10 60 E4 AA F6 E4 76 82 79 E8 33 05 62 83 22 19>)
$$ ##END=
$$ 
$$ hash MD5
$$ AF CE 68 E3 92 4D CF 5A 0E 1E 16 58 59 47 02 77
##$RELAX= 
##$RELAX= 
##$RELAX= 
##$RELAX= 
##$RELAX= 
##$RELAX= 
##$RELAX= 
##$RELAX= 
$$ Bruker specific parameters
$$ --------------------------
##$DU= <F:\spectra>
##$EXPNO= 1
##$NAME= <H1>
##$PROCNO= 1
##$TYPE= <nmr>
##$USER= <av>
##$AMP= (0..31)
100 100 100 100 100 100 100 100 100 100 100 100 100 100 100 100 100 100 
100 100 100 100 100 100 100 100 100 100 100 100 100 100 
##$AQSEQ= 0
##$AQ_mod= 1
##$AUNM= <au_zg>
##$AUTOPOS= <>
##$BF1= 200.13
##$BF2= 200.13
##$BF3= 200.13
##$BF4= 200.13
##$BF5= 500.13
##$BF6= 500.13
##$BF7= 500.13
##$BF8= 500.13
##$BYTORDA= 1
##$CFDGTYP= 0
##$CFRGTYP= 5
##$CHEMSTR= <none>
##$CNST= (0..31)
1 1 145 1 1 1 1 1 1 1 1 1 1 1 1 1 1 1 1 1 1 1 1 1 1 1 1 1 1 1 1 1 
##$CPDPRG= <>
##$CPDPRG1= <>
##$CPDPRG2= <>
##$CPDPRG3= <>
##$CPDPRG4= <mlev>
##$CPDPRG5= <mlev>
##$CPDPRG6= <mlev>
##$CPDPRG7= <mlev>
##$CPDPRG8= <mlev>
##$CPDPRGB= <>
##$CPDPRGT= <>
##$D= (0..31)
0 2 0 0 0 0 0 0 0 0.06 0 0 0 0 0 0 0.0002 0 0 0 0 0 0 0 0 0 0 0 0 0 0 
0 
##$DATE= 1750948189
##$DBL= (0..7)
120 120 120 120 120 120 120 120 
##$DBP= (0..7)
150 150 150 150 150 150 150 150 
##$DBP07= 0
##$DBPNAM0= <>
##$DBPNAM1= <>
##$DBPNAM2= <>
##$DBPNAM3= <>
##$DBPNAM4= <>
##$DBPNAM5= <>
##$DBPNAM6= <>
##$DBPNAM7= <>
##$DBPOAL= (0..7)
0.5 0.5 0.5 0.5 0.5 0.5 0.5 0.5 
##$DBPOFFS= (0..7)
0 0 0 0 0 0 0 0 
##$DE= 6
##$DECBNUC= <off>
##$DECIM= 32
##$DECNUC= <off>
##$DECSTAT= 4
##$DIGMOD= 1
##$DIGTYP= 9
##$DL= (0..7)
0 120 120 120 120 120 120 120 
##$DP= (0..7)
150 150 150 150 150 150 150 150 
##$DP07= 0
##$DPNAME0= <>
##$DPNAME1= <>
##$DPNAME2= <>
##$DPNAME3= <>
##$DPNAME4= <>
##$DPNAME5= <>
##$DPNAME6= <>
##$DPNAME7= <>
##$DPOAL= (0..7)
0.5 0.5 0.5 0.5 0.5 0.5 0.5 0.5 
##$DPOFFS= (0..7)
0 0 0 0 0 0 0 0 
##$DQDMODE= 0
##$DR= 18
##$DS= 0
##$DSLIST= <SSSSSSSSSSSSSSS>
##$DSPFIRM= 0
$$ [...]
##$SUBNAM0= <"">
##$SUBNAM1= <"">
##$SUBNAM2= <"">
##$SUBNAM3= <"">
##$SUBNAM4= <"">
##$SUBNAM5= <"">
##$SUBNAM6= <"">
##$SUBNAM7= <"">
##$SUBNAM8= <"">
##$SUBNAM9= <"">
##$SW= 20.6817932712277
##$SWIBOX= (0..15)
0 0 3 0 0 0 0 0 0 0 0 0 0 0 0 0 
##$SW_h= 4139.07284768212
##$TD= 32768
##$TD0= 1
##$TE= 0
##$TE2= 300
##$TE3= 300
##$TEG= 300
##$TL= (0..7)
0 120 120 120 120 120 120 120 
##$TP= (0..7)
150 150 150 150 150 150 150 150 
##$TP07= 0
##$TPNAME0= <>
##$TPNAME1= <>
##$TPNAME2= <>
##$TPNAME3= <>
##$TPNAME4= <>
##$TPNAME5= <>
##$TPNAME6= <>
##$TPNAME7= <>
##$TPOAL= (0..7)
0.5 0.5 0.5 0.5 0.5 0.5 0.5 0.5 
##$TPOFFS= (0..7)
0 0 0 0 0 0 0 0 
##$TUNHIN= 0
##$TUNHOUT= 0
##$TUNXOUT= 0
##$USERA1= <user>
##$USERA2= <user>
##$USERA3= <user>
##$USERA4= <user>
##$USERA5= <user>
##$V9= 5
##$VALIST= <valist>
##$VCLIST= <CCCCCCCCCCCCCCC>
##$VD= 0
##$VDLIST= <DDDDDDDDDDDDDDD>
##$VPLIST= <PPPPPPPPPPPPPPP>
##$VTLIST= <TTTTTTTTTTTTTTT>
##$WBST= 1024
##$WBSW= 30
##$XGAIN= (0..3)
0 0 0 0 
##$XL= 0
##$YL= 0
##$YMAX_a= 50868
##$YMIN_a= -33838
##$ZGOPTNS= <>
##$ZL1= 120
##$ZL2= 120
##$ZL3= 120
##$ZL4= 120
##$ABSF1= 10
##$ABSF2= 0
##$ABSG= 5
##$ABSL= 3
##$ALPHA= 0
##$AQORDER= 0
##$ASSFAC= 0
##$ASSFACI= 0
##$ASSFACX= 0
##$ASSWID= 0
##$AUNMP= <proc_1d>
##$AZFE= 0.1
##$AZFW= 0.1
##$BCFW= 1
##$BC_mod= 2
##$BYTORDP= 0
##$COROFFS= 0
##$CY= 19
##$DATMOD= 1
##$DC= 2
##$DFILT= <>
##$DTYPP= 0
##$F1P= 11.0000007629395
##$F2P= -0.999999237060547
##$FCOR= 0.5
##$FTSIZE= 0
##$FT_mod= 4
##$GAMMA= 1
##$GB= 1
##$INTBC= 1
##$INTSCL= 1
##$ISEN= 128
##$LB= 0.05
##$LEV0= 0
##$LPBIN= 0
##$MAXI= 10000
##$MC2= 0
##$MEAN= 0
##$ME_mod= 0
##$MI= 0
##$NCOEF= 0
##$NC_proc= 0
##$NLEV= 6
##$NOISF1= 0
##$NOISF2= 0
##$NSP= 1
##$NTH_PI= 0
##$NZP= 0
##$OFFSET= 16.51637
##$PC= 1
##$PHC0= -276.6733
##$PHC1= 1.101538
##$PH_mod= 0
##$PKNL= yes
##$PPARMOD= 0
##$PSCAL= 4
##$PSIGN= 0
##$REVERSE= no
##$SF= 200.13
##$SI= 16384
##$SIGF1= 0
##$SIGF2= 0
##$SINO= 400
##$SIOLD= 16384
##$SREGLST= <1H.CDCl3>
##$SSB= 0
##$STSI= 0
##$STSR= 0
##$SW_p= 4139.07284768211
##$SYMM= 0
##$S_DEV= 0
##$TDeff= 0
##$TDoff= 0
##$TI= <>
##$TILT= no
##$TM1= 0
##$TM2= 0
##$TOPLEV= 0
##$USERP1= <user>
##$USERP2= <user>
##$USERP3= <user>
##$USERP4= <user>
##$USERP5= <user>
##$WDW= 1
##$XDIM= 8192
##$YMAX_p= 0
##$YMIN_p= 0
$$ End of Bruker specific parameters
$$ ---------------------------------
##NTUPLES= NMR FID
##VAR_NAME=  TIME,          FID/REAL,        FID/IMAG
##SYMBOL=    X,             R,               I
##VAR_TYPE=  INDEPENDENT,   DEPENDENT,       DEPENDENT
##VAR_FORM=  AFFN,          ASDF,            ASDF
##VAR_DIM=   16384,         16384,           16384
##UNITS=     SECONDS,       ARBITRARY UNITS, ARBITRARY UNITS
##FACTOR=    0.0002416,     1,               1
##FIRST=     0,             0,               0
##LAST=      3.9581328,     0,               0
##MIN=       0,             -33838,          0
##MAX=       3.9581328,     50868,           0
$$ Real data points
##PAGE= N=1
##DATA TABLE= (X++(R..R)), XYDATA
$$ [...]
4132 -99 -138 -40 67 77 54 25 8 72 -59 -101 44 98 -61 -135 -115 -31 -67 50 -18 -105 52 56 -56 -7 -23 24 -89
4159 -89 70 -67 -97 -39 155 -49 -87 50 -53 -34 64 8 109 -61 -51 -29 28 -45 41 -100 35 129 -95 3 -5
4184 -5 -84 -84 -27 153 -181 42 80 -3 112 107 141 -83 -12 35 -74 -123 13 -158 -42 -2 -70 -75 86 153 -33 76
4210 76 172 167 20 71 66 -70 -63 5 -53 -38 -7 -51 -40 -9 -14 35 27 67 -4 -69 -2 46 13 -36 19 6 -109 -5 -63 -240
4240 -240 10 14 -70 -3 36 102 -35 194 82 40 -26 3 -102 -35 -5 -65 -36 109 -77 -35 -34 71 -47 13 116 73
4266 73 -68 50 -83 24 -18 34 -17 -1 114 -63 -27 -26 7 -119 63 -4 119 3 58 56 -90 -38 -75 -41 131
4291 131 -12 -205 -187 11 38 -85 -9 35 -3 24 64 -35 19 -30 29 -108 -88 30 -52 -84 73 -96 -81 -77 117 -27
4317 -27 74 141 6 6 87 28 -62 80 38 -41 -88 99 -19 -128 -37 -75 -61 -99 197 -112 33 70 109 120 -77 20
4343 20 -160 -44 -29 -78 -159 -25 63 -51 56 93 103 85 231 48 119 87 -84 18 -18 32 -39 -156 102 23 -69
4368 -69 -42 -21 22 47 95 31 135 107 -119 -67 -42 -1 -38 -80 -9 -113 -1 29 -24 -103 25 102 48 -144 81 -43
4394 -43 -86 -18 18 -23 52 -60 -38 -62 -63 -26 -59 72 53 -159 68 184 -1 -65 11 -8 -38 192 -67 -188 -146 114
4420 114 -50 16 30 -43 -70 46 8 -48 93 -3 43 24 91 1 -88 26 79 -98 -97 -51 -134 -159 5 -58 66 44 42
4447 42 -52 23 218 11 -2 -110 -46 -57 -193 119 -161 -69 35 -15 -35 -33 127 31 43 71 -45 -102 64 -7 -38 -17
4473 -17 3 -37 -141 23 -39 -85 1 -35 -48 61 63 32 -63 68 53 -63 -20 83 -178 -73 58 -13 -25 -114 -58 -53 -11
4500 -11 -8 -31 25 142 211 -59 84 68 -52 -39 11 -41 -232 -62 -62 -21 -28 119 -84 -73 83 -13 -41 -14 41 63 -11
4527 -11 -11 -85 -190 58 -105 -156 74 -39 -64 -5 119 44 -41 155 141 -7 16 12 -24 -74 -8 -1 -65 -17 -46 48 -17 17
4555 17 -27 110 122 -126 7 123 68 -61 -109 62 -34 54 -57 -60 -136 15 -35 9 34 10 -21 51 15 33 72 96 121
4582 121 -10 72 41 -123 -153 5 -64 -75 -37 101 -5 -6 81 -22 48 45 -1 1 107 64 -8 30 133 -78 -112 32
4608 32 25 22 54 36 70 114 14 9 -81 14 23 -25 -120 36 -73 -240 75 -49 -120 54 -7 1 -8 132 -1 -98 28 95
4636 95 19 -5 104 -164 -50 61 -69 -10 99 73 -3 2 139 -41 -66 65 13 -74 75 111 37 -13 74 -151 -63
4661 -63 50 -41 -50 -80 130 -36 -21 94 -46 16 52 38 -89 -47 94 -20 5 -63 -28 -125 -4 122 78 -24 123
4686 123 29 -38 168 194 -13 -33 74 -143 -68 88 -79 -46 15 -83 23 -84 179 74 -4 47 6 79 58 112 -174
4711 -174 14 17 -30 -118 -99 -15 -129 -27 40 35 -74 124 87 110 -11 -31 42 1 3 -192 -28 -10 31 -89 -20 -57 69
4738 69 69 146 60 -108 52 -2 -26 69 7 -30 -33 -3 -97 -51 16 28 -156 -63 51 76 1 79 36 -8 81 92 -38 -37 109
4767 109 -25 -71 65 -38 -19 -7 -23 48 15 136 105 -57 107 37 -6 13 2 -63 -110 11 17 -90 -43 45 5 -1 93
4794 93 154 14 181 64 -25 59 31 -74 17 -11 -7 -35 -7 -63 38 -62 -75 -37 -50 116 -74 49 -23 62 -5 48
4820 48 7 8 -9 4 -82 -129 95 187 -12 -96 180 -5 62 243 68 29 54 26 -32 -76 109 -95 -199 -11 25 -13
4846 -13 -12 -42 -2 147 117 -160 -48 33 134 13 -70 20 -26 -111 -134 -43 -129 -73 60 -26 167 36 -31 20 51 89 6
4873 6 100 -16 121 7 70 -32 -125 105 0 -50 118 79 16 20 51 32 -2 118 -34 -42 -12 57 -79 -44 69 -17
4899 -17 -23 108 6 4 83 82 -34 -220 199 31 -108 -12 21 -133 20 22 14 -62 59 25 -45 144 42 71 70 98 35
4926 35 -95 126 88 95 7 81 -96 -43 13 67 -135 59 131 -85 1 102 14 14 44 106 7 50 80 -163 -107 2 40
4953 40 -126 -95 -103 -63 20 -17 85 70 105 41 48 94 127 -55 -25 56 19 -86 56 -13 -36 -19 97 120 36 124 -61 11
4981 11 96 50 76 35 -3 25 7 -27 57 9 28 -7 -84 -55 95 -24 63 101 -58 -35 -60 -93 -98 -69 49 -115 -165 -84
5009 -84 -23 -45 6 112 128 -49 -15 -35 18 86 -131 -128 -59 66 6 -42 162 -59 -39 101 -2 -6 29 122 -19 98
5035 98 108 -39 -147 -88 102 39 -72 -10 57 -113 -127 100 -25 56 107 -37 32 71 -13 -41 28 3 -68 -73 -20 -102 -48
5062 -48 34 16 -80 -88 67 -1 58 113 24 62 -3 136 -71 126 11 -110 -42 -21 99 23 -34 -91 -217 12 62 16
5088 16 18 38 68 26 81 -40 4 -126 35 46 -127 -83 -34 -113 22 -39 -46 -19 -23 106 41 123 -23 -180 -67 3 -125
5115 -125 -5 9 -25 7 -40 -124 -82 -4 175 93 -15 -21 -25 -98 4 63 -77 -89 35 -72 -7 -5 9 27 102 -11 -89
5142 -89 -8 136 -139 -45 -22 -49 18 66 88 -33 59 -125 -197 -148 60 65 -41 -29 1 -38 59 24 15 -113 104 80 53
5169 53 18 23 18 -9 -103 3 -104 -107 149 -175 -17 30 101 -56 77 -57 -33 -51 -21 72 -101 25 28 -113 55 150
5195 150 -4 9 19 114 62 91 -10 -89 -15 64 2 -31 -62 -75 75 4 55 8 68 9 17 19 110 46 11 171 128 -85
5223 -85 -6 -31 -19 13 -39 -57 -79 -63 -4 50 -47 42 -16 -4 122 4 -56 -97 -94 -107 -58 29 -47 -5 -27 -86 -54 -45 3 -48
5253 -48 -17 28 182 49 104 -54 37 60 -64 35 -49 -42 -90 -24 153 103 -44 73 -127 -42 -98 118 123 -68 -51 170
5279 170 -4 -51 65 12 -87 -34 -32 -41 -51 8 -92 -11 12 25 5 33 112 -101 17 -32 -26 -72 -117 -46 20 -80 7 -42
5307 -42 50 154 86 -35 69 -18 3 21 -16 -110 23 38 -16 37 21 6 76 -45 87 38 -85 -23 -3 -27 -102 -170 -8
5334 -8 -8 41 -22 35 14 71 -160 -19 48 26 78 -115 -40 35 -6 87 -45 -92 -3 -60 -4 3 -110 -38 -100 21 10 51 58
5363 58 -32 71 67 131 -131 -16 -44 -21 1 22 128 -25 -94 69 8 -30 -83 147 70 126 10 -164 45 10 -26 28
5389 28 28 -78 -43 -84 -19 -142 -1 77 -10 7 67 -36 -49 -16 -5 -21 -59 61 -76 -85 120 43 -155 93 5 -17 66
5416 66 93 15 -71 15 -89 -84 -36 0 -23 24 53 -24 -9 13 -74 -23 -9 39 -44 39 20 1 72 92 -85 0 -35 -46 5 41
5446 41 38 -46 20 1 63 -2 -64 134 22 66 112 -10 17 -88 -6 51 -23 -122 -7 -64 -26 -26 -212 -66 -88 -88 -45 70
5474 70 56 83 22 51 70 12 97 9 -4 54 -67 -153 -13 10 54 87 48 17 -4 28 37 -181 61 72 6 -27 25 87 -97
5503 -97 -67 -80 16 -103 1 65 -58 43 -26 89 133 132 49 39 136 -44 -71 -86 -79 -100 109 31 -64 78 -36 -2 0
5530 0 -61 0 -9 4 -42 -37 41 -62 -35 -64 39 54 104 45 41 77 -28 139 -119 24 158 107 42 -67 31 -10 29 -9
5558 -9 5 -18 -95 59 31 -31 83 -44 9 -98 -129 -86 -22 6 -64 18 1 -30 -48 -160 22 -126 9 15 24 -55 33 -23
5586 -23 -97 59 -51 -22 -30 -100 2 -15 -123 -31 -1 -14 -64 -85 -3 55 81 172 53 83 -34 76 -3 -29 -20 35 -46 -145
5614 -145 140 35 -72 -83 -167 47 54 32 45 160 112 -6 4 65 10 48 -51 80 36 0 -48 6 -96 -7 83 64
5640 64 7 20 95 38 45 -80 41 68 2 -84 -42 -49 -40 -8 68 4 -4 -37 7 28 -21 -27 -153 -47 -2 -5 -65 -79 18 34 39 129
5672 129 -53 -59 32 67 72 29 -8 94 139 -58 96 -31 35 36 72 -89 52 -77 -39 17 51 30 22 96 23 -15 49 6
5700 6 10 47 -84 -114 -93 -44 -91 34 -88 -85 2 23 99 105 59 23 24 93 -74 -59 78 124 -56 17 83 39 22 9 -54 96
5730 96 -11 100 68 34 -63 68 -14 22 -59 41 64 -36 -51 83 -128 12 35 -13 -34 145 149 -69 119 128 -109
5755 -109 12 37 8 -61 -85 -74 -201 2 -16 -81 -76 107 -47 3 -54 -94 -92 -5 -157 103 20 55 45 64 -52 -26 67
5782 67 109 -11 23 29 115 98 3 -40 -18 -23 2 35 56 65 -48 7 50 45 42 16 -54 76 -45 40 -49 96 123 -7 -70 -10
5812 -10 -22 -77 58 -34 -122 -83 -103 -40 -59 -33 27 76 -40 47 57 65 -23 -57 64 -23 -97 -53 52 -200 18 40 44 -60
5840 -60 63 21 19 -19 12 -39 -32 48 -25 9 -4 -38 -185 29 12 39 -75 40 135 -91 -101 -124 0 67 -75 -60 -170
5867 -170 13 -156 -64 25 -23 -82 -5 -7 -146 79 3 9 -69 27 5 71 -16 27 -16 86 13 61 5 -45 40 -12 50 120
5895 120 34 69 19 -11 -1 -7 124 -42 -33 -44 63 -2 -74 50 -75 40 -2 -14 90 63 166 -71 -40 11 4 -131
5921 -131 -69 -20 -25 26 -6 71 40 43 45 -89 -56 37 -107 15 33 -46 41 10 -66 16 7 111 -132 -40 73 47 108 77 5
5950 5 -116 45 -119 64 -17 30 27 56 -30 20 -29 -42 -4 31 -70 -12 21 60 43 19 27 -96 142 -30 -48 121 -90
5977 -90 -26 67 25 -55 75 -16 -22 13 73 -6 131 79 14 11 -42 -102 12 -70 81 -28 -72 -59 125 -4 -59 -48 32 27
6005 27 40 38 -46 106 50 -91 45 -47 -64 2 -4 93 -49 -92 12 13 23 -36 -4 -15 87 -49 7 39 77 -112 42
6032 42 -114 -64 -90 -39 74 -10 -14 -75 133 -23 -67 26 48 -80 -50 -26 36 65 -146 -9 -24 0 -57 -109 7 45 23
6059 23 -24 42 -3 -63 -14 24 -94 -6 57 -139 86 -65 53 -60 50 24 -95 -1 -61 103 -11 27 -13 -28 17
6084 17 -33 -61 -1 62 85 -95 -32 -14 -24 7 53 -50 57 40 -59 -63 100 -93 60 -50 23 -3 35 61 -140 34
6110 34 -67 93 43 -87 26 1 11 12 42 -32 53 152 -84 85 25 6 -29 -35 -53 -47 75 -90 -7 -18 53 -20 -19 70
6138 70 16 -22 54 49 -23 26 -165 -49 -55 -43 -62 -55 19 8 58 56 -8 73 -18 -5 42 -54 11 -22 23 26 44 -12 -27 47 -76
6169 -76 55 -28 -131 -45 51 3 -160 38 129 -14 -118 -4 -44 -75 17 34 -32 -32 49 24 -6 67 37 -70 -25 83
6195 83 -14 -52 -104 69 36 -51 53 -14 153 131 86 -86 -45 -32 -19 100 3 59 97 28 13 -121 -6 7 32 -61 -37
6222 -37 -106 -38 109 51 23 167 74 2 -7 -71 -20 30 0 -78 -18 -95 -68 -15 -47 73 27 -54 -128 86 50 58 -26 -92 105
6251 105 -33 5 -132 -63 -33 -68 -7 4 14 88 19 32 -19 40 59 78 22 -88 -76 99 -11 -69 -24 -71 12 -98 -90
6278 -90 -40 80 35 3 -34 122 -60 -38 143 -161 -33 10 3 40 -39 94 8 -56 -79 -35 -30 10 -41 -21 14 -73 -46 72
6306 72 -89 -3 100 -52 93 2 -47 42 -15 82 57 7 55 -3 -26 96 79 -27 159 72 -17 35 52 45 20 -5 -163
6333 -163 -31 75 1 8 -44 67 -13 -35 -31 1 -7 15 -32 -11 -64 -14 18 -36 38 76 42 89 -50 1 31 14 -16 -16 -21 50
6363 50 -95 -82 8 96 49 -75 -42 44 57 92 53 -57 114 79 98 -118 -76 -23 4 -76 32 55 -108 4 103 7
6389 7 29 -52 115 19 -72 -1 43 74 19 23 38 42 44 30 82 -9 -40 72 -11 -87 53 0 21 31 -54 29 -16 -6 -100 -4 79
6420 79 69 53 -76 75 14 -96 58 116 -28 44 87 -64 28 -101 -86 -98 -32 -11 -22 -8 48 24 -76 -101 -80 -63
6446 -63 58 -160 45 -95 4 -139 39 51 -19 -74 141 61 116 14 -151 -29 -11 -115 103 35 -145 37 2
6469 2 -49 -11 76 -56 -56 -18 -41 -48 -82 1 14 24 -57 88 28 43 -26 -23 128 99 -139 9 -6 -46 -108 66 61 -18 94
6498 94 -43 -51 74 52 -103 51 64 -21 -25 -28 -88 -1 -112 10 -47 -63 40 -93 -85 -69 -69 9 -25 67 38 22 -45 -88 -79
6527 -79 13 -167 27 80 -62 13 -21 -33 -4 138 -13 101 -33 14 31 46 -68 -7 -64 -40 29 51 -70 -43 140
6552 140 -36 94 -43 141 -11 16 27 -29 1 69 63 -73 164 9 -94 67 -66 25 -124 89 -6 51 21 -88
6576 -88 66 -76 1 -102 27 -29 19 47 55 -54 -87 -133 22 109 18 27 -70 -57 127 129 -52 16 87 -6 0 -53 21 -28
6604 -28 -105 8 -115 -26 23 -53 -93 2 -17 36 86 81 -7 40 -23 13 -134 4 37 17 -10 -139 50 21 -47 -82 21
6631 21 149 83 -38 50 96 -43 -7 125 28 59 66 64 -55 52 -128 -32 -132 10 55 52 -6 45 -34 -58 -101 81 106
6658 106 -4 5 75 41 -10 20 8 107 91 22 -21 -3 -24 16 108 -71 -108 1 -99 -47 -139 -22 -49 -48 -2 135 11
6685 11 12 68 196 54 -92 27 -18 -51 -80 -122 -13 8 -93 134 38 65 10 -79 44 -76 58 -21 41 -10 7 -79
6711 -79 -5 -9 -51 -94 26 -115 52 1 -28 -118 75 -69 81 27 -6 66 111 22 -7 -90 4 23 98 -82 -15 -2 -64
6738 -64 159 22 66 -89 -13 89 41 25 79 20 -25 115 87 42 57 14 -18 17 121 79 -11 -4 41 10 97 34 26 -69
6766 -69 8 -141 -45 20 2 -94 -11 -107 -40 84 -17 -10 -65 -20 147 43 59 32 -16 57 -17 -36 -81 8 60 10 -39 90
6794 90 -29 -67 31 120 -35 133 77 46 27 -15 100 74 -6 22 75 21 -238 63 3 -44 115 145 0 28 49 -4
6820 -4 -58 -134 78 -35 -121 -120 -90 106 136 53 -82 66 45 131 13 60 87 65 12 -93 6 -107 67 -34 -73 -52
6846 -52 -186 -52 131 58 -3 -50 131 35 67 38 27 57 -9 -46 -45 -81 17 -26 69 59 -82 -16 -36 -90 41 3 -32 31
6874 31 -25 60 20 15 6 -15 -41 33 -47 67 -37 80 30 16 -116 70 -97 65 32 -116 143 20 -44 -67 -85 -25
6900 -25 135 71 -102 43 33 45 -30 -121 209 2 -34 7 -51 -31 14 -5 -4 -32 59 -66 4 -26 7 -5 -13 -67 8 109
6928 109 -22 5 88 3 12 55 -31 15 -2 -45 0 22 41 123 146 40 16 -34 15 -40 63 29 82 -23 147 95 -45
6955 -45 89 20 -167 27 83 -55 -123 187 -86 -11 62 21 116 -57 16 -98 0 -26 -19 -26 109 -36 67 -95 -9
6980 -9 -12 -102 12 9 75 62 41 67 38 -12 145 -17 5 -81 55 -40 -3 28 -1 -71 -3 -47 -139 21 -84 -41 79 -7
7008 -7 -35 -43 25 5 -115 -7 96 68 -90 -34 28 -75 -66 -58 -60 -20 0 0 -72 108 -33 42 3 -30 72 105 -38 53 95
7037 95 -112 23 149 49 23 -31 34 -157 -32 -11 37 34 -27 7 16 27 -102 83 41 -4 14 -12 -94 -3 39 -117 -29
7064 -29 -4 33 59 89 -50 -107 86 27 71 83 203 -82 88 -35 -100 51 41 -137 18 -36 79 -46 -78 -26 160
7089 160 -32 13 54 9 -40 -33 33 -24 70 39 -47 -108 -135 -63 32 -8 6 -39 -30 -41 23 -83 98 -53 -13 -47 -48 -86 55
7118 55 87 -74 -48 4 -74 33 -14 4 -52 -19 -26 14 74 -30 -6 -25 -83 31 -28 -34 -60 -109 92 -70 -44 24 74 -68
7146 -68 -59 -31 105 -74 -84 -33 -13 -45 -88 18 -33 33 -63 -18 17 -127 50 25 68 -5 43 -108 -6 -16 -37 -32 -1 -17
7174 -17 -80 -6 -111 14 87 18 -112 89 -30 -22 -131 -77 93 28 3 27 163 -35 -76 81 7 -57 -114 76 -32
7199 -32 52 -27 26 -102 26 51 -40 88 -113 0 41 -15 41 7 -142 -106 9 -24 -135 -56 -95 43 9 31 -65 -32
7225 -32 39 41 -28 -29 -28 70 134 -44 47 92 -36 45 -9 -42 -57 -27 -83 -137 -123 41 65 -71 3 27 -88 -74 -37 85 16
7254 16 47 14 0 19 2 49 15 -8 39 -26 -34 -15 61 89 -49 39 36 38 -14 20 50 -25 73 2 -128 -116 -2 116 -28
7283 -28 -85 -95 69 81 -32 -13 -35 -1 -7 57 31 17 -44 -119 -35 74 22 -43 -98 -80 32 37 -11 81 9 33 164 -85
7311 -85 -22 90 72 -43 -178 -10 -75 153 -6 -117 -91 24 10 2 -73 88 18 -17 -5 149 -81 -33 37 -61 61
7336 61 24 -28 -18 -11 -103 23 36 -118 18 66 29 -63 -32 -8 66 -56 -123 -13 -133 -112 45 -40 -3 -184 -25 88
7362 88 56 92 -74 33 -38 -32 -3 73 134 -40 80 -75 -49 47 -10 32 -33 -5 61 44 101 28 101 -55 42 35 27 70 23
7391 23 113 46 -85 -93 -24 69 45 4 -4 -61 11 -68 48 -65 -9 45 82 57 -7 90 -80 48 -51 -40 9 8 35 -50 84
7420 84 60 124 29 -160 -83 63 -8 -2 -46 -68 -18 23 -33 37 156 6 -4 89 -13 -30 84 -21 -97 123 -18 -104
7446 -104 -31 -22 176 -95 8 -107 -53 -137 42 20 47 28 -59 16 19 17 29 -17 133 -4 -103 154 10 -66 -80 -108 -54
7473 -54 -15 22 -56 -3 -13 -91 12 33 119 26 81 5 -43 119 -28 -55 -50 63 152 -15 -14 -85 -74 4 -17 -7 79 21 98
7502 98 -82 132 102 -50 3 -4 18 -26 -11 1 102 92 77 8 35 -23 164 -26 -72 11 -6 -42 -92 78 48 26 -114
7529 -114 38 -63 -46 -74 -139 23 -131 -2 -68 -114 -4 36 -81 103 -68 132 61 -71 -34 -63 -139 8 10 -213
7553 -213 -74 13 -95 -68 -134 -47 2 104 -41 -72 7 -13 -7 19 17 71 10 83 118 67 -63 -13 61 9 1 -155 71 -69
7581 -69 -36 -45 32 38 -11 91 -78 59 -67 -3 -45 -65 75 -29 68 -8 0 -20 57 40 -39 -31 73 30 57 29 -81 67
7609 67 25 244 -53 -6 -90 -97 45 64 35 -97 65 -40 117 -82 112 117 -196 95 -5 -32 -117 -46 46 48 -9 -42
7635 -42 34 -104 -68 -3 -38 50 -8 -47 -68 -42 -45 28 8 -34 18 42 -101 -32 30 -80 -25 -114 41 5 -67 -19 15 -47 80
7664 80 -78 -62 -87 -58 94 44 17 -135 -57 81 35 -34 29 -29 -82 27 112 20 -34 -3 -22 -3 -32 26 49 -56 99
7691 99 -28 36 27 -5 -38 -37 24 31 -23 -157 -99 -10 66 -44 -102 -24 -102 54 -93 -41 1 -18 68 62 15 2 114 44 -39
7720 -39 -1 17 -116 -105 57 -83 18 -80 93 82 -120 27 22 -47 -19 96 -30 -31 -13 19 -88 -12 -6 -15 -90 39 21
7747 21 -37 46 58 -52 9 6 -15 30 -129 69 40 13 81 -19 113 -16 95 10 -38 -60 10 -93 25 24 -13 -8 49
7774 49 -100 129 -45 65 31 28 -44 42 140 -30 -13 51 -80 -51 -28 37 110 113 3 -25 -4 -82 -76 13 -54 32 -12 -42
7802 -42 34 1 -27 -14 -46 14 1 24 -114 -57 -21 -34 -28 -106 5 52 77 1 2 -31 45 19 -59 -93 57 -49 41 -34 -20
7831 -20 42 -72 71 -17 34 -98 33 81 17 62 -3 24 -135 57 3 -16 -112 2 23 -57 -80 -37 7 16 73 92 -15
7858 -15 -35 -3 120 -90 3 84 2 21 60 89 7 -8 12 24 113 -6 57 100 -68 -38 -4 -4 42 62 -57 9 -132 9
7886 9 -4 94 -24 28 111 -35 -123 -83 -20 -87 -76 -87 -52 -28 63 -127 116 64 -145 34 -82 -54 -67 -31 36 79 137
7913 137 21 138 78 -27 25 -46 -1 -61 -87 41 -72 45 3 -72 -91 -64 63 64 22 -72 65 -92 28 -22 -18 -41
7939 -41 -27 70 9 -78 -38 -52 -133 4 68 59 -95 55 -46 -60 69 53 -48 -11 -6 68 104 44 -64 -133 26 -73 26
7966 26 -79 55 -80 -27 -119 -46 51 -92 -112 -19 87 -95 -95 -42 -75 35 40 -21 21 -156 63 67 93 -26 -27 -10 -11 11
7994 11 -35 68 -33 -47 32 -31 -24 68 2 9 -23 -34 -44 -181 -57 -31 -122 -58 67 4 86 -173 60 -93 -51 42 1
8021 1 68 53 -93 63 -26 50 34 23 47 -93 79 84 47 -85 -74 48 -65 13 -48 56 53 -86 72 -63 -20 -14 -7
8048 -7 -79 85 -43 -18 -55 70 47 -67 -75 -79 -74 21 -115 67 -51 -127 -18 19 -58 52 0 0 -54 66 -45 40 82
8075 82 126 -146 -35 75 -2 28 172 18 -35 -38 35 -38 -150 16 22 25 19 39 49 156 25 16 119 12 -154 -13
8101 -13 24 56 -34 -146 -10 -2 -110 -46 59 81 -78 41 -4 -77 -88 -24 -62 4 51 -32 -26 -53 25 46 47 -52 2 88 -37
8130 -37 109 91 0 97 -68 -9 -109 10 96 3 -65 -31 8 -43 50 -6 -6 1 19 -29 6 -55 -37 32 -7 58 -96 -41 -44
8159 -44 0 -43 -79 -65 -75 51 32 36 -7 -37 44 -79 67 -51 22 48 42 2 -20 -61 -87 3 14 -57 55 3 75 -45
8187 -45 23 6 85 -24 -64 47 11 135 116 25 -7 53 25 88 71 70 -29 31 -9 -84 -28 5 -22 0 -217 -34 -73 -69 -33
8216 -33 31 74 -42 26 -56 17 -28 37 16 30 -36 -7 -56 -60 -17 34 92 -9 39 -31 -27 38 17 42 -118 26 -29 40 32 68
8246 68 -81 62 20 -109 -38 13 -148 -28 -110 12 34 92 -110 -89 -7 -75 -54 13 -53 -69 -34 19 -32 -44 27 -90
8272 -90 9 -113 130 88 -33 -37 48 4 102 -24 9 -6 -70 -37 21 -23 -13 -28 27 65 -125 -16 -156 49 -124 -96
8298 -96 -21 -11 4 94 26 -119 26 63 19 -15 -45 -38 -64 53 -1 36 42 -3 9 -34 57 38 35 -40 72 -37 1 -27 -63
8327 -63 -148 12 -42 -18 62 -67 124 62 -64 15 -111 25 -97 -23 -113 -42 28 34 -48 -140 32 -8 10 -57 -36 -110 -44
8354 -44 -45 -57 35 78 -33 -77 30 -46 -72 -12 42 3 -37 128 -27 158 -45 -67 18 -30 22 26 5 45 -85 59 38
8381 38 27 0 99 -85 6 55 -52 -102 -52 119 91 19 29 30 78 -38 -155 86 -13 61 -2 -105 -80 -41 -26 -13 3
8408 3 132 -56 92 -63 -4 -139 38 15 -101 -57 -34 -30 10 51 6 38 -10 -68 -30 27 49 50 -56 34 -35 -47 -84 -105
8436 -105 -120 73 -24 -31 38 -5 30 -100 -62 -39 -137 -29 21 -71 124 2 -120 -67 25 -22 61 5 -33 56 117 47 -64
8463 -64 -46 -31 38 -83 -77 -29 -2 -80 -13 -6 3 31 -86 18 101 -14 8 -65 -31 -7 63 23 56 -40 69 0 -13 -74 -21
8492 -21 49 53 -78 -39 -78 17 -87 -86 -69 97 158 -87 41 34 -46 108 -49 -70 -71 -115 27 -117 111 -22 -39 50 -10
8519 -10 -16 135 51 -134 20 72 -16 68 57 35 -2 22 -9 -66 -65 -25 117 54 -32 69 31 123 -13 -79 -59 -74 -36 -76
8547 -76 55 29 -68 6 22 -62 -13 127 39 56 32 -42 -61 -26 -20 -11 -44 51 81 -20 -14 20 33 -99 92 -4 -19 68 -140
8576 -140 79 -3 -28 -75 -12 -126 -52 -3 107 -53 -79 -23 -16 -76 73 -72 -164 -81 -69 75 -27 -94 8 113 -39
8601 -39 -24 29 44 -99 -59 38 153 7 -48 -44 -64 -165 -51 -26 94 24 -18 -102 14 -32 0 -13 -4 -112 22 -10 -57
8628 -57 3 14 -66 -4 -67 -150 43 53 -78 -50 114 -121 -77 -47 -82 62 23 43 22 -93 0 -43 133 53 -18 18 -16
8655 -16 -12 87 -133 80 10 16 -51 39 88 43 93 -39 -28 -125 -94 -27 -71 14 -14 -58 101 -87 2 56 36 37 52 -137 44
8684 44 -10 46 64 46 -50 6 9 33 -5 -20 1 -16 16 39 51 -36 20 22 18 -31 -107 -59 80 2 26 -98 -75 88 35 -82
8714 -82 34 -41 52 -18 110 36 -208 53 29 97 46 -20 2 28 -43 -6 40 59 -180 58 -16 -110 -4 -103 -3 57
8740 57 -18 -9 96 -50 -3 40 -113 3 -114 -23 11 -10 -88 -63 -72 -17 -4 -24 6 -169 74 -26 -13 -34 -3 -32 15
8767 15 50 -10 87 116 85 -7 -37 -6 11 171 62 91 -38 -22 60 -75 -52 -20 -4 -67 -8 70 -56 -145 33 -6 -21
8794 -21 -17 58 55 78 -8 -36 43 -22 -80 49 -54 -34 122 -4 60 -17 -42 -35 28 94 25 -68 -10 60 -40 -131 48 -15 4
8823 4 76 -84 10 -160 -22 -81 27 -116 -28 -49 71 69 16 81 -39 51 -11 -26 69 18 11 -1 34 45 4 7 140 -14
8851 -14 -50 68 9 31 9 60 -21 6 43 -32 -36 10 -139 -63 54 17 65 -103 90 48 82 -90 -96 -12 9 -22 -23 -80 -69
8880 -69 -51 -27 11 -4 -4 -115 0 84 28 64 33 -70 52 -28 93 -90 37 -126 23 -27 -120 -102 18 47 -15 18
8906 18 -28 -39 13 87 -72 46 98 -82 -31 26 -10 12 -16 20 18 54 -162 -23 -6 -106 -114 -63 38 -22 -36 18 30 20
8934 20 -98 25 -68 38 89 -24 23 56 76 66 -6 -92 28 -147 -73 32 -49 -215 -122 -11 12 -11 70 -13 -10 -5 -37
8961 -37 -117 -8 65 -53 -59 62 -54 -149 9 28 38 -51 69 -24 15 117 11 -22 122 -6 27 15 -1 76 20 -47
8987 -47 123 15 -41 0 79 -15 47 -10 4 -2 40 41 40 100 37 22 -7 -77 -20 190 -3 28 -96 -82 11 5 -12 -138 -5
9016 -5 39 19 26 -54 20 -92 17 59 -1 49 49 -119 -5 -70 59 -52 76 104 -76 -29 120 98 28 35 68 -101 -6
9043 -6 78 -42 -3 -17 -65 61 58 -10 -9 -117 43 36 58 42 43 165 34 50 26 -12 -31 -75 35 119 -22 41 -66 -36
9071 -36 -20 99 -62 37 0 -3 -13 -17 -25 2 120 95 -66 -30 98 -25 107 136 40 -29 17 39 -62 37 -37 17 -64 69
9099 69 -21 -84 12 206 -112 -69 -34 79 71 -33 -24 -9 -143 -19 -41 -28 10 -32 195 8 -94 83 5 -23 -46 -55 -17
9126 -17 31 87 20 26 59 52 -24 131 3 28 8 59 -145 -56 8 -55 113 11 -16 50 -51 -20 23 -29 8 59 -39 -118
9154 -118 -37 72 39 -99 36 74 122 82 -37 -28 44 -19 32 -59 -95 51 -44 -37 -45 130 -43 21 -168 141 91 -93
9180 -93 -9 -30 -38 -102 -75 28 137 -12 -16 -104 -8 -78 -111 -54 56 -149 -92 121 108 22 65 26 -151 -30 -29 58 14 -42
9208 -42 18 52 49 -29 -40 11 -26 -12 24 12 34 -72 6 -106 -86 41 -59 17 -2 -54 -82 7 -26 -13 25 -15 98 -166
9236 -166 48 11 12 -4 -142 -6 -19 -25 -2 83 -29 -55 -37 -19 119 -15 10 25 22 -40 -19 -106 -140 82 -18 -19 -49 -19
9264 -19 -52 -79 -89 5 30 -82 -64 39 -28 -60 26 64 20 56 63 -47 19 76 31 34 -31 14 -21 -21 -19 79 -4 -4 -40 -17 -66
9295 -66 -59 33 -180 -25 48 -68 -101 -9 -26 10 22 -55 -72 -25 -32 11 -56 -42 -30 -85 108 -205 -3 -108 -93 78 76 -84
9323 -84 -56 38 13 69 96 -80 -13 -34 33 107 4 -16 -11 -97 -55 35 64 108 11 106 55 42 -144 71 -78 -51 -20 -73
9351 -73 46 16 -42 9 105 49 -121 -40 -157 15 5 -30 95 42 -16 -62 -27 20 -35 -92 10 -106 -5 -13 -23 -32 1
9378 1 11 5 -10 42 -62 59 -32 12 -192 -25 44 -23 -8 -34 -54 -29 62 12 -18 23 -18 90 134 36 -36 -15 -73 20 20
9407 20 39 -24 -20 -73 -77 -37 -38 161 43 -61 -79 47 -2 3 -87 63 -83 31 -136 -70 37 -10 -102 58 83 37 -4
9434 -4 -41 129 21 -60 105 49 -22 38 126 14 33 48 -123 -8 -28 -40 38 -7 -82 66 69 6 -57 16 -11 -50 -52 26
9462 26 33 86 133 94 -124 110 8 49 29 -101 30 -119 113 -137 -90 3 -49 70 -5 1 107 88 -126 45 -20
9487 -20 -103 143 108 103 -81 -146 -87 24 -119 94 5 -54 33 -93 139 -33 67 -8 -86 30 67 -33 19 42 -28
9512 -28 26 -27 70 -10 17 -46 131 53 40 -3 -17 -76 9 -127 -19 58 -49 83 -107 11 -109 -39 -92 6 38 -33
9538 -33 52 -16 20 30 91 -37 159 -86 11 -38 2 -112 46 -119 -137 27 76 -52 13 -39 -12 -47 8 89 57 31
9564 31 -87 7 22 -36 90 6 72 -38 -61 -30 179 -3 29 -9 75 -20 -32 38 100 5 -70 -24 -13 26 -28 17 103 8
9592 8 20 75 -63 16 -34 -22 -5 -64 -57 89 -21 19 -89 56 31 -93 -89 -57 -140 35 32 25 21 -137 59 85 -13 -176
9620 -176 -5 14 75 -38 -21 28 -35 74 38 6 30 -134 -44 63 -70 -55 5 2 -61 -18 -116 17 31 -71 92 -141
9646 -141 -86 48 27 -21 -85 9 83 -46 107 -30 0 13 -37 -5 32 -48 -76 31 -28 -2 -23 39 -30 -51 58 1 18
9673 18 -94 15 76 -40 39 15 71 -75 -20 -26 1 22 -6 114 -41 57 5 -29 34 -5 84 2 50 -87 67 29 16
9700 16 -31 -65 38 -34 -77 -16 -11 -30 -34 -57 -57 76 99 2 -42 -33 71 78 -88 53 68 -37 84 80 -121 62 18 -31 52
9729 52 177 12 12 -4 -70 60 65 -4 -20 3 -138 -58 -15 -66 5 -54 68 72 4 -127 90 38 -67 -63 35 53 -32 -15
9757 -15 -7 -89 65 27 -141 130 -21 14 -97 9 -25 -112 -89 31 -140 -68 -110 13 -13 -99 24 31 -50 -1 51 -70
9783 -70 35 3 12 -92 -76 -62 -60 -67 87 -1 113 -47 -45 115 94 -29 -105 70 -35 -49 -10 -116 -51 133 105 1
9809 1 55 41 -1 75 77 85 73 61 242 -70 -35 128 -34 -18 -74 -38 -46 41 -8 59 54 51 -45 11 70 -19 -153 39 9 -124
9839 -124 -38 -61 -14 -22 29 80 18 -56 -10 -41 -12 -52 64 0 21 33 -28 63 63 63 -44 -106 0 39 3 58 33 120 33 62
9869 62 -134 8 -27 -14 10 60 32 29 -149 -85 67 6 21 -38 6 -163 71 11 -27 -4 -20 -37 49 -46 56 14 48
9896 48 -6 7 28 132 -22 -40 23 69 67 34 19 7 -48 -5 20 33 53 -77 86 -33 110 -66 -6 -84 -49 33 3
9923 3 -71 85 39 -3 -69 -38 -1 12 -47 -86 11 -9 52 -76 124 67 -68 -60 -27 -40 50 -45 59 43 9 -122 57 68
9951 68 -36 -29 75 0 50 37 45 -58 -12 -26 -5 -19 -101 59 -23 58 105 -137 -69 -20 -5 -32 -12 -62 -153 99 20 -69
9979 -69 -9 40 33 -24 -23 -31 -59 -43 -71 -38 2 30 -5 -52 -6 15 24 92 -66 -24 39 -41 -17 52 -141 -74 36 39 -23 6 -11
10010 -11 91 19 128 -10 7 58 79 -157 -62 88 118 -17 76 -91 -26 86 -63 -56 -42 59 142 21 65 28 -47
10035 -47 -10 -11 7 -16 40 -55 28 35 13 42 8 80 45 123 -50 -7 -6 40 -66 105 184 117 -2 -1 -48 125 71 41 -55
10064 -55 52 78 66 -17 26 -36 23 115 -121 -22 -41 -5 63 53 -17 -24 -28 86 134 64 -67 -12 54 1 0 -14 90 55 -40
10093 -40 90 34 67 94 18 34 48 71 83 91 8 -16 0 -38 -26 23 -28 17 -45 37 45 34 -108 -39 22 106 -52 10 -83
10122 -83 15 -110 44 -86 36 -38 -87 -41 124 -72 -31 -79 15 -9 9 48 89 35 58 -3 101 43 12 92 54 -154
10148 -154 -26 76 80 -30 -29 57 -18 42 -51 4 29 77 33 58 146 124 -124 -35 23 54 -140 -30 -49 92 78 -22
10174 -22 56 -117 -47 2 -88 -198 -89 7 -38 -43 76 1 -22 -153 116 54 -20 -7 -92 5 15 -136 -77 73 -6 44
10200 44 -34 90 -51 -97 145 33 25 -169 -66 -147 -45 26 -84 -87 -3 30 -15 -37 -13 -94 -21 14 -113 72 53 -168
10226 -168 -34 91 -3 84 -70 58 57 -31 3 49 -50 50 32 -19 51 -32 -4 -76 110 9 144 -13 34 57 -48
10251 -48 60 -12 41 -19 24 64 50 23 -132 70 -78 59 -11 27 -112 -117 -54 -45 52 34 -69 8 -65 12 12 14 -4 -57
10279 -57 1 82 -19 -15 -112 -34 12 34 4 -64 12 78 -48 22 -65 65 47 -39 36 -42 -59 -68 56 91 -79 -8 -114 -13
10307 -13 -24 4 -41 52 28 183 -19 81 38 -96 66 10 67 -133 -2 -105 40 30 51 -57 -12 30 -60 46
10331 46 101 -33 42 -13 -30 117 -45 -25 37 27 5 -14 78 67 10 15 -2 30 -32 67 103 -47 -33 -44 -40 6 13 -44 30
10360 30 -79 -2 31 120 -19 7 -19 -89 95 47 -49 33 21 -61 -2 131 81 4 -60 -28 79 -2 -21 -66 -16 118 -64
10387 -64 -13 -66 0 -4 101 -5 3 51 34 -69 26 -62 -24 -101 -2 -19 40 -11 -21 -73 -21 1 -28 62 -57 75 -121 -94
10415 -94 -71 53 -31 62 14 -177 -15 -12 154 0 -18 -54 -29 4 -7 153 -32 -23 26 35 82 -64 -2 33 89 13 63
10442 63 119 -142 -125 57 -25 32 42 69 99 97 38 -63 -47 -98 15 -71 -63 29 85 -45 118 -118 50 16 -80 113
10468 113 4 -57 67 -13 -60 28 -60 90 -114 -42 31 70 22 17 27 56 -39 -36 23 27 3 -12 10 -44 27 87 -34 53
10496 53 99 -147 -52 -47 39 -63 13 16 -50 112 64 -100 -67 81 28 12 50 -47 31 30 45 24 -40 -102 -13 -1 -25 29 -114
10525 -114 -29 -89 96 -25 -23 -30 28 36 -126 70 -79 52 61 -78 38 119 87 -24 12 58 15 -52 -94 16 116 49
10551 49 109 -13 -50 0 -34 -51 -132 10 -62 3 57 -60 -54 -43 150 -35 77 -8 -24 19 -23 -26 -72 -29 52 8 -63 21
10579 21 21 99 50 66 -11 23 78 -38 -56 11 29 6 -44 -22 -83 -52 -61 -128 97 -48 -81 -51 -112 -31 86 -87 -43 45
10607 45 -11 -9 -41 -109 -3 72 -44 -76 -89 10 -134 20 -26 -39 -24 -69 32 72 -3 -9 -29 86 -109 49 96 38 36
10634 36 -39 -75 -35 50 2 -59 -21 67 33 41 49 -72 58 47 58 48 28 48 4 103 64 -128 9 92 -138 46 9 -43
10662 -43 58 28 51 -3 126 34 -21 -123 -43 -57 75 134 37 -9 11 -17 9 -5 -135 39 -71 -68 -9 -95 -52 57
10688 57 -116 -19 12 54 5 43 12 -14 -19 -102 -56 36 94 -47 -49 27 -5 -143 145 24 2 50 -67 -4 11 -57 87
10715 87 29 78 8 -1 13 -36 -90 -80 -25 -16 55 45 139 -15 121 47 -22 50 -78 84 -80 29 18 -158 12 -54 55
10742 55 53 -32 -34 -71 83 82 52 -46 5 48 88 -12 -167 109 -5 -43 -5 -51 -86 -4 -31 -120 -33 50 -64 -58 -2 -47 114
10771 114 18 26 23 21 -27 73 100 -168 -148 -65 3 -86 -75 83 -21 6 -147 39 30 15 77 13 -4 -43 -64 -58 123 88
10799 88 80 -62 -85 -45 8 -112 67 86 74 -81 -87 -23 -2 -34 -176 -59 104 -128 88 148 17 58 11 -21 -7 103
10825 103 91 37 85 76 53 -55 -38 -59 19 73 -71 -61 53 -31 -151 -17 -61 -49 -38 -101 18 83 36 -27 -96 16
10851 16 83 -30 -43 -33 100 -36 9 -54 -7 -63 66 18 -19 75 55 -26 47 -8 74 21 -63 55 47 36 -72 -62 29
10878 29 43 -59 -61 -16 68 -41 6 47 -35 -84 22 -33 47 -30 -38 -44 -36 19 92 33 82 21 -42 -14 7 42 2 44 55 44
10908 44 31 -46 -44 117 -67 -65 23 28 25 -44 -63 11 -21 -45 39 -27 -40 -15 8 -36 -27 76 -15 -32 -96 -59 -48 -11 -76 -36 55
10939 55 -74 78 -22 -28 70 97 -26 66 -67 -11 1 -95 83 66 102 13 64 -53 81 6 -38 89 79 -33 -52
10964 -52 -74 -70 59 -34 55 50 53 -12 -26 24 -91 13 55 16 130 -75 72 -109 12 -22 -59 -7 -40 -27 -27 71 60 -21
10992 -21 -119 -151 5 -57 3 30 -21 40 92 -76 -70 7 105 71 18 44 19 -74 -131 29 -27 20 -38 -50 -43 -47 -55 24 54 77
11022 77 28 -32 -24 109 -41 -58 1 39 47 -48 25 15 -102 -20 21 4 99 -10 -66 20 6 46 44 19 0 66 51 30 25 39
11052 39 33 -31 45 68 81 -45 -17 -16 86 3 139 22 -1 -27 44 61 85 56 59 42 16 -22 -45 96 -92 -43 45 42 -28
11081 -28 -50 0 -13 -43 42 42 68 -112 -1 -36 38 46 -165 -66 14 -92 -24 -57 25 -74 20 53 -33 -130 -10 32 -13 -22 -105
11110 -105 4 56 -20 -2 33 -74 92 13 8 -27 58 -2 -86 -45 -39 -55 -69 -49 -64 39 16 58 -24 -25 -62 15 6 -67 -43
11139 -43 60 11 1 -17 1 -15 35 -124 48 22 -23 23 -121 61 7 5 -28 81 -97 -32 -49 39 -72 -17 38 -21
11165 -21 -75 71 68 4 -17 -12 -7 -68 6 -4 -71 58 -56 20 -2 14 17 -84 111 7 28 2 70 62 3 5 31 -12 -1 -121
11195 -121 60 -16 70 89 -132 14 42 44 -24 -129 -69 76 84 72 50 -8 77 6 78 41 44 30 -15 47 54 -11 3 36 -76
11224 -76 -23 13 -57 -24 78 -29 -70 -123 57 -28 86 -73 -2 -45 -10 -19 -12 -39 -9 47 -79 95 46 41 -28 -98 17
11251 17 -60 -73 -33 68 -10 -16 6 26 64 -10 -45 134 35 21 21 42 47 -97 -74 28 -28 -128 4 67 -37 -36 -75 28
11279 28 29 27 -30 22 -2 127 20 -35 -66 -3 -49 15 39 15 43 28 -73 197 16 -19 -6 -15 66 -70 -76 -47 -14 -145
11307 -145 31 -12 -76 52 -14 8 -112 4 -3 -62 60 27 -35 -114 5 -28 17 53 68 17 -42 48 32 101 -2 20
11333 20 11 -39 -38 -33 -14 92 -3 -27 -6 -56 -17 -83 37 111 44 -99 -69 -65 13 0 -1 -104 -41 92 -13 18 -43 -60 -9
11362 -9 -10 -64 -33 -6 -21 11 -75 -175 -36 -68 41 140 80 10 16 -93 121 -105 2 73 40 32 -88 -4 -55 -28 13 -33
11390 -33 -60 86 -10 -37 22 -2 -27 28 -87 10 64 56 -3 35 -71 -5 -3 63 9 10 65 -6 13 -34 -17 -62 -134 -10 -73
11419 -73 9 -29 26 -26 0 -38 -102 -7 84 73 -101 -11 -27 -13 -42 17 -32 -71 -30 53 -55 -62 -85 -12 -64 35 -44 -54 43
11448 43 123 -60 -35 94 -7 -159 5 -33 32 -5 -4 23 -47 -36 -89 150 -18 -49 -74 -116 20 38 -44 160 -26
11473 -26 -51 -18 4 107 108 -74 -15 -13 83 -7 -27 -99 -34 -27 -38 27 -44 -13 -12 -37 35 25 102 -64 -24 -34 -50 77 145 43
11503 43 -148 55 54 6 -42 -7 110 -57 -69 63 -1 19 -49 -26 -14 -121 -36 -15 46 -10 -11 0 85 -51 -17 3 -21
11530 -21 -106 16 42 12 36 1 -70 -43 54 17 16 72 -78 -79 -9 1 46 72 25 18 -114 -17 33 32 -22 -8 41 -79 -89 143
11560 143 70 69 38 2 -52 -97 34 -7 14 -46 -68 51 104 71 14 -24 30 -91 40 45 -108 160 67 -61 -42 6 -57
11587 -57 18 -27 7 -41 125 22 20 18 35 62 13 -21 -135 -77 0 -50 27 -125 38 44 -39 -60 -29 60 103 133 116 -34
11615 -34 -38 35 -10 -138 -93 -34 134 14 -10 150 -33 64 -23 47 -2 7 31 36 -25 -38 -76 57 -37 3 32 37 -64 56
11643 56 56 102 93 47 -95 -8 -87 -2 51 -12 -75 0 13 -29 -34 11 -8 -58 -12 84 53 120 -158 -47 -8 -56 -29 -105 71
11672 71 21 34 -5 -115 18 -48 -35 54 -29 -117 79 -83 46 -28 23 102 0 56 15 23 -47 -21 73 0 -113 38
11698 38 -13 25 -120 -20 114 -65 102 6 -16 141 25 44 25 -3 -154 23 -82 -22 55 -4 118 -18 -142
11721 -142 -64 22 -52 -24 72 1 34 -10 9 19 94 -104 71 -36 -59 72 -15 -20 -43 13 -38 81 64 5 31 18 22 -80
11749 -80 38 -56 119 48 -15 -34 127 116 -115 2 -60 25 -53 -43 24 -46 -9 10 -104 -23 -30 116 -22 23 57 -17
11775 -17 34 25 -94 -4 -24 119 -108 11 -87 -7 27 -42 32 98 -36 68 84 -20 -33 33 -79 -141 -21 -17 38 -13
11801 -13 -73 59 11 44 45 -78 -60 -20 -115 -26 -38 90 -60 45 60 -63 43 -20 -29 -65 5 65 -28 -7 -128 4
11827 4 51 -45 -27 -154 6 -30 -25 -60 -12 -24 -88 4 -78 -31 47 -5 22 17 -14 130 -31 -96 -31 -152 -30 -53 62 -1
11855 -1 53 22 27 -108 -37 18 125 25 80 -31 -78 -64 60 134 38 -24 -30 44 3 -29 -9 -36 -62 12 -19 83 -102 -61
11883 -61 28 -118 -62 -92 48 -69 20 10 -23 -39 19 52 -24 6 101 3 13 -15 -80 -4 -53 -18 -130 -100 55 -100 4
11910 4 -102 2 47 -28 24 31 36 -12 87 -112 -14 -24 87 -98 49 25 25 -48 -2 -61 -71 -97 54 65 33 -33 41 -80
11938 -80 16 42 125 -58 -82 52 23 82 83 -8 10 17 -137 -82 -41 15 -123 -76 76 -42 51 33 -53 36 -70 -33 -16
11965 -16 -62 45 -61 -104 -36 -71 -10 32 3 -108 4 -132 -107 48 -56 60 -78 -65 16 28 -93 -8 -49 -82 27
11990 27 -119 25 91 11 111 121 53 -2 4 -87 -38 -19 87 -63 63 39 62 2 -49 -37 -5 -133 24 -50 -37 -58
12016 -58 -71 -84 -62 -60 85 -89 -6 -5 -77 19 -2 -55 -33 -24 -43 -5 50 -9 47 15 -143 -81 84 -108 -58 -21 62 130 -40
12045 -40 -30 37 49 73 -58 27 115 19 -49 45 8 23 8 -40 -22 -90 56 24 -140 34 -23 122 -67 57 8 71
12071 71 43 -79 -23 -61 62 -63 -55 26 67 -69 -9 22 -60 -3 25 -3 116 -97 -55 -22 -61 -2 26 24 -26 -127 -14
12098 -14 -3 77 -25 -35 42 1 74 58 72 -74 -23 -24 -48 86 46 -69 54 -160 55 107 -50 -12 -38 -26 -19 70 -118
12125 -118 -1 83 17 -6 -17 -26 17 56 -131 40 -53 65 -23 2 -59 68 -15 31 -28 22 -3 47 14 -20 68 65 -38
12152 -38 33 24 135 53 -143 48 35 -45 31 80 -88 49 76 12 -5 19 -14 -6 -57 -6 63 -44 -16 149 -33 -28 -78
12179 -78 81 1 -11 7 -41 -35 47 60 -60 -102 23 70 -62 -26 -6 -76 5 8 139 -44 6 -105 -10 69 -60 85
12205 85 59 -7 101 -22 -39 1 -123 20 11 51 106 -2 0 110 33 -150 -36 14 -15 138 -3 -36 13 58 74 57
12231 57 -6 79 -34 -115 -35 -5 -38 7 -95 -114 13 46 14 -68 31 1 -13 54 19 -87 -4 33 -6 -8 -4 -46 -32 -132
12259 -132 -38 78 -13 60 -31 -45 81 -76 14 -8 104 -54 38 -64 122 -3 95 -34 55 36 -3 -66 -60 12 15 -55
12285 -55 42 21 -53 -16 -78 -13 -81 -46 -59 -68 -72 37 31 -48 33 -26 -69 34 -29 -5 -3 -14 -21 42 20 75 -9 -4 39 151 33
12316 33 -2 -40 89 25 -78 -11 2 45 111 -50 27 50 88 -10 -55 -38 32 11 76 57 56 -20 -65 41 8 -66 32 -75
12344 -75 62 81 1 90 83 -14 -21 -16 -69 105 -28 -118 -44 77 59 -9 71 14 -105 79 -80 -49 5 36 -14 74 -20 21
12372 21 16 -49 -4 -72 153 78 -21 -17 22 -2 52 49 -50 8 -108 -21 24 -111 -77 -27 3 73 129 35 -15 25 16 -63 63 -70
12402 -70 48 61 18 23 19 -24 -70 -5 -28 -6 -71 -26 78 51 53 -49 -100 -79 0 -13 121 -73 81 -20 90 -17 -41
12429 -41 92 -98 64 -36 -23 -120 44 5 4 23 -18 -14 24 59 80 61 -37 -20 -35 53 34 29 -2 60 40 -103 -139 12
12457 12 -73 -5 -14 -7 -19 -95 -11 58 -48 -125 -67 71 16 100 -45 -12 -63 -40 100 7 65 11 -32 93 -6 -61 2 -82
12485 -82 0 -12 74 -34 132 129 -46 -25 -14 -63 64 -21 0 8 -66 -81 39 -122 -43 -31 35 -66 47 -70 -97 18
12511 18 -62 -13 -18 -30 0 94 -68 18 -33 -32 -63 42 -66 39 69 -60 -136 50 -130 -14 112 -62 -27 -22 -3 -2 -1
12538 -1 30 36 -62 -46 -16 -47 -1 29 -11 -37 -8 23 2 2 -1 15 -17 10 -68 -43 32 -26 27 37 -65 46 -35 34 82 3 93
12569 93 52 34 -14 -12 40 -13 -48 -60 20 -70 22 -36 2 -105 135 85 16 55 -60 -25 -37 8 69 -3 50 30 -123 18
12597 18 65 -77 80 -118 -8 79 71 -6 -6 -58 -104 -66 -16 96 6 13 -20 29 -61 10 -31 -36 78 -57 -123 32 -46 18
12625 18 -9 14 32 -15 7 -97 -44 25 5 -7 27 40 49 4 29 76 -58 21 76 45 -58 -64 165 -64 -77 -29 30 -1
12653 -1 40 -41 -7 57 5 64 -31 -107 57 12 -3 90 -75 -135 141 55 -105 103 115 31 139 -16 -67 20 -102 -87
12679 -87 4 139 -21 -55 -82 -23 -53 -37 16 42 -70 -125 10 -10 5 54 60 -50 21 16 -224 -85 1 -11 -29 67 14
12706 14 -68 21 -4 -53 33 44 129 31 -49 91 4 -26 13 -40 -18 35 38 28 -53 -8 -41 -92 26 -96 -98 -14 1 96 -64
12735 -64 95 -55 -9 69 -37 -112 -6 77 -82 -114 28 -21 -141 40 47 2 36 57 52 -63 -68 12 10 -20 -210 -82
12761 -82 -68 -43 -16 -52 -122 43 -7 51 66 -56 67 41 12 -13 53 64 62 66 56 9 -36 -45 120 74 26 -16 54 28 52
12790 52 -28 -74 95 18 -76 77 66 -40 76 -109 -63 -42 -2 -90 60 -8 -2 -57 -14 -26 66 -33 44 10 69 -32 -131
12817 -131 -10 74 32 17 -5 -23 -50 -73 -25 13 51 140 63 -70 -15 -27 59 -30 19 -49 -89 112 -69 -44 69 118 -53
12844 -53 -111 35 -13 -44 61 -64 -109 -24 45 26 4 6 51 57 -90 -55 -79 25 7 -18 38 -50 -32 -40 18 126 -58 30
12872 30 -56 149 0 -91 14 -4 -53 22 57 66 -35 36 153 -39 -22 153 14 67 -3 -33 176 120 15 -65 -169
12897 -169 -51 54 -46 4 62 -37 15 -6 -60 99 13 -41 -19 69 -16 17 11 -70 -136 -17 -18 -28 45 -27 -39 46 40 18
12925 18 -20 135 102 62 58 10 8 -98 -30 105 -80 32 24 -89 76 134 -51 -8 -66 -11 -33 7 -16 -67 2 -109 39
12952 39 30 -57 20 -146 -72 -15 30 2 -25 14 90 90 64 -13 4 -72 -92 68 100 27 26 -127 82 -61 -102 -4 31 -112
12980 -112 22 -99 -20 12 -7 121 1 110 -78 11 -64 0 33 -41 -27 -36 -25 -21 72 42 -41 43 -13 99 -57 46
13006 46 48 63 9 -64 -16 -10 38 63 79 24 55 154 -58 1 -158 -118 -103 11 26 -57 113 -46 144 28 30 38 -72 31
13034 31 -5 -115 -16 -38 18 24 72 -50 44 -108 75 51 -96 -108 -55 -14 22 -32 -84 -139 6 -77 -75 -29 52 36 -33 30
13062 30 48 94 52 -19 59 -33 38 49 22 112 -47 -33 -36 -5 2 -114 -17 -79 80 29 27 80 -13 61 4 86 -74 7 -67
13091 -67 1 110 37 11 -133 157 -23 95 176 62 38 88 35 -27 -17 -36 45 -41 34 96 -138 35 -9 34 -28 -126
13117 -126 26 38 -57 -74 24 31 93 -49 -199 59 -63 -30 53 28 28 -37 -72 24 30 56 7 6 -29 -62 61 -23 -89 -1
13145 -1 -123 -126 -111 62 -71 167 -82 -49 3 -74 54 13 85 114 33 -13 82 -26 -134 19 -83 22 -59 -72 -72 76
13171 76 119 -34 -12 18 -16 85 -62 6 -3 -118 -47 -4 61 42 -16 82 39 30 -58 85 -17 87 11 -147 -33 29
13197 29 -1 43 -58 67 42 -185 80 -71 -38 -96 62 73 72 44 -30 -48 40 78 35 -2 26 -90 114 -67 -8 -54
13223 -54 156 80 -29 -29 3 -53 95 -51 40 -91 4 22 -47 61 52 -24 141 -2 -62 46 -27 47 27 101 22 -77
13249 -77 -48 31 -58 -91 30 16 -60 -8 99 -33 -14 62 -45 62 121 88 92 80 -9 -18 -68 -16 -118 33 -84 40
13275 40 92 -7 45 -65 -53 89 34 17 11 88 -65 -6 153 11 44 -53 -32 -6 35 75 -34 40 -1 10 36 95 -67
13302 -67 -77 -36 2 -2 -35 -28 -18 0 67 -25 42 -23 42 90 -104 -95 33 -29 -44 -60 -6 -50 17 66 49 -68 -92 -39 -51 50
13332 50 -57 7 -41 108 -10 24 -2 10 9 -75 40 72 -28 4 -30 -91 50 -51 -78 -27 -2 43 61 -88 4 -4 3
13359 3 46 8 -67 -74 -153 72 103 98 60 98 -54 68 -61 14 -52 -44 -131 -8 33 49 -34 -1 -12 5 8 -71 29 155 112
13388 112 -25 -14 34 120 84 11 -34 129 72 33 26 -2 -27 -18 -51 -54 56 1 8 -3 22 -3 124 -34 -107 -24 -135 54
13416 54 -12 48 -28 59 21 -10 14 -46 42 -101 72 -103 87 0 53 -1 8 55 -39 34 -39 10 -40 44 12 18 107 89 -18
13445 -18 57 173 40 11 -21 8 -27 62 -21 26 22 -2 112 -18 85 -23 57 86 -127 80 34 20 -33 59 98 5
13471 5 -20 -13 -2 -56 -41 -83 120 -57 -93 -97 25 -20 23 69 14 10 24 9 -65 -75 -120 37 5 79 -9 62 86 21 -61 -63
13501 -63 -47 -53 -8 -23 47 27 31 -44 70 26 23 3 51 -40 16 72 93 65 -5 141 2 -13 21 34 -50 -22 -90 7 63 76
13531 76 1 2 -68 1 -4 -51 -111 -53 52 -95 73 30 -19 -151 106 83 80 27 53 43 -14 73 65 -49 -29 -73 20 -16 0
13560 0 69 -9 -57 56 -26 -30 16 80 0 -150 -51 -82 60 -149 39 -110 5 74 19 105 56 9 8 -29 -113 24 33 94
13588 94 -75 -120 62 -67 5 -4 -26 35 58 37 -7 -7 114 52 44 -51 90 75 -46 -27 -6 8 29 -67 2 -27 151 48
13616 48 -65 13 24 -21 83 42 -87 -29 -78 10 60 -88 71 -13 -13 46 0 101 -29 4 3 4 83 114 70 -153 -37
13643 -37 23 73 -88 -95 -90 -49 11 91 107 21 20 -85 -84 -101 -20 8 23 -21 23 -48 2 67 -18 16 24 25 -14 -112 46 -58 -4
13674 -4 59 -3 -76 70 -2 -55 -24 15 144 27 25 -63 -46 -46 -12 4 -56 -78 -4 -87 18 -146 -17 24 -57 -59 58 -125
13702 -125 28 99 -18 -10 -69 102 -57 -104 -32 -78 -49 -90 69 20 -153 19 0 58 48 66 -44 19 10 39 -12 73
13728 73 -50 8 50 -7 18 2 40 -93 -52 65 21 1 98 33 15 -35 97 72 7 2 91 24 6 5 -28 103 -65 36
13756 36 4 124 -29 5 33 79 48 -22 146 -10 28 35 29 -133 -34 178 35 21 -152 65 18 -14 151 24 36
13781 36 82 -62 -18 -39 -33 -41 18 -99 -70 -36 95 -55 -37 -60 30 86 -32 -19 -53 10 118 -9 32 27 42 87 18 -36
13809 -36 -80 65 59 42 -29 51 92 19 -50 -83 101 -91 -4 -40 37 64 51 33 -79 -18 -62 -40 -7 14 35 50 7 34
13837 34 20 -25 -67 9 -27 0 118 -2 59 -6 -94 44 -66 21 7 -29 -33 -31 39 -157 -11 4 79 48 57 -190 73
13864 73 -85 -86 47 74 -15 9 -121 26 43 -85 -54 39 -17 48 -27 -133 8 31 18 -64 83 -58 -67 -82 1 -89
13890 -89 24 80 138 7 67 -69 -53 -82 83 -18 40 0 -22 25 -1 101 95 -38 78 -39 -38 -50 -84 26 -104
13915 -104 119 148 4 -149 -49 -73 46 -118 -67 62 7 -97 -14 -2 -116 96 -72 -9 -51 -89 81 -24 -33
13938 -33 52 81 90 34 33 -69 81 18 -12 -60 70 -21 104 5 -27 63 28 12 8 -26 -50 9 -39 -93 -91 5 97 -96 -114
13967 -114 -37 -42 64 89 -74 45 -75 29 -92 44 73 3 39 -46 60 95 -67 -75 -44 -19 19 -13 18 -2 96 -141
13993 -141 12 3 -38 -67 -91 -7 -44 23 -65 -1 31 66 15 7 -99 42 70 -49 95 55 -76 -6 -59 -24 13 66 -42
14020 -42 -49 11 -11 -4 27 16 50 147 20 -3 -128 10 80 -89 -45 30 -87 25 17 -22 -64 -12 -29 28 -63 -43 39 -44
14048 -44 -91 16 5 48 98 -47 62 62 141 57 -30 66 -36 111 -7 -90 34 73 -11 3 3 -12 132 -64 -12 9
14074 9 -105 31 -44 -24 -9 -61 69 -66 -72 -180 -66 12 3 123 118 75 58 28 59 -19 34 105 85 -72 25 85 52 3
14102 3 17 31 34 -38 37 23 46 18 0 -43 84 -116 -3 127 -11 14 7 -19 -43 -81 41 -38 -64 59 69 -48 124
14129 124 -44 -55 -15 -3 61 -36 -56 124 -45 -103 -26 -58 -26 -36 14 -102 38 22 22 40 24 113 68 -50 -48 46 -14
14156 -14 13 76 -32 -11 11 3 95 51 6 46 -43 102 4 -22 11 70 -80 -47 -32 -124 -19 99 169 -15 157 -22
14182 -22 -45 24 -69 -34 -47 104 -85 -69 28 -54 -17 1 -120 50 -10 -166 81 -32 88 0 17 109 74 -105 -72
14207 -72 19 -22 51 -26 94 -45 30 32 -87 -27 -18 42 -33 -29 -19 -36 -58 -101 -14 -24 -12 -177 31 -28 12 -23 -43 -48 20
14236 20 -24 31 -8 -77 -78 47 97 11 -10 -150 -85 -79 -61 -53 -30 13 -11 -5 -16 -31 -148 -80 24 149 91 39 14 147 -44
14265 -44 -41 -32 55 19 -14 -81 21 114 64 -6 -19 13 -13 79 101 90 20 -37 -95 36 -27 2 -74 13 -35 -78 -33 -52 11 59
14295 59 13 60 93 -45 77 89 -20 -106 67 -6 -12 1 50 -72 -14 -10 -60 -28 -5 -69 -20 79 10 -12 128 -10 56
14322 56 -12 -100 -23 -126 102 83 -102 -86 -25 24 -25 -26 135 49 109 -40 1 8 -8 -65 -18 7 -17 25 -88 -79 16 -18
14350 -18 -21 75 -26 -24 -17 64 -11 -16 -37 38 133 21 17 -51 58 28 68 53 107 5 90 -57 -115 -39 -52 12 1 27 -115
14379 -115 -87 -96 17 88 -55 134 -19 24 -4 -148 78 -59 -4 -33 59 -43 125 43 63 76 34 78 40 3 6 -57
14405 -57 -28 -18 -134 64 6 0 -9 -50 96 -23 52 21 108 -9 43 49 120 -23 -17 77 11 19 204 55 108 -141 -59 -81
14433 -81 -20 136 -54 106 19 97 50 134 -16 -3 34 46 -31 -34 103 15 -56 25 -2 -43 -64 121 -22 44 2 -65 16
14460 16 -30 -7 51 -54 -74 142 96 -48 40 -96 78 101 -12 39 -27 80 54 71 -11 11 -19 189 -19 -18 43 11
14486 11 -68 -174 34 -89 88 -70 29 -50 107 95 -50 50 -9 -11 -18 -52 -40 5 35 -5 -27 4 20 16 16 -100 -26
14513 -26 0 -4 -42 -12 -172 9 27 23 10 -30 37 -66 2 145 0 76 15 -28 97 -12 -9 -49 90 40 212 87
14539 87 -58 25 -49 88 -46 -79 -28 -62 11 -61 13 -56 -38 -43 -4 -142 -44 25 72 11 -71 24 -5 20 -65 10 -90 -10
14567 -10 85 17 -31 115 -127 5 54 3 135 -26 103 -6 8 -27 -14 -10 36 71 -67 -11 57 -6 -27 130 -34
14592 -34 7 10 53 10 -90 24 -38 104 82 -54 75 -70 -34 -5 29 159 -24 -1 31 38 1 45 177 -8 -8 -1 32
14619 32 -107 -28 49 -8 -57 28 -54 -65 -28 -36 2 -18 -60 53 -120 81 -117 -62 50 -22 75 -40 -23 -1 40 -22 34
14646 34 80 -70 52 148 -71 4 -1 -99 -37 59 12 -70 39 -28 -64 34 -26 -140 -43 -20 -158 122 -23 36 8 -37
14672 -37 -24 -88 -15 111 -76 95 108 -88 -2 -31 25 -28 -10 -57 9 22 63 -60 41 -96 105 68 -102 50 43
14697 43 8 -25 52 31 27 -61 -55 -12 42 -31 81 39 28 65 38 157 42 -58 -60 -105 42 8 51 -90 53 49 85 -41
14725 -41 -43 44 77 -53 -27 -31 -31 84 -64 48 -52 17 -32 -79 91 -126 -3 32 -130 -68 35 60 8 49 97 -25
14751 -25 60 56 8 -107 21 35 -52 -1 1 -85 -13 54 -32 5 -22 120 0 88 4 59 -14 75 -40 -34 -62 42 -71 59
14779 59 -35 3 -18 -5 52 -38 -100 -97 -36 4 127 -125 3 -56 131 28 -24 55 12 43 -9 -90 17 5 -80 92 58
14806 58 36 -140 18 96 -1 133 67 -66 -42 92 -51 37 -27 -62 94 95 -76 23 55 27 4 -65 -28 -104 11 -76
14832 -76 72 47 68 -39 -36 -81 27 -81 62 51 -60 -17 62 7 -78 -8 -127 -53 -87 43 -44 14 -148 -62 -77 -104
14858 -104 2 121 -12 -32 -28 -45 -30 -93 53 -8 51 35 -14 74 -96 75 69 84 76 13 107 -101 14 11 85 7 70
14885 70 57 59 -1 -101 14 132 158 -77 58 86 8 14 -22 -85 7 -22 40 8 67 -65 -131 59 77 -5 -79 -155 65
14912 65 112 18 -8 48 -33 -4 45 -20 -27 -11 45 13 -6 119 15 17 39 -15 71 -45 31 6 -47 61 -97 -6 4 -69
14940 -69 64 -19 -116 55 -104 -98 79 41 3 -93 120 -34 25 -50 54 61 -123 47 -27 -11 -6 97 118 -52 7 44
14966 44 -61 18 24 -141 111 -24 -23 -4 -68 -21 -171 -15 94 65 70 74 104 -27 82 -82 24 43 17 2 -34 52
14992 52 -122 13 -77 61 0 0 128 -69 -37 -3 -12 41 44 -2 -59 100 107 54 -146 35 10 26 -3 52 30 11 -19 3
15020 3 -44 -39 -53 87 38 -86 -17 102 -92 -104 43 7 -86 30 69 -68 72 -31 148 65 35 42 -91 104 10
15045 10 102 29 -6 -84 34 -5 -14 89 0 -173 -74 -41 28 30 -18 49 51 -30 -45 -35 21 -46 66 -120 -6 -39 75 55
15073 55 83 15 48 119 11 -67 -12 -62 11 22 -25 -26 31 12 -72 45 17 -58 27 41 96 -17 -42 15 63 152 13 -36
15101 -36 -110 62 -117 -13 -21 7 -10 -1 70 -4 59 -17 -30 33 6 118 8 1 -25 8 121 -3 1 -42 -4 91 108 62
15129 62 -15 -43 -105 24 5 84 24 -32 4 72 18 -71 -124 30 -15 14 63 -14 -41 -26 -44 60 -55 -81 57 -46 35
15156 35 -45 -139 95 0 -11 93 -72 6 102 110 107 -69 10 -42 -108 16 27 -2 22 129 98 12 -65 -22 -2 41 86 -79
15184 -79 -13 -42 -58 74 -147 -55 28 61 37 106 -45 80 35 14 -34 -74 23 -37 -63 4 -34 -3 -54 -28 46 120 -110
15211 -110 -25 107 7 45 46 -29 -30 3 -49 41 -56 -29 7 0 99 -73 -12 3 51 80 -91 47 25 -148 39 -56 -132
15238 -132 65 -132 41 -98 66 35 86 -97 -23 63 60 49 135 -27 -115 68 58 3 32 -4 -4 -34 65 -21 17 -34
15264 -34 57 47 72 -8 -1 -22 -65 -72 151 51 61 -151 66 47 8 -4 113 -49 44 32 26 -13 -5 -68 4 62 26 29 -21
15293 -21 -15 -49 -69 55 -43 108 117 -121 -76 -30 18 -33 -132 -17 -105 -63 50 -73 104 14 43 -96 36 -84 -12 29
15319 29 68 -83 0 -4 1 -14 -86 -39 -65 132 39 -30 29 -98 -50 49 -52 125 -169 -44 -78 -76 65 44 108 146 87
15346 87 17 -14 -18 -18 -47 10 -77 93 -20 -30 5 -5 84 73 42 32 60 49 -22 -22 50 -58 41 -21 -5 24 -43 19 -4 67
15376 67 148 -72 -22 71 -33 -50 19 30 -13 -4 -24 48 -41 -8 40 53 -92 -30 81 59 -155 -19 -26 -45 21 -39 -9 3
15404 3 -47 -15 21 -54 43 -21 -14 -88 18 -69 -62 20 -114 -85 -61 -124 -18 -1 19 105 11 9 -15 -96 82 41 -22 11 42 -66
15434 -66 -52 -35 -92 -31 -53 69 24 -110 34 3 82 136 28 147 69 8 -40 -22 85 77 25 -56 67 -42 41 5
15460 5 37 42 39 42 38 67 -70 -12 -163 -21 -6 79 -86 39 116 -91 34 14 -14 -60 1 8 57 69 140 -150 -7 23
15488 23 179 51 57 37 -51 6 -102 -71 -5 58 65 -39 55 -28 23 55 -62 58 49 -133 -57 -70 -59 12 -116 -26 -2
15515 -2 106 72 -101 57 -4 20 -35 9 16 -125 -91 36 22 28 80 -32 83 -43 66 -84 -37 21 17 -9 82 -7 -64
15542 -64 -9 -25 34 -7 -21 -35 154 86 -10 -50 -81 44 10 -4 -22 66 -88 -31 10 -36 116 -60 -32 -6 -5 101 37
15569 37 -98 64 -36 13 6 -87 -19 0 -105 16 -10 -22 132 66 -11 -27 170 -53 28 37 -43 22 -72 65 -16 7
15595 7 74 -69 -81 -16 68 19 -83 -7 -5 -70 23 -54 -28 45 -23 52 5 -91 -59 -68 21 15 59 83 -28 -22 52 -91 38 86
15625 86 -86 16 0 -49 -63 -114 138 -44 -41 -26 -13 -49 -8 -77 -47 48 16 -70 62 -9 -1 54 21 77 40 -35 -119 -19
15653 -19 -32 107 16 -86 158 -61 -9 -12 74 4 -46 -9 -32 20 -85 -118 58 58 -48 -48 7 -3 40 -9 1 -14 -31 -73
15681 -73 28 13 5 104 78 -22 11 -103 59 28 30 -106 65 47 -28 150 69 -74 6 128 -123 -3 -8 61 63 43
15707 43 16 7 16 55 52 5 -2 -31 87 48 -36 -51 56 -29 -73 14 -81 34 -18 -65 -50 -67 5 11 -74 91 150 -21 -4 36
15737 36 -12 -89 -28 -14 -63 5 90 120 -94 -28 57 -143 -76 5 -128 -18 11 -2 42 62 4 -44 -38 -29 10 83 -57 123
15765 123 -5 33 -4 -33 -53 -32 73 -10 -35 -46 33 -36 -54 -114 34 30 -34 -50 55 -53 -14 -22 89 55 83 15 41
15792 41 111 38 -84 -55 -86 -99 18 23 -28 53 -28 -45 -45 -2 -19 -23 39 21 43 58 23 -23 -58 -79 -91 119 -36 147 -23
15821 -23 15 -24 -31 76 -18 87 -48 -88 34 61 -28 -35 -23 62 86 -68 -63 -47 -1 -1 11 -55 85 -43 -61 150 -7
15848 -7 -70 -65 91 24 -69 1 100 67 -88 45 -61 -22 -97 -9 33 -5 -68 45 -60 38 42 7 22 -114 -20 -115 5
15875 5 -15 47 -18 32 -166 -56 -137 -72 42 56 -180 4 14 98 53 58 -43 27 -4 89 75 -5 -78 -39 -91 53 58 35
15903 35 104 4 -31 70 -57 -63 82 -149 -18 -61 34 -48 67 -11 -47 -3 -24 -60 16 113 -8 77 -25 -56 -108 -10
15929 -10 -6 -14 66 -40 39 55 51 84 -85 -65 99 -31 -84 135 -22 -154 16 51 -98 -53 -50 15 -53 22 13 3 -38 -50
15957 -50 -48 -87 -26 -59 15 42 84 33 -52 -36 92 57 -25 -30 26 1 -32 -40 33 -73 111 45 34 -87 36 75 -65 26
15985 26 -95 141 -27 -13 -44 -64 -11 111 -80 105 72 25 -63 -15 -126 44 -32 69 62 -80 43 150 -71 -15
16009 -15 -159 -70 74 111 64 81 -40 1 28 143 -10 -72 54 56 129 -16 -32 48 2 39 -17 -23 -18 -12 -58 72 -26 85
16037 85 96 -15 86 -27 80 -15 -27 61 -4 -109 -70 30 137 -47 -46 67 -76 49 17 168 -79 -110 142
16060 142 5 -26 -89 -46 -98 -11 33 -100 47 39 18 -24 104 -32 -50 31 26 91 8 -24 -87 -56 -55 3 -89 -101 -33 78
16088 78 -53 111 -36 2 47 -121 -7 -136 65 -80 -81 46 33 -81 -32 58 22 29 -19 5 -18 45 5 32 10 -47
16114 -47 6 -29 -3 -34 84 -42 37 124 -49 71 -14 29 14 111 -18 -9 20 39 70 8 20 4 -36 23 65 9 -52 -17
16142 -17 -99 -95 -4 82 -20 -30 -48 -23 -43 -80 -25 43 -51 65 -26 -45 172 -70 -65 -2 -33 54 -13 -25 -67 150 10 -32
16170 -32 170 13 84 55 7 -18 -100 117 -3 0 -86 57 -2 86 -161 -29 -57 22 -4 -13 14 11 20 11 -189 81 14 -61
16198 -61 -21 -101 15 -81 48 -28 -72 -57 48 -97 -54 -54 20 41 -18 -40 21 70 72 -37 -48 88 3 65 1 98 128 40
16226 40 -4 -40 2 -30 -15 84 40 -174 43 43 -27 117 -128 -58 16 -20 -41 -46 19 -121 -26 20 29 27 -20 132 53 39 6
16255 6 19 -16 -23 -32 -13 89 -66 -36 1 38 -71 41 -99 -116 145 129 -18 13 6 -62 43 -21 -179 12 23 -42 -124
16282 -124 74 -52 -36 -54 -22 137 -49 -11 -123 13 68 -56 -58 9 137 -70 -139 -38 22 -13 -79 -37 -1 -25 -112
16307 -112 44 -57 -88 -18 -50 20 -77 10 -43 -22 156 123 19 -48 -43 -34 50 7 -83 -52 -20 -18 8 -137 37 -37 -38 41
16335 41 62 -200 -4 -69 2 -40 -3 74 98 98 -52 -108 -19 -39 -13 -52 85 -66 6 42 -8 10 30 0 53 -86 -2
16362 -2 28 -10 27 108 99 -59 -104 -36 18 13 -25 -9 -122 26 -79 11 50 -134 -21 -138 98
16383I8
$$ Imaginary data points
##PAGE= N=2
##DATA TABLE= (X++(I..I)), XYDATA
0 0 0 0 0 0 0 0 0 0 0 0 0 0 0 0 0 0 0 0 0 0 0 0 0 0 -31 32 -32 32 -32 32 -32 33 -64 64 -64 65 -94 96 -97 125 -129
41 -129 148 -161 181 -193 221 -243 262 -291 320 -355 391 -434 475 -528 582 -645 720 -805 906
60 906 -1026 1173 -1361 1602 -1935 2422 -3190 4629 -8241 40691 38903 -33838 -32694 -7421 20575
75 20575 17251 4631 -16385 -9004 -3535 -12458 -15588 5443 17294 6707 -5991 -10305 -10247 9317
89 9317 22438 10812 -9094 -4807 1607 -3529 -3025 1615 580 206 -628 -9209 -11153 8174 14867
104 14867 292 -6668 2906 6651 1311 -1618 -5348 -1536 9466 3372 -16810 -17480 3775 11186
118 11186 2328 -4111 -7475 -3454 10501 15412 712 -5573 5525 7574 -928 -4394 -2580 -396
132 -396 3320 -2630 -17594 -12917 9433 13458 -4163 -12251 -4733 4470 13534 12464 -1716 -7646
146 -7646 2093 5352 -1435 738 3947 -3483 -8508 -5386 -3322 168 7944 3590 -8467 -5297 5980
161 5980 6665 2657 2474 -910 -2908 1814 -593 -8000 -2382 7663 567 -10658 -6549 2502 6800
176 6800 7322 1051 -5977 1003 11634 5201 -5024 -2266 2308 -83 -1464 -3679 -9576 -5652 4281
191 4281 1774 -5952 -2956 2569 1630 3259 5579 2357 2292 5615 -81 -6551 846 7454 -222 -7631
207 -7631 -6643 -4642 -287 5172 456 -6483 -993 5300 1287 25 5268 4149 -1035 -648 -1496 -3727
223 -3727 1238 4288 -3575 -8137 -1833 1591 614 2635 1639 -2065 2085 6855 1036 -2824 3226 3983
239 3983 -2557 -4037 -2179 -2889 -1191 423 -4840 -5951 2367 4897 -1059 -753 3479 2918 3429 5539
255 5539 708 -3292 1352 3129 -2770 -3777 -778 -3371 -4335 -649 -1095 -2834 2561 3920 -2115 -1344
271 -1344 5715 5046 520 572 -436 -1996 1440 1892 -4716 -4910 1151 -3 -3672 -49 2015 -460
287 -460 1429 3887 79 -477 4247 2471 -2806 -1332 273 -2624 -1846 -17 -3946 -4590 1615 2032
303 2032 -2586 66 4274 2033 1215 3483 1571 278 3173 1036 -4575 -2105 1722 -2255 -5092
318 -5092 -1695 -1181 -2266 1283 2091 -1753 369 4900 2551 171 2808 1799 -1464 537 1155 -3345
334 -3345 -2951 1066 -1741 -4803 -519 1944 -715 557 2215 -376 849 4971 1730 -2321 727
349 727 2006 -2472 -2315 360 -2383 -3397 326 -139 -2643 1047 3631 273 457 3622 1615 68
365 68 3021 1622 -3029 -1144 1242 -2712 -4018 -629 -1170 -2804 -39 771 -1385 1308 4347 890
381 890 -302 3727 2832 -1038 362 1080 -2211 -1921 420 -2235 -3987 -300 277 -2175 151 2425
397 2425 -175 475 3810 1570 -1110 1761 2385 -1813 -1663 447 -1728 -2607 -19 -1177 -2719 884
413 884 2199 -1012 133 3846 1904 -63 2432 1699 -1503 -101 894 -2484 -2716 -288 -2062 -3507
429 -3507 -22 700 -1662 512 3072 530 60 3491 2588 -468 1120 1205 -1769 -1303 299 -2303 -3316
446 -3316 -144 -705 -2884 -99 2214 -5 125 2759 1454 108 2374 1959 -1181 -262 543 -2354
462 -2354 -2470 376 -1096 -2972 -103 825 -1455 191 3271 1346 108 2077 1175 -677 1235 1333
478 1333 -2100 -1973 64 -2130 -3124 -78 304 -1841 -113 1738 34 499 3348 1981 142 1675
494 1675 1079 -1619 -309 1007 -2008 -3281 -452 -935 -2450 -341 926 -864 302 2777 1175 571
510 571 2578 1553 -857 908 1521 -1812 -2052 279 -1394 -2943 -548 123 -1288 388 1756 -406
526 -406 -28 2685 1868 60 1485 929 -2100 -1158 764 -1226 -2549 -538 -810 -2391 -243 1147 -170
543 -170 1302 3344 739 -883 1588 2142 -77 718 933 -2588 -3149 -554 -923 -1639 322 130 -2172
560 -2172 -477 2008 852 1085 3534 1797 -1398 73 1078 -466 53 1041 -1979 -3603 -1206 -358
576 -358 -995 907 1378 -1349 -608 2633 1434 125 2040 1900 -822 -751 -38 -1746 -1303 733 -694
593 -694 -2725 -842 287 -669 936 2779 316 -460 2280 1803 -254 530 789 -1358 -1199 90 -1878
610 -1878 -2798 -135 178 -1636 -148 1501 -309 329 2790 1598 -377 1170 1475 -471 -136 246 -2382
627 -2382 -2465 389 -138 -2311 -682 324 -1168 123 2738 1208 36 1747 1402 -709 226 1127 -723
644 -723 -828 125 -2195 -3405 -97 1344 -589 -184 924 -474 -158 2666 1951 29 1235 811 -1605
661 -1605 -1178 638 -880 -1707 44 -841 -2888 -920 1335 576 840 1874 447 -530 1970 1945 -238
678 -238 127 621 -1828 -2008 292 -534 -2409 -557 534 -1169 -410 1347 527 701 2655 1110 -1054
695 -1054 524 1647 -264 -729 103 -1788 -2549 -113 412 -1626 -504 826 -181 275 2204 1071
711 1071 -67 1604 1449 -1032 -679 798 -893 -1671 -251 -874 -2323 -420 622 -506 80 1626
727 1626 331 -122 2106 1856 -249 322 847 -1145 -1317 242 -793 -2131 -640 -173 -1624 -225 1299
744 1299 117 280 2083 992 -482 1379 1863 -310 -699 319 -1067 -1771 -229 -639 -1930 -279
760 -279 639 -795 -490 1873 1004 -33 1494 1242 -584 256 1271 -737 -1575 -258 -913 -1915 -137
777 -137 203 -1342 -192 1435 151 108 2004 1444 -149 780 1138 -653 -613 372 -1218 -1921 -196 -335
795 -335 -1636 -266 974 -126 -64 1551 904 106 1573 1382 -390 -30 762 -946 -1260 -109 -794 -2097
813 -2097 -542 274 -1165 -402 1411 556 33 1620 1188 -149 792 1074 -686 -932 315 -886 -2001
830 -2001 -290 -118 -1370 -375 849 -283 80 1794 1182 -86 1167 1178 -570 5 856 -1197 -1719
847 -1719 -117 -642 -1838 -401 622 -682 -223 1318 571 269 1722 1133 -399 408 1107 -638 -1005
864 -1005 206 -829 -1921 -547 -181 -1390 -299 1096 -49 7 1610 1104 -47 1118 1167 -584 -314
881 -314 611 -808 -1537 -174 -405 -1475 -356 547 -654 -170 1621 637 38 1560 1437 -471 255 978
899 978 -643 -1186 25 -761 -1885 -207 167 -1076 -289 990 68 -62 1769 1280 -236 803 1270
916 1270 -551 -660 436 -757 -1619 -238 -390 -1647 -223 762 -476 -219 1617 856 -82 1314 1458
933 1458 -340 83 826 -705 -1148 -6 -552 -1849 -548 191 -996 -345 1206 343 -114 1500 1314
950 1314 -237 562 1097 -403 -697 380 -832 -1694 -80 -82 -1364 -445 864 -127 -69 1346 1034 -146
968 -146 1113 1273 -318 -12 650 -645 -1270 -53 -546 -1698 -467 518 -789 -428 1353 560 93 1285
986 1285 1315 -134 434 1004 -677 -899 320 -563 -1737 -507 -38 -1188 -375 809 -10 -171 1424 1052
1004 1052 -88 963 1199 -517 -391 695 -568 -1489 -175 -235 -1635 -531 578 -477 -349 1105
1020 1105 615 40 1199 1192 -185 305 1078 -573 -1155 100 -356 -1594 -579 56 -1166 -253 1174 117
1038 117 -200 1214 1176 11 603 985 -518 -409 520 -650 -1692 -393 -50 -1253 -521 315 -582 -293
1056 -293 1417 904 -77 1089 1330 -156 4 776 -500 -1192 -5 -548 -1729 -599 167 -721 -271 795
1074 795 61 -285 1216 1391 153 757 972 -656 -704 326 -337 -1374 -574 -351 -1205 -313 746 -270
1092 -270 -424 1405 930 -119 679 1186 19 53 768 -759 -1298 -32 -382 -1398 -712 44 -661 -83
1110 -83 968 66 -219 1080 1430 58 303 787 -395 -518 303 -606 -1418 -317 -175 -1161 -500 652
1128 652 -80 -289 1247 1069 3 514 940 -255 59 733 -454 -1387 -203 -345 -1473 -279 428 -614
1146 -614 -209 1133 399 -295 977 1492 239 173 538 -745 -655 501 -233 -1698 -627 102 -764 -443
1164 -443 699 71 -157 1183 797 -207 771 1224 -123 -296 318 -688 -1257 -2 -136 -1377 -617 346
1182 346 -393 -259 949 717 -38 902 945 -222 346 913 -682 -1118 118 -266 -1321 -579 61 -681 -318
1201 -318 637 -121 -326 1203 1377 -24 404 879 -336 -491 444 -617 -1471 -163 -43 -1262 -710 462
1219 462 -81 -101 949 624 -36 1108 1402 -210 -330 650 -106 -798 4 -368 -1298 -259 130 -856 -382
1238 -382 971 312 -216 781 924 -93 547 1036 -529 -776 276 -313 -1308 -374 -200 -885 -338 467 -193
1257 -193 -283 1239 854 -237 581 1212 46 -106 513 -392 -1188 81 -257 -1381 -525 458 -456 -432 725
1276 725 456 -2 1134 1174 -193 58 845 -65 -806 25 -371 -1106 -334 -117 -1117 -557 823 10 -424
1295 -424 756 952 73 584 892 -266 -251 528 -311 -1075 -214 -111 -1021 -557 170 -328 -151 1096 531
1314 531 -189 714 1207 94 82 662 -172 -699 114 -353 -1289 -432 214 -808 -663 551 287 -167 829
1333 829 745 -143 476 1134 -116 -514 398 -188 -970 -426 -75 -922 -516 431 -328 -422 745 772 -3 568
1353 568 905 11 177 653 -386 -965 69 -150 -1153 -639 45 -544 -394 733 183 -165 758 1059 28
1372 28 233 834 -38 -405 269 -360 -967 -148 -5 -856 -776 443 -75 -347 707 575 175 617 995 -228
1392 -228 -238 731 -191 -1003 -239 -298 -1006 -407 165 -633 -390 849 404 -154 608 1071 179 223 833 -157 -484
1413 -484 368 -129 -1097 -394 -12 -622 -511 416 -44 -118 900 725 -66 490 926 51 -292 271 -322 -771
1433 -771 -104 -148 -1205 -641 317 -228 -431 465 445 -48 760 812 -125 134 787 -150 -723 -23 -90 -857 -356
1454 -356 -88 -667 -279 566 163 -308 753 824 1 443 786 0 -246 408 -141 -1085 -197 41 -882 -582
1474 -582 168 -214 -293 736 348 -229 611 1065 24 -135 533 -104 -727 -127 -275 -1046 -493 168 -588 -582
1494 -582 462 273 -101 635 724 -31 460 847 -150 -473 351 -59 -875 -265 13 -852 -302 431 -214 -274
1514 -274 742 736 9 471 808 67 -14 550 -170 -848 -25 -34 -1033 -543 151 -458 -540 537 267 -243 789
1535 789 777 -100 184 722 -13 -527 49 -121 -925 -343 105 -741 -489 457 -68 -363 408 572 -48 417
1555 417 836 -5 -179 541 67 -727 -200 -67 -744 -439 94 -402 -361 526 402 -301 570 894 -62 72
1575 72 546 -118 -488 81 -165 -793 -389 21 -654 -457 462 92 -269 716 663 -36 304 730 4 -311 273
1596 273 -39 -806 -224 -143 -709 -440 256 -280 -487 545 579 -179 433 820 188 223 568 -141 -584 -67 -88
1617 -88 -898 -497 184 -621 -431 265 125 -337 490 644 -91 210 659 62 -286 236 -78 -852 -355 -142
1637 -142 -719 -522 226 -107 -358 536 577 35 428 770 188 -41 480 -135 -666 -22 -51 -688 -427 166 -211
1658 -211 -335 487 259 -202 565 745 33 277 597 -26 -347 98 -29 -908 -355 13 -598 -534 195 -94
1678 -94 -147 387 598 69 347 731 70 -87 318 -93 -630 -81 27 -634 -687 149 -232 -369 411 301 -84
1699 -84 417 645 83 189 601 -55 -351 72 -130 -820 -322 165 -386 -517 257 -6 -135 437 468 -37 279
1720 279 593 22 -239 304 -76 -652 -238 -103 -651 -519 132 -219 -345 421 346 -79 364 641 152 9
1740 9 450 -36 -570 147 -69 -749 -410 157 -468 -502 225 255 -97 384 635 45 84 659 49 -218 201 -122
1762 -122 -586 -321 -25 -566 -499 66 -214 -337 333 333 -123 355 657 -65 -30 540 0 -556 126 -99 -666
1783 -666 -433 56 -318 -383 335 315 -191 497 578 11 95 583 65 -347 204 -40 -567 -294 -86 -505 -365
1804 -365 245 -101 -228 341 533 -94 352 518 39 -71 389 -157 -537 -80 -25 -573 -524 103 -467 -387 273
1825 273 170 -142 350 656 113 103 570 73 -267 144 29 -667 -244 -47 -453 -411 47 95 -289 378 482
1846 482 131 374 690 101 -168 113 61 -509 -277 -114 -585 -494 140 -232 -393 368 291 -79 277 679 121
1867 121 127 465 -76 -428 28 -70 -556 -359 -46 -303 -373 182 125 -192 320 550 27 259 528 97 -168 223
1889 223 53 -522 -93 -17 -516 -395 23 -105 -247 243 409 67 212 572 122 22 368 71 -439 -110
1909 -110 -61 -533 -416 -15 -315 -452 166 94 -154 272 577 58 122 553 11 -304 146 33 -476 -283 -12
1930 -12 -529 -298 87 -155 -330 345 539 52 386 687 135 -60 225 -8 -492 -101 110 -582 -323 53
1950 53 -242 -434 258 140 -153 239 492 164 170 541 101 -128 -2 42 -442 -190 4 -469 -392 45 11 -280
1972 -280 323 454 -53 110 528 121 -68 303 -5 -461 -78 62 -437 -368 169 -117 -327 203 311 27
1992 27 266 548 288 83 413 234 -286 67 -37 -508 -354 -54 -500 -491 3 99 -210 100 408 17 158
2013 158 487 103 -151 207 119 -375 -188 -114 -530 -310 14 -174 -400 207 304 1 284 452 189 91 418
2034 418 -3 -160 -56 28 -517 -406 5 -341 -333 23 1 -128 290 440 23 162 434 243 -341 56 98 -424
2056 -424 -262 -75 -478 -506 24 -65 -220 317 369 -14 245 601 27 -62 362 46 -416 48 13 -491 -245 54
2078 54 -212 -353 209 314 -136 200 531 84 103 418 180 -321 97 2 -515 -186 13 -330 -413 51 -15 -318
2100 -318 103 264 -4 108 437 141 -79 259 18 -408 -100 88 -495 -382 83 -167 -363 48 250 -35
2120 -35 255 603 265 117 372 84 -196 122 41 -316 -313 22 -374 -284 154 7 -158 279 428 103 143 394
2142 394 30 -31 214 -36 -405 -240 -3 -368 -508 -67 -197 -288 106 93 -89 217 484 -24 -8 220 160 -281
2164 -281 -103 43 -405 -243 89 -302 -377 151 -19 -225 182 371 131 184 346 121 -173 282 80 -369 -174
2185 -174 21 -403 -389 36 -150 -333 -49 179 -151 65 481 182 -65 323 58 -296 -30 46 -374 -338 104
2206 104 -256 -400 42 1 -157 88 350 51 56 453 115 -202 127 82 -366 -221 124 -234 -376 32 95 -125
2228 -125 177 327 -9 93 408 162 -55 228 -14 -209 -157 99 -468 -341 77 -215 -250 103 172 -194 156
2249 156 319 106 54 328 169 -113 151 77 -496 -289 -37 -466 -355 11 -55 -234 195 396 161 121 393
2270 393 138 -70 316 89 -232 -44 108 -387 -360 18 -159 -339 68 125 -80 148 452 126 54 271 187
2291 187 -157 154 -39 -302 -259 -14 -251 -414 140 -82 -123 106 339 -24 36 457 202 27 204 106 -214
2312 -214 -101 80 -266 -408 82 -87 -210 126 379 -20 212 501 145 -60 253 49 -207 -72 -28 -350
2332 -350 -331 55 -303 -372 34 187 -215 83 302 86 -37 301 7 -165 5 18 -265 -130 -8 -373 -342
2353 -342 -62 -83 -342 118 227 -9 95 459 200 -8 266 129 -72 -19 40 -316 -133 -10 -230 -293 113
2374 113 83 -166 131 373 102 -47 398 85 -158 35 111 -349 -134 -12 -341 -285 28 -17 -221 89 157 -73
2396 -73 -48 359 112 -116 289 -3 -247 -150 44 -310 -266 14 -182 -372 -46 318 -28 192 337 38 20 245
2418 245 204 -214 51 93 -310 -250 115 -348 -447 76 21 -165 122 265 65 99 391 144 -150 209 65 -350
2440 -350 -63 -22 -446 -473 -71 -165 -363 -6 290 -123 -10 282 130 42 257 144 -231 -1 45 -262 -139 51
2462 51 -223 -277 -84 101 -127 204 281 30 -117 441 265 15 170 86 -216 -104 17 -281 -210 -2 -10 -315
2484 -315 159 211 -15 74 261 165 78 177 156 -213 -184 -37 -321 -317 -37 -187 -301 79 94 -102 135 258 101
2507 101 -64 303 160 -23 90 238 -271 -130 102 -104 -347 2 82 -180 169 119 53 140 409 195 45
2528 45 186 175 -175 -100 -51 -210 -399 15 -198 -250 -88 128 -71 14 232 67 10 281 223 -104 62 66 -226
2551 -226 -279 9 -213 -134 1 -20 -139 85 327 59 -79 271 251 -7 202 164 -168 5 -48 -179 -238 -68
2573 -68 -175 -290 112 208 -88 191 402 82 94 257 211 -168 -44 118 -239 -344 -8 -291 -338 43 -118 -135
2595 -135 131 308 -81 114 249 179 -171 214 220 -200 -194 142 -219 -183 -33 -61 -135 12 158 -139 24 309 171
2618 171 137 160 59 -155 -19 199 -232 -219 -98 -159 -312 -19 58 -222 44 157 50 65 315 219 -95 30
2640 30 66 -135 -176 17 -150 -333 -66 26 -152 23 161 -34 6 313 120 59 236 138 -176 -43 174 -204
2662 -204 -193 44 -227 -158 168 146 -168 59 373 -60 -103 242 134 -47 131 -14 -248 -107 48 -280 -311 -16
2684 -16 -20 -194 -30 53 -111 75 331 90 -151 294 128 -73 64 84 -240 -264 12 -162 -284 -26 148 -12
2706 -12 0 221 133 -58 220 136 -132 126 97 -201 -201 -33 -56 -365 -61 -11 -135 124 190 -79 86 209 125 -70
2730 -70 17 12 -126 -39 -175 -303 -188 -66 -6 -237 31 10 -3 91 312 148 40 317 246 0 -12 149 -224 -56
2754 -56 -64 -206 -254 -85 59 -114 28 262 -1 -77 224 40 -11 124 149 -173 -206 -5 -184 -259 19 -85 -312
2777 -312 -32 139 81 86 272 15 24 194 240 -125 -144 127 -192 -236 60 -7 -172 14 55 -113 86 262 14
2800 14 117 357 229 -21 16 3 -154 -125 -2 -113 -323 71 -86 -278 25 224 -76 10 203 30 -29 175
2822 175 262 -146 -11 99 -322 -303 26 -120 -266 -18 108 -127 -81 131 43 -34 241 100 -72 -17 12 -66 -68
2845 -68 -6 -124 -165 -53 -27 -113 -12 227 44 84 234 135 -17 223 131 -251 41 -61 -204 -342 -51 -53 -216
2868 -216 33 123 -9 -62 173 30 39 133 64 -84 -79 62 -118 -309 -34 -88 -256 -89 17 -238 33 118 56 -73
2892 -73 269 231 125 81 163 -136 -27 147 -26 -150 -17 -144 -243 21 132 -76 51 185 4 -6 183 128
2914 128 -185 30 140 -83 -273 2 -220 -384 -18 -11 -155 -65 88 -7 -37 295 -35 -27 110 61 -30 -47 169
2937 169 -132 -254 -57 -91 -131 63 154 21 133 234 75 -111 215 186 -47 -177 74 -47 -284 50 -219
2958 -219 -200 -19 98 -165 21 204 152 36 106 134 -13 52 222 -118 -207 102 -233 -167 -30 -91 -199 42 106
2981 106 -92 151 278 12 8 207 216 -50 100 21 -116 -180 6 29 -96 -56 -62 -224 -41 218 102 -56 112
3004 112 126 -129 -55 28 -194 -231 19 -160 -291 -60 -16 -269 44 89 -69 8 128 153 -30 105 182 -121 -43
3027 -43 -50 -53 -145 -45 -31 -102 -103 76 21 -89 256 133 92 154 146 -58 20 191 -68 -81 -19 -27 -336 114 91 -176 -18
3054 -18 91 -19 -94 137 123 15 104 72 -18 52 79 -180 -167 11 27 -107 14 -20 -17 -35 132 52 -83 98 180
3079 180 56 -41 133 -92 1 82 -138 -97 -18 181 -129 138 166 0 61 130 168 -100 28 196 -210 -74 -62
3102 -62 -300 -174 22 -70 -188 32 121 -86 -196 162 125 56 110 149 -101 -7 46 -119 -101 40 -241 -176 47 138
3126 138 -112 61 224 128 87 219 151 -55 149 42 -46 -69 -8 -103 -232 -25 -62 -51 -23 109 -63 31 121 64
3150 64 -54 72 143 -131 -86 -8 -201 -201 42 -129 -160 -29 -106 -88 -56 130 131 127 175 36 84 -23 136 -201 -155 -46
3176 -46 -16 -57 74 -4 -125 24 138 91 -70 194 59 24 91 150 -143 -128 96 0 -256 -42 -32 -170 -9 16
3200 16 -45 -13 148 78 -10 115 169 -76 -89 183 -83 -122 38 -85 -214 -115 -29 -120 -74 190 229 34 200 84
3224 84 87 177 38 -55 -46 127 -86 -108 -40 103 -75 34 122 -3 50 192 22 -76 125 170 37 -143 173 -51
3248 -51 -156 33 -146 -256 -86 63 -134 -48 155 46 29 39 101 -62 22 117 -60 -119 82 -179 -105 -28 17 -172
3272 -172 94 111 55 171 284 133 -69 209 109 -97 -120 11 21 -73 71 -6 -143 78 33 -141 -162 138 121
3295 121 -15 143 -61 -31 1 3 21 -238 -60 -221 -187 -84 51 -143 -23 69 40 45 226 298 -50 202 192 -99
3319 -99 -12 49 -72 -65 -39 -162 -174 32 57 -12 -47 188 131 -16 104 172 -110 79 136 -62 -149 1 -23 -213 -8
3344 -8 13 -178 -71 66 26 -67 190 172 -24 40 83 24 -92 -1 -90 -178 -31 -20 -145 -41 129 -37 -31 114 50
3369 50 37 223 139 -107 -4 96 -92 -99 -45 -65 -115 127 4 -79 87 23 73 -74 27 27 4 75 -20 -34 -94 -1
3395 -1 -139 -202 7 -143 -58 -84 -48 -89 -35 38 -55 -120 27 229 -57 -53 15 -38 -199 -57 -56 -96 -25 25 -74 6 126
3422 126 119 74 142 23 60 -52 104 13 -149 102 -142 -172 -33 -102 -127 -71 179 65 -59 247 19 32 55 36
3446 36 -34 86 47 -51 -31 35 -89 -211 27 -88 -82 37 339 53 -5 127 131 -100 80 76 45 -61 70 -82 -186
3471 -186 -71 -43 -180 -40 30 27 107 110 87 -47 52 56 52 -31 33 -16 -151 -83 -72 -145 -224 -28 -16 39 82 -64 -1 33
3499 33 24 48 4 47 2 -12 -35 -135 -77 -139 145 -151 75 152 -36 34 153 199 56 24 15 -43 -82 28 -78 -186
3525 -186 8 23 -135 -154 180 -92 1 208 109 38 114 24 -134 -28 28 -58 -220 1 19 -201 -102 -67 21 -38 58
3550 58 -56 -58 133 67 -6 120 154 -148 -40 56 -110 -246 -37 46 -21 -72 11 -116 44 192 141 -48 99 128
3574 128 -47 -9 12 -44 -68 -54 55 -243 -68 122 -111 -52 96 0 -20 140 116 -3 70 108 -41 -82 -24 46 -100
3599 -100 -40 66 -103 -34 118 60 -46 115 124 23 139 43 12 -25 57 -61 -141 52 -130 -288 -132 -26 -121 0
3623 0 89 -37 -92 88 84 -77 -43 116 -83 10 -80 81 -211 -27 25 -212 -36 120 -33 -116 152 86 -31 73
3647 73 12 -69 -16 111 -58 -246 16 33 -228 -103 78 -120 57 65 118 -40 177 233 108 44 135 -8 -27 124
3671 124 -50 -57 -52 44 -120 -34 72 -28 -32 76 74 -107 -35 135 -63 -142 40 -121 -217 -43 -8 -135 -98 46 2
3696 2 43 58 25 17 35 186 -4 157 67 -41 -168 46 25 -197 -8 46 -41 40 57 -1 58 114 141 -63 -32 161
3722 161 -60 -28 -89 -119 -133 -97 39 -250 -44 -13 -92 -200 64 104 213 161 96 -36 -36 25 54 -35 -13 5 -134 -100
3748 -100 61 83 -64 182 -10 177 222 88 -33 154 66 13 -66 143 -48 -118 19 -79 -186 19 91 -49 -12
3771 -12 25 -13 -108 62 61 -50 -73 4 -26 17 -79 -18 -155 -91 160 -133 -63 89 0 -61 -2 46 66 107 150 -23 -6
3798 -6 -9 5 -94 18 -2 18 -9 8 41 -4 263 -59 -35 -57 98 68 -45 133 -63 -123 -19 -25 -160 -43 122 -73
3824 -73 21 19 143 29 75 119 -67 -25 -11 -81 -143 -4 -89 -134 -5 33 -91 -158 101 151 -77 231 117 -20 -15 204
3850 204 28 -43 -61 3 14 92 -14 -54 64 -23 -108 20 149 115 6 159 167 66 92 65 -84 -205 -39 -104 -156
3875 -156 -73 44 -46 -126 37 -23 22 59 51 18 94 68 -53 -2 -89 -37 -126 -39 -36 -84 -115 24 -99 -57 40 -27 42 78
3903 78 177 -4 3 119 -62 -41 -35 -53 -99 -126 -26 -119 -168 79 111 27 43 13 28 83 44 7 -138 -161 -78 -153 -7 -127
3931 -127 -142 -49 19 66 -20 90 83 -64 20 89 87 -24 40 39 -88 -92 58 -160 133 -19 -163 27 119 -6 -80 -33
3957 -33 107 111 1 85 20 -91 47 -9 -234 -179 75 -47 -44 160 -46 -121 30 104 -127 -4 89 74 -90 -48 -79
3982 -79 -160 -90 3 -67 -27 55 70 -40 196 2 60 58 152 68 -48 74 57 13 -48 -51 -137 -41 -55 -97 -131 0 -91 4
4010 4 37 -3 40 115 73 -56 -184 43 -31 -71 -65 -103 -102 -32 -2 -98 -22 15 167 53 -6 88 5 -115 116 -55 -127 -3
4038 -3 -126 -31 -38 38 -103 -90 196 140 57 71 66 50 67 21 20 1 26 -22 -128 -82 -111 -153 -63 119 -15 -149 7 1 -121
4067 -121 -26 21 -69 -2 -55 -130 -257 -15 27 -165 -69 59 -28 -51 53 70 -109 28 153 -97 78 -30 81 -17
4091 -17 7 84 -122 53 81 -139 -48 14 -64 0 122 198 -96 28 58 -4 -51 17 19 -154 -22 -29 -179 26 119 57
4117 57 -75 84 -10 -51 96 78 54 4 99 -32 -119 92 13 -96 -33 92 -120 -89 103 15 -73 183 118 3 73
4142 73 65 18 88 -56 -81 -46 146 16 -85 -43 3 35 -67 116 73 24 81 82 -15 -108 -43 68 -46 -74 -58 -36 -25
4169 -25 6 -98 -60 -5 -55 -31 85 135 87 123 -77 -19 -40 100 64 21 -81 45 -120 -16 66 -25 -47 49 40 -24 116
4196 116 108 23 -31 16 1 54 18 9 -109 -75 -55 -70 -126 122 -61 -108 -29 5 65 -62 -11 108 30 49 46 -14 -36 -52 -45
4225 -45 -46 110 -55 -156 153 -15 12 42 36 10 58 85 71 -70 7 128 -65 -117 59 20 -103 -77 53 -88 51
4250 51 -22 19 -36 5 -62 -119 -30 -62 -102 -27 27 -117 -161 69 -3 -12 50 109 -13 -66 50 4 -35 50 20 -65 39 -25
4278 -25 -98 -35 96 -20 -30 12 -9 8 83 41 68 21 77 -2 1 -39 -1 -38 -66 -8 -40 -66 47 -28 -190 -37 33 -6
4306 -6 -35 4 -11 2 83 34 -116 -57 -106 -121 -146 -4 -32 -282 -10 -6 -15 28 119 68 -37 -11 36 -99 146 3 44 75
4334 75 -73 -15 -130 37 -26 56 77 116 -106 112 83 -46 -74 39 69 -98 -109 -78 -74 -25 33 -89 -42 96 -77
4359 -77 -89 -33 155 -19 30 121 -86 -207 -55 -37 -24 -77 4 -91 43 103 8 48 -5 47 44 31 60 -98 -23 84 -100
4386 -100 -67 -119 -23 -49 -121 6 -52 -108 114 43 -133 42 -11 19 -12 156 54 -11 -71 -14 -78 -23 22 -62 -47 7 154
4413 154 -56 48 84 -32 111 -9 10 20 4 -133 -139 -10 -2 -97 -154 -5 -14 -107 9 71 28 -15 60 -51 17 93
4439 93 53 -160 -108 14 -129 -36 -36 -97 -32 54 26 -103 7 100 -129 77 67 -57 -145 -54 2 -189 6 15 -58 -2
4465 -2 21 -120 37 82 31 13 -89 135 -68 19 -12 26 -141 -118 -43 -24 -26 -62 -140 -90 -30 21 72 93 -66 -137 42
4492 42 -62 -40 -76 50 20 -26 -49 -49 -154 -48 31 73 32 -27 63 43 -9 23 14 -54 -52 96 -50 35 8 -30 -83 10 -19
4521 -19 -130 100 97 -19 68 37 60 48 56 -74 -86 5 -66 -21 -106 51 -160 -43 33 54 -193 83 71 37 94 99 -88
4548 -88 -50 53 54 -219 29 56 -14 -21 -54 -78 -30 63 64 -113 180 202 -72 27 178 49 -25 55 34 -121 -71 102 -75
4575 -75 -48 21 96 23 43 122 32 89 22 -15 -185 30 -73 -100 7 -87 -159 -64 -81 -11 -104 5 94 5 -84 19 77
4602 77 11 36 -60 -153 -90 -23 -136 -43 20 -6 -82 65 59 84 -20 178 2 -18 69 -26 -117 -11 -38 49 -105 44 -13
4629 -13 -87 46 -36 -50 -23 -125 -8 -43 161 78 6 17 -10 -150 -104 -108 55 13 163 -35 -12 106 156 -43 105
4654 105 85 42 -29 -62 11 -72 -13 144 -194 -2 171 -67 -7 -4 33 24 -49 159 52 -69 74 -56 -108 31 136
4679 136 -18 7 7 -39 -188 54 -76 -161 32 110 4 72 103 39 55 -4 -22 -107 80 128 -90 -51 34 -89 -22 54
4705 54 156 -39 15 174 80 7 85 102 -59 35 69 18 -94 10 -160 -50 -5 65 -15 -62 49 -27 -63 100 49
4730 49 -104 30 -82 -77 -124 -17 -98 -116 20 0 -174 27 87 26 47 86 -81 137 -20 17 44 -33 5 21 -124
4755 -124 -12 4 -102 11 10 -8 94 -54 4 -116 108 -74 21 -28 -30 -11 -23 12 -89 -100 -6 38 -95 20 26 -9
4781 -9 -62 -9 102 -65 -46 -23 32 -42 73 -85 22 55 -45 -147 4 30 107 -21 -18 -59 -22 101 -10 52 -26 -13
4807 -13 -2 8 -93 -91 -78 175 25 -14 33 9 -104 -138 12 -34 -1 124 56 -40 27 -3 -96 -114 -51 6 13 3 -47 -3
4835 -3 -6 37 27 46 48 69 -25 101 24 -126 6 50 -102 -51 76 -60 -82 25 47 42 146 40 109 66 -57 73 102
4862 102 85 -38 -189 -14 -42 4 -104 25 76 80 31 5 -84 7 87 31 -182 25 -126 -85 26 -57 113 -23 -94
4887 -94 -23 -33 42 -7 -162 137 -41 -13 -40 72 67 32 90 -88 73 -49 -62 -217 -134 -55 164 -108 -2 44 39 -82
4913 -82 80 -17 -42 -38 -97 -23 -35 9 -52 -88 -32 -20 -91 -3 50 41 -27 47 -1 -33 -25 42 -179 -63 -2 -148 -107 -10 -107 -112
4943 -112 -8 52 -19 91 19 32 -32 67 -1 -24 -13 -6 -47 -93 -17 -105 -60 -8 58 -103 18 114 -49 65 -53 30 -21
4970 -21 5 -63 -14 -55 -24 -103 -47 46 -23 -34 4 59 -40 -40 62 7 141 73 -48 -66 -136 -46 -2 15 -6 -27 -41 -26 -11
4999 -11 24 -28 -116 -171 2 82 56 44 145 59 28 47 -74 -51 -107 -11 77 -111 22 -16 92 4 -35 27 -75 -86 -58
5026 -58 15 -25 -24 -102 27 -16 -97 -50 14 123 22 -11 -9 70 15 138 51 -59 57 51 -70 17 11 -32 -38 15 -20 50 -105
5055 -105 -51 33 96 121 -42 -48 29 -79 -31 -6 21 -21 -82 69 -12 -86 46 -100 10 112 22 -37 27 7 -5 -51 -26
5082 -26 -23 55 23 89 -49 -94 104 -54 -32 12 176 -8 -68 15 8 -98 -1 91 -66 -22 12 -87 54 -8 -102 -81 100
5109 100 116 -76 101 111 21 -43 -70 25 68 74 -106 -170 -99 -54 -42 -127 -33 27 -257 5 25 21 -7 -38 -118 10 52 -88
5137 -88 -9 10 2 8 -82 38 -95 -50 116 20 -19 51 129 16 60 58 142 -45 57 -29 -50 -102 5 -60 -26 47 -105 18
5165 18 -32 -20 18 64 55 152 -2 95 9 -24 -9 -95 -56 -4 -106 44 -55 52 199 -34 54 130 58 -1 49 -3 53 44
5193 44 -18 -114 -18 41 8 15 -97 133 -104 43 90 23 -6 -4 16 -16 78 -21 -96 -62 15 -33 -124 -17 -142 92 -109
5220 -109 77 -30 58 25 -62 114 3 87 -87 -78 -54 -17 1 -44 28 66 -35 -36 -53 104 60 -12 81 82 100 -72 129
5247 129 50 51 3 88 -55 -6 -52 -29 8 -51 67 -14 -110 10 -64 10 -26 103 -31 -77 60 -132 -145 64 101 -98
5273 -98 -85 -69 -6 49 52 -63 77 54 170 67 51 -81 -96 -4 139 -25 -40 58 50 -203 17 101 75 -19 209 71
5299 71 -110 65 145 60 -57 -101 8 -172 -5 -73 19 -38 28 -40 115 -37 17 26 8 -44 -70 37 13 83 -14 14
5325 14 65 22 -102 140 -19 38 64 81 -18 14 -40 -7 86 -77 -69 -88 -4 -65 -40 -23 -110 -5 4 27 -123 112 77 -10
5353 -10 -15 38 56 -48 40 46 -32 -89 -81 0 -83 -92 94 -34 117 -39 -19 -14 74 -24 56 21 73 -39 -47 -6 -49 81 46 45
5383 45 18 30 174 138 15 21 99 -66 96 44 -11 73 -85 -85 -95 -175 32 -41 56 -20 -18 -3 -53 -37 -69 -117 -44 -53 -43
5412 -43 27 -13 -62 -30 -115 -118 64 20 12 -6 132 -67 70 91 50 -111 8 109 -93 -53 -49 10 -42 -134 17 -91 -17
5439 -17 81 -21 36 65 192 -132 35 -16 -76 7 104 8 72 70 -36 1 -68 -7 89 -38 37 76 -73 67 33 -120
5465 -120 87 42 50 -184 18 30 -35 19 102 9 110 8 61 99 103 69 -81 72 57 32 22 -108 -27 15 85 126 -17
5492 -17 -97 96 67 -13 39 -13 35 59 -88 28 -107 -42 -68 -23 -86 61 -122 -49 57 -49 46 34 -42 -7 196 -3
5518 -3 149 68 73 7 125 -66 33 69 58 -44 -158 163 134 21 31 -13 62 -104 71 5 -173 -21 21 -23 -150
5543 -150 -8 12 -109 -91 21 -18 61 11 -93 -106 77 -42 -2 -62 -15 -35 -32 -31 70 -2 112 -13 15 71 -29 -128
5569 -128 -51 -76 9 148 82 80 21 -4 82 -119 -24 60 -79 -101 80 66 15 103 -30 11 21 185 15 18 8 69 -82
5596 -82 -77 30 -9 -108 74 57 43 9 33 -34 -69 -61 66 -83 2 172 39 95 46 10 36 15 -16 33 -3 2 7 -79 46
5625 46 96 60 118 11 -71 57 44 -3 43 -12 -92 -95 13 -13 -31 -78 -108 -99 -19 49 3 -11 -74 -112 -124 -29 -6 -51 -90 -10
5655 -10 -31 75 35 -107 -46 8 -14 -79 9 47 18 -79 -14 4 31 -59 111 -34 -3 -78 27 -33 -49 -63 39 -9 119
5682 119 44 -106 -54 0 -47 87 38 32 3 -104 -138 -81 123 -182 -67 52 -12 -58 -36 17 90 16 -13 -2 151 -44
5708 -44 25 45 -18 37 -50 2 -1 126 40 101 21 128 -53 -27 145 -55 -7 5 35 52 -51 -35 64 114 -88 -87 -146 34
5736 34 104 68 -17 -108 35 -36 74 -203 -110 -68 -33 -110 13 34 34 -65 13 -114 7 23 50 92 -137 95 -97 -8
5762 -8 -33 -83 -58 -12 -25 3 -29 71 -80 18 56 7 16 142 20 -92 -80 27 -72 -77 62 -104 -173 -55 41 16 32
5789 32 132 48 59 168 -12 -72 -136 42 -1 31 -9 61 4 11 -18 7 -84 -1 203 71 -61 -17 -60 -8 106 -45
5815 -45 129 57 3 -27 86 27 -69 94 -34 -53 28 -22 -38 83 68 118 41 -84 -123 -9 -51 -45 -108 3 -68 65
5841 65 38 76 -23 55 9 54 71 -22 28 -35 184 88 45 -96 -99 -7 -7 22 66 7 5 -28 73 60 9 31 -99 -27 62 89
5871 89 47 -50 -95 134 -94 55 -33 -7 -76 -45 -77 -15 -47 55 -66 -36 -24 -124 -97 -83 -33 93 -74 -20 -78 41
5897 41 -1 -11 -103 19 39 -13 179 2 -42 4 -10 -80 52 -48 -88 -76 -63 87 16 62 65 -183 -9 50 107 137 -110
5924 -110 -5 53 -142 36 -108 -52 -50 -124 -144 68 22 13 69 -9 22 -33 56 -63 47 -82 76 -111 -31 44 29 39
5950 39 119 79 -46 16 34 131 108 102 93 38 -55 5 55 -54 -30 -60 -79 -13 70 -12 -157 108 -21 6 59 17 -7 -1 -72
5979 -72 -63 -46 -81 -162 -143 -42 -47 82 64 6 -10 -76 4 -78 -59 24 33 81 -65 -57 22 46 -4 54 -22 -50 -35 -34 215 173 6
6010 6 -99 18 -84 92 140 -92 -19 -55 24 -160 -170 0 -50 -86 63 -14 38 64 14 -65 -38 75 -92 30 -117
6035 -117 -44 -68 9 -149 11 -5 36 9 -71 24 46 47 -68 109 111 -89 178 61 -5 -36 65 -9 -181 69 84 -26
6061 -26 -102 44 -82 66 80 -19 3 52 9 -138 4 -45 -36 3 56 -45 -68 -133 -12 -78 -95 -8 -32 -79 -95 94 59
6088 59 138 -20 -56 -51 -122 -103 -75 16 -16 112 19 16 138 -30 85 -2 -22 63 64 15 -55 -72 -98 -41 48 -30 -115 -11 102
6117 102 -82 -51 85 -57 -180 -36 -9 -50 -68 -47 -83 -48 106 -31 -25 -67 -7 25 -65 11 -107 -21 22 91 21 41
6143 41 -17 -105 -41 178 -28 -75 27 -55 -95 -9 6 42 -68 -4 30 -88 49 35 58 75 -76 -22 82 -103 -68 -92
6169 -92 -65 -16 -60 33 -6 27 -17 34 -14 132 79 71 -27 -3 42 -78 -99 -59 -156 -98 -17 22 86 -36 8 50 64 61 12 -30
6199 -30 31 10 -43 0 -37 70 49 -56 8 70 -21 -18 -9 -16 79 18 -55 -13 89 121 -6 25 -84 -88 -27 -49 -150 -36 85
6228 85 -32 7 73 -56 -20 -1 -15 -112 75 132 17 -71 66 -26 29 -17 -72 -22 -57 -60 41 14 205 7 -46 -7 17
6255 17 -80 27 27 -10 -74 -4 -11 20 -71 -93 -15 -26 183 -112 -24 -86 3 80 13 5 -58 26 41 23 -41 49 115 49 -88 -44
6285 -44 15 71 16 123 40 31 69 79 56 16 -89 18 71 33 24 -53 -7 59 -13 57 -11 -55 -39 -15 -185 -40 -163 -146
6313 -146 -95 33 -43 -51 -106 16 -35 -22 47 6 19 56 5 10 -7 62 3 41 26 30 -83 -9 109 77 -67 17 40 -73
6341 -73 36 -10 131 64 132 13 -77 -40 -81 -116 -39 -48 -136 -60 -86 28 11 -7 -11 4 33 88 18 63 -45 70 -124 6
6369 6 31 -43 -85 -12 -136 -62 138 39 -60 -19 -59 156 88 128 -53 39 94 -118 3 8 79 -66 58 -70 94 126
6395 126 -32 52 -25 -41 -75 -4 -8 -7 -100 -53 -107 16 -43 -67 -123 -110 -189 -40 41 21 50 48 13 -45 100 -120 6 54
6423 54 94 2 55 42 -88 0 22 -7 10 -129 -15 -29 -102 -34 -56 30 -55 -37 -9 -72 -10 -15 46 35 -56 -50 66 -62 -71
6452 -71 -7 54 91 -61 -11 66 15 -39 -63 -128 -10 50 -113 -45 62 -105 -48 87 54 30 71 76 14 -63 1 34 -149
6479 -149 29 5 51 99 51 39 23 42 20 -4 -127 -49 -54 -56 -24 39 97 -36 7 -84 -43 0 69 -65 1 -118 -88 -107
6507 -107 -63 -58 -3 17 -130 -29 37 -70 -145 -195 21 37 35 -24 36 -29 -74 123 -53 166 3 30 4 87 33 1 99
6534 99 78 8 -96 -113 -29 100 65 -102 26 72 -18 -77 -23 -30 -18 -36 4 -21 25 34 -9 -106 -19 140 -97 -38 13 -35
6562 -35 -29 -18 76 31 -18 35 28 64 35 74 51 81 -46 -60 92 -56 170 58 45 102 24 2 -19 -7 105 -74 21 74
6590 74 -77 70 -11 -196 -25 -40 -89 -17 18 10 -23 -26 24 -42 -43 -136 2 88 5 47 -46 -9 -7 31 -28 10 -49 -39 38 11
6620 11 -1 -3 -40 144 59 -110 -62 -98 -11 -63 -13 -4 -125 -30 -8 27 -102 18 12 -87 -4 125 8 -22 -98 92 -20
6647 -20 34 -36 -100 13 -43 -5 -52 86 45 38 -53 150 -93 -51 -18 51 26 29 110 88 202 101 111 89 89 97 42 5 71
6676 71 -33 16 59 -26 -5 1 -19 7 -65 26 -84 -9 45 -71 22 40 -74 -54 -110 14 67 15 -41 -29 -18 -90 -81 10 -128
6705 -128 -6 -20 2 5 -35 -26 -124 143 -87 38 21 -41 -60 -53 78 34 -56 4 75 77 50 22 -12 18 -105 40 -39 3
6733 3 -54 -13 -76 9 -83 -117 -10 6 -29 -11 -74 -60 15 100 33 -53 51 72 -92 -86 19 -40 31 -26 -30 -67 65 -27 5
6762 5 -18 62 -30 18 -7 68 17 107 -1 -80 -6 -3 -80 -46 18 32 9 -34 79 -19 41 -13 42 -23 76 -180 48 122 -88
6791 -88 71 -108 63 -63 -66 0 23 4 1 -94 -1 23 67 32 29 32 79 -19 5 -46 -122 -38 3 -124 -85 42 40 17 -25 44
6821 44 31 -40 44 81 -110 -135 18 -52 84 -35 -80 20 120 10 -60 -27 -34 -90 -31 2 11 -7 -32 -7 -128 76 -35
6848 -35 -78 51 -34 -10 -46 -133 37 -28 54 106 -28 3 -8 56 -32 29 176 -53 44 107 -54 -64 -4 -72 32 94 95
6875 95 -65 35 113 6 12 -78 209 -54 -195 28 14 121 -4 -15 -141 21 -51 -29 43 -77 -19 -90 -103 -73 3
6900 3 21 90 -31 -43 52 -92 67 92 -54 156 65 71 39 27 72 30 1 -4 -99 7 91 26 4 -133 73 -18 -60 9
6928 9 52 -23 -70 62 -60 10 25 -71 84 -138 25 -70 -112 117 -71 30 5 78 -79 87 75 -110 -1 127
6952 127 -49 -77 -15 7 146 69 -36 -52 31 -66 58 -12 -14 13 24 -24 10 99 -71 30 -41 -121 -55 -37 -99 50 56
6979 56 27 85 -21 5 -57 12 -21 -64 18 -123 -35 -73 15 20 50 47 -55 132 -137 21 60 13 21 -3 25 3 35 13 -124
7008 -124 -98 -28 72 -64 -41 -61 -11 -64 -22 47 79 53 41 29 32 2 -23 -77 16 -63 -156 22 -123 -100 6 -66 -12 24
7036 24 -103 -4 -16 34 98 29 54 39 -9 -76 -141 7 -54 6 42 -16 -33 44 -35 -40 60 83 -46 -8 54 -25 62 -118
7064 -118 94 47 -121 22 -2 87 12 -76 54 -81 -108 141 146 -14 3 98 45 20 -46 25 -1 -19 13 21 -61 -35 -47
7091 -47 37 -36 -122 -10 35 36 -36 -30 -20 31 119 101 -17 -23 5 104 92 -74 -77 -10 50 42 -32 42 81 9 -18 52 -4 29 39
7122 39 -52 30 -22 -35 -44 95 25 -77 -29 -35 20 46 -91 30 62 -98 -55 36 24 -33 -98 -39 95 -11 -16 93 38 -37
7150 -37 -8 50 -37 37 91 -71 -39 35 -21 -169 -20 -41 -104 26 148 39 10 -7 -56 10 -6 66 17 40 -96 52
7176 52 31 -117 45 -26 -32 -29 91 22 155 120 1 76 151 16 -66 31 103 72 165 -23 49 22 -3 32 64 -22 -11 11
7204 11 34 -73 50 -13 42 -113 -84 58 -153 -50 -13 30 -202 82 -68 97 -38 -54 105 -27 29 -52 58
7227 58 -123 -128 50 36 -110 22 6 73 -62 -62 47 172 3 -22 40 -58 25 21 87 0 11 -69 26 -13 -35 131 -6
7254 -6 78 -5 -47 27 114 0 -81 -34 217 -76 14 -81 -77 7 -60 -162 59 26 -12 -19 61 -12 -67 28 79 -34 20 20 62
7283 62 79 -12 97 -140 -43 4 54 -161 -52 -49 -92 65 -71 20 52 6 52 -91 0 49 -4 -82 31 36 51 4 23
7310 23 -5 -50 -51 -42 59 -139 -11 32 -23 71 18 55 -66 4 32 -35 -55 -84 -129 -65 -116 136 79 64 -33 -114 -11 4
7338 4 -24 15 46 -9 -33 -12 -69 71 -62 -65 47 -25 -116 8 -45 -91 -55 26 10 -99 27 -53 72 146 50 -121 -56
7365 -56 52 -37 -82 -7 -96 -90 -49 -44 -62 23 -7 -39 18 60 -68 -105 -30 41 -35 -26 -23 118 -5 43 17 41 -67 76 -6
7394 -6 -25 77 39 79 -8 75 -74 72 65 -82 -77 -6 25 152 36 -16 -24 -60 37 96 -188 -160 -114 -17 38 -3 52 -96
7422 -96 41 13 -83 -57 -11 -63 93 -57 29 -132 77 143 18 110 157 -59 53 2 -58 53 -19 86 109 56 -199
7447 -199 -71 2 53 -57 -19 -94 -9 -36 39 -90 18 -90 -25 19 -93 -45 -53 -162 14 15 -152 -72 -4 -49 -69 -15
7473 -15 -52 -37 -92 -47 1 44 -59 59 167 -35 101 -11 41 50 -29 41 -67 -6 -10 19 -41 -134 4 92 -90 -25 5
7500 5 52 115 -38 -79 81 -58 -59 -109 33 -88 44 55 15 -49 -81 -17 -42 -73 -75 102 46 3 -11 -36 -119 -2 97 69
7528 69 -100 46 -88 -87 89 56 -18 115 62 7 -4 -42 -45 -65 -42 -1 31 -153 -24 -14 51 -71 28 -105 0 9 -88
7555 -88 26 -12 60 -70 -26 -122 20 1 -74 19 -76 32 -15 28 3 -30 48 -46 -29 11 134 0 96 57 -52 -151 -30
7582 -30 45 -34 -52 -51 -123 -141 17 11 -69 20 21 -28 -10 -39 -50 38 1 -13 11 -25 116 77 -114 32 38 -126 89 -104 -34
7611 -34 -71 71 -13 -89 -37 -56 13 -33 97 16 -99 95 33 147 45 146 -2 14 -5 107 21 37 113 8 -60
7636 -60 -43 51 -108 96 -47 -120 118 -29 76 -98 -27 -141 -18 -95 -59 -124 -5 23 4 54 38 -9 -91 162 -22
7661 -22 1 -11 -105 32 53 -15 4 -4 4 10 -46 48 45 -24 -62 -4 38 -73 -16 124 108 29 -88 50 -73 1 29 -79 -32
7690 -32 37 -42 51 3 -66 84 -7 39 0 -80 -50 14 26 -51 -40 -32 5 -24 -54 13 11 4 -25 1 -158 21 -28 47 11 6 -44
7721 -44 -76 -81 19 2 178 11 -28 45 79 28 -25 14 25 -7 -46 192 112 -21 -91 -46 -52 8 11 -93 -6 11 24 113 23
7750 23 -32 -98 3 -24 -50 -25 42 9 -49 16 -21 -114 -86 -42 -68 24 64 127 -74 -117 -75 29 5 25 -59 -6 63 -1 -92
7779 -92 -141 -21 -45 -65 -73 62 -106 -98 -93 64 -73 -6 89 21 -33 -71 -2 -6 -29 1 -35 36 -34 -3 20 -106 -69 -71 63
7808 63 -83 40 35 15 -8 -9 80 -38 11 82 -74 44 39 73 -42 32 -61 -76 -31 -80 -72 71 97 -4 -18 20 -61 55
7836 55 -34 -127 -54 -11 -44 -76 -4 -44 -155 69 56 -74 -61 -4 -68 -83 -25 -48 -5 -53 -20 53 -117 9 115 -14 31
7863 31 -36 -15 52 -8 -28 49 45 -4 85 26 52 -24 -17 2 23 -55 13 13 -11 -51 -14 -71 21 4 37 71 -40 -39 -86 -3 -81 -47
7895 -47 -124 -94 -135 -48 64 -31 -46 -52 30 -103 127 -60 -22 -38 32 -69 -111 145 -87 75 -10 88 -126 -117 21 -101
7921 -101 14 36 47 -70 21 3 -31 21 163 15 -55 -74 21 -90 33 -66 -150 -20 -74 71 -37 -32 -29 -23 17 76 80
7948 80 64 -101 -128 -26 -31 50 -104 -13 100 -56 -59 104 16 9 87 27 77 7 -38 118 21 -54 -56 46 -58 122 -65
7975 -65 -46 98 25 -23 -30 -54 -62 -16 -81 4 -42 30 -87 66 19 121 -27 -20 96 -106 -50 -74 168 48 57 60 46 116
8003 116 1 5 -49 -96 33 10 101 50 88 71 2 32 -76 -2 -27 11 -18 10 -26 4 56 2 -7 8 31 -58 105 19 -86
8032 -86 3 -83 -73 -78 -35 -36 -96 -14 45 -108 16 31 22 -122 63 126 110 5 100 34 -21 66 -108 19 6 11 6 -25 -114
8061 -114 -60 28 -62 -71 30 164 104 -88 17 74 -44 -66 7 -26 3 -67 8 -205 -18 -95 -106 -108 9 28 -180 -2
8087 -2 23 -85 -70 47 -84 -70 32 15 72 54 63 18 51 -44 -56 75 -62 6 -15 35 -8 -42 25 100 -34 -78 25
8114 25 -55 -9 -47 13 -25 28 3 -97 77 11 -115 -63 -55 45 3 -92 -198 31 -30 16 -95 -214 -24 55 11 -53
8140 -53 26 -51 -21 -114 -70 -21 -31 95 11 -69 -24 45 -2 -16 -98 46 89 -40 72 -26 80 1 -57 -4 -50 -82 -35 100
8168 100 -51 -42 22 23 -34 23 -21 -33 -97 31 -104 -59 66 74 96 100 -160 65 -91 62 74 37 91 -77 -20 57 -73
8195 -73 133 85 21 -15 39 -203 -45 -38 -38 -59 45 44 -20 50 90 68 -88 -48 -74 65 4 -6 -54 43 -43 -7 -66 -112 -101
8224 -101 27 -164 -79 54 20 -43 60 -10 74 -107 -48 47 -10 50 12 -48 -44 -8 -195 -26 94 6 -61 56 -129
8249 -129 31 173 -24 6 -42 153 -151 128 38 -45 66 5 -12 10 -66 40 -46 -93 -38 8 -5 -9 -70 -110 200 20
8275 20 57 -52 -52 58 -11 113 38 19 -7 -13 -65 -7 72 36 9 62 105 46 -68 -40 59 10 7 8 17 -1 -17 17 -72 -45 83
8306 83 9 36 25 97 32 -52 -33 -139 4 39 40 9 -12 -120 50 -34 2 1 -62 -15 -35 54 -61 -37 55 11 4 177 -29
8335 -29 7 41 46 -22 121 -75 18 81 144 -46 41 15 -70 -47 137 -11 -26 -74 102 45 56 -5 -60 -114 83 100 -55
8362 -55 43 -78 59 -103 -38 -47 17 51 -44 -70 -91 -8 50 -61 -40 79 -43 35 60 35 170 26 -8 -16 49 116 3
8389 3 -47 -3 -176 11 8 35 -149 -71 48 -17 43 23 111 -68 59 -48 1 -56 -21 11 -18 -42 -107 -91 36 48 -82
8416 -82 53 -72 42 -87 112 148 -83 43 -10 -26 49 -107 86 -41 -43 1 -25 -9 -63 102 -51 -22 26 65 31
8441 31 69 111 11 -70 -6 151 19 47 -29 60 -121 -111 -40 -69 -62 -48 -51 45 1 48 -23 21 16 -36 -55 5 20 35 41 -16
8471 -16 -38 -129 57 -73 -11 88 -92 -75 -38 90 -62 21 58 117 22 -25 -35 11 91 31 61 -27 29 24 18 -104 -109 6
8499 6 -34 -101 32 15 35 -35 -3 -80 -127 -119 -11 -45 69 -69 24 -25 53 27 -61 42 -14 -164 24 -59 -15 -71 -38 -44
8527 -44 -88 -104 34 87 -139 -22 -110 -44 20 23 75 86 8 94 30 -149 -51 2 50 -42 25 18 24 108 -55 -18 -12 -47 -16 1
8557 1 149 -6 81 -65 54 145 10 59 86 24 83 49 -34 -39 51 -15 24 87 -111 -64 90 -61 -101 30 53 89 13
8584 13 57 -29 -5 147 -28 76 1 -74 -79 94 -1 89 108 -37 -20 -101 21 75 95 75 -131 -62 -83 -39 -6 -27 62
8611 62 42 -15 46 4 64 -23 -30 -18 27 1 -15 113 96 -98 35 23 -5 20 112 -74 -6 18 162 99 -36 -76 -5 80
8639 80 -17 -60 -27 75 82 -8 -70 119 -60 -9 -1 -50 52 -61 -4 40 -14 15 96 71 -132 -25 3 -17 -23 -19 118 122 -21
8668 -21 -20 25 -121 -5 -114 2 72 22 -47 67 118 2 117 -91 78 112 95 19 -66 -100 -13 -48 81 7 83 19
8694 19 -84 1 51 -6 33 68 -40 -32 29 -30 -20 -23 58 57 122 -35 -9 36 -6 -3 87 -59 1 -37 -70 60 -60 -49 -62
8723 -62 49 -67 10 -6 -134 37 57 45 39 82 40 3 40 24 -16 3 -42 -52 90 30 -87 -69 -102 25 -66 -5 -89
8750 -89 -74 33 -83 -14 10 -58 -17 103 -19 -55 35 5 -36 -83 57 96 102 -44 -7 -5 -10 -38 10 -13 -119 28 116 59
8778 59 80 -11 -143 -5 -29 -17 102 -67 -85 140 -82 -28 -25 49 -37 -32 29 -44 -63 -16 74 -96 38 -109 5 12 5
8805 5 -61 24 96 -157 -45 -54 60 -53 20 15 -8 -62 3 -69 61 -59 20 -83 -39 0 37 109 37 -59 1 -89 66 8
8833 8 -33 52 0 -47 36 18 -83 56 66 55 -68 41 99 16 -8 3 6 -30 -16 -64 28 -72 9 -57 -4 108 -107 -104
8861 -104 -29 18 70 84 14 20 -67 -39 43 12 9 81 111 -2 63 -45 -45 10 103 -38 54 -51 -51 73 -50 61 87 110
8889 110 10 -85 9 23 -63 -74 -35 -24 -73 -77 -122 80 -64 -33 1 -18 -116 7 56 -40 -84 22 -54 62 103 -101 -14
8916 -14 -113 43 117 24 -18 84 1 7 -115 48 23 113 -8 -28 32 18 -95 -32 16 -24 -12 12 -33 129 65 -143 -59
8943 -59 30 -13 0 -21 -57 -6 -99 -32 -143 -3 -56 -43 -21 -2 55 -11 21 49 111 198 -31 41 97 -62 -43 -122 83 -41
8971 -41 -7 -103 18 -5 51 53 25 -113 28 75 -154 98 55 -72 -4 7 105 5 -95 0 -32 -49 -113 -37 17 -55 -3
8998 -3 -23 25 112 2 76 -53 18 -103 91 146 -79 -41 46 -126 5 9 113 62 96 94 30 91 -20 32 -6 59 79
9025 79 1 21 53 12 -104 -83 -105 -39 157 -65 -130 -33 -14 -64 -90 26 -89 -121 -43 -15 -84 -50 23 32 -22 8 -23 -36
9053 -36 127 -3 -50 48 20 -49 -35 67 -15 -7 6 5 52 -48 -15 -5 47 68 30 26 90 39 -70 -87 -1 -32 -65 -95 -3
9082 -3 48 -2 -1 22 -39 -34 1 -44 -27 -151 10 -15 94 103 -90 -55 -117 23 -24 -69 3 -83 -68 63 -65 -27 9 -17 40
9111 40 72 0 45 21 -41 76 -38 105 33 -12 9 40 -36 54 97 107 -120 36 -103 8 -118 -85 -49 0 -2 -104
9137 -104 -53 -3 -62 -73 53 49 -3 74 23 8 17 -2 49 10 -55 -29 1 26 52 86 22 -116 17 59 6 -48 59 54 9
9166 9 50 -97 -37 -67 -90 -11 -41 -16 20 -12 -93 97 105 17 102 37 -43 -8 -37 -130 -63 28 -40 -74 -84 44 -62 -74 -4
9195 -4 55 0 -70 41 -11 45 -11 -2 -56 138 -26 -116 28 170 -12 -42 124 -34 60 -31 109 -11 -33 23 56 -121
9221 -121 -64 40 63 -105 -23 -53 75 -81 -10 -6 -58 -7 7 46 -60 13 44 35 -19 49 -10 36 -32 -14 32 55 3 -27
9249 -27 -33 32 -61 -10 -44 -21 83 -39 73 120 -43 0 -55 -67 -20 2 -117 -66 -32 -81 46 -34 29 -60 21 -13 48 -13
9277 -13 35 -56 81 -91 36 73 -102 -72 46 64 65 -54 10 -209 -116 28 30 -90 2 55 108 25 -154 49 -3 113
9303 113 -46 44 -93 112 -2 1 2 57 8 -6 69 45 -7 56 -75 -35 -110 33 -12 -32 -22 119 17 -85 -53 -78
9329 -78 -91 -44 5 166 -39 -33 -7 -133 -39 25 17 34 -27 -55 -24 46 136 -43 102 4 68 52 76 38 -68 -20 -61 -32
9357 -32 -15 -34 -72 -46 -5 19 93 15 4 84 16 -64 -6 -53 -90 -50 48 -63 26 132 -44 -53 -128 -64 -69 -48 14 17 30 -15
9387 -15 77 -48 -49 18 -100 24 -44 92 4 182 -49 -43 93 14 116 -19 -1 -5 67 56 -18 -63 -4 -43 15 32 10
9414 10 -127 -114 88 2 65 -54 -2 83 97 54 48 152 -116 -103 71 15 -48 -31 -60 19 -88 11 140 21 18 -4 8
9441 8 -140 -93 -37 -35 17 5 32 161 -12 -38 71 -22 -55 -58 107 31 -128 71 -25 70 -10 -26 -64 133 66 -46 -81
9468 -81 -116 21 72 58 -36 -185 -138 -24 -149 -36 -42 -2 54 1 89 -108 -108 108 13 37 4 -43 18 -46 63 11 63
9495 63 43 -29 179 53 89 23 -46 76 -53 -55 14 113 36 -13 51 -112 -94 78 60 -84 -52 -38 22 -25 -70 -119 -117 -50
9523 -50 40 37 72 37 -48 18 41 -5 21 -33 82 8 -16 100 25 -34 -13 -17 -80 43 128 79 2 -83 -47 48 -42 96 19
9552 19 -22 57 17 -36 19 -61 5 -48 -71 -39 9 -60 41 -69 0 140 25 48 -3 -56 -9 -19 -11 52 23 114 -34 51
9580 51 152 -42 -119 36 112 69 -61 69 -47 53 153 -35 63 -55 -18 -26 3 96 105 19 -100 -121 -10 42 -19
9605 -19 -59 -85 -12 -49 -33 122 -36 21 -51 -73 46 20 -8 -71 -14 -155 8 -66 129 -62 -65 80 30 -17 3 110
9631 110 -28 -181 -61 -106 36 58 88 27 113 12 -66 16 -4 127 -79 14 22 24 79 -72 16 -50 45 86 -63 5
9657 5 -28 -28 -98 22 -51 -78 -25 -37 62 105 80 121 -37 -37 -88 60 49 -14 26 -8 14 -61 -53 -16 155 -52 -30 53 -34 11
9687 11 72 75 -65 -23 -91 -46 10 125 8 -143 2 137 10 -42 4 11 -94 26 -83 -70 -14 24 -148 -63 23 -29
9713 -29 61 30 -11 13 -2 119 -106 -82 -35 -68 -15 -9 -3 -101 41 -1 -31 -66 -37 69 13 -70 31 -1 -80 -42 -1 48 -20
9742 -20 -14 -122 14 86 -13 -78 -93 33 -51 77 72 -74 56 47 -34 37 -38 -32 -30 -4 -77 -22 1 -54 12 18 -15 -57 -3 -6 -16
9773 -16 -118 1 8 27 151 63 102 92 120 47 -31 -160 -71 -109 71 -46 -91 12 21 -86 65 -146 27 43 55 147
9799 147 -72 101 -64 23 -134 -23 88 164 -23 14 79 -106 126 42 93 -26 -2 -34 -126 15 40 -20 107 2
9823 2 -14 131 60 68 49 113 -24 17 -7 9 54 -53 -157 46 49 73 68 -67 41 45 38 50 16 2 -65 -35 -98 15 -14
9852 -14 -33 33 5 -68 74 40 79 30 -71 51 113 -96 101 46 10 71 128 46 39 -48 32 35 14 -19 -137 -8 41 90
9880 90 -75 89 -67 -29 -70 -7 64 -139 -31 78 -58 126 -21 28 -51 2 92 -31 40 2 -104 -47 15 -118
9904 -118 -1 112 35 -4 -52 49 88 12 28 92 21 12 44 106 -66 -55 92 -4 60 12 -44 -6 93 -75 74 -64
9930 -64 -22 35 40 72 82 75 10 67 92 -73 59 -66 -160 -47 -123 -208 13 -15 21 -93 19 33 -65 -70 63 -57 51
9957 51 -96 181 -17 125 -46 -9 41 53 13 59 17 -25 15 118 -17 -11 48 33 19 -141 -32 140 -57 -142 140
9982 140 -2 -88 -16 19 -47 -36 -5 -17 -14 92 43 -105 19 -9 -34 -33 -133 52 7 60 -45 -81 5 -26 -56 45 52
10009 52 -38 38 -28 -15 60 -17 -20 -58 56 -31 -45 -21 -22 -79 16 -106 -49 -9 111 93 12 10 -24 96 9 -37 1 -38 31
10038 31 -149 51 28 -30 5 84 -25 -16 85 12 -97 24 -120 -66 -12 -47 0 -10 12 -108 19 -1 62 -72 -13
10063 -13 -52 21 -50 46 -65 -40 11 -93 20 29 -24 -26 13 50 -15 78 -3 6 81 96 42 42 33 74 -105 149 157 -46 61
10092 61 -98 -53 -13 -43 43 50 -103 -5 -45 -107 40 -70 61 -61 -12 -77 -3 62 -86 68 -1 -16 126 -95 -45
10117 -45 -9 -20 34 115 83 53 -56 -80 59 -55 101 -33 56 -12 88 42 1 -24 56 19 2 -13 -18 -31 -146 29
10143 29 -35 -133 -27 -14 124 -95 73 1 -64 -37 -54 -44 110 18 -23 -42 -77 61 5 -66 -25 -53 42 -28 29 80 -6
10170 -6 40 58 26 -30 1 -103 4 -113 184 11 56 -36 -30 45 10 -30 49 39 -4 -108 -48 -73 54 -92 -18 8 41
10197 41 -28 39 -6 20 -30 91 -34 -23 73 -14 28 -58 -115 17 -32 0 -32 8 100 -123 32 23 33 -28 37 -111 -75
10224 -75 23 17 -24 9 -12 37 -5 10 8 37 45 20 46 6 -83 -52 97 -53 -23 -21 56 35 115 51 77 105 19 74 -14 104
10254 104 3 99 -86 70 -12 -97 23 -23 -91 -37 64 -68 47 55 68 -80 -64 33 73 8 -55 5 33 83 23 41
10280 41 -121 -25 49 71 -25 -2 -134 -64 -44 -21 46 50 78 -43 24 -34 39 28 11 -21 85 -8 8 -32 88 30 -79
10307 -79 92 -52 -13 77 -57 66 46 -119 -24 -7 111 6 -28 -75 68 -48 -16 42 -17 -137 -95 35 93 -39
10331 -39 -96 -41 139 40 -54 -3 51 78 -5 54 37 -63 -16 -61 -7 71 -9 49 20 -15 34 3 63 -78 -17 -33 -17 91
10359 91 24 -69 -38 -73 6 -56 27 80 -8 -38 -15 11 23 -114 1 6 -63 67 8 28 -90 84 -10 10 -55 33 -83
10386 -83 -85 95 25 116 24 78 9 111 -99 -6 -113 15 -11 94 -45 49 103 -24 -39 4 37 105 37 16 -34 36
10412 36 3 85 -6 -3 19 -46 7 -83 -10 -81 62 -30 12 44 -7 -71 9 44 98 -123 -87 104 -39 -8 -2 -114 -28 -94
10440 -94 6 -47 165 -53 191 29 -31 64 92 15 51 69 55 56 -3 -99 89 147 -21 -4 62 -53 75 -5 -11 42
10466 42 101 13 -51 -40 5 -30 -68 25 -31 83 -91 -22 16 -58 25 38 22 -48 -18 88 -111 -82 -124 41 114 -2 54
10493 54 123 16 52 -99 67 -21 156 -13 -2 155 30 97 -33 76 -49 15 -93 75 -89 -39 19 -47 -170
10516 -170 8 -56 -10 29 -45 -40 -72 -37 -74 16 6 -52 -10 -2 54 68 -16 -108 -3 24 49 -68 -14 -94 108 21 92 -13
10544 -13 -45 120 35 -9 78 -29 -65 7 -6 -37 21 -8 -21 54 -46 5 50 -34 -46 104 98 -68 -22 13 76 -12 -39 110
10572 110 -116 80 123 25 100 46 -23 47 127 -47 51 -37 17 13 70 42 139 -25 130 2 65 -73 18 -20 42 129
10598 129 -71 39 19 38 -31 100 -4 165 32 -2 -96 -3 0 -4 -15 9 106 -19 -20 14 -93 -13 83 -95 115 -138
10624 -138 -57 110 35 90 4 78 -80 -40 -17 95 -2 12 21 -36 94 46 87 -72 63 69 72 68 76 -10 101 87 -1 4 11
10653 11 1 26 -5 53 2 -118 -34 30 71 90 -40 -99 13 -35 3 21 -50 35 62 47 23 4 16 14 22 -34 9 70 16
10682 16 -37 119 -67 -184 61 21 1 -42 68 -20 0 -19 29 -47 -141 35 -168 93 -14 -85 -21 52 32 126 -37
10707 -37 -28 23 -4 -40 -26 8 -17 -3 -17 1 -46 64 0 125 -63 25 75 93 29 -101 102 -6 -14 -73 45 -49 36
10734 36 2 57 -13 77 18 -14 -69 -31 -14 -25 -1 -5 59 2 28 8 8 11 82 -19 -93 44 104 -100 -108 26 109 22 -84
10763 -84 102 -24 -78 0 -110 -10 -68 -10 13 -144 -120 -49 -31 -177 91 -87 39 -2 -58 31 -49 121 23 27 -23
10788 -23 87 -74 -27 38 90 68 38 22 22 -19 -48 69 29 -71 82 -46 -44 -71 -33 -105 -26 -109 70 11 -33 80 -72
10815 -72 -6 -102 -45 -164 -15 15 -75 -27 115 80 166 49 -14 85 -45 -38 -101 -10 -60 59 -36 94 -61 -8 -29 -55
10841 -55 86 50 93 -19 60 -96 3 -84 -89 42 -102 -6 23 35 -17 15 58 -115 108 -21 8 -75 -18 13 -8 -4 4
10868 4 28 -58 -10 33 -27 80 6 23 -101 7 -31 -33 44 107 42 -24 59 -90 116 64 76 64 29 -2 -64 101 -47
10895 -47 -107 18 20 -14 67 -58 -108 8 -33 4 -12 74 -79 50 -19 109 66 -64 59 67 -73 -33 43 75 66 -5 -85
10922 -85 81 156 64 -5 23 -8 -32 -59 -28 -80 -60 87 42 -12 123 -67 133 -20 12 -57 -16 -43 60 77 -102 35
10948 35 -44 16 -2 -22 -14 -168 31 -15 -68 30 -100 104 -50 -20 83 10 -21 31 47 -7 -64 -121 104 33 -38 42 57
10975 57 41 -52 -49 7 22 -17 40 -22 -183 34 53 24 -26 -33 -4 134 -3 -110 -29 1 -43 44 -71 -92 -6 2 -16 -90
11003 -90 -29 8 27 45 34 53 9 -3 90 -7 -146 34 -86 -80 78 67 62 -57 95 -104 152 86 32 45 27 16 26
11030 26 45 21 109 32 -32 53 -32 -22 28 -2 -57 -38 102 -19 -62 -13 -45 3 -13 33 -63 -24 72 -83 -95 102 87 17
11058 17 35 -72 -28 -16 -17 16 -9 -11 52 -99 53 188 29 -103 -27 -42 -94 -65 -77 -20 -54 33 64 125 -1 -8 -30 23
11086 23 -43 24 36 38 27 -3 -29 64 -61 -38 12 93 -85 -6 -71 -70 -91 23 -73 84 62 54 44 76 -20 114 75 59 79
11115 79 120 -43 110 -72 -4 61 -12 81 -45 -12 -54 -30 77 96 -10 24 77 23 -100 -44 -80 -41 70 -8 31 99
11141 99 7 -12 111 -118 -58 -32 26 -43 68 -24 -66 -22 63 80 -131 1 46 -59 109 -95 -4 15 20 236 -12
11166 -12 13 16 -9 16 71 -65 13 -14 -51 42 21 -55 -113 86 18 -65 -48 9 56 -8 -62 -145 37 -145 143 68 65 -35
11194 -35 -19 -78 53 41 -49 -23 7 -9 -5 136 -21 -83 42 10 -60 -36 63 51 3 109 -33 61 -104 30 103 -9
$$ [...]
16383c0
##END NTUPLES=NMR FID
##END=
