##TITLE=abcd
##JCAMPDX= 6.0         $$ Bruker NMR JCAMP-DX V2.0
##DATA TYPE= NMR SPECTRUM
##DATA CLASS= NTUPLES
##ORIGIN= UXNMR, Bruker Analytische Messtechnik GmbH
##OWNER= root
$$ XWIN-NMR		Version 3.5
$$ Tue Jul 22 17:17:59 2025 Russian Standard Time (UT+4h)  servis@DPX200
##.OBSERVE FREQUENCY= 200.131235884673
##.OBSERVE NUCLEUS= ^1H
##.ACQUISITION MODE= SIMULTANEOUS
##.ACQUISITION SCHEME= undefined
##.AVERAGES= 17
##.DIGITISER RES= 18
##SPECTROMETER/DATA SYSTEM= spect
##.PULSE SEQUENCE= zg
##.SOLVENT NAME= CDCl3
##.SHIFT REFERENCE= (INTERNAL, CDCl3, 0, 16.4885)
##AUDIT TRAIL= $$ (NUMBER, WHEN, WHO, WHERE, WHAT)
$$ ##TITLE= Audit trail, XWIN-NMR		Version 3.5
$$ ##JCAMPDX= 5.01
$$ ##ORIGIN= Bruker BioSpin GmbH
$$ ##OWNER= servis
$$ F:\spectra/data/av/nmr/H1/1/pdata/1/auditp.txt
$$ ##AUDIT TRAIL=  $$ (NUMBER, WHEN, WHO, WHERE, WHAT)
(   1,<2025-07-22 17:17:33.92 +0400>,<servis>,<DPX200>,
      <created by zg, POWCHK disabled, PULCHK disabled
       terminated by command 'halt'
       configuration hash MD5:
       00 E9 B6 7A A2 85 ED C7 34 08 36 98 17 FE 4E 26
       data hash MD5: 32K
       14 49 52 3E 5E D0 E7 4F 41 01 EE 1B 98 1B E8 D8>)
(   2,<2025-07-22 17:17:37.70 +0400>,<servis>,<DPX200>,
      <Start of raw data processing
       efp BC_mod = 2 LB = 0.05 FT_mod = 6 PKNL = 1 PHC0 = -275.1915 PHC1 = 4.101552 SI = 16K 
       data hash MD5: 16K
       BF D8 F4 D5 C3 DA B6 10 E2 12 30 7A 06 43 FD 66>)
$$ ##END=
$$ 
$$ hash MD5
$$ 2A BD 56 10 51 3B 50 3A 45 13 7C 3A 6B C0 1D 72
##$RELAX= 
##$RELAX= 
##$RELAX= 
##$RELAX= 
##$RELAX= 
##$RELAX= 
##$RELAX= 
##$RELAX= 
$$ Bruker specific parameters
$$ --------------------------
##$DU= <F:\spectra>
##$EXPNO= 1
##$NAME= <H1>
##$PROCNO= 1
##$TYPE= <nmr>
##$USER= <av>
##$AMP= (0..31)
100 100 100 100 100 100 100 100 100 100 100 100 100 100 100 100 100 100 
100 100 100 100 100 100 100 100 100 100 100 100 100 100 
##$AQSEQ= 0
##$AQ_mod= 1
##$AUNM= <au_zg>
##$AUTOPOS= <>
##$BF1= 200.13
##$BF2= 200.13
##$BF3= 200.13
##$BF4= 200.13
##$BF5= 500.13
##$BF6= 500.13
##$BF7= 500.13
##$BF8= 500.13
##$BYTORDA= 1
##$CFDGTYP= 0
##$CFRGTYP= 5
##$CHEMSTR= <none>
##$CNST= (0..31)
1 1 145 1 1 1 1 1 1 1 1 1 1 1 1 1 1 1 1 1 1 1 1 1 1 1 1 1 1 1 1 1 
##$CPDPRG= <>
##$CPDPRG1= <>
##$CPDPRG2= <>
##$CPDPRG3= <>
##$CPDPRG4= <mlev>
##$CPDPRG5= <mlev>
##$CPDPRG6= <mlev>
##$CPDPRG7= <mlev>
##$CPDPRG8= <mlev>
##$CPDPRGB= <>
##$CPDPRGT= <>
##$D= (0..31)
0 2 0 0 0 0 0 0 0 0.06 0 0 0 0 0 0 0.0002 0 0 0 0 0 0 0 0 0 0 0 0 0 0 
0 
##$DATE= 1753190253
##$DBL= (0..7)
120 120 120 120 120 120 120 120 
##$DBP= (0..7)
150 150 150 150 150 150 150 150 
##$DBP07= 0
##$DBPNAM0= <>
##$DBPNAM1= <>
##$DBPNAM2= <>
##$DBPNAM3= <>
##$DBPNAM4= <>
##$DBPNAM5= <>
##$DBPNAM6= <>
##$DBPNAM7= <>
##$DBPOAL= (0..7)
0.5 0.5 0.5 0.5 0.5 0.5 0.5 0.5 
##$DBPOFFS= (0..7)
0 0 0 0 0 0 0 0 
##$DE= 6
##$DECBNUC= <off>
##$DECIM= 32
##$DECNUC= <off>
##$DECSTAT= 4
##$DIGMOD= 1
##$DIGTYP= 9
##$DL= (0..7)
0 120 120 120 120 120 120 120 
##$DP= (0..7)
$$ [...]
##$SUBNAM4= <"">
##$SUBNAM5= <"">
##$SUBNAM6= <"">
##$SUBNAM7= <"">
##$SUBNAM8= <"">
##$SUBNAM9= <"">
##$SW= 20.6817932712277
##$SWIBOX= (0..15)
0 0 3 0 0 0 0 0 0 0 0 0 0 0 0 0 
##$SW_h= 4139.07284768212
##$TD= 32768
##$TD0= 1
##$TE= 0
##$TE2= 300
##$TE3= 300
##$TEG= 300
##$TL= (0..7)
0 120 120 120 120 120 120 120 
##$TP= (0..7)
150 150 150 150 150 150 150 150 
##$TP07= 0
##$TPNAME0= <>
##$TPNAME1= <>
##$TPNAME2= <>
##$TPNAME3= <>
##$TPNAME4= <>
##$TPNAME5= <>
##$TPNAME6= <>
##$TPNAME7= <>
##$TPOAL= (0..7)
0.5 0.5 0.5 0.5 0.5 0.5 0.5 0.5 
##$TPOFFS= (0..7)
0 0 0 0 0 0 0 0 
##$TUNHIN= 0
##$TUNHOUT= 0
##$TUNXOUT= 0
##$USERA1= <user>
##$USERA2= <user>
##$USERA3= <user>
##$USERA4= <user>
##$USERA5= <user>
##$V9= 5
##$VALIST= <valist>
##$VCLIST= <CCCCCCCCCCCCCCC>
##$VD= 0
##$VDLIST= <DDDDDDDDDDDDDDD>
##$VPLIST= <PPPPPPPPPPPPPPP>
##$VTLIST= <TTTTTTTTTTTTTTT>
##$WBST= 1024
##$WBSW= 30
##$XGAIN= (0..3)
0 0 0 0 
##$XL= 0
##$YL= 0
##$YMAX_a= 324318
##$YMIN_a= -444797
##$ZGOPTNS= <>
##$ZL1= 120
##$ZL2= 120
##$ZL3= 120
##$ZL4= 120
##$ABSF1= 0
##$ABSF2= 0
##$ABSG= 0
##$ABSL= 0
##$ALPHA= 0
##$AQORDER= 0
##$ASSFAC= 0
##$ASSFACI= 0
##$ASSFACX= 0
##$ASSWID= 0
##$AUNMP= <proc_1d>
##$AZFE= 0.1
##$AZFW= 0.1
##$BCFW= 0
##$BC_mod= 2
##$BYTORDP= 0
##$COROFFS= 0
##$CY= 18.4799938201904
##$DATMOD= 1
##$DC= 0
##$DFILT= <>
##$DTYPP= 0
##$F1P= 9.9274215381318
##$F2P= -0.165520771350173
##$FCOR= 1
##$FTSIZE= 16384
##$FT_mod= 6
##$GAMMA= 0
##$GB= 0
##$INTBC= 1
##$INTSCL= 4.127829e-11
##$ISEN= 128
##$LB= 0.05
##$LEV0= 0
##$LPBIN= 0
##$MAXI= 10000
##$MC2= 0
##$MEAN= 0
##$ME_mod= 0
##$MI= 50
##$NCOEF= 0
##$NC_proc= -6
##$NLEV= 6
##$NOISF1= 3.799351
##$NOISF2= 2.8
##$NSP= 0
##$NTH_PI= 0
##$NZP= 0
##$OFFSET= 16.48848
##$PC= 4
##$PHC0= -275.1915
##$PHC1= 4.101552
##$PH_mod= 1
##$PKNL= yes
##$PPARMOD= 0
##$PSCAL= 4
##$PSIGN= 0
##$REVERSE= no
##$SF= 200.130005582386
##$SI= 16384
##$SIGF1= 3
##$SIGF2= 2
##$SINO= 400
##$SIOLD= 16384
##$SREGLST= <1H.CDCl3>
##$SSB= 0
##$STSI= 16384
##$STSR= 0
##$SW_p= 4139.07284768211
##$SYMM= 0
##$S_DEV= 0
##$TDeff= 32768
##$TDoff= 0
##$TI= <>
##$TILT= no
##$TM1= 0
##$TM2= 0
##$TOPLEV= 0
##$USERP1= <user>
##$USERP2= <user>
##$USERP3= <user>
##$USERP4= <user>
##$USERP5= <user>
##$WDW= 1
##$XDIM= 16384
##$YMAX_p= 346142895
##$YMIN_p= -1840626
$$ End of Bruker specific parameters
$$ ---------------------------------
##NTUPLES= NMR SPECTRUM
##VAR_NAME=  FREQUENCY,     SPECTRUM/REAL,   SPECTRUM/IMAG
##SYMBOL=    X,             R,               I
##VAR_TYPE=  INDEPENDENT,   DEPENDENT,       DEPENDENT
##VAR_FORM=  AFFN,          ASDF,            ASDF
##VAR_DIM=   16384,         16384,           16384
##UNITS=     HZ,            ARBITRARY UNITS, ARBITRARY UNITS
##FACTOR=    0.252644378177508, 1,           1
##FIRST=     3299.83951724647, 0,            0
##LAST=      -839.233330435636, 0,           0
##MIN=       -839.233330435636, -1840626,    0
##MAX=       3299.83951724647, 346142895,    0
$$ Real data points
##PAGE= N=1
##DATA TABLE= (X++(R..R)), XYDATA
$$ [...]
14344D60179J53038k0264k5215j81500J49175O019K24021l88845L10921n6029
$$ 460179 613217 592953 567738 386238 535413 541432 765453 376608 687529 631500
14334F31500J30358l6310L3964j12962R1480m8120J9684R4748p3260j53517M54417
$$ 631500 761858 725548 759512 646550 738030 689910 709594 804342 731082 577565 1031982
14323A031982l80301M6261K1709J78127o7081K7403J10712l52239M35055j12591
$$ 1031982 651681 697942 719651 897778 830697 858100 968812 616573 1051628 939037
14313I39037l0386m5611J73674k24460K57204j26199K4670j01670K04338J27334
$$ 939037 908651 863040 1036714 812254 1069458 943259 967929 866259 1070597 1197931
14303A197931k21618K43125J01520J92201j43095K12485j49185J36500J03852
$$ 1197931 976313 1219438 1320958 1513159 1370064 1582549 1433364 1569864 1673716
14294A673716J39551L1907J16529K16369p2862N01309O481K7942K26915K30149
$$ 1673716 1813267 1845174 1961703 2178072 2105210 2606519 2613000 2640942 2867857 3098006
14284C098006J62469O33131r712L37190Q31228n0997P27007J167551O59954Q64149
$$ 3098006 3260475 3893606 3883894 4221084 5052312 5001315 5728322 6895873 7555827 8419976
14274H419976K128944J594772K586674L733483M613420O676203M376415l896059
$$ 8419976 10548920 12143692 14730366 18463849 23077269 29753472 34129887 30233828
14266C0233828p971238n531205k897604k073273j671566j318004p69988n74531
$$ 30233828 22262590 16731385 13833781 11760508 10088942 8770938 8000950 7426419
14258G426419o89332l54369m26930m69479j33284l57030m41727j98621k09943
$$ 7426419 6737087 6382718 5955788 5486309 5353025 4995995 4554268 4355647 4145704
14249D145704j55186l39271O8459m87509k81486o3031L7521J12147m87649L78849
$$ 4145704 3990518 3651247 3719706 3232197 2950711 2887680 2925201 3037348 2549699 2928548
14239B928548m89044J87481j6843j25515l32487L08115q4359Q4177K3469j20398
$$ 2928548 2439504 2626985 2610142 2484627 2152140 2460255 2375896 2460073 2483542 2363144
14229B363144N714k16336l96094L9154K88173o7591N6882m28914K42157N402j69208
$$ 2363144 2368858 2152522 1756428 1795582 2083755 2016164 2073046 1644132 1886289 1891691 1722483
14218A722483J62245n4150Q522K72128l90632k1043K33088j5231j43894M6658
$$ 1722483 1884728 1830578 1839100 2111228 1720596 1699553 1932641 1917410 1773516 1820174
14208A820174O7055p7205J79848k7918o6153l0956J0349r1745K22153Q0011j89217
$$ 1820174 1887229 1810024 1989872 1961954 1895801 1864845 1875194 1783449 2005602 2085613 1896396
14197A896396J63232k07667N7740K92958n37276N09310j97615K9249j36027J13982
$$ 1896396 2059628 1851961 1909701 2202659 1665383 2174693 1977078 2006327 1870300 1984282
14187A984282J65446n1369l52855L49925Q068k1812k03385K41659q337J24669
$$ 1984282 2149728 2098359 1745504 2095429 2103497 2081685 1878300 2119959 2111622 2236291
14177B236291J75902k76287P2550M4476j31035J91531k34880L7634L43087j16627
$$ 2236291 2412193 2135906 2208456 2252932 2121897 2313428 2078548 2116182 2459269 2342642
14167B342642J14568q9406J31540j39221K68354k46703k6938m4146K73827k36582
$$ 2342642 2457210 2367804 2499344 2360123 2628477 2381774 2354836 2310690 2584517 2347935
14157B347935Q3693K8846M5349J26806p3038Q9400n2745J66097l06566K31919
$$ 2347935 2431628 2460474 2505823 2632629 2559591 2648991 2596246 2762343 2455777 2687696
14147B687696K8631J59784j5111K9142J04286p9551J907J01347k2293j46737J83044
$$ 2687696 2716327 2876111 2861000 2890142 2994428 2914877 2916784 3018131 2995838 2849101 3032145
14136C032145m192o5826K55016Q7138k02990J00394K71396l28144J30243Q9917
$$ 3032145 3027953 2962127 3217143 3304281 3101291 3201685 3473081 3144937 3275180 3365097
14126C365097K73650m63881K87928R7284n4509J8898J03274k3110O9167R4241
$$ 3365097 3638747 3174866 3462794 3560078 3505569 3524467 3627741 3604631 3673798 3768039
14116C768039m6215Q2256K00390J41073l35581J38908J11170j92002J80034J12346
$$ 3768039 3721824 3804080 4004470 4145543 3809962 3948870 4060040 3868038 4048072 4160418
14106D160418K32878p1261J78088l11054J04801J95799O7524n643J75519J55165
$$ 4160418 4393296 4322035 4500123 4189069 4293870 4489669 4557193 4551550 4727069 4882234
14096D882234J10392j42492L16111l64433L39661K4939J89327k63635J00856J72867
$$ 4882234 4992626 4850134 5166245 4801812 5141473 5166412 5355739 5092104 5192960 5365827
14086E365827J65913K01305k946j78019K67752k1607K77151L70956j39053j30478
$$ 5365827 5531740 5733045 5730099 5552080 5819832 5798225 6075376 6446332 6307279 6176801
14076F176801M73832k62971K55968J32859R2352n8996L93049j68361l8107K96924
$$ 6176801 6650633 6387662 6643630 6776489 6868841 6809845 7202894 7034533 6996426 7293350
14066G293350K30914j21223M60175j59391K76146R7889j4181O29970j57790N07964
$$ 7293350 7524264 7403041 7863216 7703825 7979971 8077860 8063679 8693649 8535859 9043823
14056I043823j79691r4277N7314M24524M0517R0853L42979P5616J01944K26139
$$ 9043823 8864132 8769855 8827169 9251693 9292210 9383063 9726042 9801658 9903602 10129741
14046A0129741R3236n1783L58226Q6704P0330L11090L9162M26585l1979N03677
$$ 10129741 10222977 10171194 10529420 10616124 10686454 10997544 11036706 11463291 11431312 11934989
14036A1934989N3298J41115L70422j85627K86830K304M28893m2999M72190M56226
$$ 11934989 11988287 12129402 12499824 12314197 12601027 12603331 13032224 12989225 13461415 13917641
14026A3917641j77530j3827O03650L03529p5205L83349j20960O27130j24052K12348
$$ 13917641 13740111 13726284 14329934 14633463 14558258 14941607 14820647 15447777 15323725 15536073
14016A5536073J92199K65294K80130O3646J06178K18183J35014R5946K91382k6780
$$ 15536073 15728272 15993566 16273696 16337342 16443520 16661703 16796717 16892663 17184045 17157265
14006A7157265K07465M51627k45985N10475p5943j6003j27245O93182k49518M36117
$$ 17157265 17364730 17816357 17570372 18080847 18004904 17988901 17861656 18554838 18305320 18741437
13996A8741437O3685l4990L29724M4700r9284K96648J65814k38441r0416J51590
$$ 18741437 18805122 18770132 19099856 19144556 19045272 19341920 19507734 19269293 19178877 19330467
13986A9330467L59390j07549k33209n2320P5561j60920J07677k37257L07464m70279
$$ 19330467 19689857 19582308 19349099 19296779 19372340 19211420 19319097 19081840 19389304 18919025
13976A8919025O854K86352n85741K45747j20576j67222M9447j04719j84747k47183
$$ 18919025 18925879 19212231 18626490 18872237 18751661 18584439 18633886 18529167 18344420 18097237
13966A8097237j01928l40089J13546j84046M6194j67018m89135J36770j10431
$$ 18097237 17995309 17655220 17768766 17584720 17630914 17463896 16974761 17111531 17001100
13957A7001100m15068j27222j44701k09925J36999n03758m5421R90r0917m42022
$$ 17001100 16586032 16458810 16314109 16104184 16241183 15737425 15692004 15692994 15602077 15160055
13947A5160055R9489k30087m32202j68868J07677j72169o51063J49424r5484j43226
$$ 15160055 15259544 15029457 14597255 14428387 14536064 14363895 13712832 13862256 13766772 13623546
13937A3623546k47105l89613k69258n3928J08205q5976r9017l29097l81003l42887
$$ 13623546 13376441 12986828 12717570 12663642 12771847 12685871 12586854 12257757 11876754 11533867
13927A1533867q3939j82484M3833k93241K8451J24661p05328j57153o4515N3092
$$ 11533867 11449928 11267444 11311277 11018036 11046487 11171148 10465820 10308667 10244152 10297244
13917A0297244L5437J4253m11870l16329j03752k04081j98369P0304q3666j1168
$$ 10297244 10332681 10346934 9935064 9618735 9514983 9310902 9112533 9182837 9099171 9088003
13907I088003k57274p2431j69419j73186r4495J15714l32872L8552j96247k9333
$$ 9088003 8830729 8758298 8588879 8415693 8321198 8436912 8104040 8142592 7946345 7917012
13897G917012j3725k58561j1644j54778j09140k15478J44042j37694l59456j07678
$$ 7917012 7903287 7644726 7633082 7478304 7369164 7153686 7297728 7160034 6800578 6692900
13887F692900K2436k876j12967q9407J2705J17561j90716k41151l32635K01061
$$ 6692900 6715336 6712460 6599493 6510086 6522791 6640352 6449636 6208485 5875850 6076911
13877F076911r9130Q558l92709J0291q3017J16415M5928j16851k66988L53896
$$ 6076911 5977781 5986339 5593630 5603921 5520904 5637319 5683247 5566396 5299408 5653304
13867E653304l85464o0926j03999q0658L8015r2039l95908L30601k9535M9230
$$ 5653304 5267840 5206914 5102915 5022257 5060272 4968233 4572325 4902926 4873391 4922621
13857D922621k52436l0843m2126j74343M05484k63091j58253k9298P5495J5328
$$ 4922621 4670185 4639342 4597216 4422873 4828357 4565266 4407013 4377715 4453210 4468538
13847D468538k77447r7051J0560j71241N4989k03921M48127n63733j66859L40664
$$ 4468538 4191091 4094040 4104600 3933359 3988348 3784427 4232554 3668821 3501962 3842626
13837C842626j98141l21153m56K47965j18495j45748J12789R7944j16714k28562
$$ 3842626 3644485 3323332 3322876 3570841 3452346 3306598 3419387 3517331 3400617 3172055
13827C172055K33368j35772j28748q436J40634l4945J28727j53961J13088j22472
$$ 3172055 3405423 3269651 3140903 3132467 3273101 3238156 3366883 3212922 3326010 3203538
13817C203538j07829l2375k88083L09550m5579l4967j99133J02123M1891j79189
$$ 3203538 3095709 3063334 2775251 3084801 3039222 3004255 2805122 2907245 2949136 2769947
13807B769947j51401R7614M79965r17273J83022J83250j35240m9160j66957O67341
$$ 2769947 2618546 2716160 3196125 2278852 2461874 2645124 2509884 2460724 2293767 2961108
13797B961108p00445J08368K04347j70453R4617m5140Q085j93564J54021k33571
$$ 2961108 2260663 2369031 2573378 2402925 2497542 2452402 2460487 2266923 2420944 2187373
13787B187373j73388N16134k92763R0642l07420L0205L0555j57258J31785J78871
$$ 2187373 2013985 2530119 2237356 2327998 2020578 2050783 2081338 1924080 2055865 2234736
13777B234736j70716J60756j81087j55757K78940k72930J73026k59307K37571
$$ 2234736 2064020 2224776 2043689 1887932 2166872 1893942 2066968 1807661 2045232
13768B045232r0092J9875j52452J04147k20147K53006j00475m2674j98806M6302
$$ 2045232 1955140 1975015 1822563 1926710 1706563 1959569 1859094 1816420 1617614 1663916
13758A663916J00573j51114L7799J43021j64131k0992L3780j06695Q8339j15809
$$ 1663916 1764489 1613375 1651174 1794195 1630064 1609072 1642852 1536157 1624496 1508687
13748A508687J65653j86062p2072P216j97940J78121K24649j46557P7026k19683
$$ 1508687 1674340 1488278 1416206 1423422 1225482 1403603 1628252 1481695 1558721 1339038
13738A339038l9324K68623m12095L54620R5499k72506P2240p6817l7519J34478
$$ 1339038 1299714 1568337 1156242 1510862 1606361 1333855 1406095 1329278 1291759 1426237
13728A426237k1254k58197L52650m37398K80531K90897l27235j85917l1704L8839
$$ 1426237 1404983 1146786 1499436 1062038 1342569 1633466 1306231 1120314 1088610 1127449
13718A127449j18628M68753m67659O1986J45962m2576J04056j75630J30302r5338
$$ 1127449 1008821 1477574 1009915 1071901 1217863 1175287 1279343 1103713 1234015 1138677
13708A138677j05131J44134R6972o5758k04643J85232k20969L8914J05197J96357
$$ 1138677 1033546 1177680 1274652 1208894 1004251 1189483 968514 1007428 1112625 1308982
13698A308982j68655j8245r7996N0429r9006n6058L12312k26193J32613m86136
$$ 1308982 1140327 1122082 1024086 1074515 975509 919451 1231763 1005570 1138183 652047
13688F52047J99607J07639J23289j08514k0222J65209j71382j41039J03155q1188
$$ 652047 851654 959293 1082582 974068 953846 1119055 947673 806634 909789 828601
13678H28601J3778k9573K00332j85386k1407q6664K32008L08393k71295P8474
$$ 828601 842379 812806 1013138 827752 806345 719681 951689 1260082 988787 1067261
13668A067261n6034k20750j03478j0786J02012j02098l0782j11574N7308Q4345
$$ 1067261 1011227 790477 686999 676213 778225 676127 645345 533771 591079 675424
13658F75424l3950j59311L02830j11910J64553j46994j22685J44482K2927l1596
$$ 675424 641474 482163 784993 673083 837636 690642 567957 712439 735366 703770
13648G03770R6404j12449K21519l47441J53661k33380L71900j74319k65826L4516
$$ 703770 800174 687725 909244 561803 715464 482084 853984 679665 413839 448355
13638D48355N12125m21474l15688L68549J0081J25010k92436J31408K36419k66414
$$ 448355 960480 539006 223318 591867 601948 726958 434522 565930 802349 535935
13628E35935j52625K80233q1855K2578K5999O601k6119l062R347k1555k13988
$$ 535935 383310 663543 581688 604266 630265 636866 610747 607685 617032 595477 381489
13617C81489J78512P6461k8324j10043O6897j13197J96056l1507j38059K66141
$$ 381489 560001 636462 608138 498095 564992 451795 647851 616344 478285 744426
13607G44426n5597j76316k13084K43739L2294j52354K56711k92149j89053L65152
$$ 744426 688829 512513 299429 543168 575462 423108 679819 387670 198617 563769
13597E63769J57516k77902J58800R3317j61408L24771k43938j41412o8122j69967
$$ 563769 721285 443383 602183 695500 534092 858863 614925 473513 405391 235424
13587B35424K08799K99150m29449j31783N00535m08376L12272j38734k288j54964
$$ 235424 444223 743373 313924 182141 682676 274300 586572 447838 445550 290586
13577B90586K50790j0083k24844j13579K64234k08057P392j56691J02669K0748
$$ 290586 541376 531293 306449 192870 457104 249047 256439 99748 202417 223165
13567B23165K67008K8742J47310m55220N70838k93777j51938K37667k90731K08454
$$ 223165 490173 518915 666225 211005 781843 488066 336128 573795 283064 491518
13557D91518n4848j31026r2842K57032J1342l05947L27730m5089k17813M8199
$$ 491518 436670 305644 212802 469834 481176 175229 502959 457870 240057 288256
13547B88256j64528K48456K00770n2059k01532k10267J2880L38474O2338L7447
$$ 288256 123728 372184 572954 520895 319363 109096 121976 460450 522788 560235
13537E60235L9941n01459K81470j47760j52688l8562R9390J50728N2107J42k48237
$$ 560235 600176 98717 380187 232427 79739 41177 140567 291295 343402 343544 95307
13526I5307J33412L36549l32011J90077l38226J63786L8174l25687J58957J54344
$$ 95307 228719 565268 233257 423334 85108 248894 287068 -38619 120338 274682
13516B74682P8593j79089J96476o3701k6362l33768L23533k53468M1870R9025
$$ 274682 353275 174186 370662 306961 280599 -53169 270364 16896 58766 157791
13506A57791J87968J0047o1748L3466j80800p5575K9686q63j44016M46970o6426
$$ 157791 345759 355806 294058 327524 146724 71149 100835 99972 -44044 402926 336500
13495C36500k98547K66707p2574P4432j13643K60632o7455j47515l21579K51321
$$ 336500 37953 304660 232086 306518 192875 453507 386052 238537 -83042 168279
13485A68279j16477N4016P7892q5966O0560J16036j04948j1561R2936L825n2091
$$ 168279 51802 105818 183710 97744 158304 274340 169392 157831 250767 254592 202501
13474B02501k52923Q5671R6997M14584j81154l044j46142p7450o6087K46738l41017
$$ 202501 -50422 35249 132246 546830 365676 362632 216490 139040 72953 319691 -21326
13463b1326J13074J87396Q6881n6807j74827L0478J21913j91182l26346N30054
$$ -21326 91748 279144 366025 309218 134391 164869 286782 95600 -230746 299308
13453B99308p751q4405j35901J1333L9072K26901l70037J92868q9303p4731j46338
$$ 299308 291557 207152 71251 82584 121656 348557 -21480 171388 82085 7354 -138984
13442a38984L17355n5968N8167j00659k40648K27869M3430K04565K6658o70996
$$ -138984 178371 122403 180570 79911 -160737 67132 110562 315127 341785 -329211
13432c29211K08297K98482j41799R095L2961j96411J26819N3331L789K34891k79084
$$ -329211 -120914 177568 35769 44864 77825 -118586 8233 61564 65353 300244 21160
13421B1160J94088o1629K75540k4549k24297J78978j64758q8729N7571o7735J67859
$$ 21160 215248 153619 429159 404610 180313 359291 194533 105804 163375 95640 263499
13410B63499j50202j71811K06499M5532j6988j17793J56654K8309j03958j59976
$$ 263499 113297 -58514 147985 193517 176529 58736 215390 243699 139741 -20235
13400b0235K23247m48234K19556p9427J65372N2127j22011J9016P021R9686K75175
$$ -20235 203012 -245222 -25666 -105093 60279 112406 -9605 9411 16432 116118 391293
13389C91293m85437O6198Q0207L62683k83061K28714m65159L33428k15287K55297
$$ 391293 -94144 -27946 52261 414944 131883 360597 -104562 228866 13579 268876
13379B68876J5120m62147K02581K53950l01849J76244J20888n8111M0847j00868
$$ 268876 283996 -178151 24430 278380 -23469 152775 273663 215552 256399 155531
13369A55531o0728q3210k1346j35175M40393k13748K68799m20609M3238J3862
$$ 155531 94803 11593 -9753 -144928 295465 81717 350516 -70093 -26855 -12993
13359a2993K3590r8211L16059k76636K11470R8906k48831p0959J36541K22020
$$ -12993 10597 -87614 228445 -48191 163279 262185 13354 -57605 78936 300956
13349C00956r8875k07272Q9396K5291r6134J38228j14488K67364m81247J99602
$$ 300956 202081 -5191 84205 109496 13362 151590 37102 304466 -176781 22821
13339B2821J5568j689K87916n20763L49507j63657L56826l91232K21205m00595
$$ 22821 38389 36700 324616 -196147 153360 -10297 346529 -44703 176502 -224093
13329b24093M72296k45305l36806M84557j41416l7435l8760K18633k19935K49479
$$ -224093 248203 2898 -333908 150649 9233 -28202 -66962 151671 -68264 181215
13319A81215J09920l75826K493J74624J89882m74090K1345N06819l81299Q7653
$$ 181215 291135 -84691 -82198 92426 282308 -191782 -170437 336382 -44917 42736
13309D2736P7237j34023K69930k20683N6558j34864j32050J90952M2059j23153
$$ 42736 119973 -14050 255880 35197 91755 -43109 -175159 15793 57852 -65301
13299f5301m9653J37688r4372R9363Q8675q8738j46577K25279n1290K4730j439
$$ -65301 -114954 22734 -71638 27725 116400 27662 -118915 106364 55074 79804 78365
13288G8365j3012P2371k31956K2303J06371J61761k9426j4035l53637N0401K72412
$$ 78365 65353 137724 -94232 -71929 34442 196203 166777 152742 -200895 -150494 121918
13277A21918P3227l35697O9822J48831k16022J36779J61930j06682J3584K39902
$$ 121918 195145 -140552 -70730 78101 -137921 -1142 160788 54106 67690 307592
13267C07592l28730K66416k05766j06789M2438J08726J45793r7463Q9965l65033
$$ 307592 -21138 245278 39512 -67277 -24839 83887 229680 132217 222182 -142851
13257a42851M63204l31336L00333j88811l98775M56888j31288J06496k74370P4506
$$ -142851 320353 -10983 289350 100539 -298236 158652 27364 133860 -140510 -66004
13247f6004J08540o9590k33837K26170J66217j82840j5972j88940K15281K8708
$$ -66004 42536 -27054 -260891 -34721 131496 -51344 -67316 -256256 -40975 -12267
13237a2267l10574L18207J10094j48863J16372j78528K2103K33360K8192m8715
$$ -12267 -322841 -4634 105460 -43403 72969 -105559 -83456 149904 178096 129381
13227A29381P084o2153j32555J47415J02185m9012o5820l19248K40358k06743
$$ 129381 136465 74312 -58243 89172 191357 142345 76525 -242723 -2365 -209108
13217b09108L62995N19q7415n7402J7658o8597L62157j95703K19237l30418J55017
$$ -209108 153887 154406 66991 9589 27247 -41350 320807 125104 344341 13923 168940
13206A68940j55886k94893K19734K30044r1347j33424p7880Q0889p4277K90503
$$ 168940 13054 -281839 -62105 167939 76592 -56832 -134712 -53823 -128100 162403
13196A62403k94992K23941K6698O7414l86216J93149j71703K64253k04114k00799
$$ 162403 -132589 91352 118050 185464 -200752 -7603 -179306 84947 -119167 -319966
13186c19966L99201l94600O9766K10308J02026j72583K78350k39426J9912P7683
$$ -319966 79235 -315365 -245599 -35291 66735 -105848 172502 -66924 -47012 30671
13176C0671m2694q0888J52522J40834j90035o8199J64518K07641l51901k36305
$$ 30671 -12023 -92911 59611 200445 10410 -57789 106729 314370 -37531 -273836
13166b73836K18126J98020q7909k5835j63158J06219K51950k41600J36740N9097
$$ -273836 -55710 142310 54401 28566 -134592 -28373 223577 -18023 118717 177814
13156A77814k63754J5276K54413j69849L10911m99682q3440J92915K84924r180
$$ 177814 -85940 -70664 183749 13900 324811 -174871 -258311 -65396 219528 210348
13146B10348j93323J42079m04424K20580J63669j86276J70441k93320m1311J9506
$$ 210348 17025 159104 -245320 -24740 138929 -47347 123094 -170226 -211537 -192031
13136a92031L26094j87424J7680J12434k12809o9016L94300L2391j48178o2116
$$ -192031 134063 -53361 -35681 76753 -136056 -205072 189228 221619 73441 11325
13126A1325j32796K71790j55874p1038k28339L65025j63002m2959K81629r63j15527
$$ 11325 -121471 150319 -5555 -76593 -304932 60093 -102909 -145868 135761 134798 19271
13115A9271L5627N3567j59728J1822J27197J7984p8070J05623q2840l63463M55889
$$ 19271 54898 108465 -51263 -39441 87756 105740 27670 133293 50453 -313010 142879
13104A42879l63626L42737j53945R4826K0446q9718k12322J26362O1944k5846
$$ 142879 -220747 121990 -31955 62871 83317 -6401 -218723 -92361 -30417 -56263
13094e6263Q879k00935K22185j56093K71393j18836J4580k0054n0971O4678K16234
$$ -56263 -47384 -248319 -26134 -182227 89166 -29670 -15090 -35144 -86115 -21437 194797
13083A94797j34123j41238j42937J46970o5941O9052J83380j60743K45651j45295
$$ 194797 60674 -80564 -223501 -76531 -142472 -73420 109960 -50783 194868 49573
13073D9573j4612j31770K52k9680L43694J11275m89221Q2548J31345q2760j95400
$$ 49573 34961 -96809 -96557 -126237 217457 328732 -160489 -77941 53404 -29356 -224756
13062b24756K2983L33681J8859k19505j2470k207J31666o5126k32849J40727K64425
$$ -224756 -201773 131908 150767 -68738 -81208 -83415 48251 -16875 -249724 -108997 155428
13051A55428l37982K95263r6538j56624J24977l02965M28736j73032J73205k04123
$$ 155428 -182554 112709 16171 -140453 -15476 -318441 110295 -62737 110468 -93655
13041i3655L8988l3044j22685N9890K78678j48179j5563j08884N7459N0502j87038
$$ -93655 -54667 -87711 -210396 -150506 128172 -20007 -35570 -144454 -86995 -36493 -223531
13030b23531J52170l8709N4996k55373K25384J47152k82571N5195J96120k29078
$$ -223531 -71361 -110070 -55074 -310447 -85063 62089 -220482 -165287 30833 -198245
13020a98245M504K99651j07006k97965M89825l62274N2668K86510o6862j29310
$$ -198245 -193741 105910 -1096 -299061 190764 -171510 -118842 167668 100806 -28504
13010b8504j22063J1043k95629O60355m47300J45755J31354k46272O7257j13631
$$ -28504 -150567 -139524 -435153 225202 -222098 -76343 55011 -191261 -124004 -237635
13000b37635m73521K458144j129503k45655l5390k04539j56132M8497j74203J45547
$$ -237635 -711156 1746988 617485 371830 336440 131901 -24231 24266 -149937 -4390
12990d390l6670L93392n5107l83525O1755J25280j2353J28896k45238J43181j79238
$$ -4390 -41060 352332 297225 -86300 -24545 100735 88382 217278 -27960 115221 -64017
12979f4017r0246J02842l7872P1658j78426N20257l29238Q926K09451l37881K1309
$$ -64017 -154263 -51421 -89293 -17635 -196061 324196 -5042 3884 213335 -124546 -103237
12968a03237J87881n1966J750j37374J97984j9370J87580o8107k26121m0677J80597
$$ -103237 84644 32678 34428 -102946 95038 75668 263248 195141 -30980 -71657 108940
12957A08940m8536K15431j05633l14829m2034L09178L2959k13795K31357K7579
$$ 108940 60404 275835 170202 -144627 -186661 122517 155476 -58319 173038 200617
12947B00617q721j67769r6663J30459j25842J12126j6526o2977p1910K67002m00010
$$ 200617 191896 24127 -72536 57923 -67919 44207 27681 -35296 -107206 159796 -240214
12936b40214J91883K30104m26253J07983J17962K37903k02610K3851j53143J56780
$$ -240214 -48331 181773 -244480 -136497 -18535 219368 16758 40609 -112534 44246
12926D4246m5745j10562m9165L12749K6933k46546J07419O7505K00661j42375
$$ 44246 -1499 -112061 -161226 151523 178456 -68090 39329 106834 307495 165120
12916A65120l55799M52775l66042K93333k22309O3657L46834m69766L3310K89919
$$ 165120 -190679 262096 -103946 189387 -32922 30735 377569 -92197 -58887 231032
12906B31032j37169p698P0813j23158K11227m05130K32546j15794p100k2945L23295
$$ 231032 93863 86165 156978 33820 245047 -160083 72463 -43331 -50431 -73376 249919
12895B49919j27593l1858r8863n1949m701L23796l21295j14851J07996q7868J11342
$$ 249919 122326 90468 -8395 -60344 -65045 258751 -62544 -177395 -69399 -157267 -45925
12884d5925L1325J13508j24378J47565k16048K11452j14365j73141P9852J7206
$$ -45925 -14600 98908 -25470 122095 -93953 117499 3134 -170007 -90155 -72949
12874g2949J42316R6313k14841K15340J2281l27448Q3589k16063M39447j72279
$$ -72949 69367 165680 -49161 166179 178460 -148988 -65399 -281462 157985 -14294
12864a4294k03707L26671k43916J96186Q819L9559j26689J52948k44850J2326
$$ -14294 -218001 108670 -135246 60940 69759 109318 -17371 135577 -109273 -96947
12854i6947Q5985j82900L84683l47273L68221o9946j36624J30205N8159k01899
$$ -96947 -10962 -193862 190821 -156452 211769 141823 5199 135404 193563 -8336
12844h336J05169k3360j71886L17785q3297O369p2703p0254j11051J15041K14030
$$ -8336 96833 73473 -98413 219372 136075 142444 69741 -513 -111564 3477 217507
12833B17507k37551J89005p1834K24739l55481J07413O7341l00258M58904j04838
$$ 217507 -20044 168961 97127 321866 -33615 73798 141139 -159119 299785 194947
12823A94947L2125J09642l82514j18529K47860K8774j85534L12521j33102k54233
$$ 194947 227072 336714 -45800 -164329 83531 112305 -73229 239292 106190 -148043
12813a48043L4807n9594K00384j16103O8604J0317j89589l488L33308l60128K18377
$$ -148043 -113236 -172830 27554 -88549 -19945 -9628 -199217 -202705 130603 -229525 -11148
12802a1148M2427k4207l07130M0361L51569r515k59538K01726J41286k05828p0938
$$ -11148 31279 7072 -300058 -259697 91872 82357 -177181 24545 165831 -39997 -110935
12791a10935K91692j22226j07405K9220J92860j80176J20419k01262k2480J68662
$$ -110935 180757 58531 -48874 -19654 173206 -6970 113449 -87813 -110293 58369
12781E8369K51202l74122Q9545J08852l22317J12433j38052K36250L1957R2478
$$ 58369 309571 -64551 24994 133846 -188471 -76038 -214090 22160 54117 146595
12771A46595l1328J63266l41344J68112J62575k58681J55152j48559j02866K36819
$$ 146595 115267 278533 -62811 105301 267876 9195 164347 15788 -87078 149741
12761A49741m1459n3911L9498j03555Q2577N4958k47723L69002k5176k42627R9680
$$ 149741 108282 54371 93869 -9686 72891 127849 -119874 249128 223952 -18675 81005
12750H1005j27766N8026j3097q620J2781K84671M3117k26361j44530n1817K63205
$$ 81005 -46761 11265 -1832 -10452 2329 287000 330117 103756 -40774 -92591 170614
12739A70614j17071K74665k59888j22225J8774M0191j40549L17197J58706l35456
$$ 170614 53543 328208 68320 -53905 -35131 5060 -135489 181708 340414 4958
12729D958K48116r8181P3154l9498k74496R1390J44450P6860k33335J86007j47433
$$ 4958 253074 154893 228047 188549 -85947 5443 149893 226753 -6582 179425 31992
12718C1992M2459j90506M33658k46857J60156l48884K11864L1598l872k27509
$$ 31992 74451 -116055 317603 70746 230902 -117982 93882 125480 121608 -105901
12708a05901j0011K24275N5799j97225K05874j81257j31596L07746r8371k18361
$$ -105901 -115912 108363 164162 -33063 172811 -8446 -140042 167704 69333 -149028
12698a49028J74451R7147j93531K09504l01275K09124j13734o8854J06205J59381
$$ -149028 25423 122570 -70961 138543 -162732 46392 -67342 -136196 -29991 129390
12688A29390j92787L9784J4182J63360k23985L9998k3370J36305j32227K74682
$$ 129390 -63397 -23613 -9431 153929 -70056 -30058 -53428 82877 -49350 225332
12678B25332j38355p4872Q6491q992K2393p3995k04465P5594k539p2777R3157
$$ 225332 86977 12105 98596 89604 111997 38002 -166463 -90869 -93408 -166185 -73028
12667g3028k626l1071L91745m43003p809K68909Q5796j94040o7988n2594L52622
$$ -73028 -75654 -106725 285020 -157983 -165792 103117 188913 -5127 -73115 -125709 226913
12656B26913j82678k17537J31829k537L3130J23763j28523o0376J96884J1783
$$ 226913 44235 -173302 -41473 -44010 -10880 112883 -15640 -76016 120868 132651
12646A32651m36963L13797N7565m7651J8025O6857J0182k77788N62832n14916
$$ 132651 -304312 9485 67050 19399 37424 104281 114463 -163325 399507 -115409
12636a15409J39534q7455r7538J77177j02107J29106k6382n5997j37766J30933
$$ -115409 24125 -63330 -160868 16309 -85798 43308 16926 -39071 -176837 -45904
12626d5904J92013P9169k85475J28890n9381j30995L27825l75494P79M48777j63785
$$ -45904 146109 225278 -60197 68693 9312 -121683 206142 -169352 -168573 280204 116419
12615A16419O7939q0473p4930k43644J96037L25960j16115j42166j5682K12523
$$ 116419 184358 103885 28955 -214689 -18652 307308 191193 49027 33345 245868
12605B45868k14782j85268o7805L84638p104j44037J85658k05813j55549m9976
$$ 245868 31086 -154182 -221987 162651 155547 11510 197168 -8645 -164194 -214170
12595b14170L30631j66925J50936j1550k66575J31068J75616J03626m2948K9844
$$ -214170 116461 -50464 100472 88922 -177653 -46585 129031 232657 189709 219553
12585B19553k54627J81800j58757J62030O2748m9600M6082j3038j73267K32190
$$ 219553 -35074 146726 -12031 149999 212747 163147 209229 196191 22924 255114
12575B55114j95991R4369L9777Q2811l17600K46217k40969J73827k6128j0731
$$ 255114 59123 153492 193269 276080 -41520 204697 -36272 137555 111427 100696
12565A00696n3078q0189N5441j27279K05530j39605P5101j50240K51557k41690
$$ 100696 47618 -32571 22870 -104409 101121 -38484 36617 -113623 137934 -103756
12555a03756R9750J56129j97610K85853p9548k9268q3487j64940K32404j82082
$$ -103756 -4006 152123 -45487 240366 160818 131550 48063 -116877 115527 -66555
12545f6555K26173q690n796j19884L5629J38940j79344K84932k6374k18945O4194
$$ -66555 159618 150928 145132 25248 60877 199817 20473 305405 279031 60086 124280
12534A24280r4531J20696j6088j72228J33000M7118j41822Q8771K9112j46273
$$ 124280 29749 150445 134357 -37871 95129 142247 425 89196 118308 -27965
12524b7965o0859N0430K14762j77421L0375p5452j00837J63857K06169k10767
$$ -27965 -88824 -38394 176368 -1053 29322 -46130 -146967 16890 223059 12292
12514A2292l3432K81146r8493l25420J99917j53823j0716L5457J08040J7707q8405
$$ 12292 -21140 260006 161513 -163907 36010 -117813 -128529 -93072 14968 32675 -55730
12503e5730O1954L9321K1933J08889N303P0217l59648K18216j40116M2590J15263
$$ -55730 6224 45545 67478 176367 181670 251887 -107761 110455 -29661 12929 128192
12492A28192K7484j74550J17412j4620L73J32018k57952O8248J67354k55108Q405
$$ 128192 155676 -18874 98538 83918 84291 216309 -41643 26605 193959 -61149 -52744
12481e2744L29939j21078o6125n4186k47901O83693m02147o9860O9425j16748
$$ -52744 277195 156117 89992 35806 -212095 471598 69451 -409 69016 -47732
12471d7732K28056K48167m22464P3802J54767k3581j94290J84678j50853J06070
$$ -47732 180324 428491 6027 79829 234596 211015 16725 201403 50550 156620
12461A56620n9787J62757j34481J34327r213l47854J69919J44817o9505k92897
$$ 156620 96833 259590 125109 259436 250223 -97631 72288 217105 147600 -145297
12451a45297j2363K55018n0133j46847L74566k18520K09927k51750N4333j3708
$$ -145297 -157660 97358 47225 -99622 274944 56424 266351 14601 68934 55226
12441E5226n1109K08467J22241j32336k03566L9433J25613j90801K46603r6557
$$ 55226 4117 212584 334825 202489 -1077 38356 163969 -26832 219771 123214
12431A23214j7750M2489M3024m3999r536j62931J72577k135j42006j95309K21460
$$ 123214 105464 147953 190977 146978 137442 -25489 147088 144953 2947 -192362 29098
12420B9098K77020j66398J7345J45902k33193L40654j90105Q1942j37765m8025
$$ 29098 306118 139720 157065 302967 69774 410428 220323 302265 164500 116475
12410A16475j3251m8299j01726J10357q4575M08640l90581K91687J6721j93263
$$ 116475 103224 54925 -46801 63556 -21019 387621 -2960 288727 305448 112185
12400A12185L33342j72302j91267l34712L49251K0147n1348j39551L0667Q3954
$$ 112185 445527 273225 81958 -252754 96497 116644 65296 -74255 -43588 40366
12390D0366K0516j41931K77166K36285k00154q2107m661r2078K62487j14760r4614
$$ 40366 60882 -81049 196117 432402 232248 150141 145480 53402 315889 201129 106515
12379A06515j7682l21770J67049J88848q9168J52372k47960K31678R2362M4673
$$ 106515 88833 -232937 -65888 122960 33792 186164 -61796 169882 262244 306917
12369C06917n3274l57052K24030K71707k73823J9371L62319k89997j708j46708
$$ 306917 253643 -103409 120621 392328 118505 137876 500195 210198 208490 61782
12359F1782M15113j92525j93524R3673O2396j78284K7683J77778k7541J26626
$$ 61782 476895 284370 90846 184519 246915 68631 96314 274092 246551 373177
12349C73177j11870r5487L3246n8087j60175L00709N8757j02911O6822j9752q2804
$$ 373177 261307 165820 199066 140979 -19196 281513 340270 237359 304181 284429 201625
12338B01625m407J60464k32433j52012K91953J63860k21595L7619K14433j63614
$$ 201625 197218 357682 125249 -26763 265190 429050 207455 245074 459507 295893
12328B95893j76995K98209p5456N8616j6154j04466L2717q0838k10779J58075
$$ 295893 118898 417107 341651 400267 384113 279647 312364 231526 20747 178822
12318A78822J76137m42499L06550k72638M48535k2727l13982K48620J24468k59222
$$ 178822 354959 -87540 219010 -53628 394907 372180 58198 306818 431286 172064
12308A72064l9850j52459r9091L22204J82605l82197m6417J90331J4074J08853
$$ 172064 132214 -20245 -119336 202868 385473 3276 -43141 147190 161264 270117
12298B70117q7558J4593Q5043n7213J8693r3367j31500K39439q5388j85142L1729
$$ 270117 182559 197152 282195 224982 243675 150308 18808 258247 172859 -12283 19446
12287A9446J61613r8894J25784L86989l04562m8609k12476L07307J0009j80908
$$ 19446 181059 82165 207949 594938 290376 241767 29291 336598 346607 165699
12277A65699M7396O0937R5680l72776K61934j65613o4459J79578N2874k15170
$$ 165699 213095 274032 369712 -3064 258870 93257 28798 208376 261250 46080
12267D6080J99016j8446K7666P9444J8207m9162k13542p0648K29105k3786j50464
$$ 46080 245096 226650 254316 333760 351967 302805 89263 18615 247720 223934 73470
12256G3470j26118L35279k36288K72556j91863K35035J37326P5071m23897n8271
$$ 73470 -52648 282631 46343 318899 127036 362071 499397 574468 150571 92300
12246I2300P4656K67151k8709l03361L95003j4133k50186L47223p379k87639J94028
$$ 92300 166956 434107 405398 102037 497040 482907 232721 579944 572565 284926 478954
12235D78954J01638l96272R0829j87966J80600K20965k72199K00378k63301P6523
$$ 478954 580592 184320 275149 87183 267783 488748 216549 416927 153626 230149
12225B30149m0487J53032J7204K0476n7889j51344J39256K30034j90268q6414
$$ 230149 189662 342694 359898 380374 322485 171141 310397 540431 350163 263749
12215B63749J07600l2989r9863j15343k1309j24339L8590J24859j534K0351M7735
$$ 263749 371349 338360 238497 123154 101845 -22494 16096 140955 139421 159772 207507
12204B07507L00088j97713j65576J50758K89099j34140l34537N6857M0807N8893
$$ 207507 507595 309882 144306 295064 584163 450023 115486 172343 213150 272043
12194B72043J46371j17373j66651J41544M6827K94013k98672j63889r755L70832
$$ 272043 418414 301041 134390 275934 322761 616774 318102 154213 144458 515290
12184E15290k58422K68659J48886l45739Q2335Q451j94802L03272j22035J06010
$$ 515290 256868 525527 674413 328674 411009 419460 224658 527930 405895 511905
12174E11905k62661K47197J04932k11598l885j20126l7516K54420j90484j26102
$$ 511905 249244 496441 601373 389775 385890 265764 228248 482668 292184 166082
12164A66082M4274K79537j19785Q8311j48787K91309k7795l61178p408J72894
$$ 166082 210356 489893 370108 458419 309632 600941 573146 211968 204560 377454
12154C77454k03877K29406l30825P7609J49918o6855J18324o8711M2799K17200
$$ 377454 173577 402983 72158 149767 299685 232830 351154 282443 325242 542442
12144E42442m31727J93260q147J37250K02766j98174k71257P3991K7679j54515
$$ 542442 110715 303975 295828 433078 635844 437670 166413 240404 268083 113568
12134A13568J81278K45439M8015k51608J8431j360J28506j60382L8313j16252
$$ 113568 294846 540285 588300 336692 355123 353763 482269 321887 360200 243948
12124B43948J30827J86682k48372p9885L7494Q4507o7415Q2560k13086Q707K28577
$$ 243948 374775 561457 313085 233200 270694 355201 287786 370346 157260 165967 394544
12113C94544J47733j01262k48731L05876j23951j8340K29249k14451l8142k53761
$$ 394544 542277 441015 192284 498160 374209 355869 585118 370667 332525 78764
12103G8764M10928m6074r1621M843k2086j34529K28037r8629K59034l70561N2539
$$ 78764 489692 443618 351997 356840 334754 200225 428262 329633 588667 218106 270645
12092B70645J6825L10024k8926k26205K67390k86635j66791K05462j36917K59258
$$ 270645 287470 597494 568568 342363 609753 323118 156327 361789 224872 484130
12082D84130n9516k9340m8934N1975R4669l9821k07207Q6018L98525k69269n9580
$$ 484130 424614 395274 346340 398315 492984 453163 245956 331974 730499 461230 401650
12071D01650m1900K59452r4384Q08k20895K14088p195m32457L02722N9875N8680
$$ 401650 359750 619202 524818 525626 304731 518819 511624 79167 381889 441764 500444
12060E00444p4112J39403k27065J56924P1419k465J63080k19903q6631J74668
$$ 500444 426332 565735 338670 495594 567013 564548 727628 507725 421094 595762
12050E95762j44569k18871M29511j32857j24538k2227K33406l9151k77236M4922
$$ 595762 451193 232322 661833 528976 404438 382211 615617 576466 299230 344152
12040C44152K18326k09633J58829N8444m27846J96723M2232J51209j88200j0816
$$ 344152 562478 352845 511674 570118 142272 338995 381227 532436 344236 333420
12030C33420M10897j19037j67944j24096K32740k16297J71627j15488J77688K55116
$$ 333420 744317 625280 457336 333240 565980 349683 521310 405822 583510 838626
12020H38626m24892K78400k41940K1828L19634p0246k21540K33472l46314J56052
$$ 838626 413734 692134 450194 472022 791656 721410 499870 733342 387028 543080
12010E43080K21935k94264m2015N2179q2865K13667j75487j09774M8696J78341
$$ 543080 765015 470751 428736 480915 398050 611717 436230 326456 375152 553493
12000E53493l9388k6686j60634j02918L70100J13998j74310r2680J72601j14483
$$ 553493 514105 487419 326785 223867 593967 707965 533655 440975 613576 499093
11990D99093Q2847K89972k14056l21268K45871j11147J20547P2954k2024l3543
$$ 499093 581940 871912 657856 336588 582459 471312 591859 664813 642789 609246
11980F09246j9967O7726M938o0745j91585K8626J73454k55257l9947K25534m9827
$$ 609246 589279 657005 661943 601198 409613 438239 611693 356436 316489 542023 492196
11969D92196J11067j97535J96296j19161N1332r8477K6721R6013p8008J69645
$$ 492196 603263 405728 602024 482863 534195 435718 462439 558452 480444 650089
11959F50089P8366k98315M35539J34777n37680k02768L85285r3316n0648r5795
$$ 650089 728455 430140 865679 1000456 462776 260008 645293 551977 501329 405534
11949D05534K73469j09200j86765K23499K7689j57657K38959j14816Q7927k7246
$$ 405534 679003 569803 383038 606537 634226 476569 715528 600712 688639 661393
11939F61393K36615l18388m5410j22234K95720k40843M6100J98201j98413J16924
$$ 661393 898008 579620 534210 411976 707696 466853 512953 711154 512741 629665
11929F29665L0707M6027j41172J51559p4044M6659p2431J26750J78575L3504j92979
$$ 629665 660372 706399 565227 716786 642742 689401 616970 743720 922295 955799 762820
11918G62820N5373k11222J28036r7005L1926J36584j20459M3086K1414j31197
$$ 762820 818193 606971 735007 638002 669928 806512 686053 729139 750553 619356
11908F19356J78221n5007l38093R3585J92622r5980m3292R1341J55034J37178
$$ 619356 797577 742570 404477 498062 690684 594704 551412 642753 797787 934965
11898I34965j61101N9560P2558Q7680m09495J35099N0101j98349K23315J19138
$$ 934965 773864 833424 905982 993662 584167 719266 769367 571018 794333 913471
11888I13471j65154J7255j01242L87014q7776k41127J41287j27408o3364Q7435
$$ 913471 748317 765572 664330 1051344 963568 722441 863728 736320 672956 760391
11878G60391R1107r1982J4122O7326P3071P7330r7545J26943k55526K45884n1765
$$ 760391 851498 759516 773638 840964 914035 991365 893820 1020763 765237 1011121 959356
11867I59356J8344n5684J52175j71770J20739L4725J43192m73111J93904K3470
$$ 959356 977700 922016 1074191 902421 1023160 1057885 1201077 727966 921870 945340
11857I45340J4323j16370J06089l23012K72248j48306K63375k16330N0800J18
$$ 945340 959663 843293 949382 626370 898618 750312 1013687 797357 848157 848275
11847H48275K2949L06810m5166J25351k2064l32001R7473M57613n63541L76585
$$ 848275 871224 1178034 1132868 1258219 1236155 904154 1001627 1459240 895699 1272284
11837A272284Q7770k62214J19595k51925J15505l38224J35148K3908K42851k86022
$$ 1272284 1360054 1097840 1217435 965510 1081015 742791 877939 901847 1144698 858676
11827H58676J94435M4436n4309j63102m9785J81240M56326l80133J39232k42629
$$ 858676 1053111 1097547 1043238 880136 830351 1011591 1467917 1087784 1227016 984387
11817I84387J85258n8001n553R802j27319N5637M2674l9916J54010n8342M6348
$$ 984387 1169645 1111644 1106091 1115893 988574 1044211 1086885 1046969 1200979 1142637 1188985
11806A188985l160k95612J33687j68874K33408n3272L02446K4960j67583K66479
$$ 1188985 1185825 890213 1023900 855026 1088434 1035162 1337608 1362568 1194985 1461464
11796A461464k7455l08065L5184L10390j34838j30176J25988J066J5491n3623
$$ 1461464 1434009 1125944 1161128 1471518 1336680 1206504 1332492 1333558 1349049 1295426
11786A295426j21123J85788p899l9236q5533p3440J27026J43892k05806L19014
$$ 1295426 1174303 1360091 1352192 1312956 1227423 1153983 1281009 1424901 1219095 1538109
11776A538109n5912K5330R6150n3840j66550K18774n1090q0610n0770J75340j05587
$$ 1538109 1482197 1507527 1603677 1549837 1383287 1602061 1550971 1470361 1419591 1594931 1489344
11765A489344k79546K91571j43228q4515j08832M79211k31186j2757K103O0420
$$ 1489344 1209798 1501369 1358141 1273626 1164794 1644005 1412819 1400062 1402165 1462585
11755A462585J58789k96675K18995J53843j21775k69506J23176M1230J63335l9502
$$ 1462585 1621374 1324699 1543694 1697537 1575762 1306256 1429432 1470662 1633997 1594495
11745A594495j52844K56281n741q4151j18696K03041K26598j41485j96950K50621
$$ 1594495 1441651 1697932 1692191 1608040 1489344 1692385 1918983 1777498 1580548 1831169
11735A831169l1964j34070L96501j20193J2861K29429k31436m7205J78573j23627
$$ 1831169 1799205 1665135 2061636 1941443 1954304 2183733 1952297 1905092 2083665 1960038
11725A960038j41982J28343k45218M14530m38195J87229J21290k3243n3479r9278
$$ 1960038 1818056 1946399 1701181 2115711 1677516 1864745 1986035 1962792 1909313 1810035
11715A810035K73980q1574N1282K5744K665n0119p3913k921J44739l92634M18960
$$ 1810035 2084015 2002441 2053723 2079467 2082132 2032013 1958100 1955179 2099918 1707284 2126244
11704B126244J0150j65760R8906K46315j49946K05679r0939j17988K27787j18480
$$ 2126244 2136394 1970634 2069540 2315855 2165909 2371588 2280649 2162661 2390448 2271968
11694B271968Q3635m6905J37107j06711J09325m0948J03346J42532q4819J68821
$$ 2271968 2355603 2308698 2445805 2339094 2448419 2407471 2510817 2653349 2568530 2737351
11684B737351K0302J81714n42056J69131o6465J24731j77258L2305K65502J33819
$$ 2737351 2757653 2939367 2397311 2566442 2499977 2624708 2447450 2479755 2745257 2879076
11674B879076j32170m20K7409J58700j72490L21283j20927r1892j69622K97668
$$ 2879076 2746906 2746486 2773895 2932595 2760105 3081388 2960461 2868569 2698947 2996615
11664B996615k91744J47904K28837J09044j48302K5778r6093L3574K13779j40166
$$ 2996615 2704871 2852775 3081612 3190656 3042354 3068132 2972039 3005613 3219392 3079226
11654C079226J67876j69250L77215J7252J77246l20010P5684Q1476n7128J57270
$$ 3079226 3247102 3077852 3455067 3472319 3649565 3329555 3405239 3486715 3429587 3586857
11644C586857p1387N6040L71480k3143m41904j30319K92305l6503j25599L86351
$$ 3586857 3515470 3571510 3942990 3919847 3477943 3347624 3639929 3603426 3477827 3864178
11634C864178k81061L46460r8215N3127j79786L11060K61000k70787J7395J59395
$$ 3864178 3583117 3929577 3831362 3884489 3704703 4015763 4276763 4005976 4023371 4182766
11624D182766J34235O1483J19301l26765N6608M06424l0920l48914J05275M23944
$$ 4182766 4317001 4378484 4497785 4171020 4227628 4634052 4603132 4254218 4359493 4783437
11614D783437l1166J49706l74238J98101K995J58988l2888K33532j43446J81909
$$ 4783437 4752271 4901977 4527739 4725840 4728835 4887823 4854935 5088467 4945021 5126930
11604E126930j18349l5779l0257O28651n42585M70502k03430J28198n5395q79
$$ 5126930 5008581 4972802 4942545 5571196 5028611 5499113 5295683 5423881 5368486 5367607
11594E367607k4896L35249m2179K43403j970p3365K94338k78108K66284r8536
$$ 5367607 5342711 5677960 5635781 5879184 5877214 5803849 6098187 5820079 6086363 5987827
11584E987827J23741r2689K40207O4403J10646P3367J29847K24493k02906J71165
$$ 5987827 6111568 6018879 6259086 6323489 6434135 6507502 6637349 6861842 6658936 6830101
11574F830101k9145J95691K5571P821K12520l270M4218M15152l13985M04593j77917
$$ 6830101 6800956 6996647 7022218 7030039 7242559 7239289 7283507 7698659 7384674 7789267 7611350
11563G611350K8513K35726q376j78733L59725L13839m5096l2389p0528J18047
$$ 7611350 7639863 7875589 7867213 7688480 8048205 8362044 8316948 8284559 8214031 8332078
11553H332078J94368K55062O2867k3300K18521J42182j40480O1145L69988L29529
$$ 8332078 8526446 8781508 8844375 8821075 9039596 9181778 9041298 9102443 9472431 9801960
11543I801960k31846j57111L52326K21451K6180K54074J14103J03084L09398l3718
$$ 9801960 9570114 9413003 9765329 9986780 10012960 10267034 10381137 10484221 10793619 10759901
11533A0759901l18668M42874K28161L893K56349j9231J43150L56259L42574j01265
$$ 10759901 10441233 10884107 11112268 11116161 11372510 11353279 11496429 11852688 12195262 12093997
11523A2093997L62929m57192N16918M9617K1466K17491K87574K33507K25857j69342
$$ 12093997 12456926 11999734 12516652 12566269 12587735 12805226 13092800 13326307 13552164 13382822
11513A3382822N36511J45777J09107K91177j27610L77439Q8021K76782K91097
$$ 13382822 13919333 14065110 14174217 14465394 14337784 14715223 14803244 15080026 15371123
11504A5371123R4932N43310J6786J90748J78779M05199J35101M1279J61819N17356
$$ 15371123 15466055 16009365 16026151 16216899 16395678 16800877 16935978 16977257 17139076 17656432
11494A7656432J82259K40604M64556R2514N72084K0912J85750N16848K36665L33114
$$ 17656432 17838691 18079295 18543851 18636365 19208449 19229361 19415111 19931959 20168624 20501738
11484B0501738O19051K08912L77523J23454M86140K68894M15510N45319K71073
$$ 20501738 21120789 21329701 21707224 21830678 22316818 22585712 23001222 23546541 23817614
11475B3817614O28479M01085l73O14139M90396N82086K51721P34780L82332N30486
$$ 23817614 24446093 24847178 24846805 25460944 25951340 26533426 26785147 27519927 27902259 28432745
11465B8432745P08680M74685M13210O56672O99528O31617N61688N74921P08051
$$ 28432745 29141425 29616110 30029320 30685992 31385520 32017137 32578825 33153746 33861797
11456C3861797O12180O47084J005700Q53419Q30604P35136P33810R71444O84777
$$ 33861797 34473977 35121061 36126761 36980180 37810784 38545920 39279730 40251174 40935951
11447D0935951R64220Q30952J241129J075732J197210P42882J209922J148109
$$ 40935951 41900171 42731123 43972252 45047984 46245194 46988076 48197998 49346107
11439D9346107J411140J180770J136873J300474J920291J138487J768434J647710
$$ 49346107 50757247 51938017 53074890 54375364 56295655 57434142 59202576 60850286
11431F0850286J580125J921137J447382K043932K128670J783399J987453K111168
$$ 60850286 62430411 64351548 65798930 67842862 69971532 71754931 73742384 75853552
11423G5853552K431314K254356K541088K672499K460243K872873K866797K847810
$$ 75853552 78284866 80539222 83080310 85752809 88213052 91085925 93952722 96800532
11415I6800532L828072K955893L240344L692304L868267L839624L834983M438926
$$ 96800532 100628604 103584497 106824841 110517145 114385412 118225036 122060019 126498945
11407A26498945M479446M641459M641293N254247N120950N394359N742330N809505
$$ 126498945 130978391 135619850 140261143 145515390 150636340 156030699 161773029 167582534
11399A67582534O194559O345672O617541O467585P184140P472707O927707P685137
$$ 167582534 173777093 180122765 186740306 193207891 200392031 207864738 214792445 222477582
11391B22477582P577283Q085005Q161715P632561Q263975Q110513P936840P916297
$$ 222477582 230054865 238139870 246301585 253934146 262198121 270308634 278245474 286161771
11383B86161771P882909P256585P216792P008825O030041N658704N090384M301496
$$ 286161771 294044680 301301265 308518057 315526882 321556923 327215627 332306011 336607507
11375C36607507L373742K928847J875487J081816K75496q22934j784056k558098
$$ 336607507 339981249 342910096 344785583 345867399 346142895 345319961 343535905 340977807
11367C40977807k894578m054878m965009m744265n948176o176127o549310o843939
$$ 340977807 338083229 334028351 329063342 324319077 318370901 312194774 305645464 298801525
11359B98801525p309581p377600p529402p138338p450556p306017p303023p243964
$$ 298801525 291491944 284114344 276584942 269446604 261996048 254690031 247387008 240143044
11351B40143044p164208p288774o613345o700314o718697o297102o142113n832396
$$ 240143044 232978836 225690062 219076717 212376403 205657706 199360604 193218491 187386095
11343A87386095n934277n591598n361770n312871m820267m654726m701103m762945
$$ 187386095 181451818 175860220 170498450 165185579 160365312 155710586 151009483 146246538
11335A46246538m493587m123415l976510l766976l944048l424690l608547l219171
$$ 146246538 141752951 137629536 133653026 129886050 125942002 122517312 118908765 115689594
11327A15689594l168740l262762k972585k836616k686126k902200k439978k657940
$$ 115689594 112520854 109258092 106285507 103448891 100762765 97860565 95420587 92762647
11319I2762647k075762k097156k643961k065480j826243k418357j554115k213354
$$ 92762647 90686885 88589729 85945768 83880288 82054045 79635688 78081573 75868219
11311G5868219j559070j765762j481824j401904j720451j813395j153372j416480
$$ 75868219 74309149 72543387 71061563 69659659 67939208 66125813 64972441 63555961
11303F3555961j419745j363064j357894j032447j302117j044218j268764r19309
$$ 63555961 62136216 60773152 59415258 58382811 57080694 56036476 54767712 53848403
11295E3848403j333416o30993j147753j000810j004236q51490p35730r17712q90876
$$ 53848403 52514987 51883994 50736241 49735431 48731195 47879705 47143975 46226263 45335387
11286D5335387o32844q53496n61713j123328p33313n93787o96383o47612q61596
$$ 45335387 44702543 43849047 43287334 42164006 41430693 40836906 40140523 39492911 38631315
11277C8631315o79964n12833o21416m00660p98551n67033n37904n69563l12018
$$ 38631315 37951351 37438518 36817102 36416442 35617891 35050858 34512954 33943391 33631373
11268C3631373p44985o28193l58198l45064n64762k50557m07833l84639q52954
$$ 33631373 32886388 32258195 31899997 31554933 30990171 30739614 30331781 29947142 29094188
11259B9094188l84593k55509m59824n47263k74021n39021k60408l21262m56622
$$ 29094188 28709595 28454086 27994262 27446999 27172978 26633957 26373549 26052287 25595665
11250B5595665l49891k94602j74625n08359m08658n03441n7832k14019l36287
$$ 25595665 25245774 24951172 24776547 24268188 23859530 23356089 23298257 23084238 22747951
11241B2747951l46868m49169l77082o2739m55198m64707L8156m1169k45953m79541
$$ 22747951 22401083 21951914 21574832 21512093 21056895 20592188 20630344 20589175 20343222 19863681
11231A9863681j66932j05568n71670r0736j42998n43939J21897o88672K72989
$$ 19863681 19696749 19591181 19019511 18928775 18785777 18241838 18363735 17675063 17948052
11222A7948052l62195l51660k00866k44106M0825k7215n21727K2651L9849l07468
$$ 17948052 17585857 17234197 17033331 16789225 16830050 16802835 16281108 16303759 16343608 16036140
11212A6036140m58969J62357l94588j85620l1233l89088K3734k23337J0069l18403
$$ 16036140 15577171 15739528 15344940 15159320 15128087 14738999 14762733 14539396 14549465 14231062
11202A4231062L19452j46256l81404r9427k71449J53429l07200j01999K79107
$$ 14231062 14550514 14404258 14022854 13923427 13651978 13805407 13498207 13396208 13675315
11193A3675315l83768r6034m6639L0726k33828J88422j40862J55579K6359q2507
$$ 13675315 13291547 13195513 13148874 13179600 12945772 13134194 12993332 13148911 13175270 13092763
11183A3092763L29530Q485j68060M54225J84565O2751J45841L54786N0888j10076
$$ 13092763 13422293 13430778 13262718 13716943 13901508 13964259 14110100 14464886 14515774 14405698
11173A4405698K05189R543j85485q8682Q395l33872n60964m67647M9695l94201
$$ 14405698 14610887 14620430 14434945 14346263 14354658 14020786 13459822 12992175 13041870 12647669
11163A2647669k25056j62075j15063K66285k43182J75531k11803K77609k30352
$$ 12647669 12422613 12260538 12145475 12411760 12168578 12344109 12132306 12409915 12179563
11154A2179563L07342R3304K68201M09184K79476R78312L80296K79122J79702
$$ 12179563 12486905 12580209 12848410 13257594 13537070 14515382 14895678 15174800 15354502
11145A5354502N11212M34945N26065k05013l64309o6572m50998l53301p42924
$$ 15354502 15865714 16300659 16826724 16621711 16257402 16190830 15739832 15386531 14643607
11136A4643607m69941p99703l40752m11978m82563o00928Q6787k24964l08187
$$ 14643607 14173666 13373963 13033211 12621233 12138670 11537742 11624529 11399565 11091378
11127A1091378J4698o2835m98504J73170q6928Q9016L80575l01678M09626M56450
$$ 11091378 11106076 11043241 10544737 10717907 10630979 10719995 11100570 10798892 11208518 11664968
11117A1664968K43335L93569k62680N37141j10078K42135l66210J77588J33188
$$ 11664968 11908303 12301872 12039192 12576333 12466255 12708390 12342180 12519768 12652956
11108A2652956m00996m75546j85402o02034j09613j22520k87104l69141j44972
$$ 12652956 12251960 11776414 11591012 10988978 10879365 10756845 10469741 10100600 9955628
11099I955628n3465M1779l76841k15690J99903j30561j63757r0990J18360j38132
$$ 9955628 9902163 9943942 9567101 9351411 9551314 9420753 9256996 9166006 9284366 9146234
11089I146234j95354j46976r3851k03326L35922j07792q5781k27478K819k34227
$$ 9146234 8950880 8803904 8710053 8506727 8842649 8734857 8649076 8421598 8424417 8190190
11079H190190K40806O0214j59716L43516k93493P5193N9979K73212J73353j38483
$$ 8190190 8430996 8491210 8331494 8675010 8381517 8456710 8516689 8789901 8963254 8824771
11069H824771K62835K6761K43711k51947K65866m05718K03967J21284m35637K0300
$$ 8824771 9087606 9114367 9358078 9106131 9371997 8966279 9170246 9291530 8855893 8876193
11059H876193k6883m24255j18441K8996k31050j23861j54940N4616j67942j51865
$$ 8876193 8849310 8425055 8306614 8335610 8104560 7980699 7825759 7880375 7712433 7560568
11049G560568K3850J21631O6317l35K28572n69332K64515j24847K41849q9280
$$ 7560568 7584418 7706049 7772366 7772031 8000603 7431271 7695786 7570939 7812788 7723508
11039G723508L8091k57194Q9529K01988K03932K1725n4570j90741M2176k25563
$$ 7723508 7761599 7504405 7593934 7795922 7999854 8021579 7967009 7776268 7818444 7592881
11029G592881K18361M9734l86406M28168k39659P6096J34668J7212J17956K4936
$$ 7592881 7811242 7860976 7474570 7902738 7663079 7739175 7873843 7891055 8009011 8033947
11019H033947j11678L21172j29459J40670J55538K87318p2191K83575j27653N50558
$$ 8033947 7922269 8243441 8113982 8254652 8410190 8697508 8625317 8908892 8781239 9331797
11009I331797K44953j85790M38478J1262O03167l20448R9792K06402L11611l7777
$$ 9331797 9576750 9390960 9829438 9840700 10443867 10123419 10223211 10429613 10741224 10703447
10999A0703447L34980L90434L23161l4039M83909k95576K39990J55384L58924
$$ 10703447 11038427 11428861 11752022 11717983 12201892 11906316 12146306 12301690 12660614
10990A2660614M44980J7027K30616M9026J27503l01686J05273N79323l25449M0872
$$ 12660614 13105594 13122621 13353237 13402263 13529766 13228080 13333353 13912676 13587227 13628099
10980A3628099J11859j6445K59398P8151M35732o0805N199L33903L48415M17621
$$ 13628099 13739958 13723513 13982911 14061062 14496794 14435989 14441188 14775091 15123506 15541127
10970A5541127m188j45056j84946R6553j9330l65523k38730m16592k17855P7978
$$ 15541127 15536939 15391883 15206937 15303490 15284160 14918637 14679907 14263315 14045460 14123438
10960A4123438k01517j07554l77638K74371j79529R5157K73739m5032k5696M86414
$$ 14123438 13921921 13814367 13436729 13711100 13531571 13626728 13900467 13855435 13829739 14316153
10950A4316153L60317L19847O15929L04913R92527P54107L03592P68422R88267
$$ 14316153 14676470 14996317 15612246 15917159 16909686 17663793 17967385 18735807 19724074
10941A9724074K56048M67826N95752K88624L17456L11890J35745J43145L07152
$$ 19724074 19980122 20447948 21043700 21332324 21649780 21961670 22097415 22240560 22547712
10932B2547712M02255L20727P72610O61476Q29545J551476J894270J532981K495085
$$ 22547712 22949967 23270694 24043304 24704780 25534325 27085801 28980071 30513052 33008137
10923C3008137K317210K632156K249611K635819K026457J553045O15365M26600
$$ 33008137 35325347 37957503 40207114 42842933 44869390 46422435 47037800 47464400
10915D7464400p90557r92737j417144j605039j181590j464553j030733j008285
$$ 47464400 46673843 45681106 44263962 42658923 41477333 40012780 38982047 37973762
10907C7973762j033660o30494m22548l78003J12500K64358P83445J277952J170581
$$ 37973762 36940102 36309608 35887060 35509057 35621557 35885915 36669360 37947312 39117893
10898C9117893K202176J908504K969561L882393L623073M464741M542612M902771
$$ 39117893 41320069 43228573 46198134 50080527 53703600 58168341 62710953 67613724
10890F7613724M108688L179722K414545O91829k37839j453997k667188l173753
$$ 67613724 71722412 74902134 77316679 78008508 77770669 76316672 73649484 70475731
10882G0475731l748766m133592m381000m069972l555905l308588k871656k180821
$$ 70475731 66726965 62593373 58212373 54142401 50586496 47277908 44406252 42225431
10874D2225431j665962j538255j061793p59462k08720J36411J65608L52330J153031
$$ 42225431 40559469 39021214 37959421 37199959 36991239 37127650 37293258 37645588 38798619
10865C8798619J076250J329951J777623K090241J879257K025125K224665J427282
$$ 38798619 39874869 41204820 42982443 45072684 46951941 48977066 51201731 52629013
10857E2629013Q77288m3250q65652j614256k171029l224357l245158k487071k819364
$$ 52629013 53506301 53463051 52597399 50983143 48812114 45587757 42342599 39855528 37036164
10848C7036164k776731k226100k063728j863535j745642j686384j132157j227288
$$ 37036164 34259433 32033333 29969605 28106070 26360428 24674044 23541887 22314599
10840B2314599r05148r87592p66245n58869m22005r51618m52895m35176l27846
$$ 22314599 21409451 20421859 19655614 19096745 18674740 17723122 17270227 16835051 16507205
10831A6507205k69131j71274k29812m18678k85545k17026q5424j1093J2155m91433
$$ 16507205 16238074 16066800 15836988 15418310 15132765 14915739 14830315 14819222 14831377 14339944
10821A4339944J21966l20933o2237n52688J54617j63943o0828j72990k4582L27890
$$ 14339944 14461910 14140977 14078740 13526052 13680669 13516726 13455898 13282908 13258326 13586216
10811A3586216n36948k30905K3880L8768m5817j31294l99612p1754L9012K71k3412
$$ 13586216 13049268 12818363 12842243 12881011 12835194 12703900 12304288 12232534 12271546 12271817 12248405
10800A2248405l11014O1776J1383j52487J03001q9069j48048K66296m34424K96239
$$ 12248405 11937391 11999167 12010550 11858063 11961064 11871995 11723947 11990243 11555819 11852058
10790A1852058L83549k94631P9924P4006J93830P6525J42188p2201K32225K73900
$$ 11852058 12235607 11940976 12020900 12094906 12288736 12365261 12507449 12435248 12667473 12941373
10780A2941373l66631P12894J70722J98494L65479L32448K57533P42991M11680
$$ 12941373 12574742 13287636 13458358 13656852 14022331 14354779 14612312 15355303 15766983
10771A5766983Q54146L39286K84419J067453N43192J281729R80160J390376J045798
$$ 15766983 16621129 16960415 17244834 18312287 18855479 20137208 21117368 22507744 23553542
10762B3553542J724927J038603J680994J731313J764918R93408J732385J463094
$$ 23553542 25278469 26317072 27998066 29729379 31494297 32487705 34220090 35683184
10754C5683184J237896J560282J150805R10326J319124Q53376O77249O97771Q49005
$$ 35683184 36921080 38481362 39632167 40542493 41861617 42714993 43392242 44090013 44939018
10745D4939018J338987Q08968J364301J549380J620369J820880K082225K157561
$$ 44939018 46278005 47086973 48451274 50000654 51621023 53441903 55524128 57681689
10737E7681689K526765K268991K668069K445542K779872K172477K085944J538596
$$ 57681689 60208454 62477445 65145514 67591056 70370928 72543405 74629349 76167945
10729G6167945J255100J118947Q0281L92434k87314o15242q42495j047163l46691
$$ 76167945 77423045 78541992 78622273 79014707 78727393 78112151 77269656 76222493 75875802
10720G5875802n43863l08648j83222P4367P19107J057175Q43760J334387J948877
$$ 75875802 75331939 75023291 74840069 74914436 75633543 76690718 77534478 78868865 80817742
10711H0817742J504759J429761J587761J186715Q10023q1335j215136j726962
$$ 80817742 82322501 83752262 85340023 86526738 87336761 87255426 86040290 84313328
10703H4313328k418578k593250l105962l143978k792622k744116k806267k016414
$$ 84313328 81894750 79301500 76195538 73051560 70258938 67514822 64708555 62692141
10695F2692141j206886j337760q99804q08960l58413L66710J65475P13983J541028
$$ 62692141 61485255 60147495 59247691 58438731 58080318 58447028 58612503 59326486 60867514
10686F0867514J822677K369189K496200K838970L282118L076335K951537K686606
$$ 60867514 62690191 65059380 67555580 70394550 73676668 76753003 79704540 82391146
10678H2391146J624287R04554l52841j328967k616814k970214l425535l739976
$$ 82391146 84015433 84919987 84567146 83238179 80621365 77651151 74225616 70485640
10670G0485640l672809l699362l419089k807859k709390k750734j456069j843616
$$ 70485640 66812831 63113469 59694380 56886521 54177131 51426397 49970328 48126712
10662D8126712j124847o46020o43880l70653j71292o6089Q11430N22174J465731
$$ 48126712 47001865 46355845 45711965 45341312 45170020 45103931 45915361 46437535 47903266
10653D7903266J418628J546478J879127J460563R14556J057902k22379p77630
$$ 47903266 49321894 50868372 52747499 54208062 55122618 56180520 55958141 55180511
10645E5180511k242355k494370k986510l020569l088718l152647k442746k685038
$$ 55180511 52938156 50443786 47457276 44436707 41347989 38195342 35752596 33067558
10637C3067558k221624k543518j429700j643223j589889j011499j273578j019082
$$ 33067558 30845934 28302416 26872716 25229493 23639604 22628105 21354527 20335445
10629B0335445p24147r83155q57106n52406o37172n02181p03428m38456k45958
$$ 20335445 19611298 18628143 17771037 17218631 16581459 16079278 15375850 14937394 14691436
10620A4691436q58813l46427k86538n11281j41233o88394j96063k59740j46339
$$ 14691436 13832623 13486196 13199658 12688377 12547144 11858750 11662687 11402947 11256608
10611A1256608m17190m40303j85289r9747k05810k11222k88995l40127J92712
$$ 11256608 10839418 10399115 10213826 10114079 9908269 9697047 9408052 9067925 9260637
10602I260637j79437k31419j90210l46140M20415l76345q1383j83318p8890J37339
$$ 9260637 9081200 8849781 8659571 8313431 8733846 8357501 8276118 8092800 8013910 8151249
10592H151249l96319k49187K83780k06875l41950J0274Q283k80710O1725k32390
$$ 8151249 7754930 7505743 7789523 7582648 7240698 7250972 7259255 6978545 7040270 6807880
10582F807880K11710k41827j7688L108K0593k54121J05805k78932J96322j57032
$$ 6807880 7019590 6777763 6760075 6763183 6783776 6529655 6635460 6356528 6552850 6395818
10572F395818k03178O3410k29267l0054K18681j60613K21832j75182P3989o3385
$$ 6395818 6192640 6256050 6026783 5996729 6215410 6054797 6276629 6101447 6175436 6112051
10562F112051j96493o7807J41157Q7924j38551n2152k54066K87092j28415p7876
$$ 6112051 5915558 5847751 5988908 6076832 5938281 5886129 5632063 5919155 5790740 5712864
10552E712864O1695j41827l2353N4146K67961J1632j13612m3603L08390j05644
$$ 5712864 5774559 5632732 5600379 5654525 5922486 5934118 5820506 5776903 6085293 5979649
10542E979649O8476L58945j64759J96671K35271J01520R7775M43679J28421J94483
$$ 5979649 6048125 6407070 6242311 6438982 6674253 6775773 6873548 7317227 7445648 7640131
10532G640131N80487L64740O67762L44590O84470R26880J095064J315348J250018
$$ 7640131 8220618 8585358 9253120 9597710 10282180 11209060 12304124 13619472 14869490
10523A4869490J116173M00842R99103Q27060P55825J925673J908180J442851N88997
$$ 14869490 15985663 16386505 17385608 18212668 18968493 20894166 22802346 24245197 24834194
10514B4834194O0930j63647M62876J399836J563117J360085N93861r61958k012489
$$ 24834194 24895124 24731477 25194353 26594189 28157306 29517391 30111252 29149294 27136805
10505B7136805r68911r26790n4020K02382m454j169118j904723j575330j523955
$$ 27136805 26167894 25241104 25187084 25389466 25385012 24215894 22311171 20735841 19211886
10496A9211886n34613p41682q37651l42773j540306j002337j251270q69902q90850
$$ 19211886 18677273 17935591 17097940 16755167 15214861 14212524 12961254 12091352 11200502
10487A1200502n02400r5488o49238m08881m45771l94818O6356j58383r3314l39706
$$ 11200502 10698102 10602614 9953376 9544495 9098724 8703906 8770262 8611879 8518565 8178859
10477H178859l62504P0140O4901l19270j88436l0839j65485j01990J66374o2261
$$ 8178859 7816355 7886495 7951396 7632126 7443690 7412851 7247366 7145376 7311750 7249489
10467G249489k67100J98360K00233l48862K30199j10119n2326K59551l7514O9703
$$ 7249489 6982389 7180749 7380982 7032120 7262319 7152200 7099874 7359425 7321911 7391614
10457G391614j93175L94888J55453j13249j20310K28201K35094K65168K78003
$$ 7391614 7198439 7593327 7748780 7635531 7515221 7743422 7978516 8243684 8521687
10448H521687j76853L49237L44344L42085K26109K81139n0155L13498K49470M96628
$$ 8521687 8344834 8694071 9038415 9380500 9606609 9887748 9837593 10151091 10400561 10897189
10438A0897189J20736M28244N63403M96370N18875N10347O57698O45054J033719
$$ 10897189 11017925 11446169 12009572 12505942 13024817 13535164 14192862 14837916 15871635
10429A5871635R05033Q19423J106896J297168J550402J444865J398308J560451
$$ 15871635 16776668 17596091 18702987 20000155 21550557 22995422 24393730 25954181
10421B5954181J846577J860096J767148J471469J803854J709504J675128J501265
$$ 25954181 27800758 29660854 31428002 32899471 34703325 36412829 38087957 39589222
10413C9589222J192319J445882J186541R59869J061383J121044J250009J203430
$$ 39589222 40781541 42227423 43413964 44373833 45435216 46556260 47806269 49009699
10405D9009699Q58511J865843J510409J780291J560362K230882K013484K147155
$$ 49009699 49868210 51734053 53244462 55024753 56585115 58815997 60829481 62976636
10397F2976636J744861K145530J353161J163439Q58415M4281m67534q59457j152675
$$ 62976636 64721497 66867027 68220188 69383627 70242042 70286323 69818789 68959332 67806657
10388F7806657j618932j559470k316759k188287k100170k002089j925389j283890
$$ 67806657 66187725 64628255 62311496 60123209 58023039 56020950 54095561 52811671
10380E2811671j689516j047159j322690r14184p71810j62496n36542m09615k73729
$$ 52811671 51122155 50074996 48752306 47838122 47066312 46903816 46367274 45957659 45683930
10371D5683930q54884m96599o22566j188918j149553j210818j691319j322767
$$ 45683930 44829046 44332447 43709881 42520963 41371410 40160592 38469273 37146506
10363C7146506k348480j688854j761877j695935j503846j823137j192066j391986
$$ 37146506 34798026 33109172 31347295 29651360 28147514 26324377 25132311 23740325
10355B3740325j334626o43377j137607n91445j141902p37927o52672n91165r80035
$$ 23740325 22405699 21762322 20624715 20033270 18891368 18153441 17500769 16909604 15929569
10346A5929569m12534n07864j61068n6062j19622k54482R6956n4836p3194K18397
$$ 15929569 15517035 15009171 14848103 14792041 14672419 14417937 14514893 14460057 14386863 14605260
10336A4605260k80297j19531L48355o13419l23761m33291l53939o31176m01206
$$ 14605260 14324963 14205432 14553787 13940368 13616607 13183316 12829377 12198201 11796995
10327A1796995l04885l46899K7827q82666K90937m45093L14260l23253l82829
$$ 11796995 11492110 11145211 11173038 10290372 10581309 10136216 10450476 10127223 9744394
10318I744394O8332n0341O2573l60873J97927M68190K82643r4284O11241R6960
$$ 9744394 9812726 9762385 9824958 9464085 9662012 10130202 10412845 10318561 10929802 11026762
10308A1026762K69928O35963K94541J8396J61389j41544j63906n05955l72536
$$ 11026762 11296690 11932653 12227194 12245590 12406979 12265435 12101529 11595574 11223038
10299A1223038o31086m56147n34842k93525k22396l6388j60197j45836n05273
$$ 11223038 10591952 10135805 9600963 9307438 9085042 9048654 8888457 8742621 8237348
10290H237348J72823j25984K3651L14453j06436j80061K23345N3395N6199K28057
$$ 8237348 8410171 8284187 8307838 8622291 8515855 8335794 8559139 8612534 8668733 8896790
10280H896790N2311M83969K11106M68925J43446k1441K85561j16630q6161l13830
$$ 8896790 8949101 9433070 9644176 10113101 10256547 10235106 10520667 10404037 10317876 10004046
10270A0004046L38351m17037l23709k72550n627O9724r6169L26763K0937L60614
$$ 10004046 10342397 9925360 9601651 9329101 9323474 9393198 9297029 9623792 9644729 10005343
10260A0005343m31447P02184M60581J55724L77803L43286P58724P19170N82734
$$ 10005343 9573896 10276080 10736661 10892385 11270188 11613474 12372198 13091368 13674102
10251A3674102R08620Q34810J225034J111825Q74484Q81221N26011P91130j14317
$$ 13674102 14582722 15417532 16642566 17754391 18628875 19510096 20036107 20827237 20712920
10242B0712920j72223n26382n92322k29482j97563l94308j68723M68399K36778
$$ 20712920 20540697 20014315 19421993 19192511 18994948 18600640 18431917 18900316 19137094
10233A9137094L74017J11726O30807K56056M27185Q96747P94911J417412J183120
$$ 19137094 19511111 19622837 20253644 20509700 20936885 21833632 22628543 24045955 25229075
10224B5229075J476318K276698K229257J824593K743093K097980K166997J969658
$$ 25229075 26705393 28982091 31211348 33035941 35779034 37877014 40044011 42013669
10216D2013669J762448J337654R38433m4515m20265j642446k252981j811573j563714
$$ 42013669 43776117 45113771 46052204 46007689 45587424 43944978 41691997 39880424 38316710
10207C8316710j680451r15315r49284o10491k08522k03513q5071l24994L91833
$$ 38316710 36636259 35720944 34771660 34161169 33952647 33749134 33664063 33339069 33730902
10198C3730902L29855J019902J026651J557775K039379J802758K599286K378661
$$ 33730902 34060757 35080659 36107310 37665085 39704464 41507222 44106508 46485169
10190D6485169K110516K401526K324935J909699J392414J081221J70230p53262
$$ 46485169 48595685 50997211 53322146 55231845 56624259 57705480 57875710 57122448
10182E7122448j436326k690470l074192l341710k938546k705210k128697j337172
$$ 57122448 55686122 52995652 49921460 46579750 43641204 40935994 38807297 37470125
10174C7470125j747089j311289p51715n22774n76803l81720m80899Q4450l04958
$$ 37470125 35723036 34411747 33660032 33137258 32560455 32178735 31697836 31782286 31477328
10165C1477328M32729K99343M47529J223760J240193J581241J782618J104462
$$ 31477328 31910057 32209400 32656929 33880689 35120882 36702123 38484741 39589203
10157C9589203R39150L6794n87411l47215j436839j758460k081089k556361k331183
$$ 39589203 40528353 40565147 39977736 39630521 38193682 36435222 34354133 31797772 29466589
10148B9466589j773292j732041j540156j237348j233144p74055n83296p71346
$$ 29466589 27693297 25961256 24421100 23183752 21950608 21176553 20593257 19821911
10140A9821911p11347o86977o61472l37406p48850l10219j34662l64210J73333
$$ 19821911 19110564 18423587 17762115 17424709 16675859 16365640 16230978 15866768 16040101
10131A6040101j21804K19792N0342J07109J40076j68603l26301l96189k50273
$$ 16040101 15918297 16138089 16188431 16295540 16435616 16267013 15940712 15544523 15294250
10122A5294250q13819o80879q86810o21274p98961n82084n01620o52699j3333
$$ 15294250 14480431 13799552 12912742 12291468 11492507 10910423 10408803 9756104 9742771
10113I742771n61065l01679m74379n01459j15749j2517j80823l31609J6816l39796
$$ 9742771 9181706 8880027 8405648 7904189 7788440 7775923 7595100 7263491 7280307 6940511
10103F940511m09866r684j03790j40209m5089j74691k30236j00928R3781j38777
$$ 6940511 6530645 6520961 6417171 6276962 6231873 6057182 5826946 5726018 5819799 5681022
10093E681022P9897j52389l2959m56197J03226J83295j18894J28015m96915k06562
$$ 5681022 5760919 5608530 5575571 5119374 5222600 5405895 5287001 5415016 4918101 4711539
10083D711539j37796L45639j66147J21181k74141L87R522P2338J0297l31581K08213
$$ 4711539 4573743 4919382 4753235 4874416 4600275 4600662 4610184 4682522 4692819 4361238 4569451
10072D569451M1464l08885O4864L39257k94423k01211K61745l19490K08312J25081
$$ 4569451 4610915 4302030 4366894 4706151 4411728 4210517 4472262 4152772 4361084 4486165
10062D486165j81212N605m3467J4569R6140k20429K99055k25435N5743k12779
$$ 4486165 4304953 4310558 4267091 4281660 4377800 4157371 4456426 4230991 4286734 4073955
10052D073955M86141k29052Q66p8090K26776q4951j26483r7399L91947k88724
$$ 4073955 4560096 4331044 4331910 4253820 4480596 4395645 4269162 4171763 4563710 4274986
10042D274986M2578m8326J42679L35625O8468r2973j33138j63340j13818J50573
$$ 4274986 4317564 4269238 4411917 4747542 4816010 4723037 4589899 4426559 4312741 4463314
10032D463314N5022K26470l45679K78490K2342O5315n3893K30775j89324K59321
$$ 4463314 4518336 4744806 4399127 4677617 4699959 4765274 4711381 4942156 4752832 5012153
10022E012153j30658K40491J12591P6196j06357L84264k34312J95789L4137k43193
$$ 5012153 4881495 5121986 5234577 5310773 5204416 5588680 5354368 5550157 5584294 5341101
10012E341101K39427L08878L02644O9240R4445M28890M8882k88157N04484J8079
$$ 5341101 5580528 5889406 6192050 6261290 6355735 6784625 6833507 6545350 7049834 7067913
10002G067913m6667M19479N29483Q6773J97851J77551K14950K10401N06988K16612
$$ 7067913 7021246 7440725 7970208 8056981 8254832 8432383 8647333 8857734 9364722 9581334
9992I581334L34896M45942K95919O81142P83030K66748P75970O57682P26705P39559
$$ 9581334 9916230 10362172 10658091 11339233 12122263 12389011 13164981 13822663 14549368 15288927
9982A5288927L79562O44868Q57318N30301P16480O91086J396729J128259P69818
$$ 15288927 15668489 16313357 17170675 17700976 18417456 19108542 20505271 21633530 22403348
9973B2403348J015724Q18953O25041J064100Q95692O84291Q28022O72233J018532
$$ 22403348 23419072 24238025 24863066 25927166 26822858 27507149 28335171 29007404 30025936
9964C0025936O41599J105098J385636J054665J814377J082124J174690M24689
$$ 30025936 30667535 31772633 33158269 34212934 36027311 37109435 38284125 38708814
9956C8708814p5153K04566J81064J19765L18437P09173O55596N84822Q32768R06805
$$ 38708814 38633661 38838227 39019291 39139056 39457493 40166666 40822262 41407084 42239852 43146657
9946D3146657R29501Q44930J002220J412177P55621J151680J212699J476993J332265
$$ 43146657 44076158 44921088 45923308 47335485 48091106 49242786 50455485 51932478 53264743
9937E3264743J449567J670980K271869K131791J726394J958639J296990J370434
$$ 53264743 54714310 56385290 58657159 60788950 62515344 64473983 65770973 67141407
9929F7141407J750191R69084J717360J265798K087766J904646K158889K559903
$$ 67141407 68891598 69860682 71578042 72843840 74931606 76836252 78995141 81555044
9921H1555044K890216L148306L407281L967091L848739L797597L206530K342052
$$ 81555044 84445260 87593566 91000847 94967938 98816677 102614274 105820804 108162856
9913A08162856J255773R03654J097034J249189J727200J794987J809458K046738
$$ 108162856 109418629 110322283 111419317 112668506 114395706 116190693 118000151 120046889
9905A20046889J230147J232546N21772K63748q7378n63921q73659j372022j377417
$$ 120046889 121277036 122509582 123031354 123295102 123207724 122643803 121770144 120398122 119020705
9896A19020705j884174k158078k086379j838340j794469j850539j737518k620453
$$ 119020705 117136531 114978453 112892074 111053734 109259265 107408726 105671208 103050755
9888A03050755l189776l652126l762776l917864l693623l127358k967917j950603
$$ 103050755 99860979 96208853 92446077 88528213 84834590 81707232 78739315 76788712
9880G6788712k499222k305842j994923k041098k082256k145810j812427k094867
$$ 76788712 74289490 71983648 69988725 67947627 65865371 63719561 61907134 59812267
9872E9812267j964406k420619k278196k396666k229140k213854k275156k001371
$$ 59812267 57847861 55427242 53149046 50752380 48523240 46309386 44034230 42032859
9864D2032859j781226j535504j630580j042075j610275j266306j619063j130752
$$ 42032859 40251633 38716129 37085549 36043474 34433199 33166893 31547830 30417078
9856C0417078o21057j303977q63002m96639p55147q88971l98993m50873o50452
$$ 30417078 29796021 28492044 27629042 27132403 26377256 25488285 25089292 24638419 23987967
9847B3987967o88407p11402n49466p11889l91454j024488o22557m10850r13943
$$ 23987967 23299560 22588158 22038692 21326803 20935349 19910861 19288304 18877454 17963511
9838A7963511l86163n41569m00475q95032m53287o07890N2017r51679J401m51857
$$ 17963511 17577348 17035779 16635304 15740272 15286985 14679095 14731112 13779433 13780834 13328977
9828A3328977j98955n08095m20474k26355l04215p67995k82730k84546k02256
$$ 13328977 13130022 12621927 12201453 11975098 11670883 10902888 10620158 10335612 10133356
9819A0133356k30750q8434m12592k67763k23097j23651l29593j76227k1351l44915
$$ 10133356 9902606 9814172 9401580 9133817 8910720 8787069 8457476 8281249 8259898 7914983
9809G914983Q4325o10161J59051j29809N8399k11099l00835k6424k22713M6719
$$ 7914983 7999308 7389147 7548198 7418389 7476788 7265689 6964854 6938430 6715717 6762436
9799F762436l1284k05568k86763M6636j20419j34720l65867M80433m45220L69580
$$ 6762436 6731152 6525584 6238821 6285457 6165038 6030318 5664451 6144884 5699664 6069244
9789F069244p22759K22530m0414k56517j02252R6319j39244n1611J11159p7574
$$ 6069244 5346485 5569015 5528601 5272084 5169832 5266151 5126907 5075296 5186455 5108881
9779E108881l02331m4124o7959K55541q0359J4725l64104l2561j50885L7732j89409
$$ 5108881 4806550 4762426 4694467 4950008 4869649 4884374 4520270 4487709 4336824 4374556 4185147
9768D185147l9695L63920j60672q7636k24124J89498k13949n0945j24466J8402
$$ 4185147 4145452 4509372 4348700 4261064 4036940 4226438 4012489 3961544 3837078 3855480
9758C855480l07799J43889J9162Q9265k76643R5077m9909J64680k77280J77060
$$ 3855480 3547681 3691570 3710732 3799997 3523354 3618431 3568522 3733202 3455922 3632982
9748C632982k47892j4396L8379J69935m66154M1584O7268r3561J43530m9258O05
$$ 3632982 3385090 3370694 3409073 3579008 3112854 3154438 3221706 3128145 3271675 3222417 3223022
9737C223022j07955k42544N10582m15476q7490J13228r5995J37177j00024k25053
$$ 3223022 3115067 2872523 3383105 2967629 2880139 2993367 2897372 3034549 2934525 2709472
9727B709472k2733M1080j52751J10224P9946J29908k87127l3698L1331k42600
$$ 2709472 2686739 2727819 2575068 2685292 2765238 2895146 2608019 2574321 2605652 2363052
9717B363052N79695j36489j17926P6477k30419Q4519k19118L14135J21438j02054
$$ 2363052 2942747 2806258 2688332 2764809 2534390 2618909 2399791 2713926 2835364 2733310
9707B733310k32298J94868R575q2915O6005j60154J77581m32917j39062J60766
$$ 2733310 2501012 2695880 2705455 2622540 2688545 2528391 2705972 2273055 2133993 2294759
9697B294759K63409j45668l96612K62688M991L3028p004j10259J94364j28011
$$ 2294759 2558168 2412500 2015888 2278576 2283567 2316595 2309591 2199332 2393696 2265685
9687B265685O233j41912J26895p7601j331K44329m1741k4593L3584j13535k00720
$$ 2265685 2271918 2130006 2256901 2179300 2177969 2422298 2380557 2355964 2389548 2276013 2075293
9676B075293K76223J36997j69305n8860K60022n30838Q0370L1748J04984J54090
$$ 2075293 2351516 2488513 2319208 2260348 2520370 1989532 2069902 2101650 2206634 2360724
9666B360724l47702J41845j40136P4545k27127j46870L00728N7747Q6128k04223
$$ 2360724 2013022 2154867 2014731 2089276 1862149 1715279 2016007 2073754 2159882 1955659
9656A955659K25537j96424J71511l221j11141m7120k34839L27296k1015K8972
$$ 1955659 2181196 1984772 2156283 2153062 2041921 1994801 1759962 2087258 2066243 2095215
9646B095215p6152j41462L79065r4790k43234R8531J7836R0160r9587j10269r4486
$$ 2095215 2019063 1877601 2256666 2161876 1918642 2017173 2035009 2125169 2025582 1915313 1820827
9635A820827K31782n58519K95045J53318j64636q9645P3725K38603j47907k47248
$$ 1820827 2052609 1494090 1789135 1942453 1777817 1688172 1761897 2000500 1852593 1605345
9625A605345k17289j43919L29895K13488k10103J35048L2982k49199J44733J84011
$$ 1605345 1388056 1244137 1574032 1787520 1577417 1712465 1745447 1496248 1640981 1824992
9615A824992l25904K7195J19068j35954n1926L7000J1832p4188J6669j38652L51971
$$ 1824992 1499088 1526283 1645351 1509397 1457471 1494471 1506303 1432115 1448784 1310132 1662103
9604A662103k67093j78681J37891Q1245N7201q8910j04951J90051j39822K0154
$$ 1662103 1395010 1216329 1354220 1435465 1492666 1403756 1298805 1488856 1349034 1369188
9594A369188K02659j56236k35220J25514J82385j19816l06209K02305J6506L225
$$ 1369188 1571847 1415611 1180391 1305905 1488290 1368474 1062265 1264570 1281076 1284301
9584A284301J43649j72000R9544k05286j0385j80545K23215J55055m5143J6397
$$ 1284301 1427950 1255950 1355494 1150208 1139823 959278 1182493 1337548 1292405 1308802
9574A308802j43406j83662J02450Q6019m3316j34958Q6809j5641J99730l3436
$$ 1308802 1165396 981734 1084184 1170203 1126887 991929 1078738 1063097 1262827 1229391
9564A229391J48822l61752j0953R9108L7367j92155P5762j7243r7798J61970j39632
$$ 1229391 1378213 1016461 1005508 1104616 1141983 949828 1025590 1008347 910549 1072519 932887
9553I32887J71813j6171J79378j79942J16414r1426J41872Q683j36960j50901
$$ 932887 1104700 1088529 1267907 1087965 1204379 1112953 1254825 1263508 1126548 975647
9543I75647j29265J15447Q395M5722Q3897L0534J43185k00820j652N2300J43001
$$ 975647 846382 961829 970224 1015946 1099843 1130377 1273562 1072742 1071090 1123390 1266391
9532A266391k10022j7857j19605N8701k26377L10123J99641J14151n67436K48731
$$ 1266391 1056369 1038512 918907 977608 751231 1061354 1260995 1375146 807710 1056441
9522A056441K2383L09743n8069j23795O766K03600l60488J24264P6392r2270l4057
$$ 1056441 1078824 1388567 1330498 1206703 1213469 1417069 1056581 1180845 1257237 1164967 1130910
9511A130910k59272J83443p7164R8457r4589J91366j20921M56177j21432k84509
$$ 1130910 871638 1055081 977917 1076374 981785 1173151 1052230 1508407 1386975 1102466
9501A102466q3046L27460k08129J14498P5908r7331j17642J03826L87359m69926
$$ 1102466 1019420 1346880 1138751 1253249 1329157 1231826 1114184 1218010 1605369 1135443
9491A135443J07824n2283P1145Q1275L6971j05582J43100j90742K72144M5892
$$ 1135443 1243267 1190984 1262129 1343404 1380375 1274793 1417893 1227151 1499295 1545187
9481A545187k50109J67510J37059l10335l5772K57973J14557O4369N8279m49709
$$ 1545187 1295078 1462588 1599647 1289312 1253540 1511513 1626070 1690439 1748718 1299009
9471A299009J14094n3769M41833j76126l94k05219K22790P7246Q5373k11866Q9141
$$ 1299009 1413103 1359334 1801167 1625041 1624647 1419428 1642218 1719464 1804837 1592971 1682112
9460A682112J39763q5859K55725k02212M57466k35126K30670j6280J00827j36216
$$ 1682112 1821875 1736016 1991741 1789529 2246995 2011869 2242539 2226259 2327086 2190870
9450B190870L61986J24052J07840J7774J78449k7148N80273K28180J99150J82380
$$ 2190870 2552856 2676908 2784748 2802522 2980971 2953823 3534096 3762276 3961426 4143806
9440D143806J02481L04273K76308m1187j95910n22465k02686m30129m85738j40615
$$ 4143806 4246287 4550560 4826868 4785681 4589771 4067306 3864620 3434491 2948753 2808138
9430B808138L303l63952N3249l05789j88982j28287K07871l0646l73350o0778
$$ 2808138 2811441 2447489 2500738 2194949 2005967 1877680 2085551 2054905 1681555 1620777
9420A620777M6903k0353j22506j3565R3534j43418k46649J82840r4248K63133
$$ 1620777 1667680 1647327 1524821 1511256 1604790 1461372 1214723 1397563 1303315 1566448
9410A566448k93964J62556k95772M0206j02803J76440j60120r9842K49096N4805
$$ 1566448 1272484 1435040 1139268 1179474 1076671 1253111 1092991 993149 1242245 1297050
9400A297050j66474j89534k8420j31758K73873o4783j25551N7354j11042J42155
$$ 1297050 1130576 941042 912622 780864 1054737 989954 864403 921757 810715 952870
9390I52870J63191M4571j00681n41262N31844l51978K4493j18893R8105Q7864
$$ 952870 1116061 1160632 1059951 518689 1050533 698555 723048 604155 702260 790124
9380G90124Q1569P9660r0344j75918L17802l80174K30600k10909K66179k16470
$$ 790124 871693 951353 861009 685091 1002893 622719 853319 642410 908589 692119
9370F92119n6160M78j2586J32891L7321l23840Q1452K86537n1676j12614R5167
$$ 692119 635959 636437 623851 756742 794063 470223 551675 838212 786536 673922 769089
9359G69089n1449r9383K73035k22935O05J21516j23915j28219J40847J10083j4056
$$ 769089 717640 618257 891292 668357 668962 790478 666563 538344 679191 789274 775218
9348G75218j54888K37299k46681O563j69248M93853l51693J64998m34j43060N3510
$$ 775218 620330 857629 610948 617511 448263 942116 590423 755421 754987 611927 665437
9337F65437k33973L4342J70824j10881m1292K08894k55277j46791J19048k8558
$$ 665437 431464 465806 636630 525749 484457 693351 438074 291283 410331 381773
9327C81773J39858k02516M66486k23821k45427O3456N30525l11784m09759K70694
$$ 381773 521631 319115 785601 561780 316353 379809 910334 598550 188791 459485
9317D59485M4770j4579j41144J97092j79997K08270J2352k14583J38072j5376
$$ 459485 504255 489676 348532 545624 365627 573897 586249 371666 509738 494362
9307D94362k70280J81170J40922j58132R5258m34113N64974Q847n8341j42014
$$ 494362 224082 405252 546174 388042 483300 49187 614161 623008 564667 422653
9297D22653o2465K86706l09664l149K18094m0890j26965K22986l52518L52102
$$ 422653 360188 646894 337230 334081 552175 511285 384320 607306 254788 606890
9287F06890j51343k24463L64088m5491k19587K14399k37844K67260k4761O9081
$$ 606890 455547 231084 595172 549681 330094 544493 306649 573909 549148 618229
9277F18229j10152j85662J41122J28616k12538J90699n585j78716J1287l04897
$$ 618229 508077 322415 463537 592153 379615 570314 564729 386013 397300 92403
9267I2403L5187L20564q8228j3246L8422M6405j78085n7798K87316k45574M76601
$$ 92403 127590 448154 359926 346680 385102 431507 253422 195624 482940 237366 713967
9256G13967m36029K94259j72681J81850j09925j6726k08747N866L96114l15466
$$ 713967 277938 572197 399516 581366 471441 454715 245968 251834 647948 332482
9246C32482k5573j07496j26468L67340m78752J33169J04689P9538L9501O5438
$$ 332482 306909 199413 72945 440285 -38467 94702 199391 278929 318430 383868
9236C83868q3159M43439m81202K9526l7330K33969l66189M7652J66283J19298
$$ 383868 300709 744148 262946 292472 255142 489111 122922 170574 336857 456155
9226D56155k24329J14710j01896L15582k18038k8722k55383L10491L08608l41551
$$ 456155 231826 346536 244640 560222 342184 313462 58079 368570 677178 335627
9216C35627J76093l21944J57879j85647P9023n0731J66729K62544L04073o57845
$$ 335627 511720 189776 347655 162008 241031 190300 357029 619573 923646 265801
9206B65801O0240Q2923p0909J86570m85683M46558j57805l9436K7952L0475j04094
$$ 265801 326041 408964 338055 524625 38942 485500 327695 288259 316211 346686 242592
9195B42592o4509O7190J40816J86624l39443L86435o2485k56001J74866k66972
$$ 242592 178083 245273 386089 572713 233270 619705 557220 301219 476085 209113
9185B09113J03704M3477O2755R4715m4820J29948k45347K04390j21189J33134
$$ 209113 312817 356294 419049 513764 468944 598892 353545 557935 436746 569880
9175E69880k75098K97599l59917J68743Q1842R6142r9356L55935l32188L08987
$$ 569880 294782 592381 232464 401207 483049 579191 479835 835770 503582 812569
9165H12569k91803K09950j78451j61334K27329N3562j02139L31497j0499l73144
$$ 812569 520766 730716 552265 390931 618260 671822 569683 901180 890681 517537
9155E17537j0489O2387k54975J68305p8728j15896L81371o9651k747K15472O7466
$$ 517537 507048 569435 314460 482765 404037 288141 669512 599861 597114 812586 880052
9144H80052k52598J71020j55170l9058L31736l4799J1021m26603P7977J52393
$$ 880052 627454 798474 643304 604246 935982 901183 912204 485601 563578 715971
9134G15971K95122l93581m4202R3623K467L5355l223k07998l3116J94128q7790
$$ 715971 1011093 617512 573310 666933 669400 704755 701532 493534 460418 654546 566756
9123E66756J01875J0708j16460J52036J5099R6158k9571J07602o3789R5180j83119
$$ 566756 668631 679339 562879 714915 730014 826172 796601 904203 840414 935594 752475
9112G52475j79417k14575L34632j63209N0764j17220N3911N761m5083j08303L51141
$$ 752475 573058 358483 693115 529906 580670 463450 517361 523122 478039 369736 720877
9101G20877j62195l2806P9014k66049K52994J47106k20824j90318o5044K89288
$$ 720877 558682 525876 604890 338841 591835 738941 518117 327799 262755 552043
9091E52043m35559L43792r5559K37984j36540j15948K3765K74931l42267j72635
$$ 552043 116484 460276 364717 602701 466161 350213 373978 648909 306642 134007
9081A34007L92246k13785j97877J85391J48987Q1374j63487k0905n1904j21377
$$ 134007 526253 312468 114591 299982 448969 530343 366856 345951 294047 172670
9071A72670L52846l78637J25706L7857N4138k30621P0601m1370J22246J53526
$$ 172670 525516 146879 272585 310442 364580 133959 204560 163190 285436 438962
9061D38962m49130J97860K18337k18822O4446R1132j6736j70170J8618K34371
$$ 438962 -10168 187692 406029 187207 251653 342785 326049 155879 174497 408868
9051D08868k84608J59523n2781K67481m76390K64619M4762k19825K87618j37640
$$ 408868 124260 283783 231002 498483 22093 286712 331474 111649 399267 261627
9041B61627K088k70431K67567l55531J62531k18351K04585K59587n9752K2196
$$ 261627 263715 -6716 260851 -94680 67851 -150500 54085 313672 253920 276116
9031B76116j16160J9970J44896k30958J58842j43692q8996j7138L64378l8650
$$ 276116 159956 179926 324822 93864 252706 109014 20018 2880 367258 328608
9021C28608k83311K05106O3129j64498J77696l65547M68809j57258j32009J06314
$$ 328608 45297 250403 313532 149034 326730 -38817 429992 272734 140725 247039
9011B47039j22902K2773J81316k09041m1390P1416J31327k86513K90570l02136
$$ 247039 124137 146910 328226 119185 77795 149211 280538 -5975 284595 -17541
9001a7541J07892l8788L4246j63339N7051N6845K39981j36784Q284J07505l83978
$$ -17541 90351 51563 85809 -77530 -20479 36366 276347 139563 147847 255352 -128626
8990a28626L20169l0303l3844k78461L56699k40019K56597k28095K1629l8660
$$ -128626 191543 161240 127396 -151065 205634 -34385 222212 -5883 15746 -22914
8980b2914L19361j51305J47224j82503l5290J11173j68575j6932N3438O6495o3424
$$ -22914 296447 145142 292366 109863 74573 185746 17171 239 53677 120172 56748
8969E6748R9237J35249n6582J77266m10648K11073q6170N0525n2940Q6061j34659
$$ 56748 155985 291234 234652 411918 1270 212343 126173 176698 123758 209819 75160
8958G5160Q2221j97162R584K30723k47458J31602j7900K11113l63122L7402j01723
$$ 75160 157381 -39781 -30197 200526 -46932 84670 66770 277883 -85239 -47837 -149560
8947a49560J85210K95126o2013J5069r9198k96833J76112q4065L775K817P4368
$$ -149560 35650 330776 268763 283832 184634 -112199 63913 -20152 -16377 -13560 60808
8936F0808J39387j73766Q1708j85136J26997K55566l68221L66326k43619j56707
$$ 60808 200195 26429 108137 -76999 49998 305564 -62657 303669 60050 -96657
8926i6657L92681l8531l1302N8032m53471L85479k68404L85348l58614J86010
$$ -96657 296024 257493 226191 284223 -169248 216231 -52173 333175 -25439 160571
8916A60571k06929O4036l6724J13023J28467k30946J21514r2645k01873K96252
$$ 160571 -46358 17678 -19046 93977 222444 -8502 113012 20367 -181506 114746
8906A14746r0506P0160j53534K33474O2811k24775P8130p9929J49037p4601R1348
$$ 114746 24240 94400 -59134 174340 237151 12376 90506 10577 159614 85013 176361
8895A76361O7387K36481l31862k46115M38922l97989J17913K5802J31467p1391
$$ 176361 243748 480229 148367 -97748 341174 -56815 61098 86900 218367 146976
8885A46976R629k08428K86201k38047J30616j87998M14948l74994Q9517J49901
$$ 146976 156605 -51823 234378 -3669 126947 -61051 353897 -21097 68420 218321
8875B18321q0434q2140k03342K07390Q4822P9748J25353k03838J81676n6128k13704
$$ 218321 137887 55747 -147595 59795 144617 224365 349718 145880 327556 271428 57724
8864E7724j10701J3420K72448j41871j06426m0738L36297l19497J85378J23048
$$ 57724 -52977 -39557 232891 91020 -15406 -56144 280153 -39344 146034 269082
8854B69082k01878J22049J09628j07148j89485K41163j43756o2139M7930N9488
$$ 269082 67204 189253 298881 191733 2248 243411 99655 37516 85446 144934
8844A44934L5318j05095j21010m4752K71713o2543j67432J62452p9411p3977J2581
$$ 144934 180252 75157 -45853 -90605 181108 118565 -48867 113585 34174 -39803 -27222
8833b7222L34548l54534J41769j26116R447Q328K69611j91258j08058l0714L34632
$$ -27222 307326 -47208 94561 -31555 -22108 -13780 255831 64573 -43485 -74199 260433
8822B60433m35422M99166l07446O4239p4705J10404K74407n07709K43606Q1663
$$ 260433 -174989 324177 16731 80970 6265 116669 391076 -116633 126973 208636
8812B08636k96519J22020K79742l82448L6810L99467l09328k05715L18084J9760
$$ 208636 -87883 34137 313879 -68569 -31759 367708 58380 -147335 170749 190509
8802A90509k6674j11070J54308j38784l9754k66599L32331j31287R5783K70302
$$ 190509 163835 52765 207073 68289 28535 -238064 94267 -37020 58763 329065
8792C29065m2723p3952m64032Q9479K79272Q1030j58573j19808m36120O13184
$$ 329065 286342 212390 -251642 -162163 117109 198139 39566 -80242 -516362 96822
8782I6822K0650M7920j01350O055J54468N7100j98004k48133J99417J78758k42084
$$ 96822 117472 165392 64042 70097 224565 281665 83661 -164472 34945 213703 -28381
8771b8381K27139k06943n7084L60705k18485M8548L11973k68477r8310r7831L9759
$$ -28381 198758 -8185 -65269 295436 76951 125499 437472 168995 70685 -27146 12613
8760A2613l10435J59328M42319j54785k07477K44432P1481k91364k48989O64577
$$ 12613 -297822 -138494 303825 149040 -58437 185995 257476 -33888 -282877 381700
8750C81700j12405l43533j5362k8670J96273L4923N1374k9493K50587k83044O9756
$$ 381700 269295 -74238 -89600 -118270 78003 112926 164300 134807 385394 102350 172106
8739A72106j83333K73372O0396j79302r3153O7402j62778l058J41540J97286k26168
$$ 172106 -11227 262145 322541 143239 50086 117488 -45290 -48348 93192 290478 64310
8728F4310j16549K18527o8895p6677l3527L28420l19156J39698n4747j04997k1525
$$ 64310 -52239 166288 97393 20716 -12811 315609 -3547 136151 81404 -23593 -45118
8717d5118J52603J6000R3541j72006K20636m88725L29022o7005K18352l32996
$$ -45118 107485 123485 217026 45020 265656 -223069 105953 38948 257300 -75696
8707g5696Q378j3435P5569J22409k32847K20899J4583K6245P4341j41360l0514
$$ -75696 -67318 -80753 -5184 117225 -115622 105277 119860 146105 220446 79086 48572
8696D8572J47263k9885k16355M14003l57420q5458J53546l280j10287K05039N5960
$$ 48572 195835 165950 -50405 363598 6178 -79280 74266 70986 -39301 165738 221698
8685B21698j44592j2817l06006K48673k2544K10631O1411j42497J67091k28888
$$ 221698 77106 64289 -241717 6956 -15588 195043 256454 113957 281048 52160
8675E2160J16026j36118L47910l32856O3227K77655j41236N8572p7507k13519
$$ 52160 168186 32068 379978 47122 110349 388004 246768 305340 227833 14314
8665A4314J85481j29080j94976N20792k23616L9668n4126m3709K7152R850p7112
$$ 14314 199795 70715 -124261 396531 172915 212583 158457 114748 141900 151750 74638
8654G4638n1344K90939K06201P6258J30651m1734K38236K61144l15947j55572
$$ 74638 23294 314233 520434 596692 727343 685609 923845 1184989 869042 713470
8644G13470r2879m6343q9544j57320K46261j75134n7291o4336J75824j20168J88737
$$ 713470 620591 574248 484704 327384 573645 398511 341220 276884 452708 332540 521277
8633E21277l06619M59653j43521K39224j05330P2499j72886o6535j98476p8309
$$ 521277 214658 674311 530790 770014 664684 737183 564297 497762 299286 220977
8623B20977J64972J4843l58844L99703m6069k04554J21072Q0615j27103o2778
$$ 220977 385949 400792 41948 441651 395582 191028 312100 392715 265612 202834
8613B02834K08662m47293M66725j29852j5200Q9326j57496M8172J90538J2168
$$ 202834 411496 -35797 430928 301076 285876 375202 217706 265878 456416 468584
8603D68584p0934J00785L50061l17924l58121J42359j85953m6891L66451J1557
$$ 468584 397650 498435 848496 530572 172451 314810 128857 81966 448417 459974
8593D59974j94637j05855J89650k31613m1656L24642r5994j47375J26935M8026
$$ 459974 265337 159482 349132 117519 75863 400505 304511 157136 284071 332097
8583C32097O236k46184K58778k63488K90642r4044k89947J13860K43093k53820
$$ 332097 338333 92149 350927 87439 378081 284037 -5910 107950 351043 97223
8573I7223J6802K5980j28151J45149R7527j7465j07129J90428J85031j87181j7821
$$ 97223 114025 140005 11854 157003 254530 237065 129936 320364 505395 318214 300393
8562C00393O1372J98015K8597j44421J57342l1314K07206R9442J1370K96365k29782
$$ 300393 361765 559780 588377 443956 601298 569984 777190 876632 888002 1184367 954585
8551I54585L72423J62555M06455M97861N37702M61552R23971o02047q53745r45170
$$ 954585 1327008 1489563 1896018 2393879 2931581 3393133 4317104 3715057 2861312 1916142
8541A916142l45536K33425l66957j26276l53671O7107O603M1171m1053m48202
$$ 1916142 1570606 1804031 1437074 1310798 957127 1024234 1030837 1072008 1030955 582753
$$ [...]
##END NTUPLES=NMR SPECTRUM
##END=
