##TITLE=abcd
##JCAMPDX= 6.0         $$ Bruker NMR JCAMP-DX V2.0
##DATA TYPE= NMR SPECTRUM
##DATA CLASS= NTUPLES
##ORIGIN= UXNMR, Bruker Analytische Messtechnik GmbH
##OWNER= root
$$ XWIN-NMR		Version 3.5
$$ Wed Oct 22 19:23:44 2025 Russian Standard Time (UT+4h)  servis@DPX200
##.OBSERVE FREQUENCY= 200.131235884673
##.OBSERVE NUCLEUS= ^1H
##.ACQUISITION MODE= SIMULTANEOUS
##.ACQUISITION SCHEME= undefined
##.AVERAGES= 16
##.DIGITISER RES= 18
##SPECTROMETER/DATA SYSTEM= spect
##.PULSE SEQUENCE= zg
##.SOLVENT NAME= CDCl3
##.SHIFT REFERENCE= (INTERNAL, CDCl3, 0, 16.4885)
##AUDIT TRAIL= $$ (NUMBER, WHEN, WHO, WHERE, WHAT)
$$ ##TITLE= Audit trail, XWIN-NMR		Version 3.5
$$ ##JCAMPDX= 5.01
$$ ##ORIGIN= Bruker BioSpin GmbH
$$ ##OWNER= servis
$$ F:\spectra/data/av/nmr/H1/1/pdata/1/auditp.txt
$$ ##AUDIT TRAIL=  $$ (NUMBER, WHEN, WHO, WHERE, WHAT)
(   1,<2025-10-22 19:22:59.20 +0400>,<servis>,<DPX200>,
      <created by zg, POWCHK disabled, PULCHK disabled
       terminated by command 'halt'
       configuration hash MD5:
       00 E9 B6 7A A2 85 ED C7 34 08 36 98 17 FE 4E 26
       data hash MD5: 32K
       1A 3F 13 8D EA 24 04 3E FF 45 B2 CB 33 3C 70 59>)
(   2,<2025-10-22 19:23:01.46 +0400>,<servis>,<DPX200>,
      <Start of raw data processing
       efp BC_mod = 2 LB = 0.05 FT_mod = 6 PKNL = 1 PHC0 = -271.6701 PHC1 = 2.101565 SI = 16K 
       data hash MD5: 16K
       51 25 F7 3F 84 3D C5 FE A4 2D 8B 6A D8 A0 6E 98>)
(   3,<2025-10-22 19:23:20.87 +0400>,<servis>,<DPX200>,
      <pk PHC0 = 0.9625692 PHC1 = 4.4 
       data hash MD5: 16K
       8B 02 39 A3 C0 73 90 2C A8 E0 67 23 7A 37 7F A5>)
$$ ##END=
$$ 
$$ hash MD5
$$ B8 1D 1E 10 E6 4A BD DC 1C 18 53 BF 18 01 4B EA
##$RELAX= 
##$RELAX= 
##$RELAX= 
##$RELAX= 
##$RELAX= 
##$RELAX= 
##$RELAX= 
##$RELAX= 
$$ Bruker specific parameters
$$ --------------------------
##$DU= <F:\spectra>
##$EXPNO= 1
##$NAME= <H1>
##$PROCNO= 1
##$TYPE= <nmr>
##$USER= <av>
##$AMP= (0..31)
100 100 100 100 100 100 100 100 100 100 100 100 100 100 100 100 100 100 
100 100 100 100 100 100 100 100 100 100 100 100 100 100 
##$AQSEQ= 0
##$AQ_mod= 1
##$AUNM= <au_zg>
##$AUTOPOS= <>
##$BF1= 200.13
##$BF2= 200.13
##$BF3= 200.13
##$BF4= 200.13
##$BF5= 500.13
##$BF6= 500.13
##$BF7= 500.13
##$BF8= 500.13
##$BYTORDA= 1
##$CFDGTYP= 0
##$CFRGTYP= 5
##$CHEMSTR= <none>
##$CNST= (0..31)
1 1 145 1 1 1 1 1 1 1 1 1 1 1 1 1 1 1 1 1 1 1 1 1 1 1 1 1 1 1 1 1 
##$CPDPRG= <>
##$CPDPRG1= <>
##$CPDPRG2= <>
##$CPDPRG3= <>
##$CPDPRG4= <mlev>
##$CPDPRG5= <mlev>
##$CPDPRG6= <mlev>
##$CPDPRG7= <mlev>
##$CPDPRG8= <mlev>
##$CPDPRGB= <>
##$CPDPRGT= <>
##$D= (0..31)
0 2 0 0 0 0 0 0 0 0.06 0 0 0 0 0 0 0.0002 0 0 0 0 0 0 0 0 0 0 0 0 0 0 
0 
##$DATE= 1761146578
##$DBL= (0..7)
120 120 120 120 120 120 120 120 
##$DBP= (0..7)
150 150 150 150 150 150 150 150 
##$DBP07= 0
##$DBPNAM0= <>
##$DBPNAM1= <>
##$DBPNAM2= <>
##$DBPNAM3= <>
##$DBPNAM4= <>
##$DBPNAM5= <>
##$DBPNAM6= <>
##$DBPNAM7= <>
##$DBPOAL= (0..7)
0.5 0.5 0.5 0.5 0.5 0.5 0.5 0.5 
##$DBPOFFS= (0..7)
0 0 0 0 0 0 0 0 
$$ [...]
##$SUBNAM4= <"">
##$SUBNAM5= <"">
##$SUBNAM6= <"">
##$SUBNAM7= <"">
##$SUBNAM8= <"">
##$SUBNAM9= <"">
##$SW= 20.6817932712277
##$SWIBOX= (0..15)
0 0 3 0 0 0 0 0 0 0 0 0 0 0 0 0 
##$SW_h= 4139.07284768212
##$TD= 32768
##$TD0= 1
##$TE= 0
##$TE2= 300
##$TE3= 300
##$TEG= 300
##$TL= (0..7)
0 120 120 120 120 120 120 120 
##$TP= (0..7)
150 150 150 150 150 150 150 150 
##$TP07= 0
##$TPNAME0= <>
##$TPNAME1= <>
##$TPNAME2= <>
##$TPNAME3= <>
##$TPNAME4= <>
##$TPNAME5= <>
##$TPNAME6= <>
##$TPNAME7= <>
##$TPOAL= (0..7)
0.5 0.5 0.5 0.5 0.5 0.5 0.5 0.5 
##$TPOFFS= (0..7)
0 0 0 0 0 0 0 0 
##$TUNHIN= 0
##$TUNHOUT= 0
##$TUNXOUT= 0
##$USERA1= <user>
##$USERA2= <user>
##$USERA3= <user>
##$USERA4= <user>
##$USERA5= <user>
##$V9= 5
##$VALIST= <valist>
##$VCLIST= <CCCCCCCCCCCCCCC>
##$VD= 0
##$VDLIST= <DDDDDDDDDDDDDDD>
##$VPLIST= <PPPPPPPPPPPPPPP>
##$VTLIST= <TTTTTTTTTTTTTTT>
##$WBST= 1024
##$WBSW= 30
##$XGAIN= (0..3)
0 0 0 0 
##$XL= 0
##$YL= 0
##$YMAX_a= 114092
##$YMIN_a= -57978
##$ZGOPTNS= <>
##$ZL1= 120
##$ZL2= 120
##$ZL3= 120
##$ZL4= 120
##$ABSF1= 0
##$ABSF2= 0
##$ABSG= 0
##$ABSL= 0
##$ALPHA= 0
##$AQORDER= 0
##$ASSFAC= 0
##$ASSFACI= 0
##$ASSFACX= 0
##$ASSWID= 0
##$AUNMP= <proc_1d>
##$AZFE= 0.1
##$AZFW= 0.1
##$BCFW= 0
##$BC_mod= 2
##$BYTORDP= 0
##$COROFFS= 0
##$CY= 18.4799938201904
##$DATMOD= 1
##$DC= 0
##$DFILT= <>
##$DTYPP= 0
##$F1P= 9.9274215381318
##$F2P= -0.165520771350173
##$FCOR= 1
##$FTSIZE= 16384
##$FT_mod= 6
##$GAMMA= 0
##$GB= 0
##$INTBC= 1
##$INTSCL= 4.127829e-11
##$ISEN= 128
##$LB= 0.05
##$LEV0= 0
##$LPBIN= 0
##$MAXI= 10000
##$MC2= 0
##$MEAN= 0
##$ME_mod= 0
##$MI= 50
##$NCOEF= 0
##$NC_proc= -10
##$NLEV= 6
##$NOISF1= 3.799351
##$NOISF2= 2.8
##$NSP= 0
##$NTH_PI= 0
##$NZP= 0
##$OFFSET= 16.48848
##$PC= 4
##$PHC0= -270.7076
##$PHC1= 6.501565
##$PH_mod= 1
##$PKNL= yes
##$PPARMOD= 0
##$PSCAL= 4
##$PSIGN= 0
##$REVERSE= no
##$SF= 200.130005582386
##$SI= 16384
##$SIGF1= 3
##$SIGF2= 2
##$SINO= 400
##$SIOLD= 16384
##$SREGLST= <1H.CDCl3>
##$SSB= 0
##$STSI= 16384
##$STSR= 0
##$SW_p= 4139.07284768211
##$SYMM= 0
##$S_DEV= 0
##$TDeff= 32768
##$TDoff= 0
##$TI= <>
##$TILT= no
##$TM1= 0
##$TM2= 0
##$TOPLEV= 0
##$USERP1= <user>
##$USERP2= <user>
##$USERP3= <user>
##$USERP4= <user>
##$USERP5= <user>
##$WDW= 1
##$XDIM= 16384
##$YMAX_p= 396125834
##$YMIN_p= -3672355
$$ End of Bruker specific parameters
$$ ---------------------------------
##NTUPLES= NMR SPECTRUM
##VAR_NAME=  FREQUENCY,     SPECTRUM/REAL,   SPECTRUM/IMAG
##SYMBOL=    X,             R,               I
##VAR_TYPE=  INDEPENDENT,   DEPENDENT,       DEPENDENT
##VAR_FORM=  AFFN,          ASDF,            ASDF
##VAR_DIM=   16384,         16384,           16384
##UNITS=     HZ,            ARBITRARY UNITS, ARBITRARY UNITS
##FACTOR=    0.252644378177508, 1,           1
##FIRST=     3299.83951724647, 0,            0
##LAST=      -839.233330435636, 0,           0
##MIN=       -839.233330435636, -3672355,    0
##MAX=       3299.83951724647, 396125834,    0
$$ Real data points
##PAGE= N=1
##DATA TABLE= (X++(R..R)), XYDATA
$$ [...]
8993 5132787 2462262 2302414 2118516 1491499 1702729 2740486 1054660 1489346 2360173
8984 2360173 1595521 1885449 3826714 1044322 1792936 1552265 2127907 3404457 3599486
8975 3599486 1262689 2405161 1235564 1597756 2035858 3353665 4612248 4252876 928085
8966 928085 3634189 2027772 2008116 4751155 2576132 2457135 1238096 2312590 4683946
8957 4683946 1346443 2350839 1613001 4057604 2607516 3720448 2626572 4158118
8949 4158118 4403085 1674079 1434669 2518875 3080415 1170032 3702864 1781075 3044988
8940 3044988 1170017 2013569 3500761 3118928 63080 2220937 1864491 2031579 1623480
8931 1623480 2781297 3465202 3192256 3187119 1887621 1380985 1711563 2235548 563222
8922 563222 1134152 -287771 3903634 478495 3388985 6071794 1621032 2754451 3583629
8913 3583629 744550 1027379 2708095 1434110 3031557 1944074 1331944 2422547 3389283
8904 3389283 2833178 1778584 4191741 4077771 1396695 3157264 1863453 3755309 1066727
8895 1066727 1123592 3769521 2459052 2897010 4011634 3250623 1415275 3595904 1774248
8886 1774248 1471409 1281450 2982310 1215814 1552278 1353925 1627416 4461281 297552
8877 297552 1888940 1630398 4030872 3233051 4298222 3428696 2740523 2610590 2785133
8868 2785133 2625034 4148242 1282862 3985381 2436969 402386 863139 962129 1759685
8859 1759685 3146756 2802567 3466337 2539140 2097673 403613 2424522 2192155 2822440
8850 2822440 1019742 1965675 2902526 4178893 3655987 2851776 1745277 2458863 3614865
8841 3614865 3700548 1314707 2930381 3953179 1122542 2349526 4801637 3378780 6327827
8832 6327827 933616 1530783 1543190 2270669 486122 1657434 4705654 3888596 3822520
8823 3822520 974746 2630736 2603376 422838 1991870 2953069 3400363 1934678 2199772
8814 2199772 3464768 3965156 1844906 2343792 1896871 4324138 4373362 2266085 5015747
8805 5015747 1542642 1475860 3227896 2053460 5040779 1747119 1883762 3955137 1974588
8796 1974588 4351551 4521354 2730446 3358882 3716741 3373994 4282192 4259082 3075239
8787 3075239 4075165 7667014 1883178 267647 2830937 45082 2415442 2168670 3583593
8778 3583593 2142192 3443098 4021620 3060173 4704115 3579683 3437855 4003990 2499493
8769 2499493 3905620 4005865 2696697 3236778 2924586 3412336 2049170 4242770 2625403
8760 2625403 4802915 2317228 2009563 4818628 2681564 2697957 2331269 3010890 4788006
8751 4788006 3397251 3875756 4193769 2929678 2554861 1913899 3279503 2965697 2148160
8742 2148160 1898767 3615282 4390924 3104958 3330220 1818973 3784434 4636049 697504
8733 697504 3932627 2906554 3856936 4109357 4833996 3473418 3023330 1154862 4104021
8724 4104021 3950965 1932562 4119515 2520141 2799277 4061676 3742505 2228591 4077419
8715 4077419 2970261 2912080 2378628 2297298 5936494 4873988 3978128 5184908 3616024
8706 3616024 2824257 4663152 5644169 2039838 3563362 1621086 4048923 1510009 4294871
8697 4294871 4797412 3001679 3147264 5965717 3406122 3218868 5835094 3930133 1813466
8688 1813466 3384254 4802618 3457081 2679020 3730084 4685991 5892196 3873550 3772708
8679 3772708 4319915 2988761 4278905 4114662 3457478 4739474 3683785 2328493 3925763
8670 3925763 3720404 4506598 4379698 4951264 3868707 4292284 2571767 3096114 4633032
8661 4633032 4941751 3304407 4653087 2817729 5390318 5933371 3676281 4037356 4302846
8652 4302846 2899718 6008960 4270665 3361123 2199483 3306600 3842130 5031860 3903100
8643 3903100 3593145 3544376 3489957 5654727 5160957 3261166 5991779 3536784 5433343
8634 5433343 3397146 4583031 3085932 6336421 3608846 5378792 4594071 2821735
8626 2821735 2791013 4773427 4973131 4130362 5116314 3453234 3892387 3478629 5773037
8617 5773037 3724450 3669663 6046654 3332519 3046494 5212311 5068969 4865334 4811591
8608 4811591 5604367 5431571 3706996 4510867 6190379 4738261 5609073 6169135 3416691
8599 3416691 4831015 5379520 5953341 3668130 4412330 5076095 5206834 5316348 2043876
8590 2043876 4375700 7795218 3041052 3436582 3989072 5136498 5681679 6466390 4187622
8581 4187622 4904438 6243531 4377505 6191231 7888899 5240786 4992455 6167357 4753746
8572 4753746 5001282 5037933 6134104 3693699 6458835 7096719 5404903 6274198 6821682
8563 6821682 5611434 5175937 6139205 6619659 6629375 6110192 4365239 6227917 4810673
8554 4810673 6408796 7017915 5432914 5389772 6575908 4269145 4882451 5008955 5209329
8545 5209329 6701428 4231523 4956728 5849062 4611369 5934421 5696461 5433969 5436170
8536 5436170 4394573 3550345 3779835 14893613 9534840 6869909 7638136 7216110 6563680
8527 6563680 8004683 8629102 8982985 8339404 8115524 6620999 6834082 6815765 6435833
8518 6435833 7234156 5649188 5548598 6252578 8503139 6163515 4694636 7029783 7329299
8509 7329299 8069066 9008061 8334123 5037824 7352357 7045984 7944767 7823394 6575861
8500 6575861 6300576 6920786 6042915 4717470 6841171 6676156 7229663 6311360 7477990
8491 7477990 6216314 7757097 8011052 8043171 7857565 6870355 7206941 8019225 6666878
8482 6666878 7403322 7485328 6432509 7817906 8371350 7139780 6129909 8192387 7759520
8473 7759520 6274087 7837534 7326061 6138703 7031988 6890804 8349091 8481809 8902875
8464 8902875 8508473 8129729 9098881 7416474 7823912 9299052 7868709 6901998 8890205
8455 8890205 7643208 7020783 7822990 9688308 9399318 9462599 7740197 10602300 8761340
8446 8761340 7750896 9786283 9355519 8023974 7059115 8949839 10740070 10689204 9845420
8437 9845420 8915795 9400346 7023943 10272907 8815272 7320176 11042964 8316584 10567497
8428 10567497 11450418 10098984 8048277 9061524 10444702 8579908 8637224 9864488 10528151
8419 10528151 8852884 10442785 9020635 7879110 9592296 9048350 10092205 9873640
8411 9873640 9551902 9231621 12038823 9110893 11189730 9599590 9141058 10328015 11416220
8402 11416220 8662337 12528351 9042421 10537329 10623310 9870583 8903291 9756821 10234681
8393 10234681 8864271 10056026 11209814 9639059 12403633 9719946 12714046 12060778
8385 12060778 13102219 10863154 10816113 9475501 11355487 12652231 11490714 9057490
8377 9057490 9861177 11695776 10754578 11018803 12492203 13432232 11095104 13735327 10894470
8368 10894470 11639131 12323724 10161631 13423850 11407641 10768598 11700005 11813069 11278339
8359 11278339 11608271 12771978 12492604 12716457 12358622 12825726 13351099 12999810 12282573
8350 12282573 12101725 12940657 10613373 11280507 13507422 12520245 11347929 11427352 13116514
8341 13116514 12905660 13050075 11728419 12983348 12792756 12980747 11940326 11889241 14307741
8332 14307741 13928768 12867022 12849354 13890065 14024923 14436344 12632731 11020602 14504270
8323 14504270 14413881 12449769 14497682 14865032 13325125 14055024 14398631 13018286 15012682
8314 15012682 12216963 17241391 14003726 15179373 11159592 12047873 11375524 12700949
8306 12700949 14380603 14736346 13194731 14766034 13546439 15309968 14675124 13620700
8298 13620700 14328418 15559919 16926150 15155532 15945696 14697776 14256349 14701379 15496279
8289 15496279 15564650 16408086 16860165 16805323 16689810 16707591 17271684 16277783 15477494 14190276
8279 14190276 16471259 15969271 17527605 16584285 14973618 16153386 16552260 15169178 18363733
8270 18363733 16632866 16223696 15859671 16970769 17863706 16974285 16254972 17870159 17018135
8261 17018135 17964808 17633148 17176933 15682518 15907268 17346396 17676895 16471622 16609707
8252 16609707 19868297 18913439 18949063 18720553 17612275 16935596 18144117 19306513 18123169
8243 18123169 19453575 18915990 18165706 17598419 16947668 18772939 19447581 20210626 18400611
8234 18400611 18612258 20879338 17776804 19154077 20670896 19280325 18363826 20611370
8226 20611370 19961651 20480629 18662306 21371920 22212298 19926414 21449856 18132531 20188594
8217 20188594 21394286 20667415 22039081 20939802 20752147 19105327 18559778 20555904 21767513
8208 21767513 22689170 22230196 20724924 21481256 22628901 21591826 21884808 23082297 20860449
8199 20860449 22597988 22447686 23857346 23829673 21361698 25438909 22128757 6692436
8191 6692436 23043850 23135162 22605590 23603329 23854048 23974176 24336567 24225802 22244305
8182 22244305 22626631 23793479 25117128 23628149 21673049 24611714 24170926 24195197 25385270
8173 25385270 24251715 23862664 25351794 23358799 26094886 23396051 23573749 22902065 26746433
8164 26746433 25710176 24081371 24944180 24740222 24288689 25050571 22856116 24441665 25071003
8155 25071003 23617040 25353115 27097238 24955499 25815688 28336124 26367521 25653128
8147 25653128 26735047 26213012 27260534 25863322 24944390 26542533 27913875 24981845
8139 24981845 26808147 28720979 26168529 26348936 28303063 26748355 26390351 27305295 26174168
8130 26174168 27430159 28055078 28122808 28640289 28025558 30355353 28569431 30088134 28097294
8121 28097294 29672487 28729807 27915070 27803840 28075682 27741869 28443547 28268229 30257975
8112 30257975 29144988 31297732 30651439 30882085 29481409 32776562 30303437 33626880
8104 33626880 30704799 30828987 30390099 30196706 29916994 32910862 30161451 32001967 31476081
8095 31476081 32809711 30407850 29043504 31790641 31358251 32687177 32687264 32587285 30764116
8086 30764116 30961623 33091083 32593836 32220861 33453239 29501676 32323361 31925135 32597642
8077 32597642 34294858 33451639 33938851 34360389 33902070 33441905 33677084 33122752 35198328
8068 35198328 33663516 32772599 32842986 34605085 35579681 32627478 34809850 36157271 35145574
8059 35145574 35537979 35454618 34220348 35788302 35366806 35568858 36185824 36248551 35635899
8050 35635899 36019173 36529759 36417619 37481099 36011067 35258306 36601417 35248395 36213041
8041 36213041 38378568 37863014 37195044 39347536 37871856 39548121 38572355 37040688 37947785
8032 37947785 38765375 36766674 39016035 38570289 38807670 38357424 39394814 39719147 41778367
8023 41778367 39561641 41035251 42777526 39716466 38895673 41923555 38896627 39110212
8015 39110212 41773000 40928561 41140802 43573841 41246565 41003815 43217022 43226603 44501141
8006 44501141 41501918 43866098 43021565 42770498 42932470 43666851 44994708 44345887 43257447
7997 43257447 43857558 43786306 43865621 44872819 42442653 45893192 44385483 42632990 43420322
7988 43420322 46442439 45593217 44204424 46367716 45881629 44477923 47941319 45596427
7980 45596427 46776414 43451635 45862792 46090201 47063965 45265389 47824603 46390571
7972 46390571 46354276 46641726 46877532 46683938 49819001 47977835 47885967 46473209 47542166
7963 47542166 46685086 47955669 46616037 47434698 48510356 48189639 47060790 48960900 49545972
7954 49545972 47898237 48747664 52029930 50746355 51395798 49255108 50447006 51595437
7946 51595437 52605191 49180014 50872012 49307323 51083651 50683738 49962263 50288646 50067313
7937 50067313 50953624 52308247 52250592 52767289 50755910 52500378 51068314 53009865 53727274
7928 53727274 54112651 52487217 54303964 55025917 52270948 54045899 56137147 52651913
7920 52651913 52236558 55230934 55983002 55315380 54623244 54447659 53261216 55272878 54504493
7911 54504493 55895692 56240668 53313477 54605019 57127213 54471311 54581517 58181737
7903 58181737 56450177 56156732 59980183 58703934 57467295 57424769 56489182 57021533 56507949
7894 56507949 57612154 58474838 58363802 57079414 58818226 59435458 59862907 58523984 56319122
7885 56319122 59709379 59979393 61060451 58015926 59619426 60773747 60917579 59160012
7877 59160012 62916204 60627727 60330545 60947546 61842736 60398047 60735444 62552265 61463118
7868 61463118 61375748 61931446 62542958 63140544 62407330 64167823 62898402 63295260 64150341
7859 64150341 64558312 64462694 64957119 64814645 65169405 67677391 69978147 71503755 77314357
7850 77314357 54229470 58964626 62586886 64989925 62016235 63230106 64176707 63860013
7842 63860013 65507687 66658956 65601581 66771529 67283405 67172793 66827784 66147689 67798183
7833 67798183 67881919 67723102 69572251 68750491 67364336 67729291 68738038 69620127 70729080
7824 70729080 70215808 69176609 70184374 70242038 70958068 70257220 70887668 70086810 70818288
7815 70818288 72415590 70479453 68294715 70924708 72083717 72043201 70053088 71448428
7807 71448428 70851849 72796399 70911923 73876771 74082250 74071969 72794752 72176412 75493928
7798 75493928 75317877 74972506 75844096 74301783 76453275 75944296 76141486 75333522 75885804
7789 75885804 75415924 76025373 77735691 76499692 75794130 79053785 75968142 78172911 78387355
7780 78387355 77424412 80751358 79492600 78888241 78713485 79032801 80215593 79716363 80860742
7771 80860742 80512390 80497546 80167895 79854743 80950962 82497380 83556524 80109758 81877615
7762 81877615 81712937 82963944 83420973 84092343 83703502 84272208 83398100 84536035 86274359
7753 86274359 84628035 83346803 83628049 84431084 86520645 86830270 86208948 84594253 85826614
7744 85826614 86762880 85231115 86384254 85577546 88442435 86107700 86753195 87985007 88145155
7735 88145155 90660695 89127005 91017908 89133620 90423124 92097844 90166601 90456998
7727 90456998 90281282 91801479 92555910 90557575 91876927 93954959 94120170 92302102 92628389
7718 92628389 93463536 95141227 96576074 95853312 95264139 95668204 96405775 96935834 95736218
7709 95736218 96857360 95127787 97231417 96643930 96869559 95528882 97460493 96309917
7701 96309917 97178922 96708711 99262103 98181650 98691509 97713802 96965612 97931530 96378724
7692 96378724 99272684 99084356 98141900 99834006 102260481 100655272 100795413 98763558 98291990
7683 98291990 97412673 100700493 100671537 98517867 99617279 100854200 98132009 100289159 99706585
7674 99706585 99327065 99738647 99932306 100639791 101340257 101879805 100090586 100118232 101439290
7665 101439290 101778286 103791397 102515920 100487428 102334790 104162025 105075950 102697576
7657 102697576 103510277 103615020 104478894 104946190 105449712 106423143 105238300 103558815 105236356
7648 105236356 104950186 105687867 105783582 107231319 108244126 105595773 105365841 107382648 107311513
7639 107311513 106676878 107472822 107027408 107177000 106005524 108344035 108453572 107225589 108089149
7630 108089149 106636483 109427960 110977775 109868436 109867183 109050938 110590497 111128979 109554987
7621 109554987 111782630 111329142 111050841 111119434 109190499 111552574 111211307 110478054 109307737
7612 109307737 111595292 113288597 112894989 111687167 111874092 113832495 113004079 113224718 112754005
7603 112754005 112111554 110429249 112218544 113587523 115861577 112791326 113972359 112604686
7595 112604686 114147919 115930121 114933377 115121027 116249828 115644811 117039983 116977715 116002798
7586 116002798 117496892 117374777 116035065 119189656 116445433 120142248 118881710 119244731
7578 119244731 118577707 119361628 118859559 119936730 120696523 120188329 121939831 122158359 119615888
7569 119615888 122124451 121438663 121443075 122718991 122652732 121554593 124115063 122974867 124051122
7560 124051122 124805729 123180417 124602722 125671895 125094663 125777923 126377462 125180865 125441821
7551 125441821 126284720 123948312 127577752 127304495 129407263 126446192 130237336 128451970
7543 128451970 126523658 128295482 129188868 129138796 128507332 128374097 129333073 128686785 130905530
7534 130905530 129418418 132837503 130571899 131939667 130802265 132023544 131674098 132869593
7526 132869593 132056820 133688199 134922326 135547707 134394875 133314677 133777048 134674234 136400634
7517 136400634 136377994 135338169 136011890 136043404 137738812 138773416 139091836 139071672 139044181
7508 139044181 136558689 138543191 137548578 139751504 138846233 138764588 138693975 138845287 139984431
7499 139984431 139198165 140176450 140036050 140561121 142812573 141788125 140907161 141599632 143714864
7490 143714864 142401412 142628000 141821590 144304569 143016524 143550379 145379333 145072245 146309428
7481 146309428 145793176 146714678 146055461 144510118 144599180 145857088 145145649 145651537 144132210
7472 144132210 143129023 142950032 143310570 144945493 144997060 143105157 144877629 142237257 143363358
7463 143363358 141701424 142041045 142431379 141129341 140972192 142202622 140071012 139266476 139725399
7454 139725399 140364767 138686296 140343786 139512118 140703945 141106174 137684198 140098661
7446 140098661 143195336 139348081 137663557 138380255 137608120 138887205 139597905 135294383
7438 135294383 137787144 138293317 137264001 137176979 137166112 136881643 137338087 137843097 135612802
7429 135612802 137001847 137543309 135618923 135140930 137608273 135989833 136096923 139093578
7421 139093578 137878259 136417002 136327160 137395078 137171062 137664253 136585213 135810784 136129287
7412 136129287 135435864 134335016 135204356 136110938 134754090 135074028 134503953 135221734 135374279
7403 135374279 135373113 134900989 134046877 133832248 136677008 133769357 133916401 135151199 133050548
7394 133050548 133309807 133318654 131605733 131890822 131902834 130406066 130841677 128138893 130038253
7385 130038253 129527602 126920310 128341640 129239321 128364311 127945912 128346668 127824247 126269037
7376 126269037 127850186 126474121 124980358 125165930 126667175 125262386 125068138 125258085
7368 125258085 125092828 125957236 125284197 121788152 125105875 125279868 126629050 124703598 125733912
7359 125733912 124472125 124969208 125421612 123144267 123384903 121829033 124959035 124343458 121146716
7350 121146716 122643011 121407568 121278510 120888689 121786157 121746459 119521453 120782438 118137484
7341 118137484 122422700 120206508 119796598 120516031 118060490 115868160 118196295 115870178
7333 115870178 117596998 116610336 117521262 116261243 117355329 116284687 118146803 116498017
7325 116498017 118142239 117747749 116504516 118072290 115525730 117297687 117243971 118466349
7317 118466349 118196243 116594760 118140105 117051662 118818721 117585041 119145911 118230618
7309 118230618 119900853 117415005 118869424 120219367 118220698 117333459 119939066 119726377
7301 119726377 118866446 120895687 122293717 121961167 120981762 120145616 123351744 119762719 122653174
7292 122653174 120919246 122765194 122064163 120345053 121182910 124049664 124039818 125032981 127301998
7283 127301998 123053398 125727817 127351511 128379947 129844371 129518180 131681510 133136559
7275 133136559 133438619 135838683 139671545 140443461 141326749 144412043 146169071 146729013 150962129
7266 150962129 151173133 154205341 154346945 158604245 161657906 164807977 164464793 168823649
7258 168823649 171069148 175733920 176692360 180497780 181975169 185565249 187365598 188096325
7250 188096325 183220442 181451432 179392780 174791058 169385507 164306721 159795731 154469456
7242 154469456 148502938 141978533 137139763 130348151 129723445 122774871 121319745 117456055
7234 117456055 114250076 112816709 110195035 108750543 108064740 105409943 106101440 103290154
7226 103290154 101882266 102799090 102303387 101084452 98716648 98793981 99509355 100490423 97861193
7217 97861193 98933204 95352106 97074903 95831824 97523551 94556838 94913806 98184999
7209 98184999 97339634 94953575 96451038 93214842 96092395 94996178 96032804 95428995
7201 95428995 95190015 96353074 95732206 95573869 97297887 95894852 97996987 97510897 96398397
7192 96398397 96756193 97193340 95755251 97409115 97266331 96298308 96288630 97996556 99386109
7183 99386109 99802113 97638604 97378290 99696621 97405439 101361250 95491853 98636973
7175 98636973 99937910 98710949 100130144 96230365 97234763 99142093 97971127 99868422
7167 99868422 98445500 96339399 98896807 101926903 100109183 99872688 99346285 99993411 98527215
7158 98527215 98671720 99685326 100728322 102052789 101993595 101284494 101230467 101655304 101161785
7149 101161785 104090165 102932126 101188552 102969083 104477053 103407389 105069358 103951310
7141 103951310 104190483 103666132 104338362 105069440 107462944 107059374 108530911 109376777 107197652
7132 107197652 109450089 106663773 109979023 111387987 110285219 108673452 108868214 108973678
7124 108973678 108418832 111512768 110497256 111880210 109862329 112161791 111444927 109088302
7116 109088302 111593176 110290412 111443240 110265799 111122721 114491634 111503523 112244381
7108 112244381 112706177 111087318 113841167 114546339 113816163 116059464 115367841 116952890 115992747
7099 115992747 116588199 114860399 114646731 113663516 116597300 114665090 114837171 113997780 113958654
7090 113958654 114088107 114663256 113625334 112170445 113419752 113731537 110747610 113112603
7082 113112603 112056873 112434801 112119214 112372604 110657571 110333469 108828497 111389973 111485931
7073 111485931 109381123 109804639 108528797 110562565 106724406 108395784 109822735 106203992
7065 106203992 106633194 105950740 103703378 105723293 105725327 105302908 104948544 102419204 101085334
7056 101085334 101282946 102900655 102874475 101481884 98974587 100325358 100105775 101377182 101686305
7047 101686305 101075703 102693741 100508813 98106272 101685801 99848775 101571941 100902211
7039 100902211 99620822 98033465 98886604 95950378 100191326 99392094 99709981 100981090
7031 100981090 99403658 98787345 100101854 99494863 98524200 96006435 97984702 99716766
7023 99716766 97654857 98320153 95141839 97492117 96719008 96848282 95762570 95272993 97536908
7014 97536908 94895933 96441597 96522968 93103513 92254346 92234593 92773517 94119369 94244452
7005 94244452 93516475 92051747 93449656 91096946 92013251 90275246 89274044 89997458 89882577
6996 89882577 91095660 88312475 89271455 87565580 89428353 89874557 89900717 90817611 89945180
6987 89945180 89031516 92213188 89730510 91128605 91662029 89550355 86752849 89195705
6979 89195705 87129250 87256898 87319907 87322971 87365413 87106095 87678647 86740556 84327072 87389833
6969 87389833 86232748 83967331 85080922 83070154 84269688 85765286 82821734 84756465
6961 84756465 83583721 82353035 86187492 83138729 83385288 82802764 84019129 82955515
6953 82955515 85158864 84562904 83929386 82489378 84717851 82825460 81731776 82802974
6945 82802974 83298430 82306082 82725694 81220947 82032445 80899214 80199407 79935509 81025384
6936 81025384 80105265 79007588 79127043 77732607 80559477 79552689 77266266 76951891 77827803
6927 77827803 77801799 75331996 76037425 77062681 76072761 76697094 75961470 76470376 75872219
6918 75872219 77849362 75253905 74150354 75753177 76146210 74672187 74873320 74409827 71598959
6909 71598959 73772007 73140214 70025540 71026032 71206975 72211048 70864048 71109754 69281367
6900 69281367 71187403 72324326 70757792 69345495 69800984 70542199 69548525 69609069 68830016
6891 68830016 68473938 68078541 67369555 67642877 70763298 69419775 70082597 68432186 66782145
6882 66782145 67828035 66560960 67390436 65854793 65869796 66686632 67142982 65668825 63726009
6873 63726009 63989765 64026585 65473461 67574044 65279413 65699831 66291838 66005665 65236569
6864 65236569 66600879 65883106 66795941 65177122 64402731 63901113 65587166 64574806 63359703
6855 63359703 63182921 64733012 65211355 63430107 65504353 64580239 63338508 65913459 65273168
6846 65273168 64640310 66250289 64325898 64878840 63393014 64968438 63676417 63051240 62407276
6837 62407276 59491037 60205141 61197469 58626355 58708631 60103624 58368407 57108118 56622322
6828 56622322 57839646 59140444 59305980 57114669 56212912 56935920 59720643 55793439 57851496
6819 57851496 57764597 58904812 57161657 59553918 58967130 57639725 57950333 58722132 58943385
6810 58943385 59241675 57648208 59102272 58930542 56865527 59441054 59508796 60804728 57880071
6801 57880071 56543244 56060953 60037844 56664728 57825653 57712546 58189070 54856918 56488125
6792 56488125 55559738 55641439 56866046 56129977 55407259 56296975 56217842 56019532 56545739 57287900
6782 57287900 56677585 55754738 57034801 57634981 55042923 57630476 58490409 57223776 57142948
6773 57142948 58261579 57357644 57752176 57236669 56762815 55693664 57301758 56015295 57811796
6764 57811796 57868406 56624639 54324880 55164965 57212401 56778542 55870234 53975611 55431358
6755 55431358 55610687 55452483 57403118 56093276 56061940 56837327 54549106 54962192 57419220
6746 57419220 57737027 57218094 56408962 56469846 55895073 56834659 56059067 57647434 56905633
6737 56905633 56584854 59413023 58513362 58601830 59257062 58626433 58051273 58948603 59346437
6728 59346437 59065334 58327238 60229299 57773882 61135978 60215015 59416649 59153029 61132512
6719 61132512 61256122 60006693 61229861 61338740 59866300 58874814 60708766 60369212 61976856
6710 61976856 60154529 62361943 60821252 61554190 61915054 62297952 60560608 61728346 61936549
6701 61936549 60440346 64814333 62940012 61482544 63573823 64473433 63277593 64681342
6693 64681342 65009923 66084555 62710761 65930770 66204749 66984364 67825621 66271457 66528252
6684 66528252 66129137 67871542 65302764 64366620 67212439 67642268 66934374 66912967 68039859
6675 68039859 69512139 68869040 69172937 69874824 69995980 71438304 69695924 72722222 71499468
6666 71499468 72173005 73288232 76152937 75650794 76429427 76801998 77486624 78863896 77238808
6657 77238808 78615681 81152563 80415479 80336467 81357958 79769892 85500497 83922511 85900997
6648 85900997 85765440 88015414 88261772 89184017 91486525 94258181 94073089 96135287 95634647
6639 95634647 98466498 97614044 97216194 97504951 97361558 99463560 98649826 100969434 100533312
6630 100533312 100868159 99254367 103293405 102958508 101693834 102381590 105294119 106987477
6622 106987477 107599293 110512445 111464205 111947048 116879139 117063626 119704623 122917200 127840969
6613 127840969 130231281 130439346 129055457 124555332 127093485 124725362 124653095 122777580
6605 122777580 122078203 117999622 114377305 111603516 110663310 106910433 107970167 106468249
6597 106468249 106011039 107638984 106271864 105609513 106181378 104821215 103829041 106118675 108848536
6588 108848536 111469938 113834250 115559991 119014670 118894550 115750463 112077337 110118531
6580 110118531 109224184 108206030 103275126 99439788 96066937 92293931 87911280 85258096
6572 85258096 80933508 81977409 78173031 76494647 73968313 75414817 73650177 74403104
6564 74403104 71276120 73159231 72939349 72363919 73342068 72385213 72924497 73100959 71860857
6555 71860857 71902759 71928870 68555397 68885835 67175480 66483581 66547729 64548965 61378527
6546 61378527 60907994 59610597 55580820 56723583 56427768 55195212 52401999 51522098 52824193
6537 52824193 54706924 50955094 51365743 51958862 50274499 50505739 47866997 49760077 49701986
6528 49701986 50749196 47389195 48004845 47761637 47576549 46546851 48067543 47116767 48768220
6519 48768220 47251408 47590511 47752832 46958662 47972786 46816497 49648097 45841589 47030091
6510 47030091 47021475 46267910 46493185 47695153 49120261 47484959 45100385 45627827 46321490
6501 46321490 44439366 44297413 45944016 45148511 45634675 46633554 44789722 44483943 44358075
6492 44358075 46042906 46810206 45427546 46309717 44750869 43149498 43785602 46767243 44043623
6483 44043623 44245347 45213094 45657336 43731726 42275525 44049285 45368789 44380111 43725310
6474 43725310 43955348 42177592 44584161 43011091 44006899 43001465 43435152 42266452 41785626
6465 41785626 41916100 41299252 40529533 43483967 39844871 42337471 41641991 42158763 38964653
6456 38964653 38902090 39454108 39175049 39613619 39815203 37561781 39463328 39166472 39219709
6447 39219709 37507628 36467972 36997786 37585800 38333975 37024472 38869115 34535345 37511943
6438 37511943 36622492 35253729 35297333 34698567 34039881 33731063 34249328 33292498 32825667
6429 32825667 32669066 30072087 33842747 34590031 32758142 33799904 32031097 32720391 32906490
6420 32906490 32582238 32776796 30267793 31347226 28518287 28758235 28338616 30250280 29050071
6411 29050071 27740484 28830960 29173545 30297340 29789064 27924844 28879729 29678554 27459749
6402 27459749 28519290 24871644 28515862 28805715 28371023 26257633 28496578 27719188 26934599
6393 26934599 27746947 27759984 26691013 26385324 28021196 26465858 26472407 25844367 24287066
6384 24287066 25259239 24155784 25123776 25501317 26773375 24299713 26976916 24060408 24123094
6375 24123094 24527420 25371233 25902101 26499585 24470887 25549105 25445385 26231221 27750884
6366 27750884 25128835 25450727 26320951 23584231 24763329 23722657 24474973 23765583 24558122
6357 24558122 23501466 23289508 22277912 22882117 24135478 23041485 23251660 24040856 23924842
6348 23924842 23489179 24615235 22747435 23628394 22975411 24298624 25122103 23183880 22852558
6339 22852558 24304548 22956529 23828558 24685855 25876679 23107031 24865061 21611461
6331 21611461 22284230 22139095 23206580 24184035 24236599 23130550 24653828 23236987 23891251
6322 23891251 22009027 23896264 21829441 22885631 22221396 23923662 25138562 23115447
6314 23115447 23735130 23322457 24741926 22308451 22528996 25055017 20691739 21489179 24091092
6305 24091092 21424508 22198951 20966205 21932594 22797379 22941003 22450515 20845763 22542488
6296 22542488 21768857 20659108 22718690 21072022 21757883 22830832 21012580 21817691 21620887
6287 21620887 20743581 20628599 21072202 19931095 19208497 20487929 19507131 21088598 20552211
6278 20552211 20944921 20394762 19632215 18014211 17779932 21327464 20290086 22184906 19927527
6269 19927527 17845796 19549994 20628170 21253804 19833755 18448942 19080420 18336916 18481668
6260 18481668 18684569 17774636 18630707 18527809 18806549 18349816 18879600 16977820 16136280
6251 16136280 16523160 17819010 17499858 17951464 17238142 16844866 16477803 17345868 18449199
6242 18449199 15803557 17298737 16987766 17505865 17314984 17254167 15599954 15663702 18294733
6233 18294733 13495441 16016278 14448878 15347724 16089953 15665454 15812968 14691821 12991202
6224 12991202 15596438 14251562 14610227 14790185 11896714 16171400 14145375 15188986
6216 15188986 12778817 14134841 11849551 14523251 15301110 13689267 16068562 13774870
6208 13774870 12586493 15405606 13775307 14292473 13002223 11918187 14012900 13049352
6200 13049352 12061305 13176244 13044967 15343453 12951474 13416382 11394275 12715482 11769087
6191 11769087 10337511 11822244 11656331 11916902 11430417 12949365 10465198 12100388 14778721
6182 14778721 10045965 9668407 10725440 14473954 10730859 10002569 11160064 11342651 10813047
6173 10813047 10490362 8952314 9890422 10457962 9413397 10063546 9798063 9892638 11540148
6164 11540148 10516064 12287039 10858858 9454497 10315716 7074237 7870127 8559678 9688269
6155 9688269 7297615 9239916 9205674 9233112 9547546 9867767 9941357 9336569 8601390 9704413
6145 9704413 10370518 9613024 8702512 8631940 9186992 10619984 7634454 10881955 9273942
6136 9273942 8127359 10001414 9123155 8395743 10337611 7229272 9261162 9586517 7501715
6127 7501715 10093166 8427068 8622859 6412949 7790008 7676280 5865628 7917035 7849605
6118 7849605 9457712 6713335 7307377 7962357 8809879 7662039 8604189 7840235 6811710
6109 6811710 9117246 6969893 8815143 8248474 8634588 6813893 8736988 6081711 7595683
6100 7595683 6696889 8671337 7444463 7981242 8795481 9001629 7013721 7756346 7022712
6091 7022712 7942405 8009187 7849654 9616779 8722708 6811407 8965730 7369055 8963829
6082 8963829 6324741 7306108 8180729 7727865 8403624 7510735 7080103 6982614 6773828 6016866
6072 6016866 9963833 7502127 5895053 6655703 9300525 7377904 6992701 6893542 6885115
6063 6885115 8354068 7095155 7035244 7205683 8345954 7276559 7035330 7595719 7869321
6054 7869321 6652621 8552247 6461130 7200722 8990571 5666119 7082831 7599539 7557615
6045 7557615 6176239 8147070 7777183 9390660 6540772 5711556 7845006 7830123 6875212
6036 6875212 6673973 6551852 7519379 6755385 7155264 7543153 7723862 7887242 8201873 4815457
6026 4815457 5658295 4709774 6883872 8140691 8935495 7372634 6174308 6429705 4715354
6017 4715354 7823387 8561256 7331092 8587094 6992556 7099750 6282705 5479238 6930523
6008 6930523 7247845 6938647 4297141 6215244 6402230 7347257 7006770 6338984 7594191
5999 7594191 7597533 5739511 5051517 8099782 8346442 5757937 4496355 8035813 7542207
5990 7542207 8044615 6291941 5831491 6218037 5817832 6072083 6892878 8071904 6692050
5981 6692050 10004515 5372920 6862427 7519109 5729391 7431140 6375701 7577503
5973 7577503 9247716 5738824 7092894 7040090 6406485 5999572 6405962 6961489 7639749
5964 7639749 5275776 6853971 4412122 7801119 7713992 7895112 5991413 8525663 7518551
5955 7518551 8072797 5754988 8168060 5478381 7402201 4894739 8430063 6584083
5947 6584083 8225970 7942547 6861253 7406008 6739555 9022578 6693032 7319525 6685607
5938 6685607 7084178 8077399 7617122 5630890 6915346 7582770 6867037 7716145 6123578
5929 6123578 5717007 8074982 6394883 7866158 6599305 6695853 8099745 7256542 8349542
5920 8349542 7862280 9153107 4346590 9135927 7013529 6582705 8333909 5627837 6945503
5911 6945503 8666481 6500107 7528642 6797233 6771084 7604421 8562105 8892974 7816897
5902 7816897 7905487 8238336 7333036 7468043 7311381 7864197 8841275 5861884 7251347
5893 7251347 5963141 5871918 7918381 6458957 8024718 7820293 9113442 9463314 5659686
5884 5659686 8943696 6990102 5917433 6331318 4937363 8831696 8329320 6764818 7947916
5875 7947916 6539909 8568183 9333429 8554531 6926540 7553541 8079630 9827945 8258091
5866 8258091 5828085 8075289 8352569 7597536 6254550 8794284 7182795 8206848 8721450
5857 8721450 8267300 6133008 9256777 7167462 6666486 8038356 7361219 6413481 7178471
5848 7178471 8365549 9511450 6266234 8987099 9579559 9222698 7711891 8668509 9429039
5839 9429039 8397281 8326442 7049055 8734504 9217421 8625746 8236732 8020096 8613183
5830 8613183 10015333 9363694 8668674 8179768 8013825 7564705 7685602 7658755 7404111 8762314
5820 8762314 9504732 9336288 9153509 8098877 7887841 7318027 8630208 7727978 9185283
5811 9185283 9157577 5051073 9515512 7678697 9411613 8608617 9754630 10605285 9527823
5802 9527823 8853955 8954293 9576172 10226498 10559815 8937750 8559079 7559273 10938739
5793 10938739 10215199 7310418 9687697 8748227 9169300 8153007 9144941 8831044 9003179
5784 9003179 11123468 8399636 9984060 7905264 10540282 9846382 9845265 9394339 9530182
5775 9530182 11138957 8785275 11399028 8734018 10556380 8403149 11018002 9333677
5767 9333677 9080514 9761855 9227979 10336671 11188270 10644254 10251909 10170988 12212786
5758 12212786 12578207 10766917 10183221 11196035 10670966 9600590 9798188 9834495 11138886
5749 11138886 8745132 11168703 10653632 11237887 13781505 10873610 12636524 11869986 11719746
5740 11719746 12616246 10546880 13163671 9582031 11154467 10426694 11768120 12972954
5732 12972954 12530084 13375916 10432276 11458798 13079243 13924471 11114725 13138392 13100805
5723 13100805 12360305 9930987 12968385 14493299 13118723 11713565 12165580 11626187 13465505
5714 13465505 11961621 13336737 11055636 11986818 14189753 12973291 14289140 13271507
5706 13271507 13833710 13246994 13656392 14202575 14058556 13289739 11958268 13542780 14498193
5697 14498193 11734677 12581256 13855678 13025357 14108145 14347152 16239025 14237011 15111038
5688 15111038 13708386 12705985 14306223 14030055 14645016 14554851 12893676 12496084 13292623
5679 13292623 13007935 14232255 13860402 16136499 14206157 14503411 15258365 14225299 15320243
5670 15320243 16329369 14012811 15364912 14971391 15152554 14857788 16197188 14213013 14564345
5661 14564345 14448657 15302669 15380474 15608542 17578726 15781234 15053893 16118958 15340732
5652 15340732 16087972 14387347 13631627 14939866 13614672 14507127 16892258 15586792 15455582
5643 15455582 16346781 13843532 13786170 15445445 14663409 17722263 17439052 17268572 13445755
5634 13445755 15754753 13842819 16467135 16087261 12617666 18084942 16110099 14018645
5626 14018645 17061861 17083977 16277156 18668682 15625325 17626894 15599598 15611323 17472464
5617 17472464 14192174 16378830 15256758 15543402 16817274 14093212 17662768 18075428
5609 18075428 17099007 17354315 16669859 16619327 16382638 17152886 16809003 18250856 15833891
5600 15833891 17791031 17778119 17948076 17672973 16443485 20382876 17915847 18621714 17408953
5591 17408953 19065533 14572784 19431660 18113342 18593454 15519974 17520333 19839922
5583 19839922 17899990 16537060 17085719 19590882 18222986 16766757 16674831 18257627 19785416
5574 19785416 18374084 20741324 18560129 19843761 18447155 18605015 18784555 17670941
5566 17670941 19940359 20018739 19148522 19652102 19416132 19966960 19837890 20148473 20533187
5557 20533187 20131364 23169560 21557852 22230494 20035723 22351662 20627561 19857954 20796611
5548 20796611 20613045 22186055 21046192 21926190 20909357 22498318 21374746 21137219 23398349
5539 23398349 23858180 22796915 21863984 23293641 23030310 22512805 22678939 22682594 23541226
5530 23541226 23140462 21897454 22013158 24073030 23926163 24902237 25227140 23417881 23309776
5521 23309776 23174487 26067276 24889302 25015975 24621272 23797486 25775215 23535127 27004258
5512 27004258 23563059 24310441 26617799 26142479 26363467 27339220 24753924 24468280 24973419
5503 24973419 25585193 25145825 25093454 24642351 24143757 26332594 26816309 26516379 27627000
5494 27627000 28485947 28194965 26905043 25781008 30354622 28689206 30132519 27080430
5486 27080430 28763475 28133057 28655148 28125327 28332802 30068451 29388124 27887026 31571521
5477 31571521 27598240 29468000 30516195 30490577 32360241 28915923 33947580 32455665
5469 32455665 33047451 35373810 35116986 34052039 36526562 33150982 36762045 34619102
5461 34619102 35460402 34200475 35883171 34012644 34266096 35367919 32389905 33418464
5453 33418464 35656387 33958559 36241179 37522420 34158064 40003524 36749435 35353697
5445 35353697 35753879 36977067 37366697 35734407 37184077 37223656 36994710 37372231 36136236
5436 36136236 35451955 37797309 34594843 36329865 35863657 36136522 32591182 35729057 34446197
5427 34446197 35879545 36058521 37686992 35965622 37103125 39752720 40204145 39213970 39760456
5418 39760456 40405678 38914763 39073258 40157797 37593257 35403110 38200224 37025401
5410 37025401 36480824 34808541 38218196 35845509 35192651 36570248 35506753 34959062 36026619
5401 36026619 34825522 36185921 36145740 35096705 34347170 33865157 34654102 34308415 35149843
5392 35149843 34515656 31615704 32390934 32881301 33470307 32994977 30872627 32419660 33997450
5383 33997450 31585717 34404727 32860871 32704980 33359737 32862057 32897386 34716724 34575063
5374 34575063 34821000 32196295 32802228 32761566 32611668 35551711 34128404 34101011 35247496
5365 35247496 34711277 34968041 34410343 33982605 33886749 35425667 32592391 35241633 35659636
5356 35659636 34313850 33240531 34185499 32893875 34338653 33983743 34414103 35778545 33176941
5347 33176941 33562915 34741494 34056641 32613331 35268920 33652212 32608453 33463929 34263015
5338 34263015 36042714 33243975 34824708 34205958 36105808 34771761 35678191 34704728 35717000
5329 35717000 33940951 35472702 35284275 35151243 35751487 36843142 35974079 35027176 36574829
5320 36574829 38895738 36753175 37447500 37942500 35854001 35806967 36836286 37308231 36344521
5311 36344521 38307879 39719664 38724884 38402301 39843503 38549167 39767099 40797286
5303 40797286 40520974 38113861 40022703 40612681 38748679 41084382 39855296 39172902 39369484
5294 39369484 37658161 38667759 39374502 37502105 39139925 38163703 36924287 35324208
5286 35324208 36989518 36681060 35169667 37295092 35915546 37690809 38089245 36987647
5278 36987647 37871294 37982172 38008941 39008559 39266526 37601121 41429323 40269509 40768942
5269 40768942 40217262 40221209 39111568 41742967 41184152 43086652 40872591 40567667 40782855
5260 40782855 42376615 39186196 40776699 41798192 43097479 43482843 42114094 40722178
5252 40722178 41403724 42786841 42105064 41052490 45318032 43410355 42867840 44589021 44914455
5243 44914455 45631425 46375000 47048626 50047238 48870045 49345000 49371323 47717248 48785866
5234 48785866 51469186 49635897 49454728 50676999 50311195 47354256 48904160 51071915
5226 51071915 51840968 50520235 51629685 52161622 53604715 51046051 50775580 54042309 54268610
5217 54268610 53164144 53947250 53814755 56188343 57750888 52808424 54867862 53845438
5209 53845438 56237642 56946287 55775840 56511510 55400010 57974904 57659087 59357972 62601352
5200 62601352 59057236 61005620 59583305 60232687 60232007 60757064 63346430 62882905 64805922
5191 64805922 64372404 67083838 66288370 65105164 65196577 66438547 64658496 64062213 64718570
5182 64718570 65923793 66811923 67762562 65706916 64431398 67101991 66866187 65875799 65879474
5173 65879474 65819537 64672142 64913010 64788207 64163571 68355206 64634277 63443554 63917012
5164 63917012 66897834 65542183 66219719 65623414 66661437 65784835 66251358 68145396 66692113
5155 66692113 70392936 68428281 68655386 69212335 72090371 70392201 66766997 66138697 67139667
5146 67139667 66977892 65920391 66982603 64249467 66727457 65361629 66025642 66615856 64312279
5137 64312279 65720438 65753504 67098438 66113302 65354585 67498664 66310607 68252732 68138611
5128 68138611 66906139 66164204 65869867 67111355 69509482 68022196 68908953 73529634 71226835
5119 71226835 72297641 71866270 74264086 75180552 73963283 74384645 74980843 77614565 76041800
5110 76041800 75326446 75710049 74075703 76144447 74160271 73342442 74047854 75907804 75642633
5101 75642633 74792349 75864908 78095457 75253875 75539862 75646032 78266586 77447260 78686497
5092 78686497 77244553 82475529 81096039 81114122 82308893 84098562 85278760 85520056 85839631
5083 85839631 86642402 88954157 88066447 90167243 91859055 92689797 92731596 93133739 96806778
5074 96806778 94788749 96921045 101282427 103354631 105516252 107945977 109587020 110297544
5066 110297544 108465123 110452629 109042490 108885299 106582839 107584260 109731964 108927507
5058 108927507 106837128 104357213 104742071 102481969 101938734 101083820 103241193 99222290
5050 99222290 103122186 97941832 99842592 102530805 102620939 102064850 101406486 104273732 103760717
5041 103760717 104942951 108201333 108033000 109454131 109539793 112800742 116205209 115554660 117824577
5032 117824577 122706189 123446783 128448116 131215733 133128756 134685296 139840653 143930975
5024 143930975 146898976 148491525 151114848 157077529 161205230 163815737 169122052 173060724
5016 173060724 173613474 178202497 185581048 190142707 195477025 203295956 209828596 211806703
5008 211806703 211386588 207898789 202753496 199565110 195769090 188738411 179979364 171024799
5000 171024799 162072273 156311143 150663588 144468712 140885195 138027863 135186783 131537639
4992 131537639 129129723 129249728 128058248 129790668 129862896 130310237 131839285 134572015 137910790
4983 137910790 143024312 146263224 153278257 155936658 163378203 167226019 173555636 177151908
4975 177151908 179356574 180816860 185353940 191085286 196752753 206011887 211449397 216717544
4967 216717544 221442729 228009109 238126815 244613919 258166618 270978840 283511140
4960 283511140 288612078 281410235 270374007 258855213 250934753 240333161 226934717
4953 226934717 213107983 192361923 172608297 156941052 144684813 133944598 125424231
4946 125424231 117785248 109963158 102933640 94804411 91819723 85788561 81972860 78655456
4938 78655456 75482812 74231628 73022869 70407003 68217580 66983022 63238461 62658251
4930 62658251 62920085 62108272 59771960 59219732 57292943 58875513 58145559 56871384 56515219
4921 56515219 57860386 56778145 55942513 58057033 53609614 56597232 54044597 55910335
4913 55910335 56783900 55442176 56413240 54584592 55622905 55710505 56303833 54403715 53500394
4904 53500394 53951993 55066348 53764366 56406706 58128509 58601268 55680888 55266031 55494867
4895 55494867 54880854 56521487 56202882 55421714 54320924 55627826 57545674 56394149 55321472
4886 55321472 55815502 55594528 56155998 58763507 57794972 58237595 57904018 57512834 56648837
4877 56648837 56977959 57972645 57475530 57056939 55645088 56884704 57492187 59205409 60233791
4868 60233791 58815938 60799834 58848026 60030588 58258530 61087232 59232042 59403638
4860 59403638 61033116 60739210 59793014 62006786 62109575 63035865 60960530 61818085 63624441
4851 63624441 61642953 63324099 64033939 63564779 61651398 64034921 63952272 64921409 63636572
4842 63636572 66464991 65531877 65266829 67177872 67340728 66909739 68139200 66331103 69341779
4833 69341779 68093244 67298332 70282550 68379510 68638428 71430859 68564785 68534843 68656309
4824 68656309 70418556 69730342 71270777 71861664 71904974 72131894 70892008 71485767 75618006
4815 75618006 73797834 73001062 71595727 72398597 72482610 75029290 73338756 73448763 74295547
4806 74295547 74707318 75987023 74359011 73883537 76483051 74277651 73908196 74054742 75133262
4797 75133262 75004041 76171849 77021419 78696698 79557930 78243420 77142195 80680039 79646157
4788 79646157 81318456 79821567 79403475 77029283 80490417 78487060 78486641 80472108 80050444
4779 80050444 79463924 81926275 79515298 81095646 80343505 79899029 80906974 81989754 82695185
4770 82695185 81051473 81384690 78879586 80522570 81953635 81194431 80852332 83309774 80960139
4761 80960139 80564217 82417638 82838600 82491118 83052874 81684114 82456369 82308486 82678910
4752 82678910 81343082 81982359 83531662 84669340 84819631 82975232 82973186 83761197 84049397
4743 84049397 81983191 83476465 84036658 83822130 83628626 82684277 82680140 83266224 81390938
4734 81390938 82132977 82450027 81301784 82432778 83130382 84092010 82574193 82102844 82369559
4725 82369559 83097672 83128383 82187905 82882672 82544010 83409074 82136423 82221146 83393296
4716 83393296 82325116 80344097 84559952 81437727 80430916 82700760 82113022 83947537
4708 83947537 83364281 82455917 82179556 82349286 83890470 82825970 82766770 82540382 83360274
4699 83360274 83941716 84657909 82417761 83436950 84826157 83847187 82009565 85680448 81944014
4690 81944014 82711478 81466624 81689234 83287937 84306184 81048798 83573323 82169063
4682 82169063 83620734 84905450 82062102 84123642 83516780 82802544 81880035 83355545 85205980
4673 85205980 84881114 85023767 83674122 84171204 85129312 86542025 86310485 86814708 87978600
4664 87978600 86798166 86756563 89477738 90928663 89318274 87782246 89676701 92148808
4656 92148808 91417245 94052803 94731295 93718416 94142719 94620687 95600069 94907312 98499513
4647 98499513 97868199 99897284 98366374 98264909 96958224 99326911 101162463 100800630 99724217
4638 99724217 98907638 100604938 99575328 99348662 97340498 99750014 100713504 97400958 99185118
4629 99185118 102626150 99865179 99467288 99746991 98322186 97365374 100513851 100514749 101100963
4620 101100963 99508137 99164612 100580569 99123951 98790119 99978316 101051096 99878436
4612 99878436 99276483 97725879 96668730 96694471 98136415 98616922 96960339 95462025 97235666
4603 97235666 97155601 98064398 96274471 98086052 96384863 97409746 99587721 102423623 97950751
4594 97950751 100753685 104184017 99560887 102208125 105737696 101592511 105733561 106754539
4586 106754539 107466894 110716152 106985938 108733653 109150979 110096292 109776302 111956026 112491168
4577 112491168 112840390 112077290 113579913 114375953 114700860 113261048 116413608 115951686 117443495
4568 117443495 117587469 117886838 119023982 121434461 121742295 124469960 124870294 125514897 126763910
4559 126763910 128094520 129533488 129637898 131032579 130037422 132232931 132459294 133188242 132682859
4550 132682859 132975775 134930054 135671729 136023779 134868767 134466242 134474631 134899286 135940176
4541 135940176 133169556 136799137 137024308 137496442 136937930 136454760 138395978 139657444 138937281
4532 138937281 140487752 141316152 140002536 141209006 144079088 144323188 144478521 144303747 145158666
4523 145158666 146524059 145664942 146006906 146337991 145052266 143377738 143512684 142878401 142350418
4514 142350418 141975991 140632310 141461121 141218915 139045583 139293198 136284101 135496035 136493366
4505 136493366 134379984 136020616 135975052 135583851 132447990 134281796 137174843 133913084
4497 133913084 133474148 133969988 133549474 134142352 134510461 132728738 134034271 133311301 133607385
4488 133607385 133539953 133424038 134165088 136561248 134555502 131490822 134387729 132400431 133716454
4479 133716454 134830000 133911408 135264070 135205354 133795851 132999090 136091184 136195419 133933123
4470 133933123 134931770 136025793 136725821 139332884 139896859 138602116 138064176 138103651 138008144
4461 138008144 140445956 141650198 139152541 140427314 141543999 142191267 142814694 142164875
4453 142164875 141666136 142877325 145234879 144723382 143541360 146314710 145822248 148831193
4445 148831193 148791000 151469851 151389355 151052143 151923281 156626833 156372650 157695927 158065612
4436 158065612 160539218 158482605 158857955 160329382 159010307 161681807 163101137 160911664
4428 160911664 161651764 160695096 160831873 163008914 162856682 163258525 164161053 165214391 164614277
4419 164614277 168374225 167414896 169434082 171142731 173586953 172930735 174272466 174811531
4411 174811531 176900024 179409663 181122278 179798857 181120950 182050174 181266842 184287417
4403 184287417 184255313 182981718 184663710 187153016 188747612 187753168 189019018 191632548
4395 191632548 194505706 194919174 198637214 199939740 202873846 205711954 208172737 209840536
4387 209840536 212254181 215935515 216675739 220447821 224254632 228456032 231593941 235233481
4379 235233481 238011652 242535969 244103788 252269496 254182523 259237408 262916763 265100003
4371 265100003 267313104 271107114 278249538 282620928 286980129 290644043 293502251 298869841
4363 298869841 303759481 308941090 315383986 321320538 328462669 332515427 331515070 333830752
4355 333830752 333965873 335144440 336039318 336088838 336405171 333770237 332205922 331877031 332500374
4346 332500374 334501250 335076209 333422067 338809067 338935854 342533790 346984623 351633438
4338 351633438 357494012 361012431 363520744 368717090 373947075 378213946 384151028 389669800
4330 389669800 396125834 392171860 385639241 378958412 372940732 368962288 363918608 357013631
4322 357013631 347871122 339624638 330037649 327770941 320211046 314336497 312091888 309332846
4314 309332846 306052093 303391471 299285579 297360543 295440844 292840803 291865235 289456545
4306 289456545 286053340 284349564 283186087 283522484 284082605 280430223 275752155 270285011
4298 270285011 265584489 262783150 258415882 252643983 248358846 239747852 234562784 230498475
4290 230498475 225632361 222374676 216579429 213154519 207091123 201138725 195945898 191512477
4282 191512477 185129787 181396093 175688811 171655283 166872353 163624709 159895506 154169934
4274 154169934 150344975 146348878 141633287 138842908 134827227 131990383 127627868 124991045
4266 124991045 120789582 118755291 117240366 113657549 109238378 109371853 106021832 103697664
4258 103697664 101306991 100257621 96885959 93746645 91041546 89048059 84669839 84756193
4250 84756193 83556931 77235535 77753022 72326323 72015966 68283988 66240022 66434304 61949062
4241 61949062 60926640 57750896 57363043 54472586 51981993 50939771 50271642 49082034
4233 49082034 46699391 44462327 43556865 42039936 40577278 38333498 38572394 37397121
4225 37397121 37020300 33931835 36971097 35526376 34148082 33602059 32554186 31087693
4217 31087693 29926453 28878883 27407428 28555172 27082099 26826265 26674003 27571275 25175084
4208 25175084 25781066 24041095 23306723 23995425 23742720 24771365 20392049 22165598 23478481
4199 23478481 23131384 20531754 21272136 21376123 19828907 20643313 20746360 21197979 20378385
4190 20378385 19447159 19206050 18775964 18540266 17204993 18566190 18953067 19167624 18556339
4181 18556339 17260044 17473242 17188314 17447150 18846550 15926126 17940135 16457150 16701542
4172 16701542 14931776 15699793 18493748 15662670 15498925 15742176 15731461 13599614 14832328
4163 14832328 16618785 15158045 15376479 14672841 16680842 14743143 14494738 13364334 13663043
4154 13663043 14998232 13989680 16761680 16036504 13693790 15613595 13783925 13348390
4146 13348390 12937462 13314794 13921029 13923720 13081168 13088968 14701019 13719621 11726903 14358125
4136 14358125 12912717 15004564 13021456 13490616 12969919 14205307 11808619 12181391 12501260
4127 12501260 12491450 13662367 11376973 12711846 12303233 11288567 13135409 12995033 12013416
4118 12013416 11843912 12996159 13080460 13442848 14465058 11640094 12973712 12772768 13030206
4109 13030206 11818837 13476562 13750149 12512890 11869352 14541126 11118374 12475873
4101 12475873 12863179 11661485 13583899 12744546 12599257 10988806 11801928 12920354 12471153
4092 12471153 11932718 13271462 12551746 13337894 12122771 12101977 11443812 12921752 13514410
4083 13514410 11597474 13593474 13155433 13212991 11859332 12118251 14752300 11821925 14230459
4074 14230459 11077186 11475609 11231487 12129241 12577807 11245207 11056657 13263541 12430451
4065 12430451 11032155 12165748 12254697 9966152 11795537 10818804 11673896 13078565 10143587
4056 10143587 9548261 10291940 11083354 10027504 13352038 11060795 12642198 8777395 11226415
4047 11226415 11866130 10236978 11999997 11128254 12013570 10897369 10225987 9758891 11418481
4038 11418481 9882416 11825331 10523443 9242908 10624190 11822608 9849524 8800271
4030 8800271 10329485 9200090 10480548 9392584 10146712 9187836 8272670 8682053 9270827
4021 9270827 8443457 9438502 9803719 9307153 10376773 10863681 9382740 8153165 8938829
4012 8938829 8952884 9965329 7727010 6813438 8699882 7176931 3692429 9575753 8106272
4003 8106272 7318159 7775939 6970229 8583620 7777168 8510939 8855097 9196870 8404671
3994 8404671 7939699 6970984 7917595 7420650 5704187 7963035 5668582 6238894 8963001
3985 8963001 8540173 5962071 8934372 7521398 6862272 8069581 6174793 6925128 6480807
3976 6480807 7818342 8990854 7662766 7165031 7258934 6159514 5373907 5982794 6350374
3967 6350374 6032221 7765436 7220482 6727510 7172995 7125564 8277310 5820689 4420025
3958 4420025 8660286 7653920 5507524 4604783 5702048 6034377 4791024 2944026 5317087
3949 5317087 6542669 5834219 7358473 7077393 6108656 5474485 5741848 4686084 5169288
3940 5169288 5147769 4343748 5054438 5366517 4273684 4559886 7304612 4941572 5208297
3931 5208297 4672578 4516409 4881141 3859566 4685543 4056016 3292594 6188995 4865287
3922 4865287 5813941 3946381 6101735 3800071 7082728 4428772 1856858 5131492
3914 5131492 4744613 5316508 2995471 5164459 5364888 4170688 3782779 3917942 4385687
3905 4385687 2635724 4356059 5744048 5229632 5150992 5644445 4643340 8356115 6005281
3896 6005281 4426364 3800773 5060013 4543600 3967838 5265908 8392645 4384409 5766769
3887 5766769 3347279 4408220 3494887 4644925 3033015 5561943 5885575 5289752 5261660
3878 5261660 3922585 4586758 4235128 4568705 5065616 5485372 5074243 2322653 3342507
3869 3342507 5103730 6523587 4847322 5933031 4863491 3575119 4362070 5057675 3820484
3860 3820484 3784546 2308002 3195206 4015080 3846302 4984582 4607881 3423473 4889058
3851 4889058 5438011 5564288 3925454 4361428 4294173 5324827 5600532 4892811 1636044
3842 1636044 3902493 3005095 4121712 7051843 3832773 4364047 2491872 3228802 5530246
3833 5530246 4182106 4700970 6293544 1486477 4621116 5058379 5402436 6503197 4593689
3824 4593689 3512001 3348145 4180791 4556946 4155480 5039259 4628095 4121446 2177938
3815 2177938 5804134 3246557 4716068 4387807 4307323 2643473 3426038 5894714 5491958
3806 5491958 5350827 4304645 5040314 5548518 4026217 2691813 2729033 2148369 1840755
3797 1840755 5325314 3890986 4308998 4298023 3715510 4263876 3620656 6415919 4079615
3788 4079615 4393816 4931329 3270640 4053028 4842401 3144395 4326490 4383708 3945548
3779 3945548 4548116 2697550 4912092 3179201 3993397 4746133 6412056 3496930 5474594
3770 5474594 4930726 776508 3564363 2937752 5086581 3561220 3105853 4896556 4777308
3761 4777308 4355461 2975635 2728664 2129502 3459097 3395855 3461439 3469337 2026189 5767349
3751 5767349 5020915 2607281 5153191 4409010 4704337 3518143 4673817 3199690 2958289
3742 2958289 3111011 3771667 3951277 2171195 4578659 3404673 2959995 3743043 1266180
3733 1266180 4018854 3240447 3176180 3059914 767403 1816260 4022439 2003416 2617359
3724 2617359 5617330 3343874 2960486 4321798 1194412 5064937 4157219 4427820 4932155
3715 4932155 5852665 4079264 5837686 3720174 1387431 1878514 2127444 3644499 5456161
3706 5456161 3197913 4668924 2701120 4080375 1250383 4451148 2271002 2462095
3698 2462095 3280919 2542526 1011133 3173933 4968952 6383308 2302417 2325543 3221075
3689 3221075 3711419 2916450 3238950 1936064 3664172 1245972 1592997 3875480 2381462
3680 2381462 5784045 4781585 3616300 3474317 4363840 4582984 3868459 3825960 4332964
3671 4332964 2644912 2062873 3535385 3467105 3213722 2297010 2099945 2607833 2802166
3662 2802166 3285982 2995100 2758298 2982225 4876089 4419776 3064774 4363603 3356326
3653 3356326 4490845 2763865 4946664 1251277 3630157 1534259 2189210 2429877 3442626
3644 3442626 2151156 1554968 3009332 2086111 1119536 1389373 3768166 2686490 -234837
3635 -234837 3542889 4227194 3474348 4408844 3250921 4963642 2826076 3394537 5443306
3626 5443306 5108070 2809328 1273883 3896524 1714541 3236354 3452140 1335168 2915520
3617 2915520 3997524 2528561 1075184 2289935 4872430 3983092 3578457 3083713 2728446
3608 2728446 2238604 3504040 3707903 3067337 3740116 1901213 1670139 4085789 4011580
3599 4011580 2370605 2561854 3595095 3435356 3126562 4226301 2427447 1689859 3144603
3590 3144603 2845678 5088344 4923839 3471833 4069459 5631117 5161283 2540717 4016735
3581 4016735 2609268 3941733 2280934 3316308 2006831 5616084 3620161 5903331
3573 5903331 2132318 5023154 2878952 2841983 3233183 3745197 4803291 3779199 4526583
3564 4526583 2617223 5571143 2373870 4283353 5097799 5596222 3976711 1496449 3042762
3555 3042762 3715807 4885370 5159175 2266474 4827331 845245 2992658 638048 2208882
3546 2208882 1979717 2171583 1464896 3452669 2879875 2047153 927641 2082392 5380772
3537 5380772 4130733 3056832 2696882 2467637 2730329 1456734 3979045 340220 3524559
3528 3524559 2872325 4777712 931677 2632596 2818716 4810164 1464074 4378649 1365220
3519 1365220 3523424 3120050 1260485 1550621 3836527 2859089 2535413 1880987 874846
3510 874846 1200173 3006060 3572583 809625 2503921 1099246 2220503 2429317 1215605
3501 1215605 4309807 3993306 2766828 3927085 2530070 3445702 2287735 2846241 2093986
3492 2093986 2897505 4029586 1723594 3007009 6080413 2099605 3303703 1991297
3484 1991297 1967765 2421509 2300827 1716924 4323519 1137294 3024110 2245232 3023703
3475 3023703 3061816 3166249 1992776 1882289 2718302 3082926 4372758 3129667 3846499
3466 3846499 3014573 2043002 1507380 3720402 1669203 3268868 3293659 2150075 2751293
3457 2751293 4031784 3256908 315501 3480127 2853198 5042398 5569443 2776607 4063702
3448 4063702 4937520 4581233 2870893 1698180 1796705 3784888 4397793 1405105 4378043
3439 4378043 1457235 3220490 2708538 2871432 1984383 2511545 3257213 5469535 3067363
3430 3067363 3864234 2937133 1610169 2855079 4925505 2699946 2872768 1336828 3511156
3421 3511156 1329841 1049179 993340 1677066 4170703 2465679 1017750 3413551 2052319
3412 2052319 996931 1823212 1582514 1492041 2430528 1895838 2365735 768009 2191862
3403 2191862 2702410 2694104 3049495 3794934 3308658 1201653 2917586 697536 3787140
3394 3787140 4543826 3797904 2626387 3259313 2215698 4168223 2498681 2858748 3368132
3385 3368132 1683234 2910873 3759915 5288108 4287674 3660803 3140367 1641767 2662548
3376 2662548 4802853 1576311 1242133 2068923 3023416 5662887 3200094 2680978 2961050
3367 2961050 3172173 2496012 2414164 343946 2420457 2166435 3326525 2110334 2034665
3358 2034665 882476 2891123 3334446 2100887 3465574 2293211 3194198 2358375 192378
3349 192378 28525 3781173 5177042 3940809 2387524 3406121 3678737 3952216 1721303
3340 1721303 2108050 3040542 2144243 2469236 959347 3202478 2914413 892876 1136290
3331 1136290 3107551 2635314 2550804 -867701 2936949 3956645 587739 2389367 2857090
3322 2857090 2401372 2283286 2528081 2693686 1694889 879031 1679598 1996730 2485620 1075633
3312 1075633 1372540 1839697 1458381 4181672 1283933 1572772 3555464 395090 4140226
3303 4140226 3828322 2245066 737358 3644620 740016 3252069 3122133 1310065 2595003
3294 2595003 2221183 2547779 3399300 948726 3070433 1467920 2983185 81884 2692374
3285 2692374 3254374 2996565 4860527 3237075 2619712 1307285 816470 2129939 1940167
3276 1940167 1099447 1063639 3865440 2901991 2645473 2152864 3887924 3305049 2091418
3267 2091418 453763 1664490 2833302 751965 3760411 2543379 2199708 1947526 1991925
3258 1991925 4181739 2504243 1711368 2120791 2303390 -133901 467403 2060340 1508740
3249 1508740 1131694 2193092 1883447 2430577 3316486 1903996 1528564 3386516 737519
3240 737519 2924726 872828 1267545 1040223 1389501 3090888 2616010 3188877 3495094
3231 3495094 1113064 1984498 2335821 3302442 896694 898007 2602484 2607650 2774010 309786
3221 309786 2857038 934646 772034 3488823 1427657 1649313 3801451 1999877 3467175
3212 3467175 363592 1814616 1197371 1575079 756621 1570098 -221616 3272695 4211944
3203 4211944 1445186 3899192 3149295 2988916 2560800 3208475 2839284 2811553 227068
3194 227068 930966 1275105 2188030 3143381 4643501 1806197 1627336 2546503 2255768
3185 2255768 3361568 2588712 -41129 3520245 3420800 1363310 2372462 187480 2666084
3176 2666084 4343275 -850584 599731 2359187 1750672 1230828 2819495 4438021 2470000
3167 2470000 3748054 2495065 3743368 544138 -369120 2987588 2825988 2109362 2310600
3158 2310600 4242467 1762013 1014877 2773612 3627618 1792063 -233463 3004499 2900278
3149 2900278 1914632 2713781 1064086 1502747 2413203 1812898 2019629 1443155 1912986
3140 1912986 3344391 2983226 4175409 3534089 1431756 3493758 2356563 435872 2003652
3131 2003652 2961409 -374093 1070344 2768306 2995297 1856477 1262648 -106448 2305039
3122 2305039 2918142 1958349 534347 966314 2041978 383600 1212745 1460097 2075633
3113 2075633 149666 2718251 690092 2276387 2006801 2286879 400096 1761848 2548683
3104 2548683 3201977 2369523 1439347 2834552 1176452 1962659 1935907 2417690 1119729
3095 1119729 426034 1624773 4183441 3800181 4182634 675329 2916928 3836368 1732575
3086 1732575 1430616 3047366 735436 1594188 912863 2813517 2018541 2356911 2522400
3077 2522400 4674252 3492815 1961129 1055795 355755 1104768 3777172 3834001 1501303
3068 1501303 2694661 874887 2184621 3240456 1438056 1623441 954995 1884436 1060057
3059 1060057 1937245 3480601 2749069 1850512 2457989 5042350 2425300 1585971 794524
3050 794524 656668 3770279 4008243 2850825 2011526 558948 2185763 1096853 3228980
3041 3228980 2107971 2377535 265009 1569343 1704419 962256 2488072 1699724 1350473
3032 1350473 2104883 2256300 3043595 3876185 2727103 568612 1279593 2073993 4834327
3023 4834327 2821027 1831582 977585 2710091 1865836 3339700 2590518 3553843 734006
3014 734006 2269233 1835132 2070625 1978957 2606628 794634 1205431 -426881 2299598
3005 2299598 1416484 606609 1506010 2484968 811917 2075778 2922930 1465536 4148940
2996 4148940 1419200 2436049 2612041 2123421 1713954 3502598 4572844 2410190 3193420
2987 3193420 4169854 1288649 5141693 -42881 1267493 2249163 700995 3199820 1806043
2978 1806043 1661025 838603 2024360 919360 1498431 1525935 1354856 2219875 900042
2969 900042 3624815 2719112 2124908 1949097 -38587 3096124 2608702 2299743 3542008
2960 3542008 1583662 3362936 1944020 2093637 1143614 4449063 1178822 2104516 754694
2951 754694 1073665 2004518 2711508 1203284 2254551 -257154 2382248 2762894 1522230
2942 1522230 662611 80180 1909428 3078180 2572711 2113354 1635010 3271388 2074376
2933 2074376 3924721 2161937 1144751 905140 2097314 3552227 3139217 2067070 991422
2924 991422 595225 2264139 2512947 265652 2967683 2696063 1330610 3580913 1294442
2915 1294442 3296600 644207 1793114 1727449 158840 3320492 3736443 2230155 3181811
2906 3181811 1725304 2022420 1363558 446477 2607959 989590 2020580 2425072 1487748
2897 1487748 2009826 1726025 2551636 942404 4326961 303706 1199853 2602373 3458001
2888 3458001 3123401 1168582 1954916 1508211 -695556 1047588 2373750 693614 2551642
2879 2551642 1509541 3814430 3078298 790844 1582239 2313113 1362749 2111621 356486
2870 356486 2184962 2428137 3403467 2632084 1022774 1189802 2228821 4020109 216669
2861 216669 1333688 622489 1854759 979039 1464255 2130252 2912936 1750640 3754016
2852 3754016 2427574 4186237 2729557 1368841 2795336 1455765 3391033 3286795
2844 3286795 2626792 1117729 2888973 898588 2477117 3562143 2654597 2810392 1462250
2835 1462250 607412 3248855 1880575 3256106 862460 1265508 974874 1846078 680788
2826 680788 1837828 5101242 211813 1038095 2542654 472716 124982 1990547 3642931
2817 3642931 2171433 3493880 1683008 2407124 2085341 1599480 2045212 2682756 744168
2808 744168 1581362 449439 1482314 2062176 1684011 4206591 2421307 765214 -224881
2799 -224881 1365254 2601664 2121214 1260336 602364 1500728 2368555 1205948 2561524
2790 2561524 3366249 1398288 1560967 1434606 3578808 1567883 2299207 2305991 1026073
2781 1026073 2688299 2383267 2675292 4123213 2556482 2102443 757877 944249 2888208
2772 2888208 2206617 3736797 3716887 2590878 3110186 1047102 2162006 402195 2837857
2763 2837857 754564 3777863 1355332 2277956 1933357 3486763 306380 2126788 2396299
2754 2396299 4131781 1762298 2018823 1381304 1508755 3573959 1356650 -8843 1943412
2745 1943412 2617195 3134633 229942 3134096 3555373 3269309 807870 1453607 1563868
2736 1563868 3222831 3332168 2433584 2560002 1370111 3299017 1087477 374887 -185029
2727 -185029 2188962 471620 2064160 464837 3421677 1400999 425397 2000925 2055144
2718 2055144 3830763 1566349 3197674 2868394 1252971 1796316 1951080 1458082 1079282
2709 1079282 2890152 1016578 440022 2322822 3419148 1494162 3246069 1551189
2701 1551189 816094 1923136 900516 2890910 1627195 -853270 3547777 1400317
2693 1400317 910371 5391656 502220 1027985 1282397 1702026 -387105 1450720 -425904
2684 -425904 356196 4467281 1940264 1393688 1619565 722846 1337369 1705870 980877
2675 980877 944479 2907501 2678845 3149372 2254040 1162419 1777525 1702529 2200890 1191534
2665 1191534 1101215 2500916 1647254 1750505 1217204 2205662 2960364 1165794 1071254 1747258
2655 1747258 118973 -632594 3042277 1893663 2357162 1410155 742488 1156782 877301
2646 877301 1511387 2267978 1478086 3057453 1122640 1017375 982694 1813912 -1120397
2637 -1120397 -12950 1642945 337590 1947392 1541223 2751620 2828285 1419654 891802
2628 891802 1831702 2881503 868062 1004824 2674893 671626 -709085 825718 3068435
2619 3068435 3504309 405149 601719 1869713 1235906 -122255 1124890 2488476 2196914
2610 2196914 2352844 1790968 2181727 -664521 2087033 2562151 3136435 3301979 255769
2601 255769 3292280 763437 2060568 3398120 906005 3873956 2476126 2615335 932172
2592 932172 2622066 876824 3026685 1803734 1293383 1317867 1920291 2717672 -173844
2583 -173844 3860270 1732928 3486022 2077401 1606490 2383280 3804915 765527 527441
2574 527441 1219033 2039110 2252876 2410279 2545508 2600854 2026297 1643384 1847324 3735229
2564 3735229 -92481 1126760 2005864 1431827 328081 600060 562683 412270 776262
2555 776262 4173017 2542091 511662 896655 792949 2776569 1884965 1919635 2612286
2546 2612286 899290 2339992 28123 3383602 1029011 1809647 2172144 1823884 3607671
2537 3607671 2317306 2947394 3171691 1418873 1441659 2859265 2359324 1223028 1066808
2528 1066808 -1844072 4418972 2085680 4321199 1302995 2364000 1025996 2075054
2520 2075054 943222 1500800 2782127 2276977 1100435 864517 983457 559129 2186669
2511 2186669 3251876 -130949 1969559 3099964 1728733 1680209 2367452 2277903 1999683
2502 1999683 610266 2620125 2125127 809407 1298129 3466073 1492534 2524511 3031851
2493 3031851 1454602 694524 1012558 3029517 2165280 1158812 883028 2156579 1983985
2484 1983985 867329 -614092 1582828 1452597 -65123 532318 2450013 -32569 1549172
2475 1549172 1516626 1977141 3131426 459760 2171924 1652884 1288938 1861954 2493840
2466 2493840 2561363 4082098 103349 1627365 326209 2344382 -696706 3784536 2258666
2457 2258666 1741812 2638811 1979183 1994688 812485 929183 1857898 2662686 3611836 3234409
2447 3234409 2795208 239839 3026648 2263662 2838469 2108238 3036455 3628315 1959049
2438 1959049 1485372 4323586 2725501 -50401 1559490 1887970 -914719 843086 1367318
2429 1367318 254899 745888 -1304415 601064 3405816 2860253 2949817 1797558 1330994
2420 1330994 3102896 1487797 1952337 1548158 2874585 1434649 189515 921061 2755311
2411 2755311 3711857 1610565 800388 2500371 1518354 1590542 1451262 4369659 2259745
2402 2259745 1498510 2225798 3540717 2286827 3305896 1848518 2142485 2860406 1433511
2393 1433511 85593 325321 2291248 2137418 1243882 938647 1270099 2663464 3492501
2384 3492501 1085895 -334832 1295542 472989 687642 1114580 1336551 678600 1354076
2375 1354076 1386153 2928299 2530013 1692821 1922714 1325264 2701577 2820652 1473479
2366 1473479 1669441 1704608 -669654 1550288 2764587 1355189 679807 1348355 1320775
2357 1320775 4111874 423871 1556964 534682 1521348 -108809 740156 2647515 2218788
2348 2218788 2785215 2577035 -39733 2410288 950964 1544488 816367 678485 2224901
2339 2224901 2011686 2892520 2121273 210312 2136439 2575023 2076828 54194 761726
2330 761726 698912 3150594 3469200 1349060 2724263 3322602 -111341 2167173 951400
2321 951400 2178489 1073162 3171199 720829 2056430 1140084 1767206 -339629 757559
2312 757559 2128390 2315778 2342494 1091329 2096566 581284 442084 2051886 1459344
2303 1459344 3828485 213289 -498981 -140201 991398 1817886 856298 3063141 1278962
2294 1278962 2370518 2412299 1467209 2863866 1883836 1176085 954147 620018 247978
2285 247978 2179935 1098188 3146115 792455 -214664 -171784 2696271 1907912 1188403
2276 1188403 136718 1942962 -435300 666416 2276641 1675015 2159678 1901894 1020777
2267 1020777 2639286 337983 939064 2629848 756226 3186389 1538054 1691083 3337408
2258 3337408 2428205 2503268 4038559 15386 2421549 3503434 1996793 2501711 1491173
2249 1491173 1905666 1554683 615345 2241636 1363853 684430 2218196 2606812 1178884
2240 1178884 -316384 2371296 2605432 1354557 1049039 2288933 1552631 3525642 1655102
2231 1655102 3341355 229246 1497141 1877344 1430143 482472 2777359 1053411 98571
2222 98571 872029 1980040 606882 1269391 3450254 1277511 4700712 1677013 185637
2213 185637 3584759 3161650 1385034 2025470 1776908 1233218 1231599 1582774 3338592 -325942
2203 -325942 1456737 1468763 2107348 2101502 881954 2837583 651792 1778860 1604033
2194 1604033 2263871 2984228 3277296 1416918 1897800 2778296 1059378 1823439 1948852
2185 1948852 1308816 4359053 1593561 1489918 2591866 -94074 467746 2702414 313095
2176 313095 1236596 -112393 1333557 2511461 2478612 383505 1814096 888360 900944
2167 900944 2383835 438005 1322250 2591944 1515853 724078 3139629 1814797 1505959
2158 1505959 4321658 1852141 3064874 1000269 552260 1621908 1421558 1446356 1502112
2149 1502112 1965043 188794 2296236 1886319 2783573 2291201 2263872 2870287 2400912
2140 2400912 1288984 -892563 2952263 585218 1902895 997449 1912394 2956811 1600728
2131 1600728 2610875 3512342 2528800 1227157 1685038 1594476 3401887 2438315 2727300
2122 2727300 2684645 2151057 326844 -467321 1659192 1873982 2362162 1672163 803959
2113 803959 5126844 3189850 2256907 1145162 1825462 -305770 1207242 -743256 1300415
2104 1300415 3335153 469887 585608 1209440 2882628 606394 676888 3001398 1281670
2095 1281670 1401660 2687370 3383067 3257185 2509406 1793378 1647732 2539977 2149353
2086 2149353 1469614 3485450 2467815 2735530 1819149 -334954 1551831 2171653 1739275
2077 1739275 567385 775836 2557892 3823667 796264 1548322 564757 2735059 2985164
2068 2985164 405759 2490720 895848 702214 1844016 1992910 98750 2353905 1062293
2059 1062293 2046868 971791 1650278 2642854 1500674 1331545 2132688 1282257 1480179
2050 1480179 1378000 1803849 -259496 2272125 1471304 -1203129 1906993 2439135 1519511
2041 1519511 2452702 265360 -590777 3226358 1495851 1147091 1514406 1829994 2043337
2032 2043337 421648 1502527 1050161 1383702 -431878 1015430 -128552 3192826 2423018
2023 2423018 1074570 3395491 2155520 2020126 2644728 1132874 981835 1373669 1722344
2014 1722344 750237 1155153 1790232 3658699 1775744 677643 2928634 3135091 -273321
2005 -273321 468649 1298416 392122 2580036 1377746 778149 2839442 1031448 3922030
1996 3922030 356659 407649 998090 2226714 2218078 -636396 265390 2992853 2507981
1987 2507981 2764443 2268760 1093335 2552142 1127014 2694152 2137328 5391138 2278556
1978 2278556 1570582 1375200 1281853 2091594 1316811 2194377 3282392 385099 1104941
1969 1104941 795438 -509322 1899640 1362591 1333971 2294350 -1124717 2603059 2640231
1960 2640231 1949792 1364188 844257 22048 1930637 2910626 1331123 3087332 1015457
1951 1015457 1543431 920458 1001313 1555665 2192445 1073791 3083842 1378822 321216
1942 321216 74200 324048 -395547 871911 1431796 1374425 2928504 2665568 1273324
1933 1273324 3993618 894005 2679636 -66030 2575777 851348 380798 1768541
1925 1768541 1834169 2233922 1311382 3117057 2441827 2155921 1489009 -15268 448560
1916 448560 3211887 887234 1434485 2418832 2651239 2673603 1194166 632842 3054333
1907 3054333 305788 3875247 821752 -33774 1569011 -1151353 -36516 903854 1640304
1898 1640304 2316383 2487482 2907067 1663777 80764 34768 1981753 1045193 1177279
1889 1177279 772016 1111620 1141290 -417001 1673634 -11191 2716363 2524146 709466
1880 709466 312582 2652148 1233191 1724843 708506 -177132 1313955 1916220 696491
1871 696491 1781223 2856241 1649647 3838009 -355116 2432125 2425458 2506694 2067390
1862 2067390 1466579 400316 1772767 1077549 3579946 804470 761429 2976711 957107
1853 957107 1304786 2400880 1973610 2867948 985445 3055919 1373555 551502 453240
1844 453240 1068681 874745 2733214 1358186 908306 1011400 1195369 1208836 694179 2638988
1834 2638988 2880512 -603785 1083412 2100513 1016773 1108675 1570680 1018103 2389544
1825 2389544 1807735 1191337 3224649 843630 603725 59492 862110 2203889 240941
1816 240941 1584293 975434 556871 2140599 2842918 1047489 1112357 2571573 3245475
1807 3245475 899136 1086084 1981714 2026422 3255692 537966 2790916 2050940 2235807
1798 2235807 -336078 274724 462065 1131956 589984 1976081 -516734 165783 739506
1789 739506 647008 1178259 787570 4218491 2231180 2826725 1315505 1136121 1504377
1780 1504377 3582182 -253947 1396746 -1064811 2642321 1988534 402815 3213510
1772 3213510 1354424 143574 2460459 2220097 1843227 1569551 1862999 1178233 675490
1763 675490 3190318 426845 1872705 1886469 1806926 1073621 26064 1372314 1053424
1754 1053424 1203020 3078784 532115 2360036 -110552 -252930 1991939 2913925 4250507
1745 4250507 958698 2518386 1002467 923208 2378455 1032102 2234726 2444623 3039497
1736 3039497 -70519 2406217 1106950 -184607 1677797 1516590 2221854 1296334 1854699
1727 1854699 2525262 1037530 777134 1723910 3224345 749821 361872 -101376 2468195
1718 2468195 837281 1420642 1600778 1210687 511486 1014360 1101735 2270126 313872
1709 313872 2226569 2829829 3140771 2313614 1872780 2371669 -36736 458043 -408350
1700 -408350 2533295 1810767 935624 1798032 -2166 1606892 970378 386439 -1990973
1691 -1990973 1809446 1386716 1364719 1530537 458030 2172848 1786792 2385805 183939
1682 183939 2228653 1333220 349426 2630476 1108900 2545158 1702912 1888410 -647535
1673 -647535 2728951 -1334293 146942 381712 584750 528487 895678 41271 2343642
1664 2343642 -441634 2104234 1492764 1515796 1884374 387486 791691 635136 1363901
1655 1363901 580239 1648747 1569859 -645738 218482 1834036 1180866 1057812 1823577
1646 1823577 7274 661600 2830284 815250 688998 1541215 -432529 439654 2945177
1637 2945177 1698473 -225556 1949533 2343039 2427735 1561267 1762456 886272 2626725
1628 2626725 561397 1714308 2453477 696443 608865 1325582 2041158 1474610 -546348
1619 -546348 1302063 943640 1135087 2032632 1694745 -143568 -134218 1903326 -316165
1610 -316165 -76964 2636043 1459413 257830 439843 3441033 391074 672435 1774221
1601 1774221 132842 2452090 996567 921289 3399135 2741403 2334381 -33845 1109926
1592 1109926 429260 2406221 633085 346795 2140309 1774546 647941 1416303 309053
1583 309053 2002670 1417369 -1538 132986 520105 2591237 1858063 1575834 1117033
1574 1117033 379655 1016224 2064076 1235380 1092101 1801749 481830 38430 1384033
1565 1384033 459007 2028023 2211899 1953462 2416889 1879486 1170574 557460 1239232
1556 1239232 1657121 1529739 241599 1213879 1626866 2405130 597665 2897827 -1093650
1547 -1093650 675615 3196467 2218591 -194869 -19790 -766212 2829644 57237 1590256
1538 1590256 -40665 2287037 1854633 1640504 -243555 -190771 -105928 2259988 578411
1529 578411 2485256 -153106 2531502 -1375932 1720981 797058 471436 738496 554125
1520 554125 1518660 778169 2967898 3040979 1672185 -83802 1826895 1952054 770660
1511 770660 1359845 349201 1394416 313682 -526837 195920 2108763 2758744 2649003
1502 2649003 121530 1903119 2566799 949660 1735740 2470729 2996760 1255174 435109
1493 435109 177646 -552292 1287954 1112443 3337148 1353197 1016171 1198395 4317102
1484 4317102 2311404 1439453 2078803 2156175 -251553 -1110484 68004 2728357 1751963
1475 1751963 3614184 -329976 354471 3069787 2441665 2006349 1510927 1662758 777295
1466 777295 856283 324338 1491284 2181785 1602315 2839501 1570032 2293156 739479
1457 739479 2074218 1531875 347993 534921 814908 546030 1846965 918636 -1430794
1448 -1430794 1750150 1137819 2493533 2733476 1144737 1319869 1628035 554014 2510831
1439 2510831 2155212 402394 1224290 1511800 1687391 957564 2808581 2108860 74545
1430 74545 1990904 599732 1571930 135241 2409831 2856662 126354 2019881 1440187
1421 1440187 -859986 462806 3146839 1761504 1982571 -111832 71759 1733948 -72625
1412 -72625 1179929 1971224 -110270 955151 2143305 61065 810515 672896 296337
1403 296337 1569735 1262281 2117192 4046819 1925117 1741615 501049 489259 -643415
1394 -643415 676205 996961 113421 17886 1239300 2707196 430793 -705392 270721
1385 270721 3129918 2222203 1410623 3393485 1703336 -457258 419702 -60880 976515
1376 976515 725852 593406 1075171 2578899 2661512 3052294 1939760 2982681 2136907
1367 2136907 1845259 2192464 193308 1174581 1759360 1622261 1958043 1859666 1273509 3242014
1357 3242014 508660 1199337 3887385 1343799 2196123 832197 3346338 827179 593262
1348 593262 -114577 2046664 1718205 1210588 1841627 1540549 2380868 -823003 -95337
1339 -95337 946153 2458681 1054166 1435205 476305 2083584 808779 2780335 1424466
1330 1424466 1732808 1221907 2973957 3277404 -625147 -228052 1336728 2414693 947074
1321 947074 1288256 2287699 -447832 1996820 -786856 1840288 732725 -198915 3145587
1312 3145587 2752410 1468137 1359136 1724539 3215004 2720122 2819693 8637 502237
1303 502237 2582007 1068210 1314544 1914120 1129804 288104 3453362 1187337 -649188
1294 -649188 1542028 966099 -137225 2385447 -1335256 -87633 -25528 885294 1430212
1285 1430212 1897564 -250181 -752012 2657159 -527399 -168847 2149184 1916837 1239714
1276 1239714 3030998 -61397 -44315 2798541 2366411 814808 927121 2571507 1331722
1267 1331722 1225369 1809866 2351278 -395285 1547170 3390046 116292 2724991 284688
1258 284688 648940 716493 927674 -510717 1499697 1361997 860824 2181480 1725249
1249 1725249 2548699 -365216 738554 890431 577597 1088733 329656 1132355 204117
1240 204117 908259 1212955 2568418 2529770 1874538 1261897 4505948 1764542 238328
1231 238328 2373189 2196726 345031 1418761 -663362 1661561 1488403 2028769 804900
1222 804900 297080 -1384402 2792143 1447041 -352806 -24981 4280960 2434970 1160927
1213 1160927 2849231 2569195 2156250 3123648 1099240 1713324 1914127 1577376 674641
1204 674641 918166 2799782 483754 663064 716158 981870 934089 367880 923743 2179570
1194 2179570 389080 -487916 395149 1893776 2108389 1296750 668251 1208243 1585811
1185 1585811 974252 1414898 2948837 -402470 1025874 614839 3144411 -1333448 -1090107
1176 -1090107 -95570 984016 409814 1645601 -146503 1112278 2405315 -322418 2888802
1167 2888802 -462369 3626289 264808 1657585 1106199 371246 1249828 804009 323479
1158 323479 1256961 853735 1307130 1021444 2002266 74910 545815 1917609 1505970
1149 1505970 3322178 -658687 1177246 991325 -84043 838302 1964581 1174120 1206774
1140 1206774 1414692 1349815 604449 906611 104429 2105565 975586 3676503 1460419
1131 1460419 3222430 844280 674629 1905071 1068462 2344234 1696946 2127183 679266
1122 679266 791482 2455205 246642 485290 1138660 129519 572675 1856105 1664684
1113 1664684 2925097 429444 2082582 1546273 303966 1712442 -1094476 -766040 1190406
1104 1190406 994208 -7681 1315621 770136 1710446 -222348 573331 2843377 2884297
1095 2884297 990676 2726731 3464495 1234252 26682 1377826 1858540 -931178 649444
1086 649444 757142 1773377 445349 1515551 2088271 1930804 1553355 1940600 -109451
1077 -109451 -198114 1278034 2242843 1121618 840275 -525593 1001398 1935759 1676946
1068 1676946 -252981 2232543 1924068 126418 -527890 1659233 2006926 2772520 -720201
1059 -720201 2072313 1667922 -327194 2603060 1516659 480559 58012 931591 -1140296
1050 -1140296 1477470 -478028 628466 1677079 -49359 1156262 1657518 2620955 1350552
1041 1350552 374198 1243027 1731317 1818492 1617825 485570 -892936 873343 1354595
1032 1354595 712149 3684778 1122454 1757001 1828660 578103 2982407 562817 365731
1023 365731 1571506 734508 -309692 1083473 2817603 1698910 2188805 -641711 2170426
1014 2170426 2436051 2600117 -1153407 -111851 2183952 2038580 2843409 633908 1789415
1005 1789415 2423715 -544110 1721442 1681768 3073038 -643907 799249 1807583 773790
996 773790 1351711 81058 -875416 1284695 407836 1150744 1904845 2669764 1005120
987 1005120 1592722 427965 1654622 2390388 2519336 521410 3309826 2270487 2631225
978 2631225 2368304 361102 532046 623096 914604 429520 -1031773 669145 -379210
969 -379210 1431261 1539722 846095 3453198 343765 -704786 767489 749149 -395234
960 -395234 2881387 438601 1299400 592548 744375 885066 -132550 1183231 1758435
951 1758435 3383486 1722446 2398225 2124680 -623691 2023223 962345 163632 560573
942 560573 1388369 2039027 -703164 -427493 1639416 1270300 -57917 751460 -44335
933 -44335 -889239 1581264 881948 753608 1194149 2289967 1143556 1985383 -36933
924 -36933 -557653 2466923 1896803 2478203 -241147 918452 399321 -21856 -564266 272155
914 272155 906884 1801906 710276 -272060 220375 2992321 2521043 2926657 2745973 161653
904 161653 3158744 -191708 123585 2410113 2858017 541326 969550 1107876 768963
895 768963 823152 627381 2458296 377590 -1817437 -1424859 1682237 93255 251033
886 251033 564826 941034 1241934 1114774 176725 1215877 1788133 1525528 1140366 2950408
876 2950408 1163247 141611 1218404 383708 3241093 -1240902 2002158 1720213 2069143
867 2069143 1587315 2148804 3113010 1271027 824807 -1145741 1348329 1444722 1736369
858 1736369 -324650 2513234 1713577 2693308 310102 864038 1879751 647389 173751
849 173751 2496191 1883589 1510596 1441542 308038 1609672 1879417 -1419426 -583748
840 -583748 233476 -1439230 2168321 1572637 523937 3906986 -471549 838450 1352961
831 1352961 1566645 805883 -772224 3171636 978128 1365019 1543251 802932 1543756
822 1543756 3633642 -86493 503318 239327 525721 -193645 -369203 859838 847207
813 847207 -108845 1593110 1384142 899745 -974030 -566327 -963762 2550066 877106
804 877106 429121 947775 1073960 -256698 2152421 1378610 -1665842 358420 2004844
795 2004844 673302 -1370031 1593055 -814474 -327361 69829 -58126 1060649 1574239
786 1574239 861003 -183265 53570 2410360 1149387 8850 1430517 1231661 1885538
777 1885538 1207340 546504 1856192 -437341 3024310 1148538 178615 1788664 -2303539
768 -2303539 708642 -264357 521510 1303641 1145814 1033641 2153124 1324610 -199785
759 -199785 545764 -478486 784250 816831 -134382 191359 1522120 1531800 -682764 73829
749 73829 1331514 -691019 476153 553911 438973 903286 3325394 2460271 2503310 1123991
739 1123991 918100 3193788 381101 -129699 2277450 1974581 1021893 -442791 727088
730 727088 -29065 -143778 -245673 2233905 -440368 1482784 1668963 2234577 1847922
721 1847922 2780415 1746510 2643762 1110655 620202 957960 3241666 1658888 2380000
712 2380000 2171778 3149753 2937513 -224929 -273652 -185743 -903852 613118 955709 568892
702 568892 732365 1786396 1572179 2668546 -239804 3468821 931388 1001384 1665350
693 1665350 1569544 880279 1346339 1805495 1235021 2248204 2467919 -519179 2889017
684 2889017 -1289992 1147185 245311 -891836 2375233 2767496 -3195 2186824 -71122
675 -71122 230441 -1639129 345587 3235626 1930011 1542769 -1469810 204775 2054294
666 2054294 1014328 -1604322 509208 1521910 -828200 450526 1568505 1690225 1900598
657 1900598 1042872 3149004 2048640 2692214 1490212 737700 1571641 2116546 756267
648 756267 2153882 -427954 1353462 5499 -154829 3097032 1023387 1857602 559994
639 559994 -854639 303146 1127351 -1122080 354064 2062824 1467067 1139671 -88116
630 -88116 2588651 886289 1526328 -613084 -185350 1081096 481767 627689 1919476
621 1919476 3111995 2530315 456403 1215807 2346050 1896538 -1065228 1442989 2074639
612 2074639 734374 1750553 2944444 2316803 2028442 1122398 1663904 32246 -42687
603 -42687 -786479 1262680 1011153 2600357 -1797676 -1186198 1110501 -759111 1916000
594 1916000 3556727 1773158 1250449 2053530 746879 486080 1867273 1537797 2333404
585 2333404 189375 2368087 1960356 298956 2780159 275196 983503 1130319 2234496
576 2234496 871148 286923 706576 239770 -135115 1512824 -463498 1663152 674479
567 674479 1302791 1040068 275071 271463 973872 -374719 271157 3431037 -804777 563697
557 563697 -1322624 -934930 1617257 1108924 694336 2061340 237523 1004027 1541932
548 1541932 478477 3079748 707552 2511222 251006 2039129 467158 -1218900
540 -1218900 1733239 229739 1721153 719373 -150649 -149103 2074798 369778 1682061
531 1682061 2209711 -34554 1101725 2090440 878310 873807 289069 2120901 1081447
522 1081447 335367 143922 746455 2815826 1537242 1909153 811346 2394242 -513744
513 -513744 -213151 85579 1925491 1405096 854489 2358488 457135 490800 748423 -102738
503 -102738 2379487 1339537 -10248 739499 2465712 -505092 2535664 2333436 2437981
494 2437981 1177534 -1260043 301956 2012519 1908287 1349573 1096246 573537 1147699
485 1147699 2734097 818583 1825538 -1644324 1893031 946779 1327815 2571759 558135
476 558135 1627931 170488 1834832 2185022 2031038 222834 433766 1416939 20509
467 20509 452475 2276150 38575 2002631 -485698 2312414 1517095 1914686 1565315
458 1565315 618627 1066227 -234971 -1611382 -1043485 844020 3024161 1846333 727336
449 727336 1383099 1358065 -1092722 1619210 4302818 -329516 2304353 3640565 1101243
440 1101243 2809941 -84651 971142 -1038356 -536384 2204364 -1246299 2302394 1149110
431 1149110 276220 1819993 -775475 1503705 -694832 -281529 2132425 -969184 1148689
422 1148689 901679 576761 -740171 1643947 1671176 421048 -787420 -695678 689230
413 689230 904971 275852 -228509 527755 1066875 1353518 1611891 482255 1567507 1123951
403 1123951 -740062 1099320 2234746 1629906 696307 967191 945315 651323 2267797
394 2267797 1350694 -58257 -176928 2280943 -319167 2608336 1796276 8123 2235762
385 2235762 731162 939991 648590 1849847 3289477 1484301 940945 1171769 -301130
376 -301130 2791161 1799378 1213804 767693 107512 26922 634717 1780223 855120 1608498
366 1608498 -290674 1590508 -584477 1333571 1246335 1833997 1139779 1900678 1376277
357 1376277 -77698 1267540 -403480 134590 560668 -353272 -227199 3796441 832101
348 832101 1969214 1359309 400065 -1680090 331931 -752857 -1542164 -608611 1570405
339 1570405 1731560 2013877 557883 2241496 1916374 1394210 1366556 2247774 752636
330 752636 1076819 2969010 -953127 1275837 286669 1214081 2934938 2484511 983284
321 983284 346502 2310317 -251519 2223563 574220 777331 1205962 -527871 -232852
312 -232852 1623000 1868381 48664 52476 2148499 1085396 235583 350455 1076237 700793
302 700793 2595655 -85051 1457629 2808215 2358718 3157094 1842940 370063 1041397
293 1041397 409607 -1230932 27237 -339291 648066 1193597 1323250 -771832 2235310
284 2235310 -2042091 -356766 1114954 345790 1323837 580409 1372919 1350751 327117
275 327117 -1906276 1192584 779180 -121251 1443299 497569 -434900 27652 2029458
266 2029458 1772652 2391647 1349164 1956773 1034908 2069125 395804 1727530 67275
257 67275 1925701 1204960 1991116 1153137 2538654 377432 1547739 629360 1267860
248 1267860 168650 1355643 1925985 78650 1630782 2327614 1298545 917746 1555766
239 1555766 765256 981432 704068 1190528 73176 3045996 552268 848574 361225
230 361225 634079 -669039 2016670 1182528 3797998 1735417 -1813135 478281 874011
221 874011 203385 716130 313303 630415 -914131 -411161 3017186 492251 1744856
212 1744856 -67628 766671 1296535 657561 192418 576199 1051000 1803873 216372
203 216372 782841 846667 2107243 128389 -789503 1767639 2614656 2510941 1477176
194 1477176 -331860 -8495 1536759 2116499 -123921 582645 -541094 1540258 730403
185 730403 1035192 1037133 1147684 784219 1430069 438993 -605188 1111581 760088 719382
175 719382 827628 556256 674127 672651 1154457 806615 1539374 -373606 2015021 3008037
165 3008037 725514 1298286 1042877 1892267 2708667 147126 86959 317349 876610 520075
155 520075 -1364879 1098506 734325 1143335 -29369 1176910 1848434 2300412 596045
146 596045 578912 185350 228755 657843 871006 -1076666 878683 946458 -611729 144495
136 144495 331274 -1254828 563704 775610 671894 602441 -985808 981437 -871918
127 -871918 1190655 -1375794 -783008 926656 1498851 635393 -1857843 1677223 655571
118 655571 -558033 1733586 774466 -243364 757678 938406 1603403 -221040 1030234
109 1030234 -247572 873868 -759986 668544 391935 -755697 -1353565 496541 -918241
100 -918241 -308227 498615 -235755 -271549 934447 551536 939645 -444148 -1245432 -608411
90 -608411 -35778 -280412 1028274 868811 -733012 -656648 1290511 590493 615505 -576581
80 -576581 -170658 266535 622500 -92419 -1580042 -466659 920036 -61957 38239 1684810
70 1684810 674453 -227277 147379 343433 1336343 2374699 1559943 1790826 1864563 -627571
60 -627571 253203 -378140 -631987 631409 1528993 514098 166368 -602856 -1049487 -1042324
50 -1042324 48510 -795566 658578 -1084775 -793292 -18438 -570455 -461147 312497
41 312497 -1862591 -1178330 639336 -368728 247293 -323034 -152814 176298 25861 -1604500
31 -1604500 -1038510 -951676 -699995 844191 -469563 -43272 228838 -779166 -531308 -419094
21 -419094 543016 -761075 516626 -938649 -536654 -156756 -1300414 859974 -1108968
12 -1108968 -29330 -739796 -1176674 -1965524 -965909 -1679548 -1262450 791568 -407969
3 -407969 -103750 -649374 430756
0 430756
$$ Imaginary data points
##PAGE= N=2
##DATA TABLE= (X++(I..I)), XYDATA
16383 -2590119 -3459973 -2431662 -3570058 -2059729 -3718539 -2683467 -4313483 -3579153
16375 -3579153 -4772379 -2243498 -2714228 -1951402 -2718716 -1847495 -2917697 -2003096 -1029374
16366 -1029374 -183718 -2459331 -1473707 27543 -846205 -981694 -2023527 651544 -934547
16357 -934547 -1156982 -608073 214938 208900 707756 -1224133 309930 1517565 -699425
16348 -699425 -39310 757328 -376564 -776764 -1248625 1925624 369440 799026 1514577
16339 1514577 190393 -1033896 2120985 187661 992255 1907495 2902987 1072562 1734742
16330 1734742 1312818 1401217 1590031 1465676 292420 1666991 2557651 1774095 2696887
16321 2696887 2511418 1888557 2132199 1920637 481814 3799975 3746699 2951070 2799956
16312 2799956 1792339 2516066 1497282 3027108 5729169 3166865 3075720 3865342 4086626
16303 4086626 3371135 5049474 2934832 3872699 3051518 4781332 5097706 3261127 3042232
16294 3042232 2962638 4690888 3962889 4108151 2842760 4796747 4680725 5330106 4577389
16285 4577389 5684414 5064280 4578716 4491034 3385646 4750894 5990128 5769231 5576891
16276 5576891 6052389 6249991 6145539 5705420 5888115 7825432 6755038 6750107 7425216
16267 7425216 8701024 5007143 6396741 5568206 5894371 7261506 6802837 5291832 7178753
16258 7178753 4939577 5388518 7699247 6679500 5189927 5475433 5735218 4379753 6234727
16249 6234727 8138042 5317849 6411342 8464069 7497536 7346485 7127231 5380923 9059135
16240 9059135 8327106 7002048 7115393 8669839 6855203 7887556 10428699 8412910
16232 8412910 6442402 8356687 9498934 8522871 7596242 8741516 8411470 7559564 6405874
16223 6405874 10490258 9974951 9318245 10544891 10129406 8299790 7995421 9129078 8465031
16214 8465031 9481335 8470113 10193153 10747149 7405332 9718591 9039264 8453795 8610357
16205 8610357 8987550 7143490 9937214 9828747 7792433 9032170 9524159 9049791 9035943
16196 9035943 8468682 9054071 8404059 9374609 9948360 9808670 9987771 10990569 9516140
16187 9516140 9890270 9881358 8519952 10736173 9475230 11371846 9303380 9501631 9367916
16178 9367916 9913062 10020927 10811988 10315843 8920350 10846948 10536227 10207350 10254205
16169 10254205 10632402 10208968 11161895 10498044 10392663 11343208 9630763 10863212 9982973
16160 9982973 9301133 9858964 12901887 9569391 8236589 11796930 10168340 10917893 10512704
16151 10512704 9740302 10239165 10098730 10737957 10977476 11550288 9916855 9184053 11379888
16142 11379888 10519963 11394064 10468012 10128813 9630906 10971557 11452834 10050527 11292527
16133 11292527 11579378 9598176 10683706 10798799 9849715 11680646 11304187 10055265 9491404
16124 9491404 11331903 11579743 10825893 10910445 12327830 11621064 9488801 9393315 10625603
16115 10625603 10970581 9839921 11865837 11545079 9984419 10078915 10735178 11455133 11082585
16106 11082585 9086617 10620232 9773733 10275038 10929989 11230490 10333363 10681560 11798836
16097 11798836 10903465 11585443 10659764 11610534 11290646 11828075 11175199 12219456 11072900
16088 11072900 10900520 11919113 11855675 11641357 11628127 13756053 12509071 11646209 11198867
16079 11198867 11597742 13321905 10284379 12306229 12282515 10812668 9580895 10851126
16071 10851126 12464906 11780208 9610346 10236055 10987996 8863397 11622039 12705082
16063 12705082 11940412 11708925 12561205 12960592 10102327 11739543 10839820 11375195 11404573
16054 11404573 10399492 10378560 11478620 10684077 13594065 10231755 10230841 10636794 10290143
16045 10290143 10719464 10557137 11599082 10961476 12941917 9833212 9909180 10989697 10356649
16036 10356649 8270805 11430088 12575491 12857691 9533845 11091116 11014864 11115288 12043781
16027 12043781 10767732 9824533 10411142 8963662 11065699 9689693 10942377 10095408
16019 10095408 10562105 11411623 11896949 11362999 11204624 10365984 13351241 12209388 12587997
16010 12587997 11160697 12065598 11428007 10329072 10120194 11352195 11648555 12146582 14195449
16001 14195449 13747441 12033585 11320534 9280032 12017559 12005477 12614474 11074130 9786739
15992 9786739 9798197 11116644 10593379 10167907 10374781 10764665 10536724 11191315 11614896
15983 11614896 12393367 11912436 12468219 11818910 9781413 11292358 10838939 9566535 11760727
15974 11760727 8798177 12036259 12420011 11542579 11261218 13048332 11302198 11874225 12853604
15965 12853604 12982900 11859063 10176001 9918213 13012510 13028032 11489588 10603042 12996583
$$ [...]
##END NTUPLES=NMR SPECTRUM
##END=
