##TITLE=abcd
##JCAMPDX= 6.0         $$ Bruker NMR JCAMP-DX V2.0
##DATA TYPE= NMR SPECTRUM
##DATA CLASS= NTUPLES
##ORIGIN= UXNMR, Bruker Analytische Messtechnik GmbH
##OWNER= root
$$ XWIN-NMR		Version 3.5
$$ Wed Oct 22 19:29:37 2025 Russian Standard Time (UT+4h)  servis@DPX200
##.OBSERVE FREQUENCY= 200.131235884673
##.OBSERVE NUCLEUS= ^1H
##.ACQUISITION MODE= SIMULTANEOUS
##.ACQUISITION SCHEME= undefined
##.AVERAGES= 24
##.DIGITISER RES= 18
##SPECTROMETER/DATA SYSTEM= spect
##.PULSE SEQUENCE= zg
##.SOLVENT NAME= CDCl3
##.SHIFT REFERENCE= (INTERNAL, CDCl3, 0, 16.4885)
##AUDIT TRAIL= $$ (NUMBER, WHEN, WHO, WHERE, WHAT)
$$ ##TITLE= Audit trail, XWIN-NMR		Version 3.5
$$ ##JCAMPDX= 5.01
$$ ##ORIGIN= Bruker BioSpin GmbH
$$ ##OWNER= servis
$$ F:\spectra/data/av/nmr/H1/1/pdata/1/auditp.txt
$$ ##AUDIT TRAIL=  $$ (NUMBER, WHEN, WHO, WHERE, WHAT)
(   1,<2025-10-22 19:28:57.62 +0400>,<servis>,<DPX200>,
      <created by zg, POWCHK disabled, PULCHK disabled
       terminated by command 'halt'
       configuration hash MD5:
       00 E9 B6 7A A2 85 ED C7 34 08 36 98 17 FE 4E 26
       data hash MD5: 32K
       2F 27 1B 93 DB 16 90 75 17 D1 D7 C4 50 0E 23 FF>)
(   2,<2025-10-22 19:28:59.48 +0400>,<servis>,<DPX200>,
      <Start of raw data processing
       efp BC_mod = 2 LB = 0.05 FT_mod = 6 PKNL = 1 PHC0 = -270.7076 PHC1 = 6.501565 SI = 16K 
       data hash MD5: 16K
       BA 02 A3 90 0A 32 4F B2 9D BC 46 69 28 85 3A 8D>)
(   3,<2025-10-22 19:29:08.76 +0400>,<servis>,<DPX200>,
      <pk PHC0 = -2.6 PHC1 = 0 
       data hash MD5: 16K
       4F 18 1A EE 33 21 79 2A 9C 9A 4A 81 CD 9B CA 7A>)
$$ ##END=
$$ 
$$ hash MD5
$$ 34 3D C4 6D 32 E5 40 FC F6 CC D8 4B B8 CB 5D C3
##$RELAX= 
##$RELAX= 
##$RELAX= 
##$RELAX= 
##$RELAX= 
##$RELAX= 
##$RELAX= 
##$RELAX= 
$$ Bruker specific parameters
$$ --------------------------
##$DU= <F:\spectra>
##$EXPNO= 1
##$NAME= <H1>
##$PROCNO= 1
##$TYPE= <nmr>
##$USER= <av>
##$AMP= (0..31)
100 100 100 100 100 100 100 100 100 100 100 100 100 100 100 100 100 100 
100 100 100 100 100 100 100 100 100 100 100 100 100 100 
##$AQSEQ= 0
##$AQ_mod= 1
##$AUNM= <au_zg>
##$AUTOPOS= <>
##$BF1= 200.13
##$BF2= 200.13
##$BF3= 200.13
##$BF4= 200.13
##$BF5= 500.13
##$BF6= 500.13
##$BF7= 500.13
##$BF8= 500.13
##$BYTORDA= 1
##$CFDGTYP= 0
##$CFRGTYP= 5
##$CHEMSTR= <none>
##$CNST= (0..31)
1 1 145 1 1 1 1 1 1 1 1 1 1 1 1 1 1 1 1 1 1 1 1 1 1 1 1 1 1 1 1 1 
##$CPDPRG= <>
##$CPDPRG1= <>
##$CPDPRG2= <>
##$CPDPRG3= <>
##$CPDPRG4= <mlev>
##$CPDPRG5= <mlev>
##$CPDPRG6= <mlev>
##$CPDPRG7= <mlev>
##$CPDPRG8= <mlev>
##$CPDPRGB= <>
##$CPDPRGT= <>
##$D= (0..31)
0 2 0 0 0 0 0 0 0 0.06 0 0 0 0 0 0 0.0002 0 0 0 0 0 0 0 0 0 0 0 0 0 0 
0 
##$DATE= 1761146937
##$DBL= (0..7)
120 120 120 120 120 120 120 120 
##$DBP= (0..7)
150 150 150 150 150 150 150 150 
##$DBP07= 0
##$DBPNAM0= <>
##$DBPNAM1= <>
##$DBPNAM2= <>
##$DBPNAM3= <>
##$DBPNAM4= <>
##$DBPNAM5= <>
##$DBPNAM6= <>
##$DBPNAM7= <>
##$DBPOAL= (0..7)
0.5 0.5 0.5 0.5 0.5 0.5 0.5 0.5 
##$DBPOFFS= (0..7)
0 0 0 0 0 0 0 0 
$$ [...]
##$SUBNAM4= <"">
##$SUBNAM5= <"">
##$SUBNAM6= <"">
##$SUBNAM7= <"">
##$SUBNAM8= <"">
##$SUBNAM9= <"">
##$SW= 20.6817932712277
##$SWIBOX= (0..15)
0 0 3 0 0 0 0 0 0 0 0 0 0 0 0 0 
##$SW_h= 4139.07284768212
##$TD= 32768
##$TD0= 1
##$TE= 0
##$TE2= 300
##$TE3= 300
##$TEG= 300
##$TL= (0..7)
0 120 120 120 120 120 120 120 
##$TP= (0..7)
150 150 150 150 150 150 150 150 
##$TP07= 0
##$TPNAME0= <>
##$TPNAME1= <>
##$TPNAME2= <>
##$TPNAME3= <>
##$TPNAME4= <>
##$TPNAME5= <>
##$TPNAME6= <>
##$TPNAME7= <>
##$TPOAL= (0..7)
0.5 0.5 0.5 0.5 0.5 0.5 0.5 0.5 
##$TPOFFS= (0..7)
0 0 0 0 0 0 0 0 
##$TUNHIN= 0
##$TUNHOUT= 0
##$TUNXOUT= 0
##$USERA1= <user>
##$USERA2= <user>
##$USERA3= <user>
##$USERA4= <user>
##$USERA5= <user>
##$V9= 5
##$VALIST= <valist>
##$VCLIST= <CCCCCCCCCCCCCCC>
##$VD= 0
##$VDLIST= <DDDDDDDDDDDDDDD>
##$VPLIST= <PPPPPPPPPPPPPPP>
##$VTLIST= <TTTTTTTTTTTTTTT>
##$WBST= 1024
##$WBSW= 30
##$XGAIN= (0..3)
0 0 0 0 
##$XL= 0
##$YL= 0
##$YMAX_a= 161236
##$YMIN_a= -90839
##$ZGOPTNS= <>
##$ZL1= 120
##$ZL2= 120
##$ZL3= 120
##$ZL4= 120
##$ABSF1= 0
##$ABSF2= 0
##$ABSG= 0
##$ABSL= 0
##$ALPHA= 0
##$AQORDER= 0
##$ASSFAC= 0
##$ASSFACI= 0
##$ASSFACX= 0
##$ASSWID= 0
##$AUNMP= <proc_1d>
##$AZFE= 0.1
##$AZFW= 0.1
##$BCFW= 0
##$BC_mod= 2
##$BYTORDP= 0
##$COROFFS= 0
##$CY= 18.4799938201904
##$DATMOD= 1
##$DC= 0
##$DFILT= <>
##$DTYPP= 0
##$F1P= 9.9274215381318
##$F2P= -0.165520771350173
##$FCOR= 1
##$FTSIZE= 16384
##$FT_mod= 6
##$GAMMA= 0
##$GB= 0
##$INTBC= 1
##$INTSCL= 4.127829e-11
##$ISEN= 128
##$LB= 0.05
##$LEV0= 0
##$LPBIN= 0
##$MAXI= 10000
##$MC2= 0
##$MEAN= 0
##$ME_mod= 0
##$MI= 50
##$NCOEF= 0
##$NC_proc= -9
##$NLEV= 6
##$NOISF1= 3.799351
##$NOISF2= 2.8
##$NSP= 0
##$NTH_PI= 0
##$NZP= 0
##$OFFSET= 16.48848
##$PC= 4
##$PHC0= -273.3076
##$PHC1= 6.501565
##$PH_mod= 1
##$PKNL= yes
##$PPARMOD= 0
##$PSCAL= 4
##$PSIGN= 0
##$REVERSE= no
##$SF= 200.130005582386
##$SI= 16384
##$SIGF1= 3
##$SIGF2= 2
##$SINO= 400
##$SIOLD= 16384
##$SREGLST= <1H.CDCl3>
##$SSB= 0
##$STSI= 16384
##$STSR= 0
##$SW_p= 4139.07284768211
##$SYMM= 0
##$S_DEV= 0
##$TDeff= 32768
##$TDoff= 0
##$TI= <>
##$TILT= no
##$TM1= 0
##$TM2= 0
##$TOPLEV= 0
##$USERP1= <user>
##$USERP2= <user>
##$USERP3= <user>
##$USERP4= <user>
##$USERP5= <user>
##$WDW= 1
##$XDIM= 16384
##$YMAX_p= 277591614
##$YMIN_p= -2578056
$$ End of Bruker specific parameters
$$ ---------------------------------
##NTUPLES= NMR SPECTRUM
##VAR_NAME=  FREQUENCY,     SPECTRUM/REAL,   SPECTRUM/IMAG
##SYMBOL=    X,             R,               I
##VAR_TYPE=  INDEPENDENT,   DEPENDENT,       DEPENDENT
##VAR_FORM=  AFFN,          ASDF,            ASDF
##VAR_DIM=   16384,         16384,           16384
##UNITS=     HZ,            ARBITRARY UNITS, ARBITRARY UNITS
##FACTOR=    0.252644378177508, 1,           1
##FIRST=     3299.83951724647, 0,            0
##LAST=      -839.233330435636, 0,           0
##MIN=       -839.233330435636, -2578056,    0
##MAX=       3299.83951724647, 277591614,    0
$$ Real data points
##PAGE= N=1
##DATA TABLE= (X++(R..R)), XYDATA
$$ [...]
7002G2068389q8020k11115l03350j74771O32837l3595j392756j97538K35652L20813
6992G0856546k29137p06866o87211R01170j085258K24684P47208l16738r28771
6983F8775627O91680o5402N13747R46210k726276N23544N2244l1227J086006j602788
6973F8163365n06768N55388j97301m9889p80231p55032n59646q36326n1676Q83257
6963F5865141L89492j597063J404369n22461j701148J882026j27148n70016n96079
6954F4427113J06825J86267q87802O67105N26572p27836p12566P974k8083J576448
6944F5142017q15826j517060J953439j855433j032462L25605m21125k88098L59401
6935F1850458n97118K03754j705406P82729k191808M36767Q82327j65691N21524
$$ plain form
7002 72068389 71980369 71769254 71465904 71291133 71923970 71890375 70497619 70300081 70535733 70856546
6992 70856546 70627409 69920543 69233332 70134502 69049244 69273928 70021136 69704398 68775627
6983 68775627 69467307 69401905 69915652 70861862 68135586 68659130 68711374 68680147 69766153 68163365
6973 68163365 67656597 68211985 68014684 67964795 67184564 66429532 65869886 65033560 64981884 65865141
6963 65865141 66254633 64657570 66061939 65539478 63838330 65720356 65593208 65023192 64427113
6954 64427113 64533938 64720205 63832403 64499508 65026080 64298244 63585678 63593652 63565569 65142017
6944 65142017 64326191 62809131 64762570 62907137 61874675 62200280 61779155 61491057 61850458
6935 61850458 61253340 61457094 59751688 60534417 58342609 58779376 59661703 59496012 60017536
6926F0017536p81282r31258q95525Q0882N26228o11884J425402p31708q47711
6917E7250680o01520J504432k860197o64933J228808j076027J590714m87462j987437
6908E3897058J010396j213828N02527J073812k704594K151058j920271M72314
6900E3268472l83318O67929j023273j512175K722477k113252k54264j20780J065350
6891E2317166O38214m49667m23515J120910k336313J05173J124377j654610j099066
6882D9342669J688933J23701k015700K85299Q40666p26305j52101m7838p67327
6873D8571997M93836o61186N54716J4178o03644Q56109r89234J507207o56750
6864D9087229Q29363r92982J47640P16580j023636k9291J22079n38733j399622
$$ plain form
6926 60017536 59236254 58304996 57409471 57490353 58016581 57404697 58830099 58098391 57250680
6917 57250680 56649160 58153592 55293395 54628462 55857270 54781243 56371957 55884495 53897058
6908 53897058 54907454 53693626 54196153 55269965 52565371 54716429 52796158 53268472
6900 53268472 52885154 53553083 52529810 51017635 53740112 51626860 51372596 51251816 52317166
6891 52317166 52955380 52505713 52082198 53203108 50866795 50971968 52096345 50441735 49342669
6882 49342669 51031602 51155303 49139603 49424902 50265568 49539263 49387162 49339324 48571997
6873 48571997 49065833 48404647 48959363 48973541 48369897 49226006 48236772 49743979 49087229
6864 49087229 49916592 48923610 49071250 49787830 48764194 48734903 48856982 48318249 46918627
6855D6918627n86682K422680Q49470l599228R16821R68757l16867O23999n96849
6846D7600728k58272L55010O76047k11528l66460j62883o16067J232359n49071
6837D7699863K18948j457593n17245M22920j571313J93510j94775j438574j124374
6828D2231367Q43523j8283k21365p85153J381937j144430m80369N63531q3133
6819D2287625k12026q29969N11038J051184M46715q93161o02889P49637M98045
6810D3006199j595321o97701J17459J917133j392648J91912N98068m64422k78993
6801D1401686O78967j909921P71796j071373M45105K973922k615799J81071k33178
6792D0622276k4162K38503K12305q01444J14753K36059J342758r11012L52839
$$ plain form
6855 46918627 46331945 48754625 49604095 46004867 46921688 47890445 47573578 48197577 47600728
6846 47600728 47342456 47697466 48373513 48161985 47795525 47632642 47016575 48248934 47699863
6837 47699863 47918811 46461218 45943973 46366893 44795580 44989090 44794315 43355741 42231367
6828 42231367 43074890 43056607 42835242 42050089 43432026 42287596 41807227 42370758 42287625
6819 42287625 42075599 41245630 41756668 42807852 43254567 42361406 41758517 42508154 43006199
6810 43006199 41410878 40713177 40830636 42747769 41355121 41547033 42145101 41680679 41401686
6801 41401686 42080653 40170732 40942528 39871155 40316260 43290182 40674383 40855454 40622276
6792 40622276 40598114 40836617 41048922 40247478 40362231 40598290 41941048 41030036 41382875
6783D1382875m64015N47101m17792j647334L02073K090352j252389R01228o06959
6774D0835140l25916J126700o88757j413453R7559Q36492j006837N12541j332260
6765C8641209J312105L66909o36674j1268m49375L77361L65781o45571O2820L81344
6755C9764641Q35458j338855K654127k448305J949173o25453m99303j238770N22465
6746C9575178M68863P1759m47541J241860l82006L41370m03266J7228j199670
6737C9283775K148858q02966Q23528o1347n38342O50127N93801l26998j018347
6728D0752089J012570j77294J95981J167490j68184j013909J022002l54724j60224
6719D2275797l70944J44210P25881J433947p74371l73861o40920L59091J1921
$$ plain form
6783 41382875 40918860 41465961 41048169 39400835 39702908 41793260 40540871 41442099 40835140
6774 40835140 40509224 41635924 40947167 39533714 39631273 40467765 39460928 39973469 38641209
6765 38641209 39953314 40320223 39683549 39672281 39222906 39600267 39966048 39320477 39383297 39764641
6755 39764641 40600099 39261244 41915371 39467066 41416239 40790786 40291483 39052713 39575178
6746 39575178 40044041 40115800 39668259 40910119 40528113 40869483 40466217 40483445 39283775
6737 39283775 41432633 40629667 41453195 41391848 40853506 41503633 42097434 41770436 40752089
6728 40752089 41764659 41587365 41783346 42950836 42782652 41768743 42790745 42436021 42275797
6719 42275797 41904853 42049063 42774944 44208891 43434520 43060659 42419739 42778830 42790751
6710D2790751J552174q66300J101855j023768M18630N11074K51237l50091j540750
6701D2844812Q47300j80756J062556j04473N31231M62807o92259K0831M210O52331
6691D5448590R13892n01576Q48471k18631J057176j121563n7075l87356J037470
6682D7019398N48865r21737l33700p3676O21249o16980Q25073K50039J162886
6673D8481417j956929J226999J190309q84324L68958J215779P36147N59297m94424
6664E0443229O30387M08246J3623R51747J039235r75521P26725R91808j12645
6655E4116834Q02565j12710J566375m55190K007304J60702N71754p0592J543324
6646F0130366K116696Q30150J37360J248951q2238J503715J01864m67453J145144
$$ plain form
6710 42790751 44342925 43476625 44578480 43554712 43973342 44484416 44735653 44385562 42844812
6701 42844812 43692112 43511356 44573912 44469439 45000670 45463477 44771218 44792049 44796259 45448590
6691 45448590 46362482 45860906 46709377 46490746 47547922 46426359 46369284 45981928 47019398
6682 47019398 47568263 46646526 46312826 46239150 46860399 46243419 47068492 47318531 48481417
6673 48481417 46524488 47751487 48941796 48057472 48426430 49642209 50378356 50937653 50443229
6664 50443229 51073616 51481862 51495485 52447232 53486467 52510946 53237671 54229479 54116834
6655 54116834 54919399 54806689 56373064 55917874 57925178 58085880 58657634 58587042 60130366
6646 60130366 62247062 63077212 63214572 64463523 64381285 65885000 65986864 65519411 66664555
6637F6664555m91323j180342J284695q4149p98475J710272R14828j59448K92850
6628F8153463R97986L64505K45373Q55808K81681L93811K243868J693994J1013
6619G5241502L018080J448472M523264K508237K513860L58212j179768J76153
6611H8608012j617617R78579k417357l636583j675403j475945m22199l397484
6603G4944003j306719J828095j495291o34378j338826J272096k114443J677297
6595G2831834j305572J75084J461355J37844R4468K935865J601278L206488O34159
6586H1772803J062879l40244j992724j276739k565386j6628m006259l237277k591980
6577F6808445k689603k210082k640796k232688N3861j001064j289961p91043l83317
$$ plain form
6637 66664555 66173232 64992890 66277585 66193436 65394961 67105233 68020061 67860613 68153463
6628 68153463 69151449 69515954 69761327 70617135 70898816 71292627 73536495 75230489 75241502
6619 75241502 78259582 79708054 84231318 86739555 89253415 89611627 88431859 88608012
6611 88608012 86990395 87968974 85551617 81915034 80239631 78763686 78341487 74944003
6603 74944003 73637284 75465379 73970088 73335710 71996884 73268980 71154537 72831834
6595 72831834 71526262 71701346 73162701 73300545 73395013 76330878 77932156 81138644 81772803
6586 81772803 82835682 82495438 80502714 79225975 76660589 76643961 72637702 69400425 66808445
6577 66808445 64118842 61908760 59267964 57035276 57089137 56088073 54798112 54007069 53623752
6568E3623752k648938K03377M05327m56684j012216P76965O63425j298084J074234
6559E1331158Q48076J328693k506460k25844k67465j75774j792202j354811j167045
6550D6018326p59559k329280O06977j830187R8994j164417o96662n13834m76483
6541C8953875j054865o73857J268299j646640q95925N0045L28214Q77552j922886
6532C5283812J419326m29953l00509j552748J880149j386301m63210L57930Q06731
6523C5615227k1992m62531j319257P77407m15467K62674K74236o72350n37746
6514C3500201J94889J26173l43632n22748K20516M87389j016466L59424j552607
6505C1453139P17064O06747n04573O81584r28746j01831R49797q41817Q93180
$$ plain form
6568 53623752 50974814 51178191 51583518 51126834 50114618 50891583 51555008 50256924 51331158
6559 51331158 52179234 53507927 51001467 50775623 50508158 50332384 48540182 47185371 46018326
6550 46018326 45258767 42929487 43536464 41706277 41805271 40640854 39944192 39430358 38953875
6541 38953875 37899010 37225153 38493452 36846812 35950887 36000932 36329146 37206698 35283812
6532 35283812 36703138 36273185 35972676 34419928 36300077 34913776 34450566 34808496 35615227
6523 35615227 35593235 35130704 33811447 34588854 34173387 34436061 34710297 34037947 33500201
6514 33500201 33695090 33821263 33477631 32954883 33175399 33662788 32646322 33005746 31453139
6505 31453139 32170203 32776950 32272377 32953961 32025215 31923384 32873181 32031364 32924544
6496C2924544l16491k12047j15j87822M36130l4781j220740K361466k324282L93075
6486C1818937j61222K82308o1438m15357j74916Q67827m31498l10213j640642
6477B9773786J480909n76107M10979M34934o42291j563504J545569N82111j254041
6468C0192345k285085L240421j208814n60093J818289j603551L68353m99253m05595
6459B9057017Q48312j78731j216041N54261j359485R85090k102971K195531j401814
6450B7381169k1078n64794m06388q39251J194815K34962l43700o07030J86165
6441B6214870j026574J201059K6267j088801J83569m47295J44757m92764j188849
6432B3526239O51447j037826K068432j247190J62215o15524j94621r84640O27777
$$ plain form
6496 32924544 32608053 32396006 32395891 32208069 32644199 32609418 31388678 33750144 31425862 31818937
6486 31818937 31657715 31940023 31878585 31463228 31288312 32156139 31724641 31414428 29773786
6477 29773786 31254695 30678588 31089567 31524501 30882210 29318706 30864275 31446386 30192345
6468 30192345 27907260 31147681 29938867 29378774 31197063 29593512 29961865 29462612 29057017
6459 29057017 29905329 29726598 28510557 29064818 27705333 28690423 26587452 28782983 27381169
6450 27381169 27360091 26795297 26388909 25549658 26744473 26979435 26635735 26028705 26214870
6441 26214870 25188296 26389355 26415622 25326821 25510390 25063095 25207852 24715088 23526239
6432 23526239 24177686 23139860 25208292 23961102 24123317 23507793 23313172 22328532 22956309
6423B2956309m89507J178192o92639p71183Q22093j404300l98927J341561q05178
6414B1736421O0672J44970j497186l2503K36539J490207r63244j0105j344315
6405A9821456K06J693805j410375k1943j75394N38432m61627j073325J115405
6396B0026640L67698o59324R62099m38046j401801N03174r93550N75904m07335
6387A8535459N63338q31891j001067J431692L6467r03562Q08840o84055P87252
6378A8742473p45269N64621j018123l03012J424614j332735n90751N63547m82788
6369A6822577M29429N35647l31988J015259j478532l54395J185083l23439K39226
6360A7738867k072527J374050j152118J702151O642K19891j645437J402502j71700
$$ plain form
6423 22956309 22466802 23644994 22952355 22181172 23003265 21598965 21200038 22541599 21736421
6414 21736421 21797093 21942063 20444877 20412374 20648913 22139120 21175876 21165771 19821456
6405 19821456 19821662 21515467 20105092 20083149 19907755 20446187 19984560 18911235 20026640
6396 20026640 20394338 19735014 20697113 20259067 18857266 19360440 18366890 18942794 18535459
6387 18535459 19098797 18266906 17265839 18697531 18733998 17830436 18639276 17955221 18742473
6378 18742473 17997204 18561825 17543702 17240690 18665304 17332569 16741818 17305365 16822577
6369 16822577 17252006 17787653 17455665 18470924 16992392 16637997 17823080 17499641 17738867
6360 17738867 15666340 17040390 15888272 17590423 17597065 17816956 16171519 17574021 17402321
6351A7402321r63440J795027j814772N99937N02818j223179P17458J49609l39156
6342A6826623J043211j486090O60575k82335P15568j775272J357866n92397M27970
6333A6895719J88851n68125J29460J119707k299757R65697r77296J423126j305489
6324A5571893J22883K11419O76047J10143L88132m44181R90577j148519O21426
6315A7099820l92154O78692o39495q9252J8739p94450N82571M05318o64573O05040
6305A6810256l11350J664937k961687L89491j92633r3380q51204J21489N84546
6296A5160465J187122j473284N35661j90284l71014K77077N04002R38326j214256
6287A5353815j396759j76046R65541K29980j486910J227580j98654P53094r06696
$$ plain form
6351 17402321 16438881 18233908 16419136 17019073 17521891 16298712 17016170 17165779 16826623
6342 16826623 17869834 16383744 17044319 16761984 17477552 15702280 17060146 16467749 16895719
6333 16895719 17084570 16516445 16645905 17765612 15465855 16431552 15454256 16877382 15571893
6324 15571893 15694776 15906195 16582242 16692385 17080517 16636336 17626913 16478394 17099820
6315 17099820 16707666 17386358 16746863 16657611 16676350 15881900 16464471 16869789 16205216 16810256
6305 16810256 16498906 18163843 15202156 15591647 15399014 15305634 14454430 14575919 15160465
6296 15160465 16347587 14874303 15409964 15219680 14848666 15125743 15629745 16568071 15353815
6287 15353815 13957056 13781010 14746551 14976531 13489621 14717201 14518547 15271641 14364945
6278A4364945Q0994K62773p75249P28546o33588J05428N46418J21520k284887
6269A2516900J069404K57770J95447L25998j085790J416070j300490m43189L71669
6260A3323789n88596m91364o9728O86829m90327O40626j363597J386152m57065
6251A2576719r1539R69712o49946N31557j647834O50583K07076m12743J137520
6242A3271105m85221r04147n30010K119351j668084N14588J79428k128494J253141
6233A1621657j209183k24971N68649o46351P35198j137800J354308j035703J899982
6224A1925786j499703k94138J33476j136234N71886P93537p25636K97363r43796
6215I122541K44100R78121P42704q41460k4324n17215j48475m53149m50143P36073
$$ plain form
6278 14364945 14445939 14708712 13933463 14662009 14028421 14133849 14680267 14801787 12516900
6269 12516900 13586304 13844074 14039521 14365519 13279729 14695799 13395309 12952120 13323789
6260 13323789 12735193 12243829 12174101 12860930 12370603 13011229 11647632 13033784 12576719
6251 12576719 12485180 13454892 12804946 13336503 11688669 12339252 12546328 12133585 13271105
6242 13271105 12785884 11881737 11351727 13471078 11802994 12317582 12497010 10368516 11621657
6233 11621657 10412474 10187503 10756152 10109801 10844999 9707199 11061507 10025804 11925786
6224 11925786 10426083 10131945 10265421 9129187 9701073 10494610 9768974 10066337 9122541
6215 9122541 9366641 10344762 11087466 10246006 10221682 9704467 9555992 9102843 8652700 9388773
6205I388773n04939J150126o27954m42589m38949N99811p96873J175532k60402
6196I242536r57511k77141J610806k109571Q74328k19315O87596l52798n26280
6187G972650O97703j441256J871999J21270n39078j32227j06995o04056k53926
6178G586084k32840J191659j374881P11381j02946l7366j375906K141578r72788
6169G533975n66078n10098O60079L88394K8856m85941j25883n62658J056356q91486
6159F525516M04290r23150J009106j284260N83289j406188J078276m8263P05048
6150F643664L94681o44975n41648R24723j365810Q17475l71292K23404K02473
6141F282695N29211n6310r19832k86571o00759J15093O08380P83844J175101k364247
$$ plain form
6205 9388773 8883834 10033960 9406006 8963417 8524468 9124279 8327406 9502938 9242536
6196 9242536 8285025 8007884 9618690 7509119 8383447 8164132 8851728 8498930 7972650
6187 7972650 8670353 7229097 9101096 9222366 8683288 8551061 8444066 7840010 7586084
6178 7586084 7353244 8544903 7170022 7881403 7778457 7741091 6365185 8506763 7533975
6169 7533975 6967897 6457799 7117878 7506272 7535128 7049187 6923304 6360646 7417002 6525516
6159 6525516 6929806 6006656 7015762 5731502 6314791 4908603 5986879 5938616 6643664
6150 6643664 7038345 6393370 5851722 6776445 5410635 6228110 5856818 6080222 6282695
6141 6282695 6811906 6755596 5835764 5549193 4948434 5063527 5671907 6455751 7630852 5266605
6131E266605K0016K66782J111303q77895m5819k6484n18749J327988J306427k563874
6121E266300L13265J625425k005538O98230n84408K40091m09068M1920L72580
6112E558797j886527J927921R73277r35233j100009n42062m9831P12066O70723
6103E329122n54053k41231J85004J003494R88124j864217Q25428n70342J009254
6094F110583j332731k48270j11191J128632j71457O6209j268647L24786j031540
6085C466374J528110K43306j820238R88224J436796j674265J296560j058902R9166
6076D505131Q3526J647955r15499j77359m29185j01223N73003m58312O25811m89916
6066D863932M19320M53954o10872n54059k87429N47426k94911L99507Q07541j260035
$$ plain form
6131 5266605 5286621 5553403 6664706 5786811 5740992 5714508 5195759 6523747 7830174 5266300
6121 5266300 5579565 7204990 5199452 5897682 5313274 5553365 5144297 5186217 5558797
6112 5558797 3672270 5600191 6573468 5638235 4538226 3996164 3946333 4658399 5329122
6103 5329122 4775069 4533838 4718842 5722336 6710460 4846243 5671671 5101329 6110583
6094 6110583 4777852 4529582 4418391 5547023 5375566 5441775 4173128 4497914 3466374
6085 3466374 4994484 5237790 3417552 4405776 5842572 4168307 5464867 4405965 4505131
6076 4505131 4588657 6236612 5321113 5143754 4714569 4613346 5186349 4728037 5353848 4863932
6066 4863932 5283252 5737206 5126334 4572275 4284846 4832272 4537361 4936868 5744409 4484374
6056D484374J656284r99560j039755P65794o5805k13122l63559J912364o72383
6047E464632j787131J358643r23631N2525J214953O87111j225044J54626k72827
6038D723857o24113J656625k218958K109026j272960n01458J627050p50653P75886
6029E524302k066816M61364J011615K97644j084849l87673K665596j937959L59750
6020D842974J05750n16564J188338l68j514688j57626n55382M35211K60153J102094
6010E189892r44190P53884J244324j399841K22201K19996j70805k27866n44267
6001D343328o2497J177184j961002J117861k28928J921023k422080K078894j041210
5992D922573o21985o67882P68911P25438j73713L31586m20497Q2338Q8010J080908
$$ plain form
6056 4484374 6140658 5141098 4101343 4867137 4801332 4588210 4224651 6137015 5464632
6047 5464632 3677501 5036144 4112513 4165038 5379991 6067102 4842058 4996684 4723857
6038 4723857 4099744 5756369 3537411 5646437 4373477 3872019 5499069 4748416 5524302
6029 5524302 3457486 3918850 4930465 5228109 4143260 3755587 6421183 4483224 4842974
6020 4842974 4948724 4432160 5620498 5620130 4105442 3947816 3392434 3827645 4087798 5189892
6010 5189892 4245702 4999586 6243910 4844069 5066270 5286266 5115461 4887595 4343328
6001 4343328 4280831 5458015 3497013 4614874 4385946 6306969 3884889 5963783 4922573
5992 4922573 4300588 3632706 4401617 5127055 4953342 5284928 4864431 4946769 5034779 6115687
5982F115687q39928K03692j271754O12874l52593J773541j391810j080105J928268
5973E697872j841628O69203N28283j9770N09785j494124K274687r43533o02096
5964D778679M30321J064563l31044q38211K36826m15609L32513L91891n35950
5955E113979j882875J142994N498K18150M02636o6823Q97173J480871k786369
5946D525234K81379J348870j629524R86059p75667L35920J47402j399565J950549
5937E770657n80248j609972J274022l10589J289950j797986J138608r8001J29849
5928E206290L32861k292297L217512k222352J219048j923352J625384j70611q86218
5919D106265L72704Q67519n71218L59555j305001J207722L06975j253021L43578
$$ plain form
5982 6115687 5275759 5479451 4207697 4820571 4467978 6241519 4849709 3769604 5697872
5973 5697872 3856244 4525447 5053730 5033960 5543745 4049621 6324308 5380775 4778679
5964 4778679 5209000 6273563 5942519 5104308 5341134 4925525 5258038 5649929 5113979
5955 5113979 3231104 4374098 4379596 4597746 5000382 4933559 5830732 7311603 4525234
5946 4525234 4806613 6155483 4525959 5512018 4736351 5072271 5219673 3820108 5770657
5937 5770657 5190409 3580437 4854459 4543870 5833820 4035834 5174442 5076441 5206290
5928 5206290 5539151 3246854 6464366 4242014 5461062 3537710 5163094 4992483 4106265
5919 4106265 4478969 5346488 4775270 5134825 3829824 5037546 5344521 4091500 4435078
5910D435078J3283J359903r90105k5584o74598K65501K95511N90562P19022o65988
5900E322585O8814n54551Q59189l28331l30596N52686n035R46181m93685r32361
5890E104896J749849j162776j245552J115687m49609j00558O65434n31307r87502
5881D158562J058766m7229o30272Q33154J249508j496894q23396Q57201M48148
5872E607548k5662L02338r53617J088423k57457n6722J671j154372J582201o52402
5862E481949M03678n30281L81953L45066j152706k86800J890385n09283j899828
5853D124133K513394O28122l21829k754349J944813j71512j095729o79230J8720
5844D206533J599427M31271q35732k47264K85546j22049J913411j282701J92082
$$ plain form
5910 4435078 4448361 5808264 4818159 4792575 4117977 4383478 4678989 5269551 5988573 5322585
5900 5322585 5391399 4836848 5696037 5367706 5037110 5589796 5584761 6530942 6037257 5104896
5890 5104896 6854745 5691969 4446417 5562104 5112495 5011937 5677371 5146064 4158562
5881 4158562 5217328 5170099 4539827 5372981 6622489 5125595 4302199 5159400 5607548
5872 5607548 5581886 5884224 4930607 6019030 5761573 5704851 5706522 4552150 6134351 5481949
5862 5481949 5885627 5355346 5737299 6082365 4929659 4642859 6533244 6023961 4124133
5853 4124133 6637527 7265649 6943820 4189471 6134284 5962772 4867043 4187813 4206533
5844 4206533 5805960 6237231 5401499 5154235 5439781 5317732 7231143 5948442 6140524
5835F140524k08947j83473m52290r3855J64551o37273L60825J652084r39182N57393
5825F360357j435935K079572j195865k83037K002183q62123J54832n83488l75370
5816E861126J912740j464487K21249M97114j214979J639371j646093P08908O8660
5807F583609r00862J554841j639485J517675j674776J137915L5884l17516J593179
5798G890464j546449m8291L49370p97337n4909J215880j01775J25439j555419
5789E476973J198130N06667o30817Q54842j373949R50668K62302o73290j06054
5780F465472m21670P52171n18289k5821k50321J848636j155483M16066L81674
5771G492435q76942K20705M25241q79936M16307M35889m29755J167001o46993
$$ plain form
5835 6140524 5931577 5748104 5295814 5201959 5366510 4729237 5090062 6742146 5802964 6360357
5825 6360357 4924422 7003994 5808129 5525092 7527275 6665152 6819984 6236496 5861126
5816 5861126 7773866 6309379 6530628 7027742 5812763 7452134 5806041 6514949 6583609
5807 6583609 5682747 7237588 5598103 7115778 5441002 6578917 6614801 6297285 7890464
5798 7890464 6344015 6295724 6645094 5847757 5792848 7008728 6906953 7032392 5476973
5789 5476973 6675103 7181770 6550953 7405795 6031846 6982514 7244816 6571526 6465472
5780 6465472 6043802 6795973 6277684 6251863 6001542 7850178 6694695 7110761 7492435
5771 7492435 6615493 6836198 7261439 6381503 6797810 7233699 6803944 7970945 7323952
5762G323952k98862q556m93718R36808o10615j31685m73435J842890n83032K31389
5752G735136p16908q1770Q38660N5118j87599J12209J423862o28461j486664J843550
5742H907133l32575p22129J026865q49294k45160K89429J619673j414703m98984
5733G780255K150131l17985k028996R12844m43621Q31661m20359j020435J199853
5724H643348l03777Q48857J85093K54398J39126K38799p23713J81751j305556
5715H158326K293432n97578r66884j501767K196713k40073J51253L58879l94434
5706I457867q6842j26128k67923k7483J042110L249J76370j454589J55738l9342
5696H833027n84660R43523J023943o10704K90237k05144Q03028k45578n91117
$$ plain form
5762 7323952 7025090 7016534 6522816 7459624 6849009 6717324 6243889 8086779 7503747 7735136
5752 7735136 7018228 6936458 7775118 7830236 7642637 7754846 9178708 8550247 7063583 8907133
5742 8907133 8574558 7852429 8879294 8030000 7784840 8074269 9693942 8279239 7780255
5733 7780255 9930386 9612401 7583405 8496249 8052628 8884289 8463930 7443495 8643348
5724 8643348 8339571 9188428 9373521 9627919 9767045 10005844 9282131 9463882 8158326
5715 8158326 10451758 9854180 8887296 7385529 9582242 9342169 9493422 9852301 9457867
5706 9457867 9371025 9244897 8976974 8949491 9991601 9994850 10171220 8716631 8872369 8833027
5696 8833027 8248367 9191890 10215833 9605129 9895366 9690222 10493250 10247672 9656555
5687I656555M32869J364234j664886R9430J59129L09981l93035K27572Q70858
5678A1062707n65238r60054R86000R01342n65181N5148k33607j061491j58343
5669I461283P84323L87883j048843J365966j808614R05115J016674N93511L91742
5660A2049040k700586J721963r15325J598562p83265J79569k89831J00104k78152
5651A0682079o78985J349353k31889J50965p07678J279176j022774O99304r53591
5642A0565960j41614L80554J424061m83847r60367p72595J570215m65158L62086
5633A1479295p31076J54971J287625l57288j34400j096355N67136m87898K321924
5624A3003934j395625J312943j040636j81692M15938Q42735j756532j261008K985411
$$ plain form
5687 9656555 10089424 11453658 9788772 9888202 10047331 10357312 9964277 10191849 11062707
5678 11062707 10497469 9537415 10523415 11424757 10859576 10914724 10681117 9619626 9461283
5669 9461283 10245606 10633489 9584646 10950612 9141998 10047113 11063787 11657298 12049040
5660 12049040 9348454 11070417 10155092 11753654 10970389 11149958 10860127 10960231 10682079
5651 10682079 10003094 11352447 11120558 11271523 10563845 11843021 10820247 11519551 10565960
5642 10565960 10424346 10804900 12228961 11745114 10784747 10012152 11582367 11117209 11479295
5633 11479295 10748219 10903190 12190815 11833527 11699127 10602772 11169908 10682010 13003934
5624 13003934 11608309 12921252 11880616 11698924 12114862 12957597 11201065 9940057 12925468
5615A2925468n50569p41718J1304M73838o52871j12611J02114k75926O52813k2939
5605A1808903m3881Q38814p97089K32775O48925l39573J62508K67440M24862j078171
5595A2125513L76012K46505J034499j869875J198960j53014m90j26911n41312
5586A2289887K193095j254267l06133K52439n64433L70681o2974P08832M93659
5577A4120786r24356p67816J159172J573100k552214M44720J466156N2399j302545
5568A3269402J532525n44684j792806J568653j435667J599046N2988j167317J056795
5559A4138935j718595J33411Q97496K121339j77620L51286j673221N9391q04205
5550A3328217K153336n33051J14710j4116K20680L85327R64636j295959L28532
$$ plain form
5615 12925468 12374899 11633181 11644485 12118323 11465452 11352841 11454955 11179029 11831842 11808903
5605 11808903 11765022 12603836 11806747 12039522 12688447 12348874 12511382 12778822 13203684 12125513
5595 12125513 12501525 12748030 13782529 11912654 13111614 12958600 12958110 12831199 12289887
5586 12289887 14482982 13228715 12922582 13175021 12610588 12981269 12918295 13627127 14120786
5577 14120786 13196430 12428614 13587786 15160886 12608672 13053392 14519548 14571947 13269402
5568 13269402 14801927 14257243 12464437 14033090 12597423 14196469 14249457 13082140 14138935
5559 14138935 12420340 12553751 13451247 15572586 15394966 15746252 14073031 14132422 13328217
5550 13328217 15481553 14948502 15063212 15049096 15269776 15655103 16619739 15323780 15652312
5541A5652312q0262J66994j46212J240183n14533j471217J711781o5557L73211
5532A6866700l98423l18614L82560M11472r86651P74061K20413M08479o50595
5523A6709402J001839j340870R50505k65406n56953J367374L55077l06486L82692
5514A8297174j101319P05074J70582k96408R20947j303706J125259r15004R45058
5505A8547657M9071k151149J743341P62373O38795M05335m10035j64567q79539
5496A8541282n0760R70492J455554j285514O70014n9274j388887j63518P87397
5487A9476786N52002l28731P71988M4879n40219Q65891M60874M34742l49249P75586
5477B2164549J36639L44049n60369P0557k9781R13221l29429J09355J632892q76411
$$ plain form
5541 15652312 15572050 15739044 15592832 16833015 16318482 14847265 16559046 16493489 16866700
5532 16866700 16468277 16149663 16532223 16943695 15957044 16731105 16951518 17359997 16709402
5523 16709402 17711241 16370371 17320876 17055470 16498517 17865891 18220968 17914482 18297174
5514 18297174 17195855 17900929 18071511 17775103 18696050 17392344 18517603 17602599 18547657
5505 18547657 18596728 16445579 18188920 18951293 19590088 19995423 19585388 19420821 18541282
5496 18541282 18490522 19461014 20916568 19631054 20301068 20241794 18852907 18689389 19476786
5487 19476786 20028788 19700057 20472045 20516924 19976705 20842596 21303470 21738212 21388963 22164549
5477 22164549 22301188 22645237 22084868 22155425 22125644 23038865 22709436 22818791 24451683 23575272
5467B3575272L18325J65758r34013P53940O94928l304o53000j37304N00107K90915
5457B4571624j175331J027321l59677j06932M28045j18054R36878Q4189R42756
5448B6230819j43922j66383P11321o47522O49213L43400P80668r66091J010272
5439B7801775N00763o01243m37645O85305J05852n21244o98508O91081K89071
5430B7815207j365856N07518j785924N97924J339818K5497j110856n95781K251945
5421B7679492J821186k34850q04004M9696j181461K61616k821845Q4439l73365
5412B4480904J799705p92104j449500K18341O72686k11824J108187q78343q4211
5403B4863841R5163j683139R27432R14937j564882o3879R71703m4121n70158p61765
$$ plain form
5467 23575272 23893597 24059355 23125342 23879282 24574210 24570906 23917906 23780602 24280709 24571624
5457 24571624 23396293 24423614 24063937 23957005 24385050 24266996 25203874 25288063 26230819
5448 26230819 26086897 25920514 26631835 25984313 26633526 26976926 27757594 26791503 27801775
5439 27801775 28302538 27701295 27263650 27948955 28054807 27533563 26835055 27526136 27815207
5430 27815207 26449351 26956869 25170945 25768869 27108687 27134184 26023328 25427547 27679492
5421 27679492 29500678 29265828 28461824 28511520 27330059 27591675 24769830 24854269 24480904
5412 24480904 26280609 25488505 24039005 24257346 24930032 24718208 25826395 24948052 24863841
5403 24863841 24959004 23275865 24203297 25118234 23553352 23489473 24461176 24417055 23846897 23085132
5393B3085132J497019l2706K3826n45683J036067j063229j051135R16139k68599
5384B3596831Q81441o05884j153391J433313r73034K27066j80534j13109R02363
5375B4015062N7112L1086o87077J585811o42583Q0448j374510K471714j587892
5366B3949171M72259o03074Q79199p69186L93169J15198K72667j470163k16586
5357B3022654J550203r49672l23411O19133j96311L96284q0692K73899n37110
5348B3774977J87915K59042j61632R46179j512959q2263N70360P64904P3309j020961
5338B3798871J303662k77502M25574k47144j420852Q3375o40087J730344K20285
5329B4976526m70891p12886M25006J529963j02269j21856n60393K01273J798076
$$ plain form
5393 23085132 24582151 24549445 24573271 24027588 25063655 24000426 22949291 23865430 23596831
5384 23596831 24478272 23872388 22718997 24152310 23179276 23406342 23225808 23112699 24015062
5375 24015062 24072174 24103260 23416183 25001994 24359411 24439859 23065349 25537063 23949171
5366 23949171 24421430 23818356 24697555 23928369 24321538 24436736 24709403 23239240 23022654
5357 23022654 24572857 23623185 23299774 23918907 23722596 24118880 24038188 24312087 23774977
5348 23774977 23962892 24221934 24060302 25006481 23493522 23411259 23981619 24746523 24819832 23798871
5338 23798871 25102533 24825031 25250605 25003461 23582609 23665984 23025897 24756241 24976526
5329 24976526 24505635 23792749 24217755 25747718 25645449 25523593 24963200 25164473 26962549
5320B6962549l90887J083924j392583j70648J025311q36517K95099J93470q74810
5311B5894908K67863J058135j180099J775219k18663Q81489l82462L43418k68468
5302B8171340n99687R9121L97835N24088M75436j508382r05296P33367O34376
5293B8022198j000375P79776k227109P86347J040583m80891j071138J251974m02805
5284B6698560j37982L97509M5020j288919J193012q02729L03161M47667j630775
5275B5224524J292744L86929K94075j379724J664381n87205J046934Q1226K22485
5266B8246369M0576k88490L61148J126757r42654J026764j697072o6179J744261
5257B9551480n32746R54337q24260J048372l8198J46729L07582j36772o80431
$$ plain form
5320 26962549 26571662 27655586 26263003 26092355 27117666 26281149 26576248 26769718 25894908
5311 25894908 26162771 27220906 26040807 27816026 27597363 28478852 28096390 28439808 28171340
5302 28171340 27571653 27670774 28068609 28592697 29068133 27559751 26654455 27387822 28022198
5293 28022198 27021823 27801599 25574490 26360837 27401420 26920529 25849391 27101365 26698560
5284 26698560 26560578 26958087 27003107 25714188 26907200 26104471 26407632 26855299 25224524
5275 25224524 26517268 26904197 27198272 25818548 27482929 26895724 27942658 28023884 28246369
5266 28246369 28286945 27998455 28359603 29486360 28543706 29570470 27873398 27807219 29551480
5257 29551480 29018734 29973071 29148811 30197183 30158985 30305714 30613296 30476524 29796093
5248B9796093Q95534j05792R03551J100687j215233J048951M45264O16968o30960
5239C2855063J441652m28796k9303R30261j135441Q56387M16995L55142m26670
5230C4835290n82952J229695l81364M05518k45253J00876l23552J384320j50065
5221C6272513q65234M73440j074083J431961J453087j255111N37419Q19570q33285
5212C6960277K28158K05554J209055R54082j89155P37389J130728j066648J245683
5203D1415123q1308l76738P83000J131199j238066L76458J453481j19883N63768
5194D3907034j88182N19858K622759j337925O10929o53163O29088q54994O88414
5185D5943818j961998J479225p37044O00308p77308q23747Q60364M99195L277
$$ plain form
5248 29796093 30691627 30585835 31489386 32590073 31374840 32423791 32869055 33486023 32855063
5239 32855063 34296715 33867919 33838616 34768877 33633436 34489823 34906818 35261960 34835290
5230 34835290 34252338 35482033 35100669 35506187 35260934 35361810 35038258 36422578 36272513
5221 36272513 35407279 35880719 34806636 36238597 37691684 36436573 36973992 37793562 36960277
5212 36960277 37188435 37393989 38603044 39557126 39367971 40105360 41236088 40169440 41415123
5203 41415123 41333815 40957077 41740077 42871276 41633210 42009668 43463149 43343266 43907034
5194 43907034 43718852 44238710 46861469 45523544 46134473 45481310 46110398 45255404 45943818
5185 45943818 43981820 45461045 44724001 45324309 44547001 43723254 44583618 45082813 45086090
5176D5086090k03814q12131J26651K100033j942748N90681j8609l17027Q77492
5167D5486618j165741m20707q39402J069660M25302O6878J286032n95129l98932
5158D4914579J146209J325421l04177r35373K142374q99497j75960N32923n98243
5149D7148256M69630P21928n58062k49652Q7521j232370n75779N45495j03351
5140D6253616j107763J013751j192773J969434K77475p59458l20352R94735l04805
5131D6823860r08476K553061j450544O36399o40509K62765K32396M83277O57733
5122D8649962k92484L27366N00510R71301r56793N74763J854294j134086M8146
5113E0542979o71458Q19142R05334o7980N09192p62356P16388m71202R50374J20788
$$ plain form
5176 45086090 44882276 44070145 44196796 46296829 44354081 44944762 44926153 44609126 45486618
5167 45486618 44320877 43900170 43060768 44130428 44555730 44622608 45908640 45313511 44914579
5158 44914579 46060788 47386209 47082032 46146659 48289033 47389536 47213576 47746499 47148256
5149 47148256 47617886 48339814 47781752 47532100 47619621 46387251 45811472 46356967 46253616
5140 46253616 45145853 46159604 44966831 46936265 47213740 46454282 46133930 47128665 46823860
5131 46823860 45915384 48468445 47017901 47654300 47013791 47276556 47508952 47992229 48649962
5122 48649962 48357478 48684844 49185354 50156655 49199862 49774625 51628919 50494833 50542979
5113 50542979 49871521 50690663 51595997 51528017 52037209 51274853 51991241 51520039 52470413 52591201
5103E2591201j252417O9715Q02284k81074J623970M97334p94316M52940r9093
5094E3610544N71336N38715L16018K36890O65570K69110O75200J152665j89599
5085E7846449N97094M61301J284623P87625j479919K321696Q77572l74383Q01341
5076F3123399J764784k04579O12459N40225K131835K93636K196801m42650K776958
5067G2792868R99137K154544n35k442045J855214j034018M62886r85565p06384
5058G3096102M08219j706400j399342r26940q05408r07210r95674K59787J434582
5049F8457716m59585p43772J295721j07342r5998J029529M73377j259523J335328
5040F9925451J377551R79704J25394J360515J775636O41659k63112J587564K235425
$$ plain form
5103 52591201 51338784 51408499 52210783 51929709 53553679 54051013 53256697 53709637 53610544
5094 53610544 54181880 54720595 55036613 55273503 55939073 56208183 56883383 58036048 57846449
5085 57846449 58443543 58904844 60189467 60977092 59497173 61818869 62696441 62322058 63123399
5076 63123399 64888183 64683604 65296063 65836288 67968123 68261759 70458560 70015910 72792868
5067 72792868 73792005 75946549 75946014 73503969 75359183 74325165 74788051 73802486 73096102
5058 73096102 73504321 71797921 70398579 69471639 68666231 67759021 66763347 67023134 68457716
5049 68457716 67998131 67254359 68550080 68442738 68346740 69376269 69849646 68590123 69925451
5040 69925451 71303002 72282706 72408100 73768615 75544251 76185910 75922798 77510362 79745787
5031G9745787J330880J998291J447786M030676K119947K157952L507111J348797
5023I7687227K879779R71269J058174J831383K224893J164842J493155P91109
5015A10101831L475185J384427K769568M768784M039420M787446O064968N086552
5007A42478181K578521J403255l183443k469417l736125k384894n198309p088659
4999A22399110o052548n543974n526988m570369k425592k868986k688401j706993
4991I1015259j321592j968177j650749M5297O95358q81129J675029j304960L002424
4982H9306760P02480K741942K168109M340914M144624M375846M919347L318150
4974A16018172L426502K297172K058237J675731K156783L297248J440315K151126
$$ plain form
5031 79745787 81076667 83074958 84522744 88553420 90673367 92831319 96338430 97687227
5023 97687227 100567006 101538275 102596449 104427832 106652725 107817567 109310722 110101831
5015 110101831 113577016 114961443 117731011 122499795 126539215 131326661 137391629 142478181
5007 142478181 145056702 146459957 143276514 140807097 137070972 134686078 129487769 122399110
4999 122399110 116346562 110802588 105275600 100705231 98279639 95410653 92722252 91015259
4991 91015259 89693667 87725490 86074741 86120038 86815396 85934267 87609296 86304336 89306760
4982 89306760 90009240 92751182 94919291 99260205 103404829 107780675 112700022 116018172
4974 116018172 119444674 121741846 123800083 125475814 127632597 130929845 132370160 134521286
4966A34521286M293621N347691O525785O123746Q437942J1410832R681167P370186
4958A93712256L611067R1583m591738o120710o259420q342412r404094j3569861
4950A49126671j4489607j3530870j1059894q651880o494464o381600o219981l740464
4942G8557911n991256l496976m938970k475042l393268l413754k455025N66212
4934E2959832l127599j29678j131334j590932j15056k291157n39918J171119j631534
4925D3573743J95844n56584p11045J21206k46130j115545r58364J298142L50786
4916D1952053j394695J71911Q1512m9304p02254L07780J78093L07213k183124
4907C8669185J461009j45083L04214o76079j127081J003620l25775J21690P95787
$$ plain form
4966 134521286 138814907 144162598 150688383 156812129 165250071 176660903 186342070 193712256
4958 193712256 197323323 197414906 192823168 186702458 180443038 172100626 162696532 149126671
4950 149126671 134637064 121106194 110046300 101394420 94899956 88518356 82298375 78557911
4942 78557911 72566655 69069679 64130709 61655667 58262399 54848645 52393620 52959832
4934 52959832 49832233 49702555 48571221 46980289 46865233 44574076 44034158 45205277 43573743
4925 43573743 43769587 43213003 42501958 42623164 42377034 41261489 40303125 41601267 41952053
4916 41952053 40557358 40729269 40810781 40761477 40059223 40367003 40545096 40852309 38669185
4907 38669185 40130194 39985111 40289325 39613246 38486165 39489785 39164010 39285700 40081487
4898D0081487j10942p43751N670J046628r78542M26636j93710J123605j190455
4889C9466626M3561J300694j804065J422226m87750O33530P92972M00605J92141
4880D1960540p38288Q1456N91272k43904J214809j227598K400502p94828r31320
4871D2312641M43777k24921J196955j147989M96263N06152p7239J223076j042344
4862D3686371l93402R58082N84569j292675J342903K51486j690490K78051J451086
4853D5175981J106061j107652J208096k88059R81015l01360j21746l6842J402028
4844D8017522o15153J65568L57325R34145J066227p72882m38276O93530o67529
4835D8740477O16983O0253j429788J560398N19178k7062l1745r57355L443804
$$ plain form
4898 40081487 39970545 39226794 39232464 40279092 39300550 39727186 39533476 40657081 39466626
4889 39466626 39510187 40810881 39006816 40429042 39941292 40574822 41367794 41768399 41960540
4880 41960540 41222252 41303708 41894980 41651076 42865885 41638287 44038789 43243961 42312641
4871 42312641 42756418 42531497 43728452 42580463 43076726 43582878 43505639 44728715 43686371
4862 43686371 43292969 44251051 44835620 43542945 44885848 45137334 43446844 43724895 45175981
4853 45175981 46282042 45174390 46382486 46094427 47075442 46774082 46652336 46615494 48017522
4844 48017522 47402369 47567937 47925262 48859407 49925634 49152752 48714476 49408006 48740477
4835 48740477 49357460 49417713 47987925 49548323 50067501 50040439 50008694 49051339 52495143
4826E2495143j754021j2101J920270p76297l76468m5785J789014l23844r08147
4817E2007764o67493P92328R84877o13008O75753K805157j737560p01499n68972
4808E2977347L52294J293803p31593P12426q7613M43414k08991O67274K38682
4799E5657043L62568Q05805j94778j635054K314433N14383N9071j068649J192228
4790E8007050r04021l49239M61208N8064M91086K59745n60852k76496N88204N38506
4780E8313255n7096n16595J085300k184490Q33598R93334O03164q31321R29770
4771E9168919J8160q9649J92237k1701N82681j096364J022012K88464J73859j269708
4761E8968910m67395J093160J140123n12629p59875L69632J110642m13494K067367
$$ plain form
4826 52495143 50741122 50729021 52649291 51872994 51496526 51450741 53239755 52915911 52007764
4817 52007764 51340271 52132599 53117476 52504468 53180221 55985378 54247818 53546319 52977347
4808 52977347 53329641 54623444 53891851 54604277 54516664 54960078 54751087 55418361 55657043
4799 55657043 56019611 56825416 56630638 54995584 57310017 57824400 57883471 56814822 58007050
4790 58007050 57103029 56753790 57214998 57273062 57764148 58023893 57463041 57186545 57774749 58313255
4780 58313255 58256159 57739564 58824864 56640374 57473972 58467306 59070470 58239149 59168919
4771 59168919 59187079 59097430 59289667 59267966 59850647 58754283 59776295 60064759 60238618 58968910
4761 58968910 58501515 59594675 60734798 60222169 59462294 59831926 60942568 60529074 62596441
4752F2596441k078271N526o72944P98540j563235J354127O28128l8860m05434
4743F0624018K39779j985735K041884j10407j88386o23461N61490q63649k021
4734E9693512M33452j9402j024723K68790j21091j97251J132124j110595R82305
4725F0037121j055342J266028l58892j798793K039113M00728q86506j039824Q22720
4716E9426353m02236K57488p54371p315J313600r90560J825177j686672L75983
4707E9357447m92368R92911J388366j393312k05964q94473O57315R56423r63874
4698E9402471J136774r98880K65262p76999J567895K21734j746233K415145j776936
4689E9710233o35885J077707q74381J089709n21519j846898Q94051J683586m55727
$$ plain form
4752 62596441 60518170 60523696 59850752 60649292 59086057 60440184 61068312 61029452 60624018
4743 60624018 60863797 58878062 60919946 60809539 60621153 59997692 60559182 59695533 59693512
4734 59693512 60126964 60107562 59082839 59351629 59230538 59033287 60165411 59054816 60037121
4725 60037121 58981779 60247807 59888915 58090122 60129235 60529963 59643457 58603633 59426353
4716 59426353 59024117 59281605 58527234 58519919 59833519 58842959 60668136 58981464 59357447
4707 59357447 58865079 59857990 61246356 59853044 59647080 58752607 59409922 60366345 59402471
4698 59402471 60539245 59540365 59805627 59028628 60596523 60818257 59072024 61487169 59710233
4689 59710233 59074348 60152055 59277674 60367383 59845864 57998966 58893017 60576603 60120876
4680F0120876N45669J389838j874111p194J066701m25999L4901o54285j17043
4671F0079353J412534p09736Q14282P20193O35263m52154m95988K184059M41524
4662F4629330L38598M67789p49421J289765N81844q8324m51150Q89087J097029
4653F8004547O53104L72350J221046K77410M04410L89931J966979j146862j209644
4644G0933271K97594J49241L61500L81238Q72727q41971o68049q25897J602626
4635G2262280Q46938j427226j12785q36164J148522n48289l36679Q11777r62218
4626G0846156L32807J48914j97432K77525J730927j28886N73718j051136J510187
4617G4042780j538917j171761J248952J39708j203075n4117j28286o43195P35808
$$ plain form
4680 60120876 60666545 62056383 60182272 60175078 61241779 60815780 60850681 60196396 60079353
4671 60079353 61491887 60782151 61596433 62316626 62951889 62499735 62003747 64187806 64629330
4662 64629330 64967928 65435717 64686296 65976061 66557905 66469581 66018431 66907518 68004547
4653 68004547 68657651 69030001 70251047 70528457 70932867 71322798 73289777 72142915 70933271
4644 70933271 71230865 71380106 71741606 72122844 72995571 72153600 71485551 70659654 72262280
4635 72262280 73109218 71681992 71569207 70733043 71881565 71333276 70996597 71808374 70846156
4626 70846156 71178963 71327877 71130445 71407970 73138897 73010011 73583729 72532593 74042780
4617 74042780 72503863 71332102 72581054 72720762 71517687 71463570 71335284 70692089 71427897
4608G1427897j233676K85375J036109k6240j93278L91766r26215j26539K71767
4599G0906966J1037P88891J091481J294793o31056o63321K092694j76637j3106
4590G4701742J546844K50986O6717R43277l13255J371154k59608N81213J562393
4581H0451463j59426N73721k605O76479P73082L25370n71003J0633P66830K384496
4571H5229040p03730K47415R72404L85532R45168O98925K343555P95745n03539
4562I0410515M62311R12524R58515j19445L97105K106816j125130J489207n39955
4553I4952463K707292j238963M42239q16808R44619K01672l15689Q61256r35158
4544I6802923L82683J35514o85211P70371J001J087870j94573Q26788J575939
$$ plain form
4608 71427897 70194221 70479596 71515705 71489465 71296187 71687953 70761738 70635199 70906966
4599 70906966 70918003 71706894 72798375 74093168 73462112 72798791 74891485 74714848 74701742
4590 74701742 76248586 76499572 76566289 77509566 77196311 78567465 78307857 78889070 80451463
4581 80451463 80292037 80865758 80863153 81539632 82312714 82638084 82067081 82077714 82844544 85229040
4571 85229040 84525310 84772725 85745129 86130661 87075829 87774754 90118309 90914054 90410515
4562 90410515 90872826 91785350 92743865 92624420 93021525 95128341 94003211 95492418 94952463
4553 94952463 97659755 96420792 96863031 96046223 96990842 97192514 96876825 97738081 96802923
4544 96802923 97185606 97321120 96635909 97406280 97407281 98495151 98300578 99127366 100703305
4535A00703305K99828L67524l36714J448631Q11875j387714K312787o00899K112673
4526A05731296m8144j079553m85526k9349J357603q76759L25327j832058L20028
4517A03382865o23905j98965k99586k010602k10686j189623j706559O63733L3053
4508I7839725q90087q90627J614835j245808r86579Q41423l73421j446270M21548
4499I4884739j13591J105099k59243p66385P59360j272920P34799Q65853q26024
4490I5111687J034983o18263J387539r80898l26473J310710k083245p85757K909732
4481I6960015j897021O79670o89459K29737M03557R88933r41497L7371K397753
4472I8169059j170407O56095m93803R86884k59490K424710k031123J017392L17854
$$ plain form
4535 100703305 101003133 101370657 101033943 102482574 103294449 101906735 104219522 103618623 105731296
4526 105731296 105683152 104603599 104118073 104088724 105446327 104569568 104894895 103062837 103382865
4517 103382865 102758960 102559995 102260409 100249807 100039121 98849498 97142939 97806672 97839725
4508 97839725 96949638 96059011 97673846 96428038 95441459 96282882 95909461 94463191 94884739
4499 94884739 94771148 95876247 95617004 94850619 95609979 94337059 95071858 95937711 95111687
4490 95111687 96146670 95528407 96915946 95935048 95608575 96919285 94836040 94050283 96960015
4481 96960015 95062994 95742664 95053205 95282942 95686499 96675432 95733935 95771306 98169059
4472 98169059 96998652 97654747 97160944 98147828 97888338 100313048 98281925 99299317 99617171
4463I9617171M65667N41200J364683l02342o19551n37844J296628K125152j736423
4454A02214341J008761Q7998l19935K479835M84777l48006k07223K639153p48589
4445A07291112k85750J542190M78238J904300J552644J657095n86987J450238
4437A15003080O55683q37628r36413R62294r93973M49732q6560L17734J194874
4428A15728823j300883K30499N38323O93893R07236J419719l66148L96057Q52094
4419A19099613q81177J915777L74447J507557J341974k39450J100423P07082j55985
4410A24770261J421280Q99766p29283J437910K44564M68881J032818R3017K746
4401A29641960J670143K088509J695137J375876l76838J127980R23572K74982
$$ plain form
4463 99617171 100082838 100624038 101988721 101686379 101066828 100528984 101825612 103950764 102214341
4454 102214341 103223102 103311100 102991165 105471000 105955777 105607771 105400548 108039701 107291112
4445 107291112 107005362 108547552 109025790 110930090 112482734 114139829 113552842 115003080
4437 115003080 115658763 114821135 113884722 114847016 113853043 114302775 114216215 114533949 115728823
4428 115728823 114427940 114658439 115196762 115890655 116797891 118217610 117851462 118247519 119099613
4419 119099613 118218436 120134213 120508660 122016217 123358191 123118741 124219164 124926246 124770261
4410 124770261 126191541 127091307 126362024 127799934 128044498 128513379 129546197 129639214 129641960
4401 129641960 131312103 133400612 135095749 136471625 136094787 137222767 138146339 138421321
4393A38421321J826237J622826M04742L417813J196109J016962J679271J543522
4385A51128803J653532K976214J145718L305316K684193J660252K312616K296676
4377A69163320L410271L830064K452259J792286K468547K776218K751187O13393
4369A89257545L483304L872215M043045K286551L986117L167418K990376N072687
4361B18159258M108574N034492N667398K323684l03046j89255Q8184L44375n92285
4352B34641379J044449l339148j940697J381902O65035l0785J652932J17126J118521
4343B35310714Q13501J265750K690109K305801L569304L067840L419421K30081
4335B52672521M204132M008426N675463O358306M672766n96067k905171k662880
$$ plain form
4393 138421321 140247558 141870384 142275126 145692939 146889048 147906010 149585281 151128803
4385 151128803 152782335 155758549 156904267 160209583 162893776 164554028 166866644 169163320
4377 169163320 172573591 176403655 178855914 180648200 183116747 185892965 188644152 189257545
4369 189257545 192740849 196613064 200656109 202942660 206928777 210096195 213086571 218159258
4361 218159258 222267832 227302324 232969722 235293406 234990360 234801105 234889289 235233664 234641379
4352 234641379 235685828 232346680 230405983 231787885 232452920 232422135 234075067 234192193 235310714
4343 235310714 236124215 237389965 240080074 242385875 245955179 249023019 252442440 252672521
4335 252672521 256876653 260885079 266560542 272918848 277591614 276995547 274090376 271427496
4327B71427496m500291l395449m515655m804471n482193r326751n767392k584432
4319B31050862o216941j847713j446258j773894l146993l290663l487314j718951
4311B08122135k229241l306385j651503r64968j415585j299064J163729o57536
4303A97761582L93898Q61525l876479m598258k471528k081299l501324j967328
4295A80520789o156318k273429m573074k287543k855205l708011l234459o100232
4287A49332518j932702m699788k240281l638873n854616l521546k594135m729686
4279A20120891k928439l833757l756907j366113m660481k157270m220477j398851
4271I5798596m333784j799285l267337j491406k519282j092232k186125j513321
$$ plain form
4327 271427496 266927205 263531756 259016101 254211630 248729437 239402686 233635294 231050862
4319 231050862 224833921 222986208 221539950 219766056 216619063 213328400 209841086 208122135
4311 208122135 205892894 202586509 200935006 199970038 198554453 197255389 198419118 197761582
4303 197761582 198155480 199017005 195140526 190542268 188070740 185989441 182488117 180520789
4295 180520789 174364471 172091042 167517968 165230425 162375220 158667209 155432750 149332518
4287 149332518 147399816 142700028 140459747 136820874 130966258 127444712 124850577 120120891
4279 120120891 117192452 113358695 109601788 108235675 103575194 101417924 97197447 95798596
4271 95798596 91464812 89665527 86398190 84906784 82387502 81295270 79109145 77595824
4263G7595824j935271l092087r26796q38861j754067k781241m49334k473957k914185
4254F0430025l95446j796216j989128j591525l273002l228198J132755k508355
4246D6780910k486760k00419k215120j183431k207337n29790j965855j424559
4238C4567639j873656O01796j905637p66597r86062j65911k559358j692140N71579
4229B5791653k401384J32259j084198J69604N13756r42297j984797M8560j181218
4220A9061938q63757Q08292j94396k229457P37974J28246j123963p44667K75341
4211A5855551n70740j66298j467203L85295J114273n52794j614886N24247k078055
4202A1429390J190808p68790O07882j241195K437755k081738M89436o04620j011264
$$ plain form
4263 77595824 75660553 72568466 71641670 70802809 69048742 66267501 65818167 63344210 60430025
4254 60430025 60034579 58238363 56249235 54657710 51384708 48156510 49289265 46780910
4246 46780910 44294150 44093731 41878611 40695180 38487843 37958053 35992198 34567639
4238 34567639 32693983 33295779 31390142 30623545 29637483 29471572 26912214 25220074 25791653
4229 25791653 23390269 23522528 22438330 22607934 23121690 22179393 20194596 20243156 19061938
4220 19061938 18198181 19006473 18812077 16582620 17320594 17448840 16324877 15580210 15855551
4211 15855551 15284811 15118513 13651310 14036605 15150878 14598084 12983198 13507445 11429390
4202 11429390 12620198 11851408 12459290 11218095 13655850 11574112 12063548 11458928 10447664
4193A0447664n69975J116006m73025m36111J482167m73330j221295M87462j542259
4184H817304J173738j241640J343332n62558n64306N12807K6765l61108N75194
4175I719528j20252p65868j22076m89118J349141j176033o62870K76132J469M94769
4165H504822j277547P27489K57363r23201N71834J134187k779465J393773j52897
4156G456358n40337K42073r7148q7178k14317J112972p08177M25699k5188p72817
4146F791940r50633J522495j055896J631248q93109q6178J109176j800240J513781
4137G782584j520545L10611N87183l80212N91376o20009J114309j020208k318961
4128D526128K767065m8170r63511J19403N84198M1708l18710p7069l70647O49503
$$ plain form
4193 10447664 9877689 10993695 10520670 10084559 11566726 11093396 9872101 10359563 8817304
4184 8817304 9991042 8749402 10092734 9530176 8965870 9478677 9505442 9144334 9719528
4175 9719528 9599276 8833408 8711332 8222214 9571355 8395322 7732452 8008584 8010053 8504822
4165 8504822 7227275 7954764 8212127 7288926 7860760 8994947 6215482 7609255 7456358
4156 7456358 6916021 7158094 7060946 6973768 6759451 7872423 7164246 7589945 7564757 6791940
4146 6791940 5841307 7363802 6307906 7939154 7046045 6959867 8069043 6268803 7782584
4137 7782584 6262039 6572650 7159833 6779621 7370997 6750988 7865297 6845089 4526128
4128 4526128 7293193 7245023 6281512 6400915 6985113 7026821 6708111 6631042 6260395 6909898
4118F909898j29735J011572j931435R07102L8032o29375N36657m10764N68671
4109F870623o46578J748059n4554m86533l87839Q115L62807o39934M97245o05865
4099F665546P58506j169423K45971j27505Q8278M66579M07894j423008J056599
4090F969437r06157M62310N18761K1433M18891j179303N68792J43202n59927j225479
4080E231960N45631J982444j316881M58176m45284j11234M32327L08132j145505
4071E939766K13979q956n98417N70122p2927R61930j235396q31175L70828J030310
4061F340064n56067M625J081345p71993m48259l33283J480067j24928K56073m81414
4051F446230k56439K81234R87076p64199q88959L93840L41070r55451p38361K09086
$$ plain form
4118 6909898 6780163 7791735 5860300 6767402 6805434 6176059 6712716 6301952 6870623
4109 6870623 6224045 7972104 7917550 7431017 7043178 7051293 7414100 6774166 7271411 6665546
4099 6665546 7424052 6254629 6500600 6373095 6461373 6927952 7335846 5912838 6969437
4090 6969437 6063280 6525590 7044351 7065784 7484675 6305372 6874164 7017366 6457439 5231960
4080 5231960 5777591 7760035 6443154 6901330 6456046 6344812 6777139 7085271 5939766
4071 5939766 6153745 6144789 5546372 6116494 6043567 7005497 5770101 4938926 5309754 6340064
4061 6340064 5783997 5788622 6869967 6097974 5649715 5316432 6796499 6671571 6927644 6446230
4051 6446230 6189791 6471025 7458101 6693902 5804943 6198783 6539853 5584402 4846041 5055127
4041E055127J31247K826345k122055l19067k32110J66812Q00368p44304K29279
4032E791642M00868q68556j25664R21553n43863p69548Q7105N15556M05087j409754
4022D404426K200263j318650K78510J4913J09559o39983J62917r27707N91294
4013D875542k163121J475029O7884o32849K25353O58318j91332o69306L87384
4004D032902N29243K51969j717123Q39748j14361k68985j28395K351654j930812
3995C845840l68689P77933j599856Q85118K8129k1430l2810L00013m59678P88893
3985D143463k12548l4504j779512J805196p40303K4646n78601j358606K650348
3976C919579o47740o37847o82382R79683J93731j215482J086628J69490l15955
$$ plain form
4041 5055127 5186374 8012719 5890664 5571597 5339487 5506299 6306667 5562363 5791642
4032 5791642 6192510 5323954 5198290 6119843 5575980 4806432 4893537 5409093 5814180 4404426
4022 4404426 6604689 5286039 5564549 5579462 5689021 5049038 5211955 4284248 4875542
4013 4875542 2712421 4187450 4255334 3622485 3847838 4506156 4314824 3645518 4032902
4004 4032902 4562145 4814114 3096991 3936739 3822378 3553393 3424998 5776652 3845840
3995 3845840 3477151 4255084 2655228 3540346 3568475 3547045 3514235 3814248 3354570 4143463
3985 4143463 3930915 3896411 2116899 3922095 3181792 3206438 2627837 1269231 3919579
3976 3919579 3271839 2633992 1951610 2931293 3125024 1909542 2996170 3165660 2849705
3967B849705o35352K73877J174794j607916o3722J328498J73357j942135R49596
3958B500702j89966M53251n64697K39464M38969j020471K86860k84891K36814
3949B096035j18391M74346q01927J618775p96864j358668J361151j278416R95175
3940B191216n9469J34746l61889K77354n39848m92534M89324J511566k63160j742058
3930A145248M08863J171869m95335o75781j89391Q78509k3932Q10659q74577n78233
3920A577899J509896q61914l53752k51799m09938P26142K8211k51278n12017J116240
3910B317690p98407O019Q31262P00270m89966j046207j84990L54018L02809l52233
3900A640265p99464O80505O47514r85864J337734j61333q98777R84393J68159
$$ plain form
3967 2849705 2214353 2488230 3663024 2055108 1991386 3319884 3493241 1551106 2500702
3958 2500702 2310736 2763987 2199290 2438754 2877723 1857252 2144112 1859221 2096035
3949 2096035 1977644 2451990 1650063 3268838 2471974 1113306 2474457 1196041 2191216
3940 2191216 2131747 2266493 1904604 2181958 1642110 1149576 1638900 3150466 2887306 1145248
3930 1145248 1554111 2725980 2230645 1554864 1365473 2243982 2220050 3030709 2156132 1577899
3920 1577899 3087795 2225881 1872129 1620330 1210392 1936534 1964745 1713467 1201450 2317690
3910 2317690 1519283 1525302 2356564 3056834 2566868 1520661 1335671 1689689 1992498 1640265
3900 1640265 840801 1521306 2168820 1182956 2520690 2359357 1460580 2444973 2613132
3891B613132j054233M88022M43743j373446J404553l61219P9503k25678k19162
3882A795215O51223J156196k186064L72540Q80487j026747J062878j456228P04875
3873A954375j038126J036221N8488o31218J000673k43311J269040j342823m37699
3864A625620K185124k648016p70249J192002L38327q14403L45820M73830k25560
3855A702495N06775k75714M44156j757728M30585O11473J387336j447935Q75644
3846B477087j197416J150546q49357R39179p15014O33174j249746J2864Q48368
3837B049685k07977M67329j551581O06581R11860m93957J077262j075273o04287
3828A179642K54687m75820M0253O50567O59691k40242k436498K588909p4671r15595
$$ plain form
3891 2613132 1558899 2046921 2490664 1117218 2521771 2160552 2240055 2014377 1795215
3882 1795215 2446438 3602634 1416570 1789110 2669597 1642850 2705728 1249500 1954375
3873 1954375 916249 1952470 2010958 1379740 2380413 2137102 3406142 2063319 1625620
3864 1625620 3810744 1162728 392479 1584481 1922808 1108405 1454225 1928055 1702495
3855 1702495 2209270 1933556 2377712 619984 1050569 1662042 3049378 1601443 2477087
3846 2477087 1279671 2430217 1580860 2520039 1805025 2438199 1188453 1201317 2049685
3837 2049685 1841708 2309037 757456 1364037 2275897 1781940 2859202 1783929 1179642
3828 1179642 1434329 958509 998762 1649329 2309020 2068778 -367720 2221189 2146518 1230923
3818A230923J108525j041300O99813m77843K39510k89993J162990j269042J299158
3809B662741n41918j24090J40415K46142L17932j618885l34509Q35056j91591
3800A391293Q67864J397110k324916J67916K50903k71550j370480K291206N37076
3791B936422n63839j784178N42305J458721r20925j63284O62233r93129Q5138
3782A259464M91347O00222j531117N04597J75259J190647L29608j705420l94339
3773I20268N15309j073633K518108n92803m13435O93159j648467Q76585j753418
3764D1673m20801J926837q88436J740482k78604J52233l87349n02762P06254j07849
3754A981678q43359N65979j13471P44851J12333j827795P53130Q52742j391195
$$ plain form
3818 1230923 2339448 1298148 1997961 1520118 1759628 1469635 2632625 1363583 2662741
3809 2662741 2120823 1996733 2137148 2383290 2701222 1082337 747828 1582884 1391293
3800 1391293 2259157 3656267 1331351 1499267 1750170 1478620 108140 2399346 2936422
3791 2936422 2372583 588405 1130710 2589431 1668506 1505222 2167455 1174326 1259464
3782 1259464 1750811 2351033 819916 1324513 1499772 2690419 3020027 1314607 920268
3773 920268 1435577 361944 2880052 2287249 1873814 2566973 918506 1795091 41673
3764 41673 -379128 1547709 659273 2399755 2121151 2273384 1886035 1383273 2089527 1981678
3754 1981678 1138319 1704298 1590827 2335678 2448011 620216 1373346 2226088 834893
3745H34893Q67078P54362j399620m52136L26958j89986O70298K38450j216354
3736D33943R13619j49586J336438M66576q95084j511783J398051l74823j176972
3727D40379N17531m78422R86093k66741N8698K06647j41204j001751M64848R15982
3717A702060q38922p60895P93316J272648j825804J255451J68705q37706Q31180
3708A760033p1626o28151M49224n65412M38854P66218q27934j000484N62745J253982
3698B137449l94729J58663K66330k839405J512102n80034N11435K95226J058101
3689B125138m14190m52770o92353J019160K65807q6612r91674k60297J275316
3680A787525j15911l69356K28654p51360P98657Q7706k20046O56765p34178J27360
$$ plain form
3745 834893 1701971 2456333 1056713 604577 931535 741549 1411847 1650297 433943
3736 433943 1347562 1197976 2534414 3000990 2105906 594123 1992174 1617351 440379
3727 440379 957910 479488 1465581 1198840 1257538 1464185 1322981 321230 786078 1702060
3717 1702060 863138 102243 895559 2168207 342403 1597854 1766559 928853 1760033
3708 1760033 1688407 1060256 1509480 944068 1382922 2149140 1321206 320722 883467 2137449
3698 2137449 1742720 1901383 2167713 -671692 840410 260376 771811 1067037 2125138
3689 2125138 1710948 1258178 565825 1584985 1850792 1764180 772506 512209 1787525
3680 1787525 1671614 1302258 1530912 779552 1578209 1665915 1445869 2102634 1368456 1495816
3670A495816O71267j109408m36727J298228p81461K21686j481026R96437N22452
3661A397264K03801r71453n05574P16370j94238J292500r14636p89591N12761
3652G47204r0295K38510N63243J57692m76408M55463r61045L42631N47140j9319
3642A504816J576056k191439N63327o1018L04473p46861r1236Q34141l36246o97874
3632F58139k38417N52284J86555m17109q10180J970128m29054o41121J568733
3623B399958j607007k5819O86581j051438L87083l44175N08062o90969O55746
3614I18022R14928K82311L7119N45226m02848r22431J388027j693791J50247p81920
3604D34890j28540N36224K1609R45876j317797J353084m67311o60999J410540
$$ plain form
3670 1495816 2167083 1057675 620948 1919176 1137715 1359401 -121625 874812 1397264
3661 1397264 1601065 629612 124038 840408 646170 1938670 1024034 234443 747204
3652 747204 656909 895419 1458662 1616354 1139946 1595409 634364 976995 1524135 1504816
3642 1504816 3080872 889433 1452760 1391742 1696215 949354 858118 1692259 1356013 658139
3632 658139 419722 972006 1158561 741452 -68728 1901400 1472346 831225 2399958
3623 2399958 792951 767132 1453713 402275 789358 445183 953245 262276 918022
3614 918022 1832950 2115261 2152380 2697606 2294758 1372327 2760354 1066563 1216810 434890
3604 434890 306350 842574 864183 1810059 492262 1845346 1378035 717036 2127576
3595B127576k98949l63741J62433l58473J56115L72679m35852J675716j060878
3586A976626j001379P45914m03130m5657M28080K8633j26478J886514k148922
3577A340201Q67441M42154k082739O90833j06164p5701O05352o54692m05890Q74525
3567A495320o60155J05321N65668n24586K011728j73205j265626J29730m5217
3558A638978m01198P02431n81585O57194o24811R02576M2158j706739P7853K67194
3548I74051p5752M86658k44223P62780o02814L55579k04216M34816j470541P60839
3538A177177J226604j317693n70764J156555m61885M35188j288441R17822K67088
3529A541651M10298p07653k67021n98222J362117j891534N65230n2091J097421
$$ plain form
3595 2127576 1828627 1464886 1627319 1268846 1424961 1797640 1361788 3037504 1976626
3586 1976626 975247 1721161 1318031 1272374 1700454 1729087 1602609 3489123 1340201
3577 1340201 2207642 2649796 567057 1257890 1151726 1076025 1681377 1026685 620795 1495320
3567 1495320 835165 940486 1506154 981568 2993296 2820091 1554465 1684195 1638978
3558 1638978 1237780 1940211 1358626 2015820 1391009 2293585 2335743 629004 706857 974051
3548 974051 898299 1384957 1140734 1903514 1300700 1656279 1452063 1886879 416338 1177177
3538 1177177 2403781 1086088 515324 1671879 1209994 1645182 356741 1274563 1541651
3529 1541651 1951949 1244296 977275 379053 1741170 -150364 414866 362775 1460196
3520A460196j908385K358746j135184J545878o49870j88023L11528l83757l48024
3511A063105m20686P31654L80737j395775P58715Q87572l98630K004207j518715
3502B092184r72101j20370O22051p70365K8219l61172J122438m08980L57971r7929
3492A491946L33059j2380n34025J70675p3301N1322L85179R7099j499496N53833
3482I63911p11862K178103j898636j44930N81046J969547j525501j18909j080308
3473B12461O44102j88377J14433R6859j182800J568971P50881M14356j867392
3464E63494J493225j429030k90125R11010m30147Q07959j219459J068247L44635
3455A819809j098855N72416N17454q35155J700201k767878J274093R78309j11869
$$ plain form
3520 1460196 -448189 1910557 775373 2321251 1671381 1483358 1794886 1411129 1063105
3511 1063105 642419 1374073 1754810 359035 1117750 2005322 1606692 3610899 2092184
3502 2092184 1120083 999713 1621764 851399 879618 518446 1640884 1231904 1589875 1491946
3492 1491946 1825005 1812625 1278600 1449275 1375974 1427296 1812475 1909574 410078 963911
3482 963911 252049 2430152 531516 386586 967632 2937179 1411678 1292769 212461
3473 212461 856563 668186 782619 879478 -303322 1265649 2016530 2430886 563494
3464 563494 2056719 627689 337564 1248574 818427 1626386 406927 1475174 1819809
3455 1819809 720954 1293370 1810824 975669 2675870 -92008 1182085 2160394 2048525
3446B048525n64261n88332O71775K71592j67828j254730J456263o82956p86372
3437D03676N29060K76329m64964L82961r6168p79621J272989j666961J654698
3428A511999k95510P38204o09483L05814l11733K11664n93230o12445P21749p26875
3418C40154P94852K1121o87725P38587J41151j127648J236051n07436O43393N73971
3408B166471j329887r24734K660353r75321k075785K579811j309375R50372l06144
3399A435761K81312j831229L25093K19356O88100Q51652n27557j012286J255139
3390A685341j55750n32976l3252J92275M61272O76241j785594K35327M12939L0378
3380A186201Q75641j74904p27143L26388J02714p85759R34508j440846J759212
$$ plain form
3446 2048525 1484264 895932 1567707 1839299 1671471 416741 1873004 1190048 403676
3437 403676 932736 1209065 744101 1127062 1030894 251273 1524262 -142699 1511999
3428 1511999 1216489 1954693 1345210 1651024 1339291 1550955 957725 345280 1067029 340154
3418 340154 1135006 1156127 468402 1206989 1348140 220492 1456543 949107 1592500 2166471
3408 2166471 836584 -88150 2572203 1596882 -478903 2100908 791533 1741905 1435761
3399 1435761 1717073 -114156 210937 430293 1118393 1970045 1442488 430202 1685341
3390 1685341 1529591 996615 963363 1155638 1616910 2293151 507557 742884 1155823 1186201
3380 1186201 2061842 1886938 1159795 1486183 1588897 803138 1737646 296800 2056012
3371B056012j401603J50120j64545q2185K48787K74909j63511P95834j54774o23299
3361I35745J827421j953227j111982R98552R60745r70570R8193l55002K0718Q39900
3351A290493M03156p2804j015976m55096P03581R77130k029084J940567n21874
3342A220093N07014j936148J831533p36608m46041J231556l70661j529090J538406
3333A310054r97371O15276J499798k105011l50865J142101N13471j140264K85011
3324G72200Q75514N04494j591132M25517n39886J242150o52389R75851o01931
3315A410388l21714j591612Q84182p7436R01909m19935k4644n56484k12362P65345
3305G57637J310268n85969O5868o55015j364977J217355K69928r4970O69854o78994
$$ plain form
3371 2056012 654409 804529 639984 557799 806586 1081495 917984 1713818 1559044 935745
3361 935745 2763166 809939 -302043 696509 1657254 686684 784877 429875 450593 1290493
3351 1290493 1693649 1620845 604869 149773 853354 1830484 -198600 1741967 1220093
3342 1220093 1727107 -209041 1622492 885884 439843 1671399 1300738 -228352 1310054
3333 1310054 312683 927959 2427757 322746 -28119 1113982 1627453 487189 772200
3324 772200 1647714 2152208 561076 986593 446707 1688857 1036468 2012319 1410388
3315 1410388 1088674 -502938 381244 303808 1205717 785782 761138 204654 -7708 757637
3305 757637 2067905 1481936 1547804 892789 -472188 745167 1015095 920125 1589979 910985
3295I10985L3009j95176J266448Q86659k646717M25480O53645K55988j719504
3286a29183J195258n08386m31180O82869l50102J059683O3396q06633k11796J06734
3276F70660r01176k01937J101178p88375J394151N08228j725004J183170O93069
3267A933964j013878p25030m7947K279412k68484k216491J104089j79698j738525
3258h72588J418029N11349j381770R73452o523J917915k674356J659571k85913
3249A259166l6409k22515n87271K219522k149202k9732M58332L23245L07487j227903
3239C14720L37521M37089P67630k250171J240959M0981m98239j400485K343038
3230A333043k74409l50895l84291J664485j320191M90626j33371j004856J163800
$$ plain form
3295 910985 943994 748818 2015266 2901925 255208 680688 1334333 1590321 -129183
3286 -129183 1066075 557689 126509 809378 459276 1518959 1582355 775722 563926 670660
3276 670660 -230516 -432453 668725 -119650 1274501 1782729 57725 1240895 1933964
3267 1933964 920086 195056 147109 2426521 2158037 -58454 1045635 865937 -872588
3258 -872588 545441 1056790 -324980 648472 641949 2559864 -114492 1545079 1259166
3249 1259166 1222757 1000242 412971 2632493 483291 453559 911891 1235136 1542623 314720
3239 314720 652241 1089330 1856960 -393211 847748 888729 390490 -1009995 1333043
3230 1333043 1058634 707739 323448 1987933 667742 1158368 1024997 20141 1183941
3221A183941j161242p77021J621727M30434n22697q12098L22897J137367k49552
3212A173756o64062j204658J781938L55387n265q94379j29118J841037j003364
3203A251272l50916J8438l60729p50107o45138J538179Q22247L0346k63489j92343
3193A097760q36916q04219J560593n07352J200662l45577l61334O5772l26786
3184G42603l71759j49205O38898k31463J683899k464926P68407M78105J294065
3175B388624k367916R11781m9075K46835q5366k16339j25816l95107J51J867613
3165B175385j415576K16972M4271J087146m99866j435380M06207j283605K47067
3156d57379J943025k093264J537983N83726j199218l5375M77918L46260J87175
$$ plain form
3221 1183941 22699 -754322 867405 1297839 775142 -36956 285941 1423308 1173756
3212 1173756 509694 -694964 1086974 1442361 1437096 542717 413599 2254636 1251272
3203 1251272 900356 918794 558065 -192042 -837180 700999 1523246 1553592 1290103 1097760
3193 1097760 260844 -543375 1017218 509866 1710528 1364951 1003617 1069389 742603
3184 742603 370844 221639 860537 629074 2312973 -151953 616454 1094559 2388624
3175 2388624 20708 932489 883414 1130249 1044883 828544 702728 307621 307772 2175385
3165 2175385 759809 976781 1021052 2108198 1608332 172952 579159 -704446 -457379
3156 -457379 1485646 -607618 930365 1514091 314873 279498 757416 1103676 1290851
3147A290851N0060Q44410r41039l36013N46527o19000N00492l21605p57895N60846
3137H17634J62689L401Q25431p30964j237934J692004r72203J051607r32222P50100
3127A429543m14000o15855J105782j368796R29114l51377L82719m59599q18595
3118a81064M41541l18414J108615O09113j731643J050221o68745o44569Q18527
3109D83582J068816j001018L39293K02842j68335K6355K27990L8202L62395n08101
3099A072021M20716j050014L09500L14495n19523k81120O35592Q71670O04338
3090B377675j235299p96542K97932Q64544K78257j276467R36303o46673l98435
3081D01295R3082J529790j3416p17851J89629n62161j70959j146717K530265j561533
$$ plain form
3147 1290851 1340911 2185321 1244282 908269 1454796 835796 1336288 1014683 256788 817634
3137 817634 980323 983724 1809155 1078191 -159743 1532261 560058 1611665 679443 1429543
3127 1429543 1015543 399688 1505470 136674 1065788 714411 1097130 637531 -181064
3118 -181064 260477 -57937 1050678 1659791 -71852 978369 309624 -334945 483582
3109 483582 1552398 551380 890673 1093515 925180 951535 1179525 1217727 1580122 1072021
3099 1072021 1492737 442723 752223 1066718 547195 266075 901667 1773337 2377675
3090 2377675 1142376 345834 643766 1508310 1786567 510100 1446403 799730 401295
3081 401295 494377 2024167 2010751 1292900 1482529 920368 749409 -397308 2132957 571424
3071E71424K04267K09082M82393n60493j523185J907656m35269P6695r63468M23993
3061C93095R35283l77949L95158j712255N12356M76630K9869K15099j501647N43328
3051i1033J05944N34564P38888K36969M97155k241452Q73711J868018j666982
3042H55782P51294r80996J059886j263500N95584k85064J230538l56934j310803
3033B95787P67023k12980O27768j17371p17643O67286p82158J445780j870096
3024A03396K210694j988422J182118j027321J368570j09884j237392N82570j545379
3015d61050O86567O33986j39990N3994O50815K12186j047348L15959l96468J498979
3005B007630J45453q61284k7022o3324j53023l55643p4754O54167M58685j363012
$$ plain form
3071 571424 775691 984773 1467166 906673 -616512 1291144 855875 932570 -30898 393095
3061 393095 1328378 950429 1345587 -366668 145688 622318 652187 867286 -634361 -91033
3051 -91033 14911 549475 1288363 1525332 2022487 -218965 654746 2522764 855782
3042 855782 1607076 626080 1685966 422466 1018050 732986 1963524 1606590 295787
3033 295787 1062810 849830 1477598 1360227 642584 1309870 527712 1973492 103396
3024 103396 2314090 325668 1507786 480465 1849035 1739151 501759 1084329 -461050
3015 -461050 225517 859503 719513 773507 1424322 1636508 589160 905119 508651 2007630
3005 2007630 2153083 1291799 1264777 1201453 1048430 692787 618033 1272200 1730885 367873
2995C67873J187348r105k052961J761625n10395J306014j272539k56104J218783
2986A740539j846943J036814L66127n97143j24848l15601M61904j083753J018118
2977F55214l35518J266348r02229J40913j007171J476223o87329J364171k799961
2968h29339O96577l7614J078620n5976J063826j648537J461640j284031m14287
2959C0879j04365J195235R55680j288764M68987j105145N90130R44810r3256K61441
2949A855632j400959k52771J96894M67052j506511J04507J988101q17315M43568
2940A078198L28587N95796k093943K79682l73620P99741J21847p25012P13188
2931G24464J31968l8949J49188l1970J61869M01191r51020m97004J283796l9432
$$ plain form
2995 367873 1555221 1546116 -506845 1254780 744385 2050399 777860 521756 1740539
2986 1740539 -106404 930410 1296537 699394 574546 258945 720849 -362904 655214
2977 655214 319696 1586044 683815 824728 -182443 1293780 606451 1970622 -829339
2968 -829339 -132762 -170376 908244 852268 1916094 267557 1729197 445166 30879
2959 30879 -73486 1121749 2077429 788665 1257652 152507 742637 1687447 1594191 1855632
2949 1855632 454673 201902 398796 865848 -640663 -536156 1451945 634630 1078198
2940 1078198 1406785 2002581 -91362 188320 -185300 614441 736288 11276 724464
2931 724464 856432 817483 966671 934701 1096570 1497761 546741 49737 1333533 1294101
2921A294101O41681p87862M70445l39563j447381O47516j109550J108080J285139
2912A762606k575527K142858O4056j053681J054596p02093M98693j406058K077741
2903A863191j349514L598J82169O80037q38221Q02252J77779j04298p74336k70212
2893C72445J500412j672882p50425J282754L34543m7356q1698j18670j18948r43817
2883b43642J334413m28464M8806k96570n9440J464167j264239K7393P4723J094972
2873A752119j497712M77397n51627j06280p82719J191877l86358p64464M46479
2864b21288P5128M37760Q92514k1552q5653Q355p91841N26806j265786Q08023
2854C62466J866027j956286L57266j301789J226091O73094j290290P33823j43772
$$ plain form
2921 1294101 1935782 1147920 1618365 1278802 -168579 478937 -630613 477467 1762606
2912 1762606 -812921 1329937 1393993 340312 1394908 692815 1191508 -214550 1863191
2903 1863191 513677 517275 699444 1379481 541260 1343512 1521291 1416993 642657 372445
2893 372445 1872857 199975 -550450 732304 1066847 1019491 937793 819123 700175 -243642
2883 -243642 1090771 662307 711113 414543 355103 1819270 555031 582424 657147 1752119
2873 1752119 254407 731804 180177 73897 -708822 483055 96697 -667767 -221288
2864 -221288 -146160 291600 1184114 1162562 1076909 1085264 293423 820229 -445557 362466
2854 362466 2228493 272207 629473 -672316 553775 1226869 -63421 670402 526630
2845E26630R42259m79997R8195j82252J066155j320215j334442Q94765J92658
2836D03756J344043j385720J108819K79253j279019J06328K14936N73970o9312
2827A297054J98875j111180K64098J484580k119628J068915p93795J101927O82159
2818B073005m77300L32835j536327n71825J355343p31792P71689j350485R87288
2809H52431j78139Q90236j313089l60570K093133j546806R7960j29092p93872
2800c87808M35845J74385Q10034K77043k90233q3812l5678L49932j521254j6761
2790b88307K085470j686933J030702j8564p09944r35414K040556k93926Q1820
2781A305460J96160k54409j108404J267284j401070J74704J177557j758848J946585
$$ plain form
2845 526630 1468889 988892 1087087 904835 1970990 650775 -683667 211098 403756
2836 403756 1747799 362079 1470898 1750151 471132 577460 792396 1366366 1297054
2827 1297054 1495929 384749 648847 2133427 13799 1082714 288919 1390846 2073005
2818 2073005 1595705 1928540 392213 -179612 1175731 443939 1215628 -134857 852431
2809 852431 674292 1564528 251439 -109131 1984002 437196 535156 406064 -387808
2800 -387808 48037 222422 1032456 1309499 1019266 935454 899776 1249708 -271546 -288307
2790 -288307 1797163 110230 1140932 1122368 412424 -522990 1517566 1223640 1305460
2781 1305460 1501620 1247211 138807 1406091 5021 179725 1357282 -401566 1545019
2772A545019j128133P76857K1801l47299K01829r1887o13161P29n41253N79939
2762D04441j52456r095R08337j169361K66003j00530K97985m66635O06665m73044
2752A12310J958077j286410R73226P3903k022810n000O09870n56416J008451L0794
2742H95995M59872m04829J064489j523943m03050J604450p43537j056675J080756
2733I73528j584163J678542J97439M05671j104517o31779R02437m63175P95275
2724A169258j489497J355338j60188J57592l65100R35121k216511K2462J630053
2715A038528l59691j46329l03238L80963q95795N88581N94321L81496k90381k71170
2705G17285Q12529o57787r20175P31507J106665l12071k09927o37185q72842R82350
$$ plain form
2772 1545019 416886 1193743 1215544 868245 1070074 978187 365026 365755 -175498 404441
2762 404441 251985 242890 1151227 -18134 247869 147339 445324 -21311 585354 112310
2752 112310 2070387 783977 1757203 1831106 -191704 -196704 413166 -143250 865201 895995
2742 895995 1355867 951038 2015527 491584 88534 1692984 949447 -107228 973528
2733 973528 -610635 1067907 1265346 1671017 566500 -65279 837158 373983 1169258
2724 1169258 -320239 1035099 874911 1032503 667403 1602524 -613987 -591525 1038528
2715 1038528 678837 532508 229270 610233 -285562 303019 897340 1278836 988455 717285
2705 717285 1529814 872027 -48148 683359 1790024 1477953 1268026 630841 -242001 740349
2695G40349j35855O57004j357154Q3826J570825j106856r81633J134625J504432
2686B109563r17720l66307L76089K46776L83518j213556l57371P08513j382320
2677d12815K116757o57164R65015k59504m39568m26206p54998K10460j42068O34378
2667H34287Q95134j358691O88661m54513M29272m74657M51455L53671m52531Q44852
2657A756940r31418m82365L38485q9228J015145q05173j352649N23453J939352
2648A912542p56809K24601m36265j62166k47285O60931j502776J641941m36229
2639H98485K99410J68899j169322M02229j081350Q46069r73488K304193p10986
2630I84139Q3806J14496j801983J474246r47898P24627R77416j200619R08034
$$ plain form
2695 740349 604494 1261498 -95656 -11830 1558995 452139 -529494 605131 2109563
2686 2109563 1191843 825536 1201625 1448401 1831919 618363 260992 969505 -412815
2677 -412815 1703942 1046778 2011793 1752289 1312721 886515 131517 341977 199909 834287
2667 834287 1729421 370730 1059391 604878 1034150 559493 1010948 1364619 912088 1756940
2657 1756940 825522 343157 681642 592414 1607559 802386 -550263 -26810 1912542
2648 1912542 1155733 1380334 944069 781903 534618 1195549 -307227 1334714 898485
2639 898485 1197895 1366794 197472 599701 -481649 364420 -609068 1695125 984139
2630 984139 1067945 1182441 -619542 854704 -93194 631433 1608849 408230 1316264
2621A316264N24444k319125K09879J224630j51861J108297j769502K82813q38789
2612d12950J106891l08183j32350p46665K806011j612635L57950m16624o1342
2603E80103j496172K077951n20568q852R73490m77780k87109J177151j492530
2594E25684p76754P35459J36652M33908p34680K10188q11235R83588Q0576p79781
2584C605J560586j579102J454727J14977L28859q80799m33498N19614r20251L16409
2574D85127p72979M68071J744696n47269m99886N94775m30533j803847O63977
2565i7868K80896j70797O28522J440942j021810j166616J172056k87765q41435
2556f3875Q82130Q00589m77900J23905l32729j4192k96499K894Q05466j318789
$$ plain form
2621 1316264 1840708 -478417 -268538 956092 804231 1912528 143026 425839 -412950
2612 -412950 693941 385758 253408 -493257 2312754 700119 1058069 641445 580103
2603 580103 -916069 1161882 641314 632462 1605952 1128172 841063 2018214 525684
2594 525684 -251070 484389 621041 1054949 320269 530457 -280778 702810 783386 3605
2584 3605 1564191 -14911 1439816 1554793 1883652 1002853 569355 1088969 168718 485127
2574 485127 -287852 180219 1924915 1377646 877760 1472535 1042002 -761845 -97868
2565 -97868 183028 12231 640753 2081695 1059885 -106731 1065325 777560 -63875
2556 -63875 818255 1618844 1140944 1264849 932120 917928 621429 624323 1429789 111000
2546A11000N37729N59596m23524M5605n32310L99834M33152r18576j21513O20753
2536G11746L44311L08999j089648k52733m10748J009068J17941j880054j436938
2527b578056K456849J126231O04549j815887J192620L90275J8223j057477j18569
2518B18758o57757Q81031N94172k929617K843705J32135m57592n61053O94557
2509G58339o02498J047334j336335M48985J7311J46855J05928n0269k98000O30288
2499H67938k87099l89363J60812Q70870q65072j52740r5840J337361p35009k49464
2489D62394o62748K54023k82359O58611Q69025j428102k62112J470119p24565
2480C54286j967402J717261L09894l18521R59321q70132N38476J220981j581763
$$ plain form
2546 111000 648729 1208325 784801 830406 298096 697930 1131082 212506 90993 711746
2536 711746 1056057 1365056 275408 22675 -388073 620995 738936 -1141118 -2578056
2527 -2578056 -121207 1005024 1609573 -206314 986306 1376581 1394804 337327 218758
2518 218758 -438999 442032 1036204 -1893413 950292 1082427 624835 63782 758339
2509 758339 155841 1203175 -133160 315825 333136 479991 585919 535650 237650 867938
2499 867938 580839 191476 352288 1223158 358086 205346 109506 1446867 711858 462394
2489 462394 -200354 53669 -228690 429921 1298946 -129156 -391268 1078851 354286
2480 354286 -1613116 104145 414039 95518 1054839 184707 723183 1944164 362401
2471C62401J024556k86048p63719M90614j326372K495224j576304R38317m8961
2462A309708L27066k053836J075095m03679M62039n52298r4359R0873K83462J635881
2452B079952j300417K44309q01270O00147L03563J08725k95865p42735j162332
2443i65923P21569O91255m98665l83826J839983p02911K5619q01629J266453j158932
2433C2993J139928j701200J190734Q34759L42896j005341K9834q39984R68627
2424I93246J057880l99787k236106Q13896J52001M01806M13012j095616n02M40960
2414E40790M19120N62932j047120n51471o96649J394104M8274j519479J2756O28587
2404b08156J307023L27977l57529o23085J237714q08206K65361n31957l23299
$$ plain form
2471 362401 1386957 1100909 337190 827804 -498568 1996656 420352 1358669 1309708
2462 1309708 1636774 -417062 658033 254354 716393 164095 69736 160609 444071 2079952
2452 2079952 779535 1023844 222574 822721 1126284 1235009 939144 196409 -965923
2443 -965923 -244354 446901 -51764 -435590 1404393 701482 727101 -74528 1191925 32993
2433 32993 1172921 -528279 662455 1497214 1840110 834769 864603 24619 993246
2424 993246 2051126 1651339 -584767 229129 381130 782936 1195948 100332 99830 540790
2414 540790 959910 1522842 475722 -75749 -772398 621706 669980 -849499 -836743 -208156
2404 -208156 1098867 1426844 1069315 446230 1683944 875738 1141099 609142 285843
2395B85843m00552L96595Q61169O56910j355678O49629j7747k42845O85808M67213
2385A986345j623233Q86745m81539L01078M59081q83115P59400j72158o84948
2376E47656j626564R61327J81104R75431p02750J209466j166413N21540n32503
2367C68294J163188q50649R86625o92028m80192o98968J711695j532248J067305
2358A043022M30705k34725r99966L54763r50246r6546J412812j051843P3201J029807
2348A010984j644379J615212k84189p50567K9495L21902K4304l60300r01020J594560
2338F56002m70794M54081r4833K92485k90178J146673q77715M29556j078143N19691
2328F86825N9156k72993M246j619107P87428J071932n421L38280p80706J057564
$$ plain form
2395 285843 -114709 281886 1143055 1799965 444287 1093916 1076169 833324 1519132 1986345
2385 1986345 363112 1249857 768318 1069396 1528477 645362 1404762 1232604 547656
2376 547656 -1078908 -117581 63523 1038954 336204 1545670 379257 900797 368294
2367 368294 1531482 680833 1667458 975430 495238 -203730 1507965 -24283 1043022
2358 1043022 1473727 1239002 239036 593799 -356447 -452993 959819 -92024 -18823 1010984
2348 1010984 -633395 981817 697628 -52939 -23444 298458 322762 -37538 -938558 656002
2338 656002 185208 639289 544456 836941 546763 1693436 815721 1245277 167134 686825
2328 686825 745981 472988 477234 -1141873 -354445 717487 712066 1050346 269640 1327204
2318A327204p13216J31014P7005l45024j9305L68482l65839q0630M42799l5792
2308G86698J401757q85026j558921r24627J927200m63858j008383P44988N58718
2299E78546m69607L2693N2421N45416r33473K8276R68852o50455l04447P59592
2289F07814N09582K37237k065804K228505j445555R10723k52753o88469O80964
2280G22244j17306q3720M87820j359455K44397Q7319R37975J112734k144568O23505
2270E10945Q22577j869006P6320J195868n82030k04004P62570J46226N83188j494944
2260e2290J473777j768505J890040j067479M60421j86330r54813J249830j05388
2251I39263Q04912j761856J252038M0450r52286L80417J72712k97926m97481J903111
$$ plain form
2318 1327204 613988 745002 822007 476983 457678 826160 460321 379691 822490 786698
2308 786698 2188455 1303429 -255492 -1180119 747081 283223 -725160 19828 578546
2299 578546 108939 141632 194053 739469 -194004 -165728 803124 152669 -151778 607814
2289 607814 1117396 1354633 -711171 1517334 71779 982502 729749 41280 722244
2280 722244 604938 521218 1009038 -350417 -106020 -18701 919274 2032008 -112560 510945
2270 510945 1333522 -535484 -459164 736704 154674 -49330 713240 859466 1442654 -52290
2260 -52290 1421487 -347018 1543022 475543 935964 749634 -205179 1044651 939263
2251 939263 1744175 -17681 1234357 1274807 322521 702938 875650 577724 80243 1983354
2241A983354r67093k24719j86052j035565J952592r94459j52886J848310K68008
2232B491490k849119K329975m93063J23857r60374m73237R99418l50520j084168
2223b65741N01354J661173k185115l18460J16898O61679L57836n61624L32132
2214C00132L93097L46092p38461P18407k27946l9214o13872J195147n36351k69288
2204E27743n36363M41068k00086L83695q37796Q27815J83884j73920J59775J81225
2194I57040p119o4700L02761q58067O33405j70462K38733j017422j7811k39918
2184b43560R09600n12980M3122R62397l80845L03626p81942N62695M43504j247610
2174E8007Q05059M59224q89255L78951k37154j44749J73687P22628j559616O85111
$$ plain form
2241 1983354 1016261 791542 605490 -430075 1522517 528058 375172 2223482 2491490
2232 2491490 -357629 1972346 1479283 1603140 642766 169529 1168947 818427 -265741
2223 -265741 235613 1896786 -288329 -606789 -489891 171788 529624 -32000 300132
2214 300132 693229 1039321 300860 1019267 791321 752107 138235 1333382 797031 527743
2204 527743 -8620 432448 232362 616057 -221739 606076 789960 616040 775815 957040
2194 957040 949921 885221 1187982 329915 963320 792858 1031591 14169 -3642 -243560
2184 -243560 666040 153060 196182 1158579 777734 1081360 299418 862113 1305617 58007
2174 58007 863066 1322290 433035 811986 574832 430083 603770 1326398 -233218 451893
2164D51893K200088k394357K80846M17617o24190N67967Q90012p62476Q42180
2155A869580k318771P74909J316215j164709J64072j003213J467812r67220m70319
2146c31644K232691r72514N59311o74092r01754r5047m30103Q59772K04410J144179
2136A595209M1289n79275q6128O28668k82827j514231O06114j92016j000947R64516
2126A80372R55702o21232Q96543m45782J52791M4743p28575N48989m16150N36121
2116A103522j80412j41795J210934j43573m85476j159677M40729k54502r87881
2107e98131O99247N06664m17896M54684o43398N65586k16351q38878N13230K01555
2097B26312r4356J028812j295774J606050j326756L79353J07656o67651J115232
$$ plain form
2164 451893 2651981 257624 538470 956087 331897 899864 1789876 1027400 1869580
2155 1869580 -449191 325718 1641933 477224 641296 -361917 1105895 138675 -331644
2146 -331644 1901047 928533 1487844 813752 -88002 -183049 -613152 246620 451030 1595209
2136 1595209 1636498 1057223 971095 1599763 1316936 -197295 408819 216803 -784144 180372
2126 180372 1136074 514842 1411385 965603 1118394 1163137 434562 983551 567401 1103522
2116 1103522 923110 781315 1992249 1848676 1363200 203523 644252 389750 -598131
2107 -598131 101116 607780 189884 644568 1170 566756 350405 -488473 24757 226312
2097 226312 131956 1160768 -135006 1471044 144288 523641 631297 -36354 1078878
2088A078878O8646j676506J577475n28305K33071O64494j131004K80219m82300
2079H4668P42371k29291J04111j255971J358534J360747k172876O31728L63261
2070I87282M51694j697051M67848J86357j7876L40938Q2475l32910l30272j414079
2060a275594K444172j046541K67171P55406o42444O16891n31024M72538p20134
2051C40441J31491M96960j086456Q9541m89818Q32552P326K128967k426110P06972
2041G31866N54976j133627J279274j904335J327485L97935j220432K72080J52614
2032D57836j00121l91524J043850m40365j63074o0915P1923k42306M3793R81144
2022A200241q03628p43217J011113j245958J059459l60322J032836j086786Q60066
$$ plain form
2088 1078878 1147524 -528982 1048493 520188 753259 1417753 286749 566968 84668
2079 84668 827039 597748 701859 -554112 804422 2165169 -7707 624021 987282
2070 987282 1438976 -258075 209773 396130 378254 719192 801667 468757 138485 -1275594
2060 -1275594 1168578 122037 389208 1144614 502170 1119061 588037 1060575 340441
2051 340441 471932 968892 -117564 -28023 -517841 314711 322037 2451004 24894 731866
2041 731866 1286842 153215 1432489 -471846 855639 1253574 33142 305222 457836
2032 457836 357715 -33809 1010041 569676 406602 345687 417610 175304 219097 1200241
2022 1200241 396613 -346604 664509 -581449 478010 117688 1150524 63738 923804
2013I23804o15255M45623m36797J152756O8502J51244p32534m36492k9353j090082
2003e98584N52857J294068l24376r76199M92522q33697J118559j179595J303896
1994H49451J41943j072872M27184q0026J122439j262094K82744J062420p19638
1985G51551j014435J898383j82233j576827J95107J03248R79533p87446q1342
1976B85539J056291k81300k48944p35869M76124j05651Q6453P84902j28829J17322
1966A306038j455794J073613j683125R87741o77467R51736J551635j276783R31318
1957A708912j431670j78445J118836K57409m29108j995962J963166l37946j187660
1948e12468J036555j070683J973495j467435N53187L4863o98281J807078j523814
$$ plain form
2013 923804 308549 754172 317375 1470131 1538633 1689877 957343 520851 491498 -598584
2003 -598584 -45727 1248341 923965 -52234 440288 -393409 725150 -454445 849451
1994 849451 991394 -81478 345706 265680 1388119 126025 408769 1471189 751551
1985 751551 -262884 1635499 1453266 -123561 71546 174794 1154327 366881 285539
1976 285539 1341830 1060530 811586 75717 551841 446190 532643 1317545 1188716 1306038
1966 1306038 -149756 923857 -759268 228473 -448994 502742 2054377 777594 1708912
1957 1708912 277242 98797 1217633 1475042 1045934 -950028 1013138 675192 -512468
1948 -512468 524087 -546596 1426899 -40536 512651 547514 -150767 1656311 132497
1939A32497j31356L33969Q13929p10835N47383j243260J348577j721863J846059
1930A215100j190358O74137r35817k03907J510307r8819j45760K93955L09569
1921A428407k17141r49154p85429J676696j808657J605562l85099L33971q7262
1912H11894p28419J64709L54978J79354O23851r40082q54392K71625K07627Q82107
1902I73252L78672j310687j02514J324549p34152j15302P36702l31711L14846
1893A133655j09450p68532N02398p11002N77654n52486J462245o99465L3375l96335
1883D72057j016119J967603k461813J878444o84451l67K78313j2627O26766k16197
1873H31609L15236r9159m78201n05203J247010J46366n89045N0805k34445j83806
$$ plain form
1939 132497 1141 335110 1149039 438204 985587 -257673 1090904 -630959 1215100
1930 1215100 24742 698879 -236938 -440845 1069462 970643 824883 1118838 1428407
1921 1428407 1211266 262112 -523317 1153379 -655278 950284 565185 899156 811894
1912 811894 83475 248184 603162 782516 1406367 466285 -388107 -116482 91145 973252
1902 973252 1351924 41237 -61277 1263272 529120 413818 1150520 818809 1133655
1893 1133655 1024205 255673 758071 47069 624723 72237 1534482 835017 868392 472057
1883 472057 -544062 1423541 -1038272 840172 155721 155354 433667 421040 1047806 831609
1873 831609 1146845 1047686 569485 64282 1311292 1457658 868613 919418 684973 501167
1863E01167l14063q88523J572600p53654N87239l96257m9557L30621k69754L07785
1853F27604j62660m55071r41736J023028J144478L00291j84357k117788K440394
1844A674183l47328j125162L82911n4491j023926J291101n64172R42807l16885
1835H59038P9583j42565q06942J405532m65951j35358Q93019q21219n33044J138587
1825A470680j399826K27354P23049j286067O79570m06774J330915j000921J82250
1816E20230l18952O06685n31318Q95644q34883R21534j19059o09050O77262j772448
1806e64355L66287J451587L00674j502473Q55073p14258K5608P12981o36977Q33653
1796A127800k43852O50635o45033Q06478N17387k353048J111309n27173N29891
$$ plain form
1863 501167 187104 -701419 871181 117527 704766 308509 258952 589573 319819 627604
1853 627604 464944 9873 -931863 91165 1235643 1535934 1351577 -766211 1674183
1844 1674183 1326855 201693 584604 530113 -493813 797288 233116 1175923 859038
1835 859038 938621 796056 -10886 1394646 928695 793337 1686356 865137 332093 1470680
1825 1470680 70854 298208 1021257 -264810 414760 7986 1338901 337980 520230
1816 520230 201278 807963 276645 1172289 337406 1258940 1139881 530831 1208093 -564355
1806 -564355 -198068 1253519 1554193 51720 906793 192535 218143 931124 294147 1127800
1796 1127800 883948 1534583 889550 1696028 2213415 -139633 971676 444503 974394
1787I74394p97150J39133J80697M25098J233027p72136n08411P60070j640211
1778e489J218658j416648O96631J099032m35130k78806j076584Q27319k4680n00552
1768A03751J2759J36218o86958L79175n88139J840303j525143j75814K637312
1759B133464j411262o55772m40090L15400P90695p01540q27418P94239J969176
1750A966892j317853J081696j284007n04871J310075M42547r00076L55537k66748
1741H83192J46788l54654K45025j740739J599623r90017J131778j135779J02243
1732a12540N56996J419226r60408j683598J473463M02143l81966j039161J62963
1723a62882R2951q5339J021049m11074r28377R28323J71514j35623R51128p23257
$$ plain form
1787 974394 177244 316377 497074 922172 2155199 1383063 874652 1634722 -5489
1778 -5489 1213169 -203479 493152 1592184 1157054 878248 -198336 628983 604303 103751
1768 103751 116510 252728 -434230 -55055 -643194 1197109 -328034 -503848 2133464
1759 2133464 722202 66430 -373660 -58260 732435 30895 -796523 -2284 1966892
1750 1966892 649039 1730735 446728 -58143 1251932 1694479 794403 1149940 883192
1741 883192 1029980 675326 920351 -820388 779235 -210782 920996 -214783 -112540
1732 -112540 444456 1863682 903274 -780324 693139 1095282 713316 -325845 -162882
1723 -162882 -69931 -155270 865779 454705 -473672 454651 626165 490542 1441670 718413
1713G18413j760284Q94155m26966J586653L58916j030832L30024j75398Q03717
1704A298398m80197J14848O24159o56071j071458J272184j116180n25558J360614
1695H20739J99165j94155m5863j85977Q91315p97693M19442K98125j226592k49906
1685g1400J480555j522227J454120j120046Q66756o95206J069373q11920J11127
1676G61132q87231R99138N97577j742702L86495R00898j873578Q35965J002490
1667I80184L0438O08l138905K937532J48109P44331j50929k63196q39162M19661
1657H68671R06728j222134j786915J284424K27169l14351P15682l32177k54082
1648I3015L9545R42078r97854N63306j69194n41081J485360k33859n11351J062407
$$ plain form
1713 718413 -1041871 -147716 -574682 1011971 1370887 340055 670079 494681 1298398
1704 1298398 818201 933049 1557208 901137 -170321 1101863 -14317 -539875 820739
1695 820739 1019904 825749 779886 593909 1485224 687531 1106973 1405098 178506 -71400
1685 -71400 1409155 -113072 1341048 221002 1087758 392552 1461925 650005 761132
1676 761132 -126099 873039 1470616 -272086 114409 1015307 -858271 -22306 980184
1667 980184 1010622 1011230 -2127675 809857 957966 1702297 1551368 1288172 449010 868671
1657 868671 1775399 553265 -1233650 50774 277943 -36408 679274 347097 93015
1648 93015 132560 1074638 76784 640090 470896 -70185 1415175 1181316 669965 1732372
1638A732372j274210N16664r54820L3017J183871j415578K62066J056065k303396
1629a163949J759296q45041K257502j233838m70219m427M78373o17854l5094O09547
1619G34296P42984p08966L04860N50515p13667j341871J660128j270092J759971
1610A718158j834005Q71461l78302L98767j274676J714706J62365j026028N46568
1601H99014R75767j120255m74969K3100P81709K35970r48772R53521k23083m42086
1591F59916l70700l0289k40483k12578M22489K88424R68366l97309p07642K64516
1581F44710o36686m83629p9529J588203n18020k45371j98832K68899K183087q41333
1571A681499n77732j294474K43137j042614N76055O92502O12828K4506p03891
$$ plain form
1638 1732372 458162 974826 20006 53023 1236894 -178684 83382 1139447 -1163949
1629 -1163949 595347 -249694 2007808 773970 303751 299324 777697 159843 124749 734296
1619 734296 1477280 768314 1073174 1623689 910022 -431849 1228279 -41813 1718158
1610 1718158 -115847 755614 377312 776079 -498597 1216109 1378474 352446 899014
1601 899014 1874781 754526 279557 302657 1084366 1320336 371564 1325085 1102002 659916
1591 659916 289216 258927 18444 -194134 228355 516779 1485145 1087836 380194 644710
1581 644710 8024 -475605 -555134 1033069 515049 269678 70846 339745 2522832 1681499
1571 1681499 1103767 -190707 52430 -990184 -414129 278373 891201 915707 211816
1562B11816n88347J095669j51010m30857o99673K053948R7497n89815j727301
$$ plain form
1562 211816 -376531 719138 568128 137271 -562402 1491546 1589043 999228 -728073
$$ [...]
##END NTUPLES=NMR SPECTRUM
##END=
