##TITLE=abcd
##JCAMPDX= 6.0         $$ Bruker NMR JCAMP-DX V2.0
##DATA TYPE= NMR SPECTRUM
##DATA CLASS= NTUPLES
##ORIGIN= UXNMR, Bruker Analytische Messtechnik GmbH
##OWNER= root
$$ XWIN-NMR		Version 3.5
$$ Fri Oct 24 17:56:44 2025 Russian Standard Time (UT+4h)  servis@DPX200
##.OBSERVE FREQUENCY= 200.131235884673
##.OBSERVE NUCLEUS= ^1H
##.ACQUISITION MODE= SIMULTANEOUS
##.ACQUISITION SCHEME= undefined
##.AVERAGES= 16
##.DIGITISER RES= 18
##SPECTROMETER/DATA SYSTEM= spect
##.PULSE SEQUENCE= zg
##.SOLVENT NAME= CDCl3
##.SHIFT REFERENCE= (INTERNAL, CDCl3, 0, 16.4885)
##AUDIT TRAIL= $$ (NUMBER, WHEN, WHO, WHERE, WHAT)
$$ ##TITLE= Audit trail, XWIN-NMR		Version 3.5
$$ ##JCAMPDX= 5.01
$$ ##ORIGIN= Bruker BioSpin GmbH
$$ ##OWNER= servis
$$ F:\spectra/data/av/nmr/H1/1/pdata/1/auditp.txt
$$ ##AUDIT TRAIL=  $$ (NUMBER, WHEN, WHO, WHERE, WHAT)
(   1,<2025-10-24 17:56:04.60 +0400>,<servis>,<DPX200>,
      <created by zg, POWCHK disabled, PULCHK disabled
       terminated by command 'halt'
       configuration hash MD5:
       00 E9 B6 7A A2 85 ED C7 34 08 36 98 17 FE 4E 26
       data hash MD5: 32K
       74 CD E7 51 3B 61 1C 0C D6 01 AA AC CB AF 9D 64>)
(   2,<2025-10-24 17:56:06.46 +0400>,<servis>,<DPX200>,
      <Start of raw data processing
       efp BC_mod = 2 LB = 0.05 FT_mod = 6 PKNL = 1 PHC0 = -269.1076 PHC1 = 6.501565 SI = 16K 
       data hash MD5: 16K
       56 B0 11 71 43 46 B7 7C 27 00 8A 2F FC 0C AE 04>)
(   3,<2025-10-24 17:56:22.68 +0400>,<servis>,<DPX200>,
      <pk PHC0 = -1.8 PHC1 = 0 
       data hash MD5: 16K
       69 3C 39 C4 88 4E 3B BC C0 6C 52 7B A1 5A 20 08>)
$$ ##END=
$$ 
$$ hash MD5
$$ 3C 99 69 EA B0 5A 6E 20 A6 8E 03 C1 A6 3D 26 41
##$RELAX= 
##$RELAX= 
##$RELAX= 
##$RELAX= 
##$RELAX= 
##$RELAX= 
##$RELAX= 
##$RELAX= 
$$ Bruker specific parameters
$$ --------------------------
##$DU= <F:\spectra>
##$EXPNO= 1
##$NAME= <H1>
##$PROCNO= 1
##$TYPE= <nmr>
##$USER= <av>
##$AMP= (0..31)
100 100 100 100 100 100 100 100 100 100 100 100 100 100 100 100 100 100 
100 100 100 100 100 100 100 100 100 100 100 100 100 100 
##$AQSEQ= 0
##$AQ_mod= 1
##$AUNM= <au_zg>
##$AUTOPOS= <>
##$BF1= 200.13
##$BF2= 200.13
##$BF3= 200.13
##$BF4= 200.13
##$BF5= 500.13
##$BF6= 500.13
##$BF7= 500.13
##$BF8= 500.13
##$BYTORDA= 1
##$CFDGTYP= 0
##$CFRGTYP= 5
##$CHEMSTR= <none>
##$CNST= (0..31)
1 1 145 1 1 1 1 1 1 1 1 1 1 1 1 1 1 1 1 1 1 1 1 1 1 1 1 1 1 1 1 1 
##$CPDPRG= <>
##$CPDPRG1= <>
##$CPDPRG2= <>
##$CPDPRG3= <>
##$CPDPRG4= <mlev>
##$CPDPRG5= <mlev>
##$CPDPRG6= <mlev>
##$CPDPRG7= <mlev>
##$CPDPRG8= <mlev>
##$CPDPRGB= <>
##$CPDPRGT= <>
##$D= (0..31)
0 2 0 0 0 0 0 0 0 0.06 0 0 0 0 0 0 0.0002 0 0 0 0 0 0 0 0 0 0 0 0 0 0 
0 
##$DATE= 1761314164
##$DBL= (0..7)
120 120 120 120 120 120 120 120 
##$DBP= (0..7)
150 150 150 150 150 150 150 150 
##$DBP07= 0
##$DBPNAM0= <>
##$DBPNAM1= <>
##$DBPNAM2= <>
##$DBPNAM3= <>
##$DBPNAM4= <>
##$DBPNAM5= <>
##$DBPNAM6= <>
##$DBPNAM7= <>
##$DBPOAL= (0..7)
0.5 0.5 0.5 0.5 0.5 0.5 0.5 0.5 
##$DBPOFFS= (0..7)
0 0 0 0 0 0 0 0 
$$ [...]
##$SUBNAM4= <"">
##$SUBNAM5= <"">
##$SUBNAM6= <"">
##$SUBNAM7= <"">
##$SUBNAM8= <"">
##$SUBNAM9= <"">
##$SW= 20.6817932712277
##$SWIBOX= (0..15)
0 0 3 0 0 0 0 0 0 0 0 0 0 0 0 0 
##$SW_h= 4139.07284768212
##$TD= 32768
##$TD0= 1
##$TE= 0
##$TE2= 300
##$TE3= 300
##$TEG= 300
##$TL= (0..7)
0 120 120 120 120 120 120 120 
##$TP= (0..7)
150 150 150 150 150 150 150 150 
##$TP07= 0
##$TPNAME0= <>
##$TPNAME1= <>
##$TPNAME2= <>
##$TPNAME3= <>
##$TPNAME4= <>
##$TPNAME5= <>
##$TPNAME6= <>
##$TPNAME7= <>
##$TPOAL= (0..7)
0.5 0.5 0.5 0.5 0.5 0.5 0.5 0.5 
##$TPOFFS= (0..7)
0 0 0 0 0 0 0 0 
##$TUNHIN= 0
##$TUNHOUT= 0
##$TUNXOUT= 0
##$USERA1= <user>
##$USERA2= <user>
##$USERA3= <user>
##$USERA4= <user>
##$USERA5= <user>
##$V9= 5
##$VALIST= <valist>
##$VCLIST= <CCCCCCCCCCCCCCC>
##$VD= 0
##$VDLIST= <DDDDDDDDDDDDDDD>
##$VPLIST= <PPPPPPPPPPPPPPP>
##$VTLIST= <TTTTTTTTTTTTTTT>
##$WBST= 1024
##$WBSW= 30
##$XGAIN= (0..3)
0 0 0 0 
##$XL= 0
##$YL= 0
##$YMAX_a= 475817
##$YMIN_a= -264854
##$ZGOPTNS= <>
##$ZL1= 120
##$ZL2= 120
##$ZL3= 120
##$ZL4= 120
##$ABSF1= 0
##$ABSF2= 0
##$ABSG= 0
##$ABSL= 0
##$ALPHA= 0
##$AQORDER= 0
##$ASSFAC= 0
##$ASSFACI= 0
##$ASSFACX= 0
##$ASSWID= 0
##$AUNMP= <proc_1d>
##$AZFE= 0.1
##$AZFW= 0.1
##$BCFW= 0
##$BC_mod= 2
##$BYTORDP= 0
##$COROFFS= 0
##$CY= 18.4799938201904
##$DATMOD= 1
##$DC= 0
##$DFILT= <>
##$DTYPP= 0
##$F1P= 9.9274215381318
##$F2P= -0.165520771350173
##$FCOR= 1
##$FTSIZE= 16384
##$FT_mod= 6
##$GAMMA= 0
##$GB= 0
##$INTBC= 1
##$INTSCL= 4.127829e-11
##$ISEN= 128
##$LB= 0.05
##$LEV0= 0
##$LPBIN= 0
##$MAXI= 10000
##$MC2= 0
##$MEAN= 0
##$ME_mod= 0
##$MI= 50
##$NCOEF= 0
##$NC_proc= -6
##$NLEV= 6
##$NOISF1= 3.799351
##$NOISF2= 2.8
##$NSP= 0
##$NTH_PI= 0
##$NZP= 0
##$OFFSET= 16.48848
##$PC= 4
##$PHC0= -270.9076
##$PHC1= 6.501565
##$PH_mod= 1
##$PKNL= yes
##$PPARMOD= 0
##$PSCAL= 4
##$PSIGN= 0
##$REVERSE= no
##$SF= 200.130005582386
##$SI= 16384
##$SIGF1= 3
##$SIGF2= 2
##$SINO= 400
##$SIOLD= 16384
##$SREGLST= <1H.CDCl3>
##$SSB= 0
##$STSI= 16384
##$STSR= 0
##$SW_p= 4139.07284768211
##$SYMM= 0
##$S_DEV= 0
##$TDeff= 32768
##$TDoff= 0
##$TI= <>
##$TILT= no
##$TM1= 0
##$TM2= 0
##$TOPLEV= 0
##$USERP1= <user>
##$USERP2= <user>
##$USERP3= <user>
##$USERP4= <user>
##$USERP5= <user>
##$WDW= 1
##$XDIM= 16384
##$YMAX_p= 487172813
##$YMIN_p= -779964
$$ End of Bruker specific parameters
$$ ---------------------------------
##NTUPLES= NMR SPECTRUM
##VAR_NAME=  FREQUENCY,     SPECTRUM/REAL,   SPECTRUM/IMAG
##SYMBOL=    X,             R,               I
##VAR_TYPE=  INDEPENDENT,   DEPENDENT,       DEPENDENT
##VAR_FORM=  AFFN,          ASDF,            ASDF
##VAR_DIM=   16384,         16384,           16384
##UNITS=     HZ,            ARBITRARY UNITS, ARBITRARY UNITS
##FACTOR=    0.252644378177508, 1,           1
##FIRST=     3299.83951724647, 0,            0
##LAST=      -839.233330435636, 0,           0
##MIN=       -839.233330435636, -779964,     0
##MAX=       3299.83951724647, 487172813,    0
$$ Real data points
##PAGE= N=1
##DATA TABLE= (X++(R..R)), XYDATA
$$ [...]
12624 -233762 -381902 -361433 -320759 -231532 -82978 -257655 -203592 -285502 -393347 -47178
12614 -47178 -266483 -356944 -527653 -456482 -272863 22629 -357651 -464577 -395567 -297965
12604 -297965 -324502 -183998 -181054 -311917 -256409 -251681 -294538 -381663 -259289 -120515 -281878
12593 -281878 -469452 -288123 -309793 -297220 -327579 -334564 -469894 15778 102463 -153698 -451858
12582 -451858 -397777 -179665 -253525 -256049 -238859 -386700 -424096 -299104 -284567 -284813 -114811
12571 -114811 -155018 -405893 -318680 -412367 -222343 -274141 -428302 -361047 -269399 -189305 -277095
12560 -277095 -115745 -260041 -378254 -343899 -344915 -77741 -136392 -282889 -207245 -197829 -356772
12549 -356772 -215968 -104424 -433211 -460935 -148942 -108163 -472599 -312592 -326344 -165473
12539 -165473 -193719 -70057 -222469 -441877 -257440 -304322 -273872 -372657 -234127 -218106
12529 -218106 -238692 -339546 -239255 -235861 -271224 -179262 -243433 -359276 -278940 -163625 -303330
12518 -303330 -312197 -421677 -363031 -277775 -243618 -249000 -192097 -205810 -203541 -332701 -274329 -248365
12506 -248365 -329238 -339740 -122215 -181455 -376585 -371216 -76392 -213238 -180411 -204719 -125628
12495 -125628 -378298 -338381 -150619 -64613 -360272 -228659 -54024 -127580 -340129 -197131
12485 -197131 -258855 -395604 -460915 -284612 -156972 -241722 -135630 -179763 -351720 -288592
12475 -288592 -171718 18478 14209 -329252 -475325 -153648 -202505 -250157 -220849 -154058 -355305
12464 -355305 -290741 -374926 -298587 -213200 -173062 -389192 -381579 -273848 -224304 -311226 -253858
12453 -253858 -132155 -410602 -243536 -181356 -138984 -452946 -214272 -87183 -434562 -189126
12443 -189126 -75954 -303495 -297527 -333260 -316092 -291634 -422887 -341510 -82524 -343218 -257489
12432 -257489 -296282 -341168 -382621 -26480 -169540 -314899 -168302 -321376 -172225 -276719
12422 -276719 -200106 -101200 -231961 -364054 -273536 -358235 -260816 -20313 -255054 -318552 -313287
12411 -313287 -383719 -60012 -357003 -226904 -87862 -440938 -96272 -123687 -266554 -418698
12401 -418698 -243574 -197430 -415555 -85745 -126764 -203335 -250134 -181054 -451415 -432921 -31473
12390 -31473 -241743 -532246 -244615 -257383 -351619 -541298 -243988 -101374 -228927 -202912
12380 -202912 32512 -265208 -605694 -233872 -132384 -266982 -283427 -285178 -250483 -225503
12370 -225503 -257810 -329058 -200349 -121224 -272390 -108972 -222011 -282427 -311626 -123179
12360 -123179 -257668 -526901 -378732 -97835 -101502 -244593 -183728 -382292 -388697 -238663
12350 -238663 -295184 -206243 -153264 -290235 -297922 -297732 -396966 -546781 -276421 -89039 -398478
12339 -398478 -449642 -57659 -118868 -415480 -333336 -96075 -208757 -473050 -125568 72824
12329 72824 -254534 -314629 -231709 -288642 -392749 -280657 -194298 -261133 -295548 -571735 -471190
12318 -471190 -126277 -125158 -308674 -484186 -167923 -462117 -460467 -204782 -108980 -209211
12308 -209211 -235471 -400786 -250766 -294003 -428839 -258977 -283402 -315297 -208984 -132899
12298 -132899 -134207 -286514 -533001 -327047 -221007 -288764 -326260 -99255 -175746 -126033 -323874
12287 -323874 -202267 -294927 -213146 -193949 -424119 -30945 -190196 -455217 -349582 -300585
12277 -300585 -271931 -319248 -127114 -190299 -407739 -458839 -187200 -192339 -211649 -311805 -254244
12266 -254244 -251665 -224322 -247588 -188671 -173020 -317589 -349156 -269456 -106879 -185517 -363410
12255 -363410 -136802 -139354 -398567 -381352 -231572 -290211 -191310 -220955 -202167 -339722 -281719
12244 -281719 -188422 -166067 -324286 -223517 -90037 -228122 -367097 -83705 -153040 -334593
12234 -334593 -202812 -378388 -230684 -169777 -172437 -203495 -400976 -453067 -403302 -353983 -121399
12223 -121399 -115399 -348067 -421341 -176402 -203115 -111092 -209063 -112142 -374838 -394122 -323059
12212 -323059 -226710 -243387 -206865 -174500 -488682 -209823 23694 94140 -277529 -318133 -505246
12201 -505246 -489831 -321128 -155503 -91189 -325258 -492893 -425549 -150856 -182613 -165435
12191 -165435 -304161 -213218 -322116 -450263 -277567 -215955 -427443 -507965 -39534 -252416
12181 -252416 -410321 -87463 -109455 -152439 -290554 -294338 8826 -254573 -343313 -240790
12171 -240790 -349338 -272754 -143967 -136692 -141111 -267581 -259648 -271692 -226725 -365752 -340907
12160 -340907 -263144 -375551 -321773 -164380 -237944 -255490 -362889 -450698 -210361 -377537
12150 -377537 -340155 -222369 -355585 -189185 -129458 -308183 -212140 -271685 -305189 -97780
12140 -97780 -133135 -165422 -127579 -402184 -296175 -250329 -57600 -135148 -242582 -500983 -448318
12129 -448318 -163590 -192598 -130696 -214086 -209618 -287847 -335058 -226881 -152448 -481587 -398246
12118 -398246 -121833 -215606 -279270 -249117 -382937 -155236 -222005 -345442 -128550 -344196
12108 -344196 -290980 -399366 -591241 -318203 -138397 -215711 -263315 -359519 -343930 -147688
12098 -147688 -51088 -369641 -220695 -110721 -347967 -255379 -449301 -527375 -278838 -403047
12088 -403047 -161419 -160834 -198302 -184470 -332805 -345640 -331250 -46951 -286950 -181643 -290032
12077 -290032 -250485 -256751 -553229 -303652 -163377 -334514 -341702 -168869 -221461 -537547 -466610
12066 -466610 -172301 -263996 -296583 -259270 -194416 -297159 -511873 -378395 -162238 -250491
12056 -250491 -331795 -326674 -200537 -359747 -193450 -166506 -176999 -458737 -316558 -124203
12046 -124203 -194952 -198787 -280253 -350867 -309842 -438647 -241197 -219468 -213185 -384251 -155972
12035 -155972 -303606 -305849 -112654 -157187 -368463 -333374 -369553 -303722 -300552 -382512 -382722 -444065
12023 -444065 -271456 -138147 -64301 -172420 -262305 -330300 -265682 -175557 -330931 -319449 -384517
12012 -384517 -352936 -192448 -196366 -235046 -197759 -398139 -44080 -50269 -185939 -197282 -186080
12001 -186080 -421496 -356257 -270058 -241738 -150930 -323902 -271862 -360222 -253527 -240923 -188877
11990 -188877 -259177 -306831 -343035 -417965 -232575 -217331 -408050 -176145 -313860 -296447 -197346
11979 -197346 -161331 -271678 -396824 -373619 -352422 -226214 -179200 -247443 -392288 -182893
11969 -182893 1900 -238799 -137968 -184432 -317789 -314308 -263410 -373858 -253251 -252061 -295795
11958 -295795 -352099 -245218 -136420 -21686 -225106 -26061 -169720 -473003 -489654 -178620
11948 -178620 -387851 -437047 -318387 -136698 -247428 -318009 -247984 23981 -253400 -171968
11938 -171968 -272136 -543016 -223700 -220662 -391627 -227377 -363315 -267025 -72177 -219531
11928 -219531 -196806 26381 -455180 -298211 -149509 -425921 -159095 -186463 -312076 -108913
11918 -108913 -330039 -400691 -150284 -219090 -277915 -163395 -276476 -251504 -105270 -442947
11908 -442947 -347837 -190156 -360318 -185467 -90260 -281202 -394844 -410899 -117837 -248990
11898 -248990 -556198 -79707 -160363 -367705 -303265 -192356 -440148 -376748 -271512 -284971
11888 -284971 -380036 -339081 -227090 -179272 -400995 -174368 -63457 -457074 -172258 -177853
11878 -177853 -182482 -251273 -148335 -91767 -326736 -322347 -159269 -129362 -381242 -504208 -215348
11867 -215348 -178155 -366699 -311129 -363877 -133241 -259422 -170633 -192880 -219751 -223656 -439474
11856 -439474 -222981 -211972 -264946 -186879 -178320 -362051 -221110 -228377 -108276 -244021 -177485
11845 -177485 -258540 -380769 -283535 -386153 -294537 -336992 -476148 -438966 -140823 -22214
11835 -22214 -413789 -356597 -48248 -387981 -466055 -349183 -270488 -253997 -348212 -222584 -295798
11824 -295798 -424896 -254313 -166719 -339437 -182514 -364619 -236841 -167150 -329041 -228196
11814 -228196 -47513 -292889 -233786 -195031 -305772 -277388 -74249 -170863 -282140 -402939
11804 -402939 -436943 -128292 -282239 -226034 -268421 -262407 -272169 -162697 -275852 -225490 -128894
11793 -128894 -246865 -385650 -386420 -249158 -242094 -130891 38719 -390428 -320065 -59462 -49651
11782 -49651 -380910 -248409 -498590 -245648 -52734 -139890 -235934 -286802 -393606 -287924
11772 -287924 -190499 -298323 -152209 -103583 -236270 -442391 -335870 -278141 -135676 -252993
11762 -252993 -156668 -233513 -314942 -215893 -171032 -437171 -228584 -126794 -113103 -43469 -363067
11751 -363067 -267633 -151215 -432080 -334799 -112980 -272718 -398544 -231543 -420463 -151650
11741 -151650 -139883 -196706 -154542 -337251 -340556 -140569 -406783 -213427 -231370 -438390 -140759
11730 -140759 -127999 -142017 -420753 -242838 -97074 -141446 -122665 -236821 -173386 -414630
11720 -414630 -507665 -132835 -214431 -175168 -76633 -334364 -308026 -316959 -289000 -64998 -305334
11709 -305334 -352179 -405880 -164191 -262893 -89491 -301401 -322552 -256521 -197676 -210753 -286978
11698 -286978 -358547 -259182 -456530 -370328 -82392 -259455 -234005 102385 -205020 -419583
11688 -419583 -279036 -190129 -317104 -369297 -532306 -349106 -152392 -419550 -318729 -67962
11678 -67962 -140819 -77287 -226991 -260038 -260851 -368555 -317234 -196052 -266072 -500762 -44824
11667 -44824 -167320 -228776 -173882 -141908 -166094 -109866 -268169 -309385 -269081 -334008 -267168
11656 -267168 -410972 -436025 -167455 -281070 -250920 -245937 -309763 -144887 -179549 -449012 -300274
11645 -300274 -231317 -308851 -266746 -130056 -194654 -237585 -295048 -334670 -105647 -485992 -273386
11634 -273386 29181 -265332 -372099 -192174 -315176 -151666 -289304 -214462 -195265 -403836
11624 -403836 -269497 -200725 -275355 -214783 -194332 -216818 -486098 -164084 -283250 -359747 -130056
11613 -130056 -396426 -177825 -243683 -223601 -84883 -393810 -179709 -196092 -322541 -202264
11603 -202264 -156162 -86072 -330157 -394851 -192313 -268401 -65696 -172069 -250045 -170203 -285910
11592 -285910 -218929 -577487 -183961 -275559 -345048 -254115 -221605 -342163 -366328 -131298 -63356
11581 -63356 -310691 -201196 -281347 -242375 -379335 -513171 -221805 -409461 -262951 -98897
11571 -98897 -409829 -234204 -402047 -131135 -260359 -244115 -199483 -245818 -254228 -294431 -609712
11560 -609712 -295639 68232 23875 -53735 -272645 -378817 -321855 -241401 -335012 -135568
11550 -135568 -113927 -192420 -296022 -337432 -389510 -294912 -190305 -9637 -296505 -364821 -203058
11539 -203058 -124933 -282873 -252545 -219018 -57249 -214140 -194544 -195320 -390480 -476146 -348011
11528 -348011 -188885 -286354 -337574 -200207 -210438 -104267 -231803 -433243 -206460 -158448
11518 -158448 -435569 -357260 -279919 -399996 -378351 -187317 -229862 -267407 -159851 -204115 -222004
11507 -222004 -284162 -373846 -150810 -78927 -289148 -303955 -250316 -161197 -199260 -231911 -203717
11496 -203717 -317440 -242864 -258895 -526396 -330673 -272884 -222941 -181754 -22541 -288730
11486 -288730 -440084 -203492 -51627 -351501 -574166 -239348 -56346 -401400 -397585 -205489
11476 -205489 -125001 -285201 -266205 -64561 -276713 -429433 -189927 -256517 -404120 -405414
11466 -405414 -304038 -80367 -364200 -337117 -424710 -252753 -6574 -385772 -260904 -234537
11456 -234537 -401238 -446787 -243178 -21055 -206573 -174954 -266715 -385691 -222491 -396924
11446 -396924 -173098 -110326 -274262 -239349 -261588 -354923 -323501 -261030 -114076 -387151 -315691
11435 -315691 -129631 -284911 -231608 -441306 -544571 -68753 -232358 -204277 -300918 -244501
11425 -244501 -243405 -382577 -159407 -321086 -273104 -123808 -235338 -205719 -307253 -245380
11415 -245380 -134641 -115808 -58281 -344452 -268644 -373859 -582843 -406424 -343394 -66293
11405 -66293 -66081 -298101 -102893 -227038 -331129 -362717 -267367 -117054 -272598 -147780 -316386
11394 -316386 -318546 -329804 -255586 -204353 -347191 -328521 -268994 -308317 -201400 -326998 -325760
11383 -325760 -216903 -297126 -108315 -259218 -256113 -114988 -168184 -336435 -276132 -72839
11373 -72839 -264411 -377858 -250874 -380993 -325744 -146096 -173758 -197397 -167360 -186474 -324486
11362 -324486 -243343 -112613 -316954 -230858 -292141 -492567 -311026 -239852 -354123 -162120
11352 -162120 -144826 -292682 -322738 -368538 -228606 -388612 -41072 -87060 -223025 -193562
11342 -193562 -291157 -246939 -223430 -353679 -49443 -200131 -267586 -302945 -146889 -139693 -226894
11331 -226894 -276318 -158123 -213210 -283177 -492277 -36263 -495657 -532259 -21702 -189530
11321 -189530 -285546 -343067 -254854 -240240 -381258 -369795 -244036 -81298 -133502 -244874 -570506
11310 -570506 -420336 -12407 -239362 -302408 19037 -431697 -339065 -248422 -467178 -355938
11300 -355938 -299281 -43324 -158941 -378516 -367700 -257124 -101120 -290147 -255839 -196277
11290 -196277 -168375 -77114 -312257 -316021 -56664 -304065 -134214 -312580 -220847 -146531 -154596
11279 -154596 -160674 -386657 -395895 -208768 -77845 -23295 -406799 -323710 -176122 -211187 -225131
11268 -225131 -478494 -186470 79651 -445714 -389237 -312695 -240646 -198508 -390644 -27203
11258 -27203 -191476 -247541 -327508 -332539 -180801 -450940 -369685 -7376 -5611 -308250 -448388
11247 -448388 -129981 -206858 -331683 -214497 -260688 -265902 -237056 -69173 -89475 -414212 -220979
11236 -220979 -450437 -155463 -154707 -328697 -239801 -266396 -348415 -328959 -447010 -125674 -183934
11225 -183934 -413338 -41738 -222612 -344209 -36368 -242029 -329312 -492971 -156097 -52459
11215 -52459 -307268 -324507 -386211 -425522 -145819 -118745 -280814 -220813 -70501 -233209 -453239
11204 -453239 -225451 -115020 -262546 -360473 -254977 -169155 -442269 -288429 -133954 -310493
11194 -310493 -126990 -223187 -47280 -198600 -231528 -290228 -444553 -245825 -286005 -97687
11184 -97687 -326967 -241951 -179317 -383542 -288894 3241 -454668 -271342 -182855 -235078 -217338
11173 -217338 -470764 -219517 -326463 -410115 -184022 -210784 -258554 -251747 -229382 -332237 -320331
11162 -320331 -41231 -296130 -306476 -327573 -473747 -341505 -151010 -112532 -262328 -339425
11152 -339425 -177290 -297457 -348363 -300139 -258146 -319719 -369390 -303907 -384805 -313369 -194301
11141 -194301 -236851 -164845 -482079 -244553 -143900 -328221 -404080 -287267 -249025 -125644
11131 -125644 -252213 -398245 -263086 -290320 -99267 -286918 -353471 -236021 -246967 -123219
11121 -123219 -335316 -463919 -412978 -280121 -167706 -56100 -185899 -331254 -243354 -268991
11111 -268991 -271883 -362048 -354194 -148133 -375954 -309014 -290235 -257025 -319081 -266330 -171564
11100 -171564 -247644 -279146 -111043 -3802 -487522 -492282 -173864 -87563 -249289 -328209 -314725
11089 -314725 -262953 -261745 -323488 -136790 -256502 -411764 -194476 -168976 -244091 -214978 -351363
11078 -351363 -279590 -143832 -147934 -297034 -240171 -241578 -295029 -384072 -282849 -79344 -81468
11067 -81468 -304244 -301774 -399816 -497869 -144477 -197491 -347764 -64675 -248272 -106782 -240664
11056 -240664 -338121 -31835 -423916 -316265 -177108 -145114 -158300 -240514 -375999 -404047
11046 -404047 -397438 -232665 -159729 82624 -247207 -203895 -315147 -539891 -96476 -285163
11036 -285163 -118753 -116130 -208987 -180020 -578848 -310007 -14609 -296324 -234825 -77640
11026 -77640 -107623 -348677 -267155 3324 -282501 -267398 -101045 -288496 -248603 -418113
11016 -418113 -88244 -203597 -469290 -252628 -60611 -95269 -284144 -101287 -226900 -402591
11006 -402591 -336507 -229435 -76023 -96056 -416283 -32828 -162699 -157092 -160870 -171455 -95775
10995 -95775 -255716 -96723 -237762 -312638 -210066 -239385 -205435 -220918 61150 -266163
10985 -266163 -414313 -147110 -345138 -400506 -94249 -305035 -420420 -246215 -178067 -291878
10975 -291878 -323720 18047 -229740 -210799 -489312 -164963 12010 -470922 -336541 -157224
10965 -157224 -315923 -184763 -240139 -89558 -263495 -98098 -109187 -325680 -373348 -136088
10955 -136088 -239784 -331599 -148932 -278748 -290628 -58665 -270560 -243563 42119 -138850
10945 -138850 -198226 -220793 -280660 -214272 -192456 -435471 -106946 -206381 -427064 -150231 -137864
10934 -137864 -472146 -132803 -170625 122759 -91133 -161957 -234826 -325731 -264127 -237827 -113459
10923 -113459 -185998 -140449 -159245 -146119 -314923 -293198 -95465 -269422 -195366 21339 -76500
10912 -76500 -441766 -283344 -173414 -157160 -266019 -157615 -196858 -183001 -57272 -143315
10902 -143315 -289279 -340210 -239287 -82007 -209862 -207453 -230705 -175862 -259848 -302132 -167413
10891 -167413 -100372 -52131 -245570 -384233 -229720 -231111 -57296 -12677 17937 -137752 -526438
10880 -526438 29155 36869 -340473 -478610 -48267 -120901 -297632 -300994 -96096 -145960 -115740
10869 -115740 -125763 -199060 -66310 -72766 -77264 -63688 -108931 -97893 -56097 -355444 -71286
10858 -71286 -179948 -140563 -45497 49187 102028 -93475 -239527 -97236 -40056 63841 51031
10847 51031 -115152 -45923 -84812 -194452 -73896 82276 -74337 -9570 66636 -122647
10837 -122647 16625 -146198 -237682 -171133 -187661 -87365 47768 202653 -93163 -285379
10827 -285379 -149225 -25807 -43002 41727 -121841 -173732 -207670 -193099 -163822 -93178 10703
10816 10703 34237 133388 -100162 895 9482 -16383 -57190 -120066 -30367 77522 57660
10805 57660 -108561 -183690 -280885 -11809 -647 100393 129017 109563 -3912 -137109 -215028
10794 -215028 -163236 189132 167334 -113490 -129990 -177983 47946 235445 81983 70443
10784 70443 162249 -202032 -183968 100736 -125922 33685 205789 110695 -86261 -133770
10774 -133770 241138 69411 -88678 34599 58277 -214328 -74123 -10391 -65687 -140253
10764 -140253 -26320 -69449 201414 -27875 219071 166824 -37954 -86508 75617 19673
10754 19673 16132 58858 -66011 -96613 33072 -43440 12757 130899 62293 -40276 -142188
10743 -142188 -93413 34190 151511 129255 -167166 55598 299167 250327 93829 -46158
10733 -46158 183522 292596 475111 263697 241504 411860 331856 542577 575578 394454
10723 394454 522880 718546 392232 166974 44235 271654 216002 79274 2475 -119656
10713 -119656 -171989 -10663 -51204 -179876 -474009 -154680 -119829 -208552 -222998 -317614 -240057
10702 -240057 -154829 -143044 -284417 -348048 -61895 -197886 -430705 -243490 -60073 -191116
10692 -191116 -383712 -123079 -370790 -373180 -65704 -242706 -176117 -412512 -390869 -63643
10682 -63643 -119091 -146416 -170447 -320531 -141819 -123903 -358354 -408863 -152899 -213799 -266378
10671 -266378 -167055 -218174 -115380 -262070 -170153 -257701 -148183 -288342 -158032 -188449
10661 -188449 -158933 -212943 -386157 -241707 -203985 -259918 -200945 -327855 -104138 37732
10651 37732 -395398 -463603 -392045 -131875 -190091 -193247 -203997 -233038 -346248 -86763 -132088
10640 -132088 -101886 -16805 -165624 -418985 -212805 -208699 -223173 -272661 -360949 -410168 -346649
10629 -346649 -217188 -76279 -195722 -242152 -196438 -73143 -314033 -392440 -283318 -278596
10619 -278596 -422258 -287444 -200009 -345857 -471747 -403188 -237680 -382181 -456920 -357612
10609 -357612 -387862 -240165 -372436 -221455 -303321 -279404 -233695 -267909 -310381 -317157 -325776
10598 -325776 -348513 -309588 -223581 -309988 -104705 -47015 -510076 -360744 -196898 -60378
10588 -60378 -11423 -314061 -115249 -130769 -135264 -203016 -106861 -180764 -291881 42306 -231805
10577 -231805 -151535 -260820 -289816 -118378 -353678 -418523 -57466 10817 -55368 -251119
10567 -251119 -368659 -375979 -395719 -19016 -119966 -231037 -186063 13239 -169730 -352916
10557 -352916 -200734 -178337 -354962 -167147 -198335 -313665 -274241 -180114 -277440 -397176
10547 -397176 -254376 108486 -406774 -138968 -263199 -202247 -150841 -257673 -368231 -335672
10537 -335672 -35465 -192875 -264615 -213560 -314182 -184315 -25913 -79570 -169026 -298145
10527 -298145 -284130 -204152 -232001 -370619 -207308 -281080 -215560 -254180 -176392 -268326 -158270
10516 -158270 -180984 -195222 -261698 -263925 -188533 -201563 -152822 -160467 -239111 -321849 -133931 -320543
10504 -320543 -161059 -49484 -363278 -352648 -181757 -234662 -309531 -161454 -224625 -265460
10494 -265460 -150600 -333178 -112962 -273707 -347168 -154729 -253873 -246748 -257230 -209494 -81649
10483 -81649 -297365 -379186 -141047 -76332 11572 -147931 -63837 -213497 -194847 -180907 -293534
10472 -293534 -207130 -108093 36685 -173327 -430906 -130381 -226467 -252785 18025 -325219
10462 -325219 -153036 -207390 -308081 -245917 -475201 -531441 -376667 -261730 -177520 -406170
10452 -406170 -129123 -184790 -133541 -143856 -251196 -127496 -188510 -208847 -132026 -316391 -336005
10441 -336005 -325066 -232777 54319 -182241 -75092 -206646 -200963 -296369 -539681 -143198
10431 -143198 -240131 -181162 -281717 -520800 -133600 -138708 -228909 -237368 -318713 -333905 -225742
10420 -225742 -171290 -326865 -338110 -335256 -181052 -265803 -312546 -274588 -269597 -87789 -167743
10409 -167743 -240031 -408786 -220048 -265748 -242526 -346219 -392921 -67174 -89226 -394204
10399 -394204 -169973 -240397 -311432 -302390 -111006 -276685 -240246 -170115 -249588 -89397 -289695
10388 -289695 -359302 86384 -128874 -169365 -301726 -147008 -178766 -312440 -378793 -73035
10378 -73035 -140049 -257285 -350153 -161441 -152102 -355887 -163716 -231131 -292264 -351861 -143201
10367 -143201 -195706 -228962 -93274 -200716 -250760 -186849 -346615 -68982 -32436 -347720
10357 -347720 -434113 -240820 -47901 -304285 -350811 -143867 -228679 -274847 -305478 -205350
10347 -205350 -231816 -385079 -238538 -204559 -47755 105643 -179430 -144140 -236600 -297577
10337 -297577 -411676 -170697 -162393 -220542 -197563 -50513 -220015 -280044 -298553 -62603 -137441
10326 -137441 -161407 -221996 -326673 -319546 -271071 -219965 -285237 -173659 -124379 -225209 -75629
10315 -75629 -202452 -299854 -297129 -255190 -207504 -151763 -229956 -264203 -113492 -332954 -265397
10304 -265397 -155302 -133205 -49412 -308164 -42871 -289385 -402628 -229393 -275508 -161664
10294 -161664 -175545 -147362 25613 -400152 -338181 -289216 -79172 -115149 -225151 -21355
10284 -21355 -333743 -405148 -278784 -237502 -79911 104877 -35600 -489586 -372904 -142561
10274 -142561 -340955 -226215 -130605 -245404 -368989 -387529 -167029 -136570 -311377 -440956
10264 -440956 -184075 -10668 -149279 -99786 -241840 -327192 -63389 -196661 -151554 74427
10254 74427 -161568 -445989 -424609 -248114 -135922 -57682 -88240 -323296 -367456 -333550 -426565
10243 -426565 -63187 -225663 -431446 -219455 -186717 -295917 -383264 -170574 -81358 -332201
10233 -332201 -77314 -144286 -285877 -508101 -352918 -158500 -230725 -203523 -58212 -54484
10223 -54484 -214762 -282753 -359664 -396657 -309323 -41747 -193435 -331044 -344753 -141671 -336396
10212 -336396 -182779 -89600 -353311 -277416 -231015 -36898 -534807 -267557 -137185 -8130
10202 -8130 -274460 -316374 -170452 -223410 -370518 -143361 -226361 -256931 -281498 -264086 -254017
10191 -254017 -361746 -400861 -218497 -29805 -85194 -202498 -267261 -220630 -332226 -411984
10181 -411984 -335404 -127139 -224967 -322791 -109236 -307071 -282777 -183123 62538 -99856
10171 -99856 -477971 -319150 -56816 -127039 -442871 -311558 -152867 -256335 -229098 -156155
10161 -156155 -188601 -274145 -450575 -287174 -270072 -268897 -86637 -128135 -252349 -346977 -224826
10150 -224826 -276468 -153994 -182355 -422798 -215958 -112819 -162727 -191149 -130429 -18814
10140 -18814 -382312 -189334 19571 -121386 -254740 -234174 -233039 -266392 -299144 -154829 -260747
10129 -260747 -298843 -162885 -201744 -376265 -310560 -169830 -196811 -96218 -78837 -292018
10119 -292018 -153788 -9856 -190795 -400606 -111632 -85237 -138884 -256791 -159081 -256797
10109 -256797 -399412 -189142 -57900 -255719 -293777 -136390 -119214 -313036 -366598 -319407
10099 -319407 -277614 -132286 -279097 -258843 -316304 -242845 -409975 -251998 -228601 -53380
10089 -53380 -116369 -132453 -356491 -278889 -316928 -215676 -151037 -214435 -199549 -112439 -288588
10078 -288588 -74625 -324788 -261473 -279760 -163486 -43382 -211819 -228752 -23962 -425349
10068 -425349 -335585 -114028 -117597 -199075 -264892 -142894 -381162 -319003 -390898 -193475 -126320
10057 -126320 -134254 -76207 -142592 -204077 -325635 -372022 -96754 -196109 -188015 -75545 -428114
10046 -428114 -178520 -238036 -166431 -99218 -158136 -264645 -493514 -287440 -164865 -143655
10036 -143655 -157123 -364885 -102351 -107026 -291317 -262406 -28776 -14961 -343961 -281411 -194110
10025 -194110 -165337 -329261 -361108 -88733 -91204 -313397 -218490 -213345 -279306 -230661 -301846
10014 -301846 -33635 -152933 -275081 -83712 -162855 -372376 -246467 -78943 -58054 -389108
10004 -389108 -286432 -339385 -273465 -275066 -232196 -205244 -216212 -119570 -69414 -189118 -283754
9993 -283754 -346979 -87250 15635 -207318 -333534 -301837 -85012 -262228 -320000 -63162
9983 -63162 -155496 -57796 -357558 -325946 -228368 -100123 -209909 -360673 -339013 86978 -149785
9972 -149785 -261535 -211504 -328483 -431767 -95453 -52712 -248719 -327585 -85523 -124533
9962 -124533 -380401 6343 -252418 -259557 -225561 -245327 -242114 -420604 -222984 -142124 -334588
9951 -334588 -117902 -85547 8846 -297408 -96044 -138950 -242725 -81855 -118300 -292299
9941 -292299 -284714 -299149 -262548 -104067 33799 -218161 -249255 -315145 -300574 -245992 -37707
9930 -37707 -162813 -211569 -205765 -251395 -170366 -310513 -141644 -131460 -393500 -326628 -243764
9919 -243764 27373 -162532 -201670 -394101 -186665 -162590 -118961 -138437 -175371 -494221 -219317
9908 -219317 -93801 -17245 -228189 -274907 -26885 -243730 -262928 -60262 -128815 -258810
9898 -258810 -116916 -108356 -312404 -306212 -82704 -175050 -423738 -185203 -34614 -11334 -236692
9887 -236692 -347687 -174489 69176 -235516 -268248 -268298 -230939 -292269 -195110 -108787 21590
9876 21590 -337478 -237691 -103346 -273274 -278711 -85078 -113690 -186498 -367905 -1005 18995
9865 18995 -200292 -239846 -114791 -294343 -57292 18548 -52847 -214636 15757 -136144
9855 -136144 -138055 5420 -117788 -104695 -354189 -226610 -156044 -318725 -291048 -188235 -176456
9844 -176456 -148985 -193745 -90981 -222575 -159256 -7341 -305214 -182510 -167358 -97717 -231167
9833 -231167 -280260 -130861 -363614 -261779 -168598 -332066 -425045 -137167 -170031 -185116 -452673
9822 -452673 -309048 87066 -241122 -252128 -205846 -42956 -318374 -100700 -162304 -120616
9812 -120616 -72927 -310961 -329808 -110540 -309990 -196852 -221912 -87801 -193690 -374422
9802 -374422 -185387 -105295 -34765 -151502 -310208 -222053 -215684 -209804 -284933 -55359 17842
9791 17842 -363189 -301076 -66504 -211063 -163042 -243612 -171318 -93856 -261951 -162505 -248209
9780 -248209 -262322 -194887 -222832 -74534 -137558 -126468 -313316 -211453 -224874 -111040 -115537
9769 -115537 -359881 -373820 -217339 -187503 -244266 -121353 -219593 -187223 -222337 -157089 -34923
9758 -34923 -168012 -334126 -284108 -176685 -346688 -77219 -156095 -298650 -2527 -306035
9748 -306035 -318236 -133708 24356 -61820 -391426 -232099 -97305 -55116 -324809 -329071 -362996
9737 -362996 -251323 -28434 31465 -103027 34416 -80448 -501276 -171792 551 -172372
9727 -172372 -203352 -371212 -151692 -152049 -184756 -28197 -178652 -275765 -117268 -148908 -175212
9716 -175212 -85947 -209929 -402681 -192979 -156913 -290747 -40102 -20032 -121348 -185568
9706 -185568 -273398 -57257 -35466 -178530 -81292 -224778 -60284 -97230 -334126 -225079
9696 -225079 -90236 -125177 49205 -174665 -425490 -319898 -59157 -130645 -187418 -193657 -68634
9685 -68634 -95503 -393309 -129985 152118 -124740 -349981 -62509 3587 -229046 -199388
9675 -199388 -78685 -58627 -298704 -412404 -193374 -31955 -195402 -188932 -162072 -304194
9665 -304194 -7748 -74516 -128837 -127218 -536537 -235532 -151161 -280373 -149371 -56061 -248773
9654 -248773 -84647 -40715 -205834 -159964 -262871 -261913 -166089 -290825 -191788 -75875 -271745
9643 -271745 -334032 -189300 -328164 -63853 -95535 -64760 -282289 -200501 27203 -149855
9633 -149855 -374461 -34551 -79115 -99398 -159660 -156322 -314670 -160039 -9987 -213964 -10242
9622 -10242 -202168 -233705 -163273 -111883 -197244 -312239 -180284 -55959 -226154 -234563 -75771
9611 -75771 76712 -200901 -342208 -103936 -193690 -55321 -46266 -210101 -31339 -424964
9601 -424964 -70048 -72956 -124932 81088 -104594 -212717 -209751 -302415 -275565 -104933 -83564
9590 -83564 -138110 -81871 -143641 -275789 -199403 -118855 -195777 -281136 -74541 -164483 -395209
9579 -395209 -268344 -160807 -123756 -250660 -242639 -225934 -95879 -172316 -13951 -344401 -78900
9568 -78900 11690 -260776 -279539 -62445 -141385 -144427 -234391 -165848 -468250 -126131 104836
9557 104836 33646 -282950 -198791 -39120 -322773 -226929 -106220 -156681 -114764 21909 -262681
9546 -262681 -282606 -229878 -247921 -45047 -81127 -126330 -151673 -70957 -5448 -398298 -201948
9535 -201948 -140568 -122405 -125333 -260877 -119852 -141873 -292087 -140485 -86766 -247689 -235548
9524 -235548 -43294 53356 -125287 -275913 -276940 -158543 -109383 -359345 -119490 -119004 -297670
9513 -297670 -75993 -221083 -191500 -392502 -189291 28985 -191015 -263931 -23706 -195001
9503 -195001 -223446 -88700 6167 -253048 -53924 -65590 -113989 -97904 -175703 -168460 -129093
9492 -129093 -218496 80751 -11163 -195763 106014 -18135 -377944 -204502 191141 9247
9482 9247 -170327 -199560 -93967 -244722 -135286 -95689 -355991 -292082 -11266 -154801 -251
9471 -251 12371 -134826 -339327 33031 86097 -149291 -153108 -62974 -178479 -369808 -400154
9460 -400154 -56655 13835 -160649 52124 -44889 -491023 -138478 -32694 -271395 -304772
9450 -304772 -221376 -47329 -107868 -60920 -116651 -106092 -229768 -59511 -13445 -174069 -281990
9439 -281990 -161120 7675 -133508 -287971 -324765 39886 -32986 -149244 -27921 -230997
9429 -230997 -124607 -148700 -114482 -306069 -313002 -75253 -95571 -172416 -236884 -222143 58756
9418 58756 21314 -218427 -90069 -179622 -217087 -294673 -253735 -238607 -63104 -228195 -236456
9407 -236456 37296 -19257 -285745 -11108 -18059 -126680 -274689 7716 -282087 -209612
9397 -209612 3320 -227351 -105100 -103227 99459 -146097 7016 -76659 -99652 -76107 -204368
9386 -204368 -110375 -148247 -270952 -113538 55720 41152 -71917 -156997 -146522 -16566 -179108
9375 -179108 -83756 -32451 -144378 -118102 -249528 -326888 -86768 161755 127792 -222639 -84018
9364 -84018 -81150 -58056 -254214 29589 147102 -214007 -98359 53672 -170496 -194503 -87423
9353 -87423 -198751 -154855 83735 -2503 -228147 -90853 -15877 -281041 -47486 11372 -172231
9342 -172231 -127280 -104915 -105915 -110651 -105403 69833 -96682 -144341 -18477 -99627 -312145
9331 -312145 -94942 -27864 -162182 -113198 88661 62503 -66143 6841 -25709 -157026 -36135
9320 -36135 -114415 -137252 -98648 191888 -53523 -189620 71226 -88534 83295 44285 3777
9309 3777 37558 -117477 -105916 -79208 206616 -14307 -121028 -9220 195398 9222 78146
9298 78146 114791 70135 -40840 8852 133720 -110410 -55588 10380 -47453 -91092 -86730
9287 -86730 113311 95835 49540 66182 158840 12125 62503 142448 -11180 -120104 278459
9276 278459 114579 182516 49248 -70836 136233 16256 165194 -24081 132440 39673
9266 39673 -157821 118026 112511 88060 327855 253930 227804 -25091 250358 214863 134743
9255 134743 12918 133703 221669 271697 463829 119100 49586 199979 96320 157595
9245 157595 391402 187779 25001 239208 108458 149278 254302 399477 269732 195327
9235 195327 331238 371545 43361 118596 349613 209718 223226 421844 637423 294038
9225 294038 237960 377851 226839 248453 552872 458734 356068 242527 385420 610147
9215 610147 309622 295279 377526 430542 467059 374121 614667 654618 533620 613424 564914
9204 564914 680077 688918 732580 653547 495942 620997 515810 688510 517415 621318
9194 621318 763087 752090 840929 810876 558213 755378 738852 688017 678673 892369 793337
9183 793337 719309 879328 787185 969538 927717 951567 1019537 964768 969560 1036804 905910
9172 905910 870331 1042637 1213732 1117675 1094609 1095766 986875 955168 1027715 1107496 847407
9161 847407 947202 1196104 892860 892352 1098685 1271839 1018819 1053425 1283681 1343884 1134202
9150 1134202 1134196 1177272 1100509 981899 1358696 1350714 1182141 1354503 1174452 1311741 1276729
9139 1276729 1146925 1274556 1279309 1466152 1308445 1058168 1309874 1493791 1494226 1503421 1581927
9128 1581927 1429638 1240545 1623950 1461282 1377530 1446094 1423109 1551399 1480375 1659994
9118 1659994 1546829 1565257 1881853 1838278 1850761 1750047 2116903 2186649 2078806 2012686
9108 2012686 2076791 2278633 2498494 2476564 2515189 2460075 2584717 2743727 2769432 2732173 2686554
9097 2686554 3022109 3020783 3268583 3225654 3290214 3769672 3774646 4052872 4609568 4590660 5039375
9086 5039375 5478814 5849270 6448756 7417770 8314686 8382559 7417948 6429584 5520934 5020364
9076 5020364 4476557 3826422 3004324 2899171 2713211 1911894 1223701 1026902 526602 137256
9066 137256 226965 57966 116865 -252701 -102488 25338 -210632 42675 80158 -66859
9056 -66859 -191595 -316036 -189099 -66658 -157217 -128767 -5600 -150753 -250058 -141
9046 -141 96963 -127917 -287163 -311742 24039 46611 -358622 -172740 -199853 -175161 -55112
9035 -55112 -31848 -83826 -68758 -56620 -12736 -148606 -323721 -215415 -120733 -133476 -113083
9024 -113083 91543 -159583 -180542 -97046 -188965 -248045 -147467 69790 -22053 -301712 -271647
9013 -271647 -66823 -53731 -152401 -269172 -174169 -31170 -11122 -22647 -1933 -257632 -394879
9002 -394879 14983 111335 7598 -147229 13651 -61768 -284473 -108585 18306 -106485
8992 -106485 -375993 -56623 -126624 -202611 152945 46458 -449670 -155211 -61426 -36123
8982 -36123 -61347 -318980 -289314 -332947 -124547 104736 85721 -368533 -262706 -49893 128846
8971 128846 103290 92596 -128433 -320229 -238558 -201209 236655 1889 -322204 -256079 -67440
8960 -67440 -171084 -291743 -36074 164452 -159104 -347608 -59372 -156553 -13934 -290614
8950 -290614 -239175 -155978 -28156 14746 42532 -191798 -204940 -204493 -81119 39998 4952
8939 4952 -123362 -200680 -189149 -489401 -231515 -6901 -97775 -93815 -256035 -166706 -151003
8928 -151003 -203543 -117331 -150828 -111847 -53408 -102949 9806 -203826 -203192 -275749 -210537 -75810
8916 -75810 -208254 -82946 -232453 -212060 -262444 -291876 25019 66147 -275323 -32483 -56412
8905 -56412 -289533 -315713 -138128 442 -137090 -69917 -44292 -259586 -340370 -7406 247629
8894 247629 -175390 -160493 -20682 -166782 -228306 -360478 -314342 -128627 -228646 -119810
8884 -119810 -146337 -173263 -134232 103396 33736 -227841 -191902 17975 -50697 -97701 -294094
8873 -294094 -113855 -184746 -197794 -198366 -143628 11405 138160 -90381 -133889 -192008 -134105
8862 -134105 -102293 -62138 -329498 -372551 -257541 -222527 -80701 -133635 -49172 26735 -198604
8851 -198604 -183493 -70459 -284720 -147804 -27002 -252618 -257731 -22325 -136312 -162823
8841 -162823 -44231 -9726 -182290 -349763 -91069 -87079 -349833 -194496 -99949 -322343
8831 -322343 -266143 -71343 -64299 61184 -18295 28672 -218553 -187084 -304165 -28987 -152942
8820 -152942 -175262 -269776 -228431 -96636 -48196 -86986 -3552 170817 -267720 -257818 80878
8809 80878 -221930 -284873 -119478 46533 -115397 -356128 13261 21431 -133100 -230913 -293351
8798 -293351 82019 14945 -142326 -179271 -177185 -332043 -273281 -90225 -53087 -214881 -103702
8787 -103702 -112320 -283193 124712 -92526 100552 -54554 30447 -118498 -260758 -235607
8777 -235607 -64398 -186207 -248383 -39995 91132 -68810 74175 -13340 -156577 -203147
8767 -203147 -227451 -187315 -164992 -117631 21414 -231497 -122401 -77294 -104894 -187401 68159
8756 68159 -20506 -177394 -166355 -230644 -137492 53232 -88332 -5880 -85242 -114784 -162602
8745 -162602 -59666 76525 -74452 -220353 10741 -118182 -332643 65953 188882 -237362
8735 -237362 -182475 -177585 -76350 -78293 -143932 -144787 -161006 -103164 -119163 -160400 -125593 -91105
8723 -91105 -31850 -85435 187051 37740 -223407 -9409 -60578 -261937 -255490 -191004 -105662
8712 -105662 -187126 35660 120415 -191214 -9139 12941 -74610 -151770 183275 -122456 -332370
8701 -332370 -84087 -185873 -145753 -229658 -82276 1611 -96130 -192264 -28792 -157826 -38400
8690 -38400 -82729 -189230 -78904 -41972 -88868 -103412 -356147 -231080 -137915 67477 -117218
8679 -117218 -126322 54520 -80699 -229020 -125746 154148 -28543 -166496 -84474 119252
8669 119252 -164062 -326815 141239 18374 -96021 -94917 143730 -11928 -194710 -154539
8659 -154539 -69888 -138306 -113227 -12526 -48802 -24171 -156653 -195096 41991 -204615 8624
8648 8624 -43318 -38237 -253927 -275463 84545 80207 -160596 -51688 40857 35739 -201065 -192901
8636 -192901 32415 -128887 -136908 -166891 -128930 36265 56153 -96311 -17198 -20375 39748
8625 39748 -109766 -81315 -43371 -314796 -293506 -213406 -42166 -15490 -108855 -7321 -50372
8614 -50372 15211 -26781 -182938 -54154 -131425 -245399 -131278 -187619 -83401 -16970 39268
8603 39268 -83026 -139273 -62087 -216462 -106075 -214700 -168075 37791 -3163 5368 -129265
8592 -129265 -149377 -53480 -19508 -53538 -340815 -59460 -16885 -71125 -104440 -1549 -101897
8581 -101897 -257532 -44038 27400 -92012 39953 -9918 -120835 -191548 -153797 -179151 -75643
8570 -75643 17249 -61869 -135618 -51281 -42014 -43146 -40976 -119753 -54510 -98264 99271 -112882
8558 -112882 -206955 20515 20186 -204937 -280808 198460 158247 -189816 -171216 -104722 -149690
8547 -149690 -98607 49234 138109 -245513 -181091 -162789 -27268 -141629 -246710 -2746
8537 -2746 -201089 -296911 -744482 399308 63305 -180078 222898 136236 -236608 -7205
8527 -7205 11600 -148682 -105181 37340 147091 -60209 -12337 23627 65949 -176780 -86838
8516 -86838 8134 -267248 -27557 -13944 -48406 49601 -13642 -21180 -49512 61226 196250
8505 196250 -187801 -31279 -77748 -108888 -184855 31393 101800 -296203 -58725 172091
8495 172091 -273435 -146941 -1212 -54205 -127881 -133507 -53987 -69248 16195 55140 114318
8484 114318 -79402 -73714 142954 -262422 -287390 -25518 -235933 -155814 -2145 51897 30597
8473 30597 -65108 128305 163923 -130278 -98727 -15504 12965 -244347 -154238 -153212 -80835
8462 -80835 -109899 -309428 210359 246695 -63043 -26881 38164 -148610 -27416 155828 -121768
8451 -121768 -170129 -14688 -45892 -121310 -295732 14573 -40826 -193882 204473 108386 -117280
8440 -117280 -14272 86230 -90838 -193605 125443 48598 -54948 7451 24520 -66186
8430 -66186 -203780 399308 162167 -286697 157203 146907 -81761 -6643 -50427 -249035
8420 -249035 -200932 150670 -195793 -78150 -43882 -2297 -86422 -94850 -13814 101826 -83344
8409 -83344 -94387 -348904 -140511 56650 -69928 -136274 -124121 68615 24852 35836 47642
8398 47642 110748 -45542 -92541 -118663 -23781 -101370 -127689 -20645 31397 117912 -241593
8387 -241593 -24126 184627 -129452 -143327 -14722 25432 -211646 94023 236470 4759
8377 4759 -52162 -79246 130267 110171 -55880 -137019 -170613 -135570 54444 -63602 103534
8366 103534 61704 233023 -68500 32883 -13244 -9911 191664 -58497 -236183 -173889 3670
8355 3670 97036 126429 -113603 -9695 -64106 223428 10778 -62168 211181 162463 -15569
8344 -15569 -182840 106595 -12655 -197770 191339 28221 -121241 23766 82562 79102
8334 79102 69273 44309 -161093 -40412 110872 85992 -81383 93092 172585 11038 -165536
8323 -165536 74897 160883 55334 138563 24911 -61407 51922 218434 152417 81577 120131
8312 120131 16024 7429 96154 56769 -60721 -43483 317513 241746 -223019 -146536 39607
8301 39607 -3216 40265 102405 43872 154659 36927 12296 -66263 -233708 33032 247878
8290 247878 -74386 -83512 -12873 32659 20632 185521 -25338 181421 146317 152347 193250
8279 193250 -19459 159653 100576 -213757 -222542 56473 41842 151169 121067 51716 -36938
8268 -36938 -3766 199336 246294 173187 -134478 -183031 1158 -2830 133279 12033 -34280
8257 -34280 253134 121932 52642 159465 128483 103341 -32884 16601 -85568 18799 -52471
8246 -52471 200458 -19780 -12232 -18083 288097 226937 168910 -16415 77113 108879 -9246
8235 -9246 57258 55774 -65524 239961 158339 7249 5728 21144 173340 165829 96111 35052
8223 35052 377261 268650 -727 59353 -39185 181606 307994 68034 44202 102655 28630
8212 28630 -7950 102778 133802 76145 99830 319461 143407 -108943 -11280 337142 19770
8201 19770 19740 86925 100657 132013 83612 302793 76153 -74953 483143 1936739 -49722
8190 -49722 137267 272168 91444 -77352 280467 187955 -13850 221575 183032 47665
8180 47665 27317 228981 230384 235205 238821 204405 160133 143420 260003 95232 109860 263419
8168 263419 294705 145326 201936 34950 175628 239829 228633 254492 38105 287128 418081
8157 418081 258606 68362 158644 180325 190729 288471 44586 100628 389084 234692 338099
8146 338099 294812 211328 261612 225512 175317 277051 302547 225351 193843 327159 385198
8135 385198 235288 71910 312065 266514 76633 248513 325389 362958 168526 65893
8125 65893 316709 351789 212873 319112 250090 171650 75568 396835 226653 152477 425622
8114 425622 81722 368378 548690 243402 257713 101306 225711 340274 208722 390892
8104 390892 240908 175710 118701 380456 305583 186668 364084 472178 170035 139735
8094 139735 283643 415720 309098 6010 367362 249427 573467 494169 321286 265152
8084 265152 242150 466712 469060 594180 123756 420924 519951 322948 456103 330710
8074 330710 246847 376822 443696 464124 266774 401952 457973 480573 233673 537282 524326
8063 524326 576257 508024 393170 254851 369675 495388 478894 514237 382842 356051 535821
8052 535821 631727 600173 546630 578057 713960 503301 505481 703021 350708 401883 599569
8041 599569 598801 568005 534256 819530 387346 152469 557944 923898 461220 446613 749631
8030 749631 520330 546334 512930 564848 673654 362757 469789 553346 694484 646214 560890
8019 560890 560204 705483 685064 545962 798510 842858 456228 437518 640337 684925 383555
8008 383555 602685 674279 534858 794310 798209 709800 624092 713477 588565 546975 703935
7997 703935 508491 441046 781887 630332 417382 645052 993749 697869 821965 677768
7987 677768 772661 781927 640143 692773 640522 612267 743461 693211 812303 901484 823985
7976 823985 847722 887482 850333 697521 628793 828389 914194 877638 824740 709220 700104
7965 700104 815669 1106786 813623 795036 1153312 1040303 722982 931415 898026 992640
7955 992640 1050321 924510 1109333 1017896 821958 1148085 981614 828783 1130709 1322307
7945 1322307 1177485 1135378 942423 860722 902430 1169688 1166969 1142584 895574 1234939 1093884
7934 1093884 805716 969544 1229778 1172042 1111077 1138104 1136139 1367195 1140975 1097100 1107434
7923 1107434 1102961 1212720 1392078 1266753 1262458 1212768 1236979 1216067 1253165 1204979 1483877
7912 1483877 1419186 1059381 1360477 1293831 1396255 1368299 1454513 1424359 1374219 1407640 1572435
7901 1572435 1371860 1261557 1430624 1431098 1437033 1535483 1645835 1408619 1436681 1406545 1699574
7890 1699574 1624168 1411383 1495710 1735092 1544351 1473443 1713428 1711690 1660621 1562205 1707455
7879 1707455 1855032 1514084 1612221 1935908 1768589 1715429 1735397 1899470 1906217 1868437 1627361
7868 1627361 1888967 2133616 2000139 1689567 1862935 2145475 2139196 1947664 1979087 2358765
7858 2358765 2168625 2181502 2147872 2210307 2185331 2233918 2232829 2499388 2844699 2244739 2052191
7847 2052191 2137203 2317400 2301131 2485303 2692620 2642023 2372544 2319789 2613388 2624759
7837 2624759 2767517 2885412 2855854 2773034 2784934 2817538 3052862 3082145 2985050 3036164 3162403
7826 3162403 3107621 2998672 3088420 3171053 3134800 3071107 3293839 3285729 3239064 3323654 3436275
7815 3436275 3459324 3518424 3560460 3510565 3574443 3662392 3604184 3572497 3721687 4124925 3687446
7804 3687446 3718286 4186943 4158157 4146320 4104120 4340252 4428395 4229310 4269016 4369564 4443702
7793 4443702 4433629 4570770 4572976 4372276 4714327 4984035 4793411 4851621 4936331 5097515
7783 5097515 4972573 5102250 5199760 5157114 5071224 5297544 5438672 5509223 5594079 5690997 5562991
7772 5562991 5852908 5846445 5839959 5946423 6028785 6247277 6203021 6215231 6471801 6469797 6349823
7761 6349823 6642873 6910564 6856590 6963601 7095628 6995034 6993207 7252155 7247091 7399616
7751 7399616 7315717 7393467 7389834 7473249 7641772 7607360 7848381 7817734 7794502 8000932 8012661
7740 8012661 8040178 8546431 8497424 8490003 8497286 8928781 9029130 9028781 9299086 9412338 9338273
7729 9338273 9447485 9737793 9840801 9654830 9937369 10075479 10129387 10168868 10470660 10385194
7719 10385194 10714474 10827672 10924170 11055418 11457526 11546803 11580561 11994137 12443917 12452017
7709 12452017 12653693 13063308 13150152 13254467 13640717 14085334 14441868 14858275 15074153 15612750
7699 15612750 16170964 16402694 16553259 16955107 17139769 17013618 16780567 16704382 16583245 16080790
7689 16080790 16043838 15929607 15669008 15470200 15278424 14861234 14303577 13778390 13667285 13189633
7679 13189633 13120312 13068813 12939161 12879873 12838524 12776808 12511930 12252151 12411669 12045562
7669 12045562 12287400 12478635 12339886 12301562 12494712 12101873 12258969 12818599 12631728 12695344
7659 12695344 12886829 12828544 12916211 12954909 13321957 13606077 13645218 14073568 14035150 14008222
7649 14008222 14378577 14703050 14773305 14967694 15048969 15140681 15303767 15738732 15748761 15858207
7639 15858207 16070923 16313505 16290702 16222909 16417621 16505255 16295543 16439199 16650329 16194742
7629 16194742 16448229 16753776 16672415 16765815 16904993 17287640 17317809 17506413 17904988 18273278
7619 18273278 18169141 18300197 18380744 18320047 18847421 18728453 18814760 19091751 19284339 19588315
7609 19588315 19760474 19932465 20309366 20494165 20775085 20924737 21450266 21661165 21776364
7600 21776364 22297198 22715288 22922558 23181899 23878133 24261714 24021374 24595824 24977628
7591 24977628 24962090 25208176 25615991 25926587 26158733 26343289 26609836 26721434 26758893 26801001
7581 26801001 26941048 26992686 26984236 27087503 26773761 27085814 27202218 27020686 27332270 27575631
7571 27575631 27605580 27917286 28283585 28641298 28971897 29394486 29825279 30436551 30797563 31097132
7561 31097132 31902161 32544159 32927710 33361132 34061105 34534113 34803598 34783797 35213043 35460704
7551 35460704 35682909 36028416 36482708 36681147 37133253 37685993 38046861 38438078 38905790
7542 38905790 39572018 40268693 40495800 41248140 41804017 42258062 42990181 43531086 43998640
7533 43998640 44635290 45311310 46077844 46962239 47447380 48168766 49070442 49544702 50301348
7524 50301348 51451520 52139052 53090213 53564690 54374410 55216196 56074797 56691338 57564692
7515 57564692 58690945 59486158 60570397 61745330 62879883 63860390 64609733 65815093 66607770
7506 66607770 67189580 68538831 69321575 70218568 71318475 72788931 73955373 75068041 76379763
7497 76379763 77521818 78443710 78967177 79604013 80053408 80376282 81322283 81999417 82492289
7488 82492289 83392519 83960653 84685750 85473521 86247007 87174572 88218599 89120213 89409721
7479 89409721 89412972 89540380 89916244 89905667 89863676 90122626 90387905 90797145 91127464 91728337
7469 91728337 92142241 92970895 93838733 94991513 96262871 97489332 98176245 98150769 97988685
7460 97988685 98041842 98592392 99185302 100096500 101134617 101919314 102611048 103318165 103912364
7451 103912364 104056185 104852133 105732530 107003872 108419338 109986134 111525804 112993373
7443 112993373 114483009 116089868 117547230 118407203 119297456 120124153 121074972 121877244 123171844
7434 123171844 124664154 126373716 128332402 130422172 132818602 135598392 138499331 141678324
7426 141678324 144742157 148118472 151568644 155566974 159827169 164011572 168650476 173459566
7418 173459566 178756567 184400374 189618047 194357537 198819021 203754460 208790433 213892153
7410 213892153 219539313 225745846 232552730 239549708 247947594 258062150 269823014 282814791
7402 282814791 295798291 309776422 325480280 343069083 363028442 385276548 409292843
7395 409292843 434616171 460111436 481114685 487172813 471516977 440304637 402956040
7388 402956040 365098157 329198129 296952523 266662734 237028334 207006745 176440957
7381 176440957 146898322 119371138 95907507 77263945 62627013 51290353 43278512
7374 43278512 36880613 31834500 27604081 24359811 21726642 19530800 17883048 16381676
7366 16381676 15174180 14211656 13592051 12933602 12286787 12083941 11638922 11291469 11193508
7357 11193508 10920435 10648778 10408072 10374650 10248944 10050723 10041842 10084945 10068781 9738972
7347 9738972 9872285 9517057 9484566 9507670 9323369 9173985 9078616 9096634 9207882 9150075
7337 9150075 9089392 9258829 9543259 9524424 9540147 9142614 8705343 8376038 8163582 8094933
7327 8094933 7951392 7558756 7177025 7256522 7023352 6631344 6648533 6804801 6355686 6252064
7317 6252064 6317337 6136807 6048115 6152619 6119455 5980023 5954017 5871903 6092293 6042260 5818100
7306 5818100 5890179 5900727 5864926 5675845 5691987 5688468 5764864 5518214 5395186 5701951 5503224
7295 5503224 5343291 5535250 5586291 5541000 5196962 5508459 5269528 5516152 5722976 5567333
7285 5567333 5483124 5567659 5849148 5652020 5935120 6087596 6220891 6379911 6112747 6260592
7275 6260592 6294620 6316814 6495131 6584516 6813562 6773973 6772638 6980630 7083312 7041551 6886968
7264 6886968 7392866 7399533 7025204 7129638 7312615 7478323 7299011 7296918 7515598 7312638
7254 7312638 7670144 7604524 7576902 7697550 7866906 7819457 7966770 8148926 8062454 7949085
7244 7949085 8135188 8148753 8191865 8169582 8367936 8381698 8468679 8479338 8544105 8661101 8887894
7233 8887894 8927845 8798341 9155369 9040921 9302405 9682387 9905210 9717397 9899178 10421141
7223 10421141 10290367 10560049 10668371 10870424 11002362 11112939 11384515 11465954 11648118 11967140
7213 11967140 11841364 11927147 12049365 12240320 12369049 12367463 12467411 12320270 12602388 12950880
7203 12950880 13308391 12715002 13029468 13389955 13360632 13542930 13760465 13791907 14259684 14422280
7193 14422280 14525086 14229840 14657409 14920340 15023512 15422496 15549620 15561122 15942159 16102658
7183 16102658 16363954 16443556 16461695 16586457 17140068 17292954 17290993 17790997 17922705 18003269
7173 18003269 18230257 18484144 18909836 19429604 19579044 19689733 19806920 20215499 20610447
7164 20610447 20796749 20780081 21346995 21329868 21774359 21864241 21907355 22101054 22454770 22434824
7154 22434824 23005425 23143155 23192609 23630654 23673098 23924155 24257598 24640452 25031416 25389491
7144 25389491 25734938 25948338 26653041 27005631 27206892 27725310 27850501 28225638 29013409
7135 29013409 29143027 29564288 29785808 30183773 30522788 30914390 31437549 31921981 32498368
7126 32498368 32846553 33363386 33978371 34488114 35224910 35863773 36490296 36984488 37224870
7117 37224870 38085719 38654771 38775919 38772525 38505658 38882801 38991124 38886571 38926360 39312782
7107 39312782 39480045 39480094 39839435 40256691 40647934 41097394 41311525 41888307 42382435 42837383
7097 42837383 43422040 44250832 45048072 45398093 45320587 45404986 45205616 45049376 44843866 44659990
7087 44659990 44158870 44102541 43826842 43865683 43872389 43930879 43634043 43824684 43893832 44108892
7077 44108892 44435467 44631299 44925271 44815155 44467727 44855257 44471518 43871883 43522176
7068 43522176 43444603 43143761 42739562 43054541 42919642 42678658 42654383 42727275 43044725 43352955
7058 43352955 43527752 43893403 44739300 45305052 45632980 46393012 46956779 47143095 46766533
7049 46766533 46610608 46477346 46317591 46577802 46863423 47196945 47295415 47533270 47769649 47833251
7039 47833251 48223370 48143178 48015243 48228882 48531001 48841029 49004407 49821446 50619528 51176883
7029 51176883 52048342 52848435 53562625 53982158 54152464 53674990 52974574 52880774 52882595 52238842
7019 52238842 51752277 51495059 51010468 50441158 49309474 48258885 46947142 46134830 45198299
7010 45198299 44001885 43278506 42094931 41046481 40257829 39123685 37836848 36594805
7002 36594805 35590747 34224989 32743917 31509054 30594191 29839021 28692911 28455609 27901477
6993 27901477 27510317 27365107 27129763 27059175 26973464 27115316 27040436 26960885 27566205 27797164
6983 27797164 28096732 28607502 28787495 28720975 28530236 28362406 27757336 27409550 27202291 26626577
6973 26626577 26538843 26524259 26165126 25997359 25919124 25866208 25967011 25860286 26011401 26020965
6963 26020965 25791297 25693309 25974049 26124905 26234624 26620241 26338815 25658893 24913506 24483762
6953 24483762 23841003 22991963 22236114 21256430 20558957 19800697 19129162 18607249 18121453
6944 18121453 17584395 17369287 17339569 17055807 16967769 16930944 16602358 15986050 15966237 15759924
6934 15759924 15285106 15470854 15750032 15266298 14798480 14766192 14541372 14341742 14202689 14362088
6924 14362088 14280204 13899852 13739603 13774712 13746294 13922399 14189679 14174320 14325448 14109182
6914 14109182 13511099 12963837 12695542 12373644 11854491 11885449 11515382 11231208 11066598 10663054
6904 10663054 10290134 9878619 9645441 9701924 9105315 9224962 9075304 8947768 9061444 8903261
6894 8903261 8948280 8860421 9153100 9096161 9467477 9558992 9403715 9323210 9179722 9029454
6884 9029454 8751184 8856241 8696304 8264862 8245700 8397706 8014994 7827356 7932383 8113632
6874 8113632 7732927 7822139 7851294 8104887 7830421 7689971 7989977 7983497 7933411 8235727
6864 8235727 8007426 7849953 7760786 7468588 7413332 7326803 7347081 7356331 7335502 7089597 6938396
6853 6938396 6926036 7074670 6833701 6976032 7049978 7126249 7361618 7421503 7515957 7443362 7441329
6842 7441329 7771128 8041441 8042444 8170351 8158431 8164289 8347122 8430968 8632678 8625511 8911151
6831 8911151 8952580 8776704 8983019 9486818 9358617 10011919 10186700 10347501 10626455 11178210
6821 11178210 11720984 12003536 12378569 13264039 14001253 14731209 15052921 15273560 14738004
6812 14738004 13833425 12835889 12056576 11378834 10725491 10395249 9636655 8855661 8034708
6803 8034708 7683215 7144639 6789706 6314861 6214899 6355288 5979989 5863143 6007546 5741696
6793 5741696 6004344 6028831 5863261 5988347 6064718 6074034 6007342 5890395 5986127 6075305 6035474
6782 6035474 6184752 6235000 6202312 6318005 6265521 6298223 6510238 6532792 6595320 6624191 6638498
6771 6638498 6702160 6818334 6904027 6959288 6767241 6856277 7088291 7256904 7321327 7214366
6761 7214366 7220041 7300007 7205391 7364167 7656593 7566468 7437921 7579407 7971607 7802576
6751 7802576 7896034 8232944 8082480 8135043 8238781 8353380 8362407 8560592 8743849 8534422
6741 8534422 8516874 8768684 9117645 9079930 9104303 9195891 9206445 9365758 9593717 9523439 9496857
6730 9496857 9918626 10215481 10159772 10269587 10098763 10174938 10528036 10481229 10677024 11106102
6720 11106102 11264207 11069208 11187441 11537899 11631553 11810630 12180878 12004920 11938203 12197984
6710 12197984 12442692 12357644 12594128 12781739 12770715 13057953 13400741 13519813 13471465 13721782
6700 13721782 13905407 14045938 14230125 14411709 14524717 14619573 14894118 15025690 14863164 15321864
6690 15321864 15748170 15784839 16017744 16335597 16350363 16373887 16833604 17135800 17369149 17493578
6680 17493578 17686298 18064273 17967080 18198370 18494656 18588770 19158927 19234656 19355347 19757988
6670 19757988 20012539 20127674 20116953 20526455 20637173 20794105 20886355 20827989 20839108 21379075
6660 21379075 21733634 21679175 22096244 22416434 22615565 22767313 23352563 23611510 23896406 24256755
6650 24256755 24310712 24249753 24453833 24894514 25161973 25484181 25852431 26078764 26135889 26813962
6640 26813962 26982237 26840376 27066211 27872110 27595469 27694930 28663487 28993881 29047557 29661052
6630 29661052 30113217 30324259 30575190 31153769 31459502 31870650 32385409 32806426 33234690
6621 33234690 33776039 34370227 34946908 35838236 36940496 37378588 38538879 39765082 40834095
6612 40834095 41775680 43283316 44945902 46098579 46372191 45908293 45560283 44738811 44210277
6603 44210277 44107485 43951127 43657801 43460900 43109108 43022280 42806171 42923397 43388639 44149090
6593 44149090 44668162 46102135 47893807 49287855 50928578 52913022 55146065 57809061
6585 57809061 60862699 64182827 68213799 72713926 76461878 76916572 74282884 70112235
6577 70112235 65354346 61313550 57931171 54902093 52006118 49629322 46880524 43946294
6569 43946294 40905594 38712211 36838058 35606651 35393719 35875014 36324857 36666931 37671112
6560 37671112 38758633 40101353 41707424 43677639 46203840 48978237 52432933 55218245
6552 55218245 56478262 54146824 50217314 46400599 42731117 39891502 37153017 35055796
6544 35055796 33176396 30590467 27990711 25445288 23036404 21335109 19849561 19021710
6536 19021710 18812601 18891355 18588126 18464675 18930290 19053749 19673261 20249683 20997716 21674110
6526 21674110 22619024 24132938 24935150 24187635 22856229 21619245 20144931 19087196 18399561
6517 18399561 17238083 16398351 15721292 14857792 13899712 12819605 12229827 11826099 11208239
6508 11208239 11148187 10951891 10590396 10572307 10631463 10303601 10318075 10622368 10541250 10603076
6498 10603076 10562186 10505702 10721939 10915868 11031069 10897327 10741269 10584110 10954286 10892853
6488 10892853 10748525 10859959 10957709 11164776 11079036 10936067 10928323 11123547 11189750 10908083
6478 10908083 10984627 10897648 11037593 11075324 10861294 11029496 11002905 11286554 11056816 10896599
6468 10896599 11123932 10846653 11068323 11180126 11028896 11025274 11323477 11467922 11364919 11329651
6458 11329651 11332934 11140999 11235584 11147087 10998555 10884725 10934373 10895531 10827444 10746157 10661953
6447 10661953 10463618 10328961 10424747 10203818 10094800 10168732 10028256 9893677 10013250 10211059
6437 10211059 10099092 10026463 10047967 10266927 10257501 9911446 10084322 10245336 9798285 9789154
6427 9789154 9769318 9912183 9759993 9744263 9681598 9545623 9267433 9144708 9220259 9152288
6417 9152288 8958054 8995507 8853458 8836081 8552006 8512547 8559311 8412603 8331518 8571883
6407 8571883 8553071 8365869 8373300 8327343 8458078 8442393 8315078 8423716 8225021 8470866
6397 8470866 8179750 8027364 8280883 8239476 8060082 7843286 8083174 7914315 7614191 8014566
6387 8014566 7756828 7604815 7597836 7718401 7582950 7500818 7476106 7450210 7330808 7547159
6377 7547159 7706001 7380576 7407643 7655744 7535643 7521314 7539970 7615906 7690286 7609937 7706312
6366 7706312 7662887 7516115 7505128 7636489 7534543 7515651 7819291 7647202 7729278 7822916
6356 7822916 7710831 7846576 7747785 7846529 8197443 7910227 7960266 7983206 7965446 7895491 7853328
6345 7853328 8041742 8032427 8149695 7979791 7993095 7798826 7619863 7703195 7747930 7680558 7736339
6334 7736339 7814256 8022849 7758641 7736674 7658223 7754723 7759056 7734221 7698305 7583969 7767108
6323 7767108 7546086 7459281 7844103 7799912 7349611 7464313 7888150 7538813 7449602 7506049
6313 7506049 7686848 7374168 7428005 8002187 7848339 7774836 7909042 8072448 8071527 8034088 7941890
6302 7941890 7913402 8068685 8008323 7777210 7947271 7880900 8050499 7845564 7870959 8069468
6292 8069468 7900916 8015354 8009229 8198951 8139832 8272715 8416419 8172097 8452119 8500991
6282 8500991 8563282 8573327 8695997 8831702 8669398 8572715 8493502 8246368 8205333 8105452 8050319
6271 8050319 7930824 8072801 8056067 8069975 7936283 7486819 7545747 8212379 8429985 8216228
6261 8216228 8311850 8381787 8440001 8668551 8954332 9070101 8637266 8696984 8851616 8520836
6251 8520836 8443175 8689353 8574408 8277475 8245052 8108880 7863993 7997508 8030338 7789010
6241 7789010 7455303 7813598 7912648 7844768 7892808 7749527 7835554 7983395 8174909 7890663
6231 7890663 7725303 7827126 7585019 7657953 7587110 7156271 7097395 7026227 7138317 7056841
6221 7056841 6758561 6799610 6762296 6703587 6406445 6318463 6358452 6505766 6224318 6256066 6338994
6210 6338994 6230307 6426886 6293683 6142702 6119168 6034809 6081658 6206533 6100956 6126240
6200 6126240 6197540 6091232 6146193 6239147 6079999 5721630 6049691 5965560 5828343 5771196
6190 5771196 5858905 5774511 5545416 5460374 5590713 5214283 5264244 5576563 5398834 5146257
6180 5146257 5343041 5201497 4891354 5016049 4920856 4974374 5013882 5162340 5124280 4758062
6170 4758062 5113532 4955309 4933561 4742813 5091160 5045709 5116674 5163490 5046726 4633109
6160 4633109 4664670 4872498 4901137 4800958 4701763 4708843 4589446 4561793 4520244 4552557 4433779
6149 4433779 4652349 4365489 4287472 4206929 4356049 4559367 4324535 4074577 4160786 4324299
6139 4324299 4354088 4213805 4259579 4231521 4159042 3983796 4313785 4327436 3842705 4017191
6129 4017191 4137068 3927638 3905303 3979557 4172333 4043659 3926812 3567541 3956062 3765600
6119 3765600 3853290 3880080 3654969 3768471 3910553 3740038 3717988 3415916 3441376 3605690
6109 3605690 3732362 3521418 3339732 3531906 3766542 3716298 3500260 3639671 3536750 3407368
6099 3407368 3569777 3438269 3203097 3555740 3579308 3490387 3110840 3432783 3545044 3481234
6089 3481234 3459647 3180090 3286324 3336140 3342917 3367435 3137639 3082632 3303512 3145505 3409940
6078 3409940 3361950 3127922 3282119 3250809 3150567 3136509 3197383 3323185 3087869 3189046
6068 3189046 2997802 3261975 3395544 3084956 3000256 3063544 3238810 3218384 3078450 3362869
6058 3362869 3153251 3015706 3037104 3178734 3352062 3039071 3126598 3124003 3024506 2975352 2922357
6047 2922357 3282813 3089835 3029203 2999182 3083349 3143118 2890232 2983143 3097018 2979343
6037 2979343 3134327 2940853 2935195 3140862 3132766 2930388 3082765 3057210 2955381 3013747 2986826
6026 2986826 3098527 3023963 3048000 3078585 2857233 2983158 3160008 3251941 2814872 2808248 2862996
6015 2862996 2851604 2973933 2869948 2993891 2774464 2874098 3002387 2854896 2831880 2941628
6005 2941628 2872139 2800147 2921497 2766265 2754210 3156808 3005572 2752464 2899623 2948488
5995 2948488 2953520 2636214 2969834 2915327 2557566 2801111 2931277 2852533 2725222 3032571
5985 3032571 3219490 2646477 2575768 2725037 2841787 2826682 2713774 2619518 2677654 2756201
5975 2756201 2682923 2736974 2737964 2936313 2706992 2765407 2753987 2589446 2572041 2548818 2595502
5964 2595502 2679600 2549119 2633417 2690613 2848212 2614976 2491428 2634540 2672024 2671822 2440507
5953 2440507 2733955 2732199 2488130 2710777 2714469 2513183 2615646 2724354 2691651 2600975 2680591
5942 2680591 2364036 2347553 2439806 2415620 2444038 2525586 2745474 2728442 2310589 2556219 2474790
5931 2474790 2372847 2478862 2604554 2501372 2394051 2399192 2251424 2324969 2391324 2493981
5921 2493981 2326502 2397621 2641120 2377281 2186024 2283724 2529672 2318156 2452577 2317840
5911 2317840 2438016 2357328 2229793 2220932 2412621 2307317 2477253 2365134 2222054 2334047
5901 2334047 2230893 2151179 2294134 2483019 2238249 2287738 2153762 2251353 2266339 2075961
5891 2075961 2149448 2342154 2140783 2091672 2296980 2182812 2232173 2073080 2190973 2361722
5881 2361722 2216980 2096037 2293103 2210313 1955241 2159159 2267172 2242131 2317386 2113365
5871 2113365 2171672 2220620 1990507 2230142 2186590 1985151 2136081 1995728 2133922 2227648
5861 2227648 1885016 1892497 1951025 2012865 1859870 2251556 2040385 2019011 2157379 1935070
5851 1935070 2009397 1966307 2021991 1901913 1736061 1936203 2008658 1898579 2102236 2088843
5841 2088843 1855655 1862838 2144496 1910699 1994958 1930830 1881205 2029354 1749971 1799439 1854227
5830 1854227 1706684 1938573 1933997 1834141 1964913 2046744 1846188 1937178 1954973 1774321 1933091
5819 1933091 1783371 1746072 1825417 1706090 2043638 1956702 1580205 1678762 1897737 1560971
5809 1560971 1820451 1922463 1573327 1593284 1858892 1808281 1610173 1707452 1829466 1811082
5799 1811082 1667681 1637179 1800525 1766820 1577373 1676650 1479452 1654636 1822985 1706770
5789 1706770 1843897 1614640 1564359 1739705 1763839 1700723 1756343 1458579 1553671 1744852
5779 1744852 1623184 1816974 1629542 1410596 1678334 1698047 1611741 1759388 1612768 1484044
5769 1484044 1469122 1510562 1593052 1797391 1485319 1274602 1614354 1642252 1549414 1718745
5759 1718745 1568116 1642542 1309200 1331729 1611076 1488822 1283046 1383383 1525142 1513524
5749 1513524 1309576 1481892 1534922 1495224 1293746 1382835 1672889 1542943 1605668 1443659
5739 1443659 1271994 1496596 1549186 1513201 1739532 1448570 1371442 1448944 1452755 1405302 1213616
5728 1213616 1174921 1275202 1377827 1153085 1508087 1413837 1098190 1355050 1170393 1438665
5718 1438665 1393649 1015394 1312405 1294288 1179495 1282723 1475205 1150407 1182192 1320375
5708 1320375 1210356 1361417 1200640 1111580 1239068 935549 1018414 1335192 1167375 1308766
5698 1308766 1159255 1090420 1242295 1267640 1182368 1087316 1088390 1243298 1309811 1058499 1105824
5687 1105824 976973 900949 1188915 1239266 1028198 1221964 1381097 998914 918632 1161434
5677 1161434 1068232 1242865 1138027 1005010 1211235 1078540 1177585 1151372 908679 875135
5667 875135 1164961 1106003 1040086 1192212 967096 914430 1193409 1090996 995824 1065596 976087
5656 976087 991526 998458 1128619 1078574 908236 843723 1132672 989293 886970 1153396 961781
5645 961781 1052073 1017375 1016350 1061939 999205 889097 773609 1118350 822547 956923 1068469
5634 1068469 958833 942417 746554 1037970 1078463 880580 759786 1078003 790025 758343
5624 758343 990346 968095 896042 819501 770594 953031 1010580 1013311 878393 798289 902228
5613 902228 884826 832128 899127 883088 702132 833237 1092709 972474 876681 863406 783590
5602 783590 907881 970428 921187 978351 901177 665290 766262 764808 1005446 913112 760453
5591 760453 931212 854666 741097 883759 874708 759502 823814 720904 889078 880619 734810
5580 734810 624355 1049005 828180 733236 676950 932498 1008871 569147 698171 1047055
5570 1047055 665330 720425 939286 741984 494002 814950 929439 697395 756354 915699
5560 915699 904488 773587 728056 703769 439757 622372 808014 913585 668967 877445
5550 877445 782539 402124 670759 958502 844729 928664 714253 541417 498898 595651
5540 595651 870163 903089 817919 730147 762183 625703 762611 749856 749349 580140 607312
5529 607312 856963 840350 704177 554379 719299 699797 812768 829156 582014 589831 730015
5518 730015 636766 464074 649189 1073554 822766 471886 631116 834008 702068 708752
5508 708752 844774 534103 420018 960207 804393 724792 672056 534494 668919 707230
5498 707230 813598 649004 525304 637632 769909 555495 700278 784228 732984 741915
5488 741915 510004 511403 617211 637333 627017 527572 747972 577335 884193 845753 689000
5477 689000 492395 697916 795551 693322 488413 630363 576534 742958 765170 704450
5467 704450 599037 640470 578321 604573 936612 679078 571540 751877 575717 583187 450938
5456 450938 629880 597357 609695 645422 583145 656190 547809 616462 575778 520956 784878
5445 784878 768041 690868 586319 678653 528638 731892 1066879 621278 646751 797547
5435 797547 788209 713873 497726 773591 682519 673783 838587 791669 830790 601621 814484
5424 814484 780568 724341 996188 968147 970684 862237 792576 882675 1179936 1147136 844376
5413 844376 783629 976090 726193 736375 962925 771792 552583 736820 826089 617609
5403 617609 668453 364376 526648 578130 620562 508788 496715 650623 608713 235378 390398
5392 390398 525684 459224 293888 321611 418272 595871 658110 674988 511014 441256 464150
5381 464150 425654 568373 543243 531516 450129 565255 538636 352077 533409 639327 624999
5370 624999 531524 626550 796117 539241 516774 592405 545486 472283 460870 863911 600913
5359 600913 545699 524569 696962 816378 477191 550518 580913 497367 575303 711118 585207
5348 585207 411431 651704 657106 413481 786043 778234 667103 590385 628063 703021 472944
5337 472944 723302 778657 521445 466136 694822 792031 774990 517470 602642 769991 744907
5326 744907 593842 713806 694968 719607 655817 615350 746498 877944 709550 705359 915708
5315 915708 608460 691348 808862 650069 770013 730182 737485 831663 956868 872772 789726
5304 789726 871721 1002119 967735 751872 818792 933700 1001020 748318 779499 1012840 983153
5293 983153 988936 800254 815091 975151 1136464 943603 868647 1129102 1060285 945860 1016747
5282 1016747 950835 798121 949650 1198375 1039289 929671 1309470 991050 992279 940421
5272 940421 1176979 1148508 766099 1060100 1096284 994474 1101219 1205864 1236097 982247
5262 982247 1185610 1604263 1325300 1106149 1020723 1264598 1085250 1132293 1400697 1305914
5252 1305914 1362229 1303761 1129551 1369529 1236663 1336171 1304282 1389271 1317617 1271181 1446735
5241 1446735 1545258 1442250 1450372 1316296 1557523 1462380 1615885 1536174 1420540 1617633
5231 1617633 1502260 1517734 1601928 1535009 1573115 1679490 1725292 1672412 1773935 1608966 1870209
5220 1870209 1693788 1685085 1924098 2017993 1821973 1737416 2008579 1850641 1985493 1967201
5210 1967201 2086795 2128408 2164857 2180914 2175937 2298596 2012298 2121676 2469575 2363950
5200 2363950 2403788 2198776 2416835 2646245 2568130 2443712 2508872 3113849 2917834 2808997
5190 2808997 3049317 3029464 3036350 3269064 3238555 2947032 3024274 3211323 2867616 2699779
5180 2699779 2771696 2844547 2893740 2598808 2702132 2768071 2521030 2796533 2805687 2504412 2863973
5169 2863973 3016173 2804615 2838753 2851635 3033582 2980245 3004093 3082639 3045592 3093446 3300729
5158 3300729 3357061 2921784 3247797 3560248 3468828 3441650 3441703 3584694 3698469 3604550 3655360
5147 3655360 3783094 3765315 3726684 3951209 3967860 3789441 4093953 4094675 4133530 4241681 4194712
5136 4194712 4419290 4316298 4424261 4400775 4356499 4700100 4539373 4720244 4861057 4873497
5126 4873497 4769507 4973599 5184571 5028602 5451314 5214698 4992525 5344429 5433141 5546936
5116 5546936 5545440 5682534 5854015 5945612 5907697 6169084 6291424 6208472 6409399 6493333 6386638
5105 6386638 6667281 6899887 7134488 7086636 7187167 7444043 7716982 7690299 7952649 7873613
5095 7873613 7974304 8335776 8361929 8596009 8622554 8430720 8855778 9057861 9156965 9131523
5085 9131523 9423265 9569538 9627384 9816434 9886667 10245646 10557771 10370923 10709382 10851517
5075 10851517 10938056 11306106 11608021 11955365 11928849 12322348 12586650 12728871 12829601 12894208
5065 12894208 13390061 13480431 13844212 14184118 14291229 14692502 15074443 15296909 15719772 16022286
5055 16022286 16169165 16468578 16952427 17142861 17850284 18027170 18213815 18425886 18433966 18829021
5045 18829021 18991740 19561011 19894888 20103087 20245291 20761983 20976777 20950673 21486895 21464756
5035 21464756 21429561 21961094 22350107 22738107 22904040 23251339 23665108 23649398 24009445 24695423
5025 24695423 25215943 25338146 25714889 25630302 25369977 25543823 25469208 25260564 25235105 25147564
5015 25147564 25129139 25419169 25769283 26119061 26559792 26701519 27054138 27378871 28200361 29423096
5005 29423096 29921296 29545683 29293288 29191787 29209240 29435405 29920862 30255323 30525812 30685977
4995 30685977 30919818 31403732 31501433 31590281 31854562 32370871 32670240 33312412 34153082 34549136
4985 34549136 34957188 35618490 36169277 36485106 36710827 36889971 36877090 37327637 37756543 38190174
4975 38190174 38579834 39466164 40103517 40805824 41998745 43585607 45130742 46613180 48313990
4966 48313990 49717010 50220182 50851899 51628661 52316162 53181912 54576208 56433397 57705388
4957 57705388 58557392 59422650 60124610 61196332 62167288 63389384 65091114 66896525 68464259
4948 68464259 70337147 73143852 77219100 81682165 85323296 89680017 94901855 100867714
4940 100867714 107895317 116814171 127176191 138474773 152118505 169603774 181669822
4933 181669822 174384391 156190826 136880472 119584268 105125447 93658154 84134516
4926 84134516 74979520 64729280 53703278 41901556 31011402 22270597 16004436 11910105
4918 11910105 9297972 7583615 6179025 5353088 4896099 4305555 3590623 3420401 2954607
4909 2954607 2637424 2102656 2133130 1836447 1837825 1635196 1518685 1624700 1620814 1537419 1427835
4898 1427835 1554618 1593506 1298917 1373673 1615024 1675636 1419193 1259945 1373243 1440275
4888 1440275 1339946 1476749 1389833 1366552 1260930 1257899 1235873 1146364 1104563 1059032 976171
4877 976171 914797 692852 971753 1264752 976811 612386 818781 931174 851276 800377
4867 800377 773485 977761 752245 804494 730091 731086 821494 918813 830274 828676 873913 795356
4855 795356 896922 926458 740695 723348 699671 676714 719851 822700 712718 751479 900923
4844 900923 758201 710674 872304 650339 614559 367311 564266 640649 511134 579141
4834 579141 683626 522748 270581 618563 888416 608642 649424 647996 585963 570057 492229
4823 492229 671466 740389 721739 610759 738042 858226 694623 537266 751682 686061
4813 686061 642052 795157 867943 700202 537813 695941 788937 768160 748844 758233 551942
4802 551942 688819 662015 715370 487277 533430 638749 357386 577685 628743 479553
4792 479553 592130 585340 442624 590382 643601 613675 625242 429690 362598 437570 798563
4781 798563 603293 472075 419511 640276 505349 432788 823269 848628 356741 600461
4771 600461 673348 555101 491254 667955 794058 659526 749429 651906 825022 941351
4761 941351 670217 630269 718225 813304 873251 689765 1114046 843423 861823 726360 1029990
4750 1029990 905573 924718 1047963 650974 796449 816582 955100 911179 643853 806818
4740 806818 853090 506841 984751 721504 732075 864287 828199 782557 932783 829776
4730 829776 878431 1041857 768927 772075 1121852 964789 916529 974924 878169 1032452 1040733
4719 1040733 758682 1006913 1137306 1192430 1175765 976279 951840 1222735 1211246 1181007
4709 1181007 984042 1095172 1184553 1229104 1175116 1375048 1316649 1290930 1550376 1170678
4699 1170678 1272563 1617061 1429546 1250285 1420184 1443489 1436447 1470364 1563834 1635091 1506866
4688 1506866 1413654 1775055 1859055 1648916 1694662 1976191 1836039 1983389 1945893 2219581
4678 2219581 2317026 2037598 2371650 2240203 2064940 2097239 2014227 1910272 1974180 2040381
4668 2040381 1950091 1893120 1700194 1881887 1830879 1716971 1750891 1933096 1507779 1609809
4658 1609809 1929423 1687917 2060223 1905075 1754695 2019539 1928405 2028379 1946068 1990077
4648 1990077 2147284 2130583 2144640 2181033 2273621 2089351 2280516 2139516 2048087 2290020
4638 2290020 2480550 1990445 2165545 2129847 2132388 2101992 2022940 2305176 2179452 2141803 2093811
4627 2093811 2373884 2175949 2113826 2444051 2489905 2435391 2542774 2259685 2267907 2318994 2351041
4616 2351041 2574997 2536616 2486766 2391078 2359922 2615090 2719319 2660265 3020102 2783463
4606 2783463 2819831 2991612 2990252 2805448 2846430 2986579 2838508 3124982 3064849 3228565
4596 3228565 3270994 2985845 3510863 3376870 3328498 3660667 3679675 3287536 3372944 3757133
4586 3757133 3682828 3676637 3880327 3615818 3664993 3772150 3705974 3703967 3501382 3848306 3841201
4575 3841201 3714998 4141724 4185456 3981276 3907459 4109644 4192940 4332575 4333545 4315322 4126355
4564 4126355 4238501 4605987 4694040 4746369 4956619 5003146 4852217 4766014 4770761 4664818 4781439
4553 4781439 4732133 4807279 4872984 4972638 5006566 4858087 4978815 5188618 5272197 5242453 5095700
4542 5095700 5290906 5185947 5336264 5473661 5516733 5828278 5762046 5850105 5892983 6001439
4532 6001439 6111773 6061881 6287166 6255152 6117525 6125458 6429721 6352945 6298632 6398376 6610815
4521 6610815 6478219 6527102 6579764 6828426 6802384 6843763 6659978 7018422 7191201 7335947
4511 7335947 7198412 7273011 7597407 7451778 7539290 7612400 7768559 8052372 8019374 8187361
4501 8187361 8227407 8274978 8618658 8753551 8805735 8885219 9205193 9218475 9114563 9498898
4491 9498898 9643802 9718066 9989010 10199284 10378029 10401870 10517721 10754392 10964261 11047265
4481 11047265 11145529 11366572 11932681 11923196 11921892 12284316 12514213 12658594 12749565 13002154
4471 13002154 13384256 13604956 13387618 13911262 14425868 14284795 14690996 15109474 15198703 15385388
4461 15385388 15389595 15722716 16024755 16552456 16886347 16885717 17331478 17738476 17996075 18174896
4451 18174896 18595850 19260208 19165437 19519970 20088500 20110257 20589147 21065975 21417936 21899890
4441 21899890 22146803 22682947 23024592 23304404 23817724 24335428 24608440 25012914 25502119
4432 25502119 25622776 26124772 26814877 27100270 27762876 28254077 28624946 29166584 29414953
4423 29414953 29724909 30067408 30359211 31000829 31342573 31845527 32434354 32888323 33445936
4414 33445936 33873805 34427005 34996643 35480740 36192502 36794657 37366129 37367078 38147589 38784347
4404 38784347 39112181 39871129 40613277 41022426 41729390 42347207 42888273 43127466 43379533
4395 43379533 43948322 44302785 44494651 44894831 45707937 46237337 46779393 47589934 48410675
4386 48410675 48844801 49448427 49882428 50706565 51625778 52611351 53074589 53522675 53920817
4377 53920817 54544778 55060791 55883833 57003219 57743786 58953737 59384675 60313295 61084320
4368 61084320 61762432 62378726 63556776 64777357 65536081 66911972 68493396 69734693 71107272
4359 71107272 72260891 73535868 74583989 75902647 77445287 78634711 79919645 81153309
4351 81153309 82471240 83855877 85855259 87767578 89292085 91284977 93883569 96139183
4343 96139183 98991608 102448978 106252275 110812341 116167289 121870393 121979652 119235463
4335 119235463 116673740 114231061 111866324 110844021 110469140 109944376 109165333 107956633
4327 107956633 106204092 104481063 103120742 102731257 103331331 104769050 106927252 108727439
4319 108727439 109885604 112425964 114939877 118224593 122927547 128758674 134479877 141015807
4311 141015807 149379903 159535608 160729062 153886545 145144579 137523484 130559290 125244295
4303 125244295 120920991 116652485 112208158 107297620 101615844 96084023 90931285 86907583
4295 86907583 84589851 83072968 81606927 80980325 80543047 80284038 80364808 80891755 81649424
4286 81649424 83188611 84806212 86952007 90180196 94018050 95321471 91653319 86630274
4278 86630274 81615411 77534376 74476532 72474791 70347802 68112117 65210706 61907813
4270 61907813 57922151 53976115 50558694 47781236 45446423 43213278 41283545 39216630
4262 39216630 37619227 36014045 34434727 33522489 32329172 30205266 28571350 27445730
4254 27445730 26065935 25085132 24498141 24220068 23754110 23888966 23335580 23016385 22568772
4245 22568772 21689308 20541630 19688106 18934267 17843065 16894827 16118164 14824378 13586910
4236 13586910 12321504 11382151 10117383 9019675 8280129 7479250 6905977 6102208 5183664
4227 5183664 4842947 4573859 4217317 3827261 3675558 3593717 3164191 2755433 2834407 2895455
4217 2895455 2371246 2486889 2590802 2267779 2126579 2251003 1964000 1803894 1936970 1804192
4207 1804192 1804332 1656359 1643077 1383446 1377448 1500251 1259063 1368841 1491261 1366727 1305804
4196 1305804 1325095 1311888 1210695 1185075 1189639 1099333 1170470 1180365 1034192 1314514 979065
4185 979065 1193831 1290976 1167582 1102695 1129785 926276 922494 1043444 754124 1012573 1089957
4174 1089957 911939 962614 1098019 1157206 743224 867878 900687 976412 1011781 1016510 577024
4163 577024 755062 882455 937538 690162 930050 843225 713753 1065290 787812 772563
4153 772563 898411 884665 841511 823881 794419 838886 811824 653824 592434 907393 766681
4142 766681 868346 773124 781507 887581 772881 693882 915611 694147 709780 828842 1152488
4131 1152488 818841 689309 835751 747450 918296 910850 802173 900316 633115 751782
4121 751782 651616 1088737 986091 783966 732355 982274 772742 769078 885077 940031
4111 940031 877354 759182 797676 814214 1093153 817838 739904 863102 1070370 1149194 1038549
4100 1038549 965640 983425 965973 972331 995216 1071410 1025080 1010495 1023757 1147389 1090405
4089 1090405 1134806 1285173 1167305 1067889 1269760 1017292 1327252 1215304 834381 1101674
4079 1101674 1090275 1157623 1234591 1224713 1151553 998977 1172465 1293437 1223632 967746 1026617
4068 1026617 1095625 966793 901406 1225109 1342881 1279157 1148848 1330926 1262432 1157558
4058 1157558 1302886 1370970 1455211 1388085 1384290 1296721 1112824 1285039 1085897 1347388 1285330
4047 1285330 1204266 1036716 1045982 1177289 993849 918204 947080 1048192 1200297 886856
4037 886856 1010901 1109744 999260 1101835 1042883 1107437 1060274 1192994 1090081 954758
4027 954758 1245081 1090807 1218893 1122292 955492 990894 982541 1000725 998549 787996 917699
4016 917699 928117 901317 793627 778276 1051568 839332 822159 827003 912886 982800 743857
4005 743857 911519 687190 524085 743340 648523 897468 490989 530097 883891 679583
3995 679583 652163 564443 680299 452229 369760 725279 394521 512779 438307 384999 458276
3984 458276 427440 441912 402922 453888 428026 450040 381728 265770 279869 281272 190240 597632
3972 597632 262640 361817 219324 355270 344581 154831 291135 407301 322542 205968
3962 205968 223888 197945 186969 290925 114806 687 282652 129468 -14029 135327
3952 135327 36750 220292 111797 147955 27908 10393 -23887 114445 159991 -28268 53257
3941 53257 -11725 77121 -56600 41718 11992 161194 98809 39736 301741 262820 63939
3930 63939 65843 -90580 68163 -48882 56081 56426 -260177 -202394 10986 -116323 59313
3919 59313 145721 -54316 107830 4098 -127777 42159 -102247 -63401 -112127 -86670 -84618
3908 -84618 -77733 -144328 -66908 160077 45544 108135 43135 124710 -37181 -148100 -160524
3897 -160524 -96310 125299 62143 -111640 -109985 -98462 110312 -75664 -279412 1672 -14547
3886 -14547 32601 -74979 -103787 69649 -322993 -31870 107475 -124181 -44276 32514 89936
3875 89936 -294040 -225657 -89809 -76128 23307 -338645 -47104 -52269 12858 -217858 -118384
3864 -118384 -148124 -115714 -18811 41 -265768 -164619 -59943 -71790 -130116 -136448 28148
3853 28148 -153400 -80497 11137 -86477 46286 -105164 -159379 -35573 -134488 -36144 -225994
3842 -225994 -102069 -99125 -71053 -35467 -84779 175485 -30096 -221502 60544 3730 -231242
3831 -231242 -103579 -140831 -205300 -127457 -7502 -111397 -84590 -68059 -277408 -70326 183855
3820 183855 151928 -400852 -250742 -98790 -121197 21050 203016 28386 -104790 -100049
3810 -100049 -163145 -131355 19206 -203378 -153300 -57877 -114503 -126998 -82110 -16461 -195502
3799 -195502 -314999 -126626 140144 -147164 -128504 -187924 -236290 -267564 77070 -30583
3789 -30583 -265943 -171175 136457 -225172 -194338 -67780 -146984 -187046 -16817 -48732 -292159
3778 -292159 -54894 -238107 -129172 -42679 12385 -44182 -75934 -125461 -219022 -177084 -24031
3767 -24031 2500 -100170 -193123 -264788 -63362 45507 -176751 -132635 -38057 -226474 -90048
3756 -90048 17315 -137588 -129663 -285119 -101736 9646 -227630 -243367 -72912 -146561 -227772
3745 -227772 -87833 181651 -257366 -174475 -127592 -183414 -139055 -283724 -4740 -205161
3735 -205161 -259160 -166527 -23874 19581 -228007 -366618 8282 130801 -80027 -291480
3725 -291480 -271779 -263208 -96151 2616 -229677 -119813 -257035 -308005 -16664 -150766 -133154
3714 -133154 -197429 -227695 -311843 -128571 -166708 -108433 5351 -104746 -331514 -178334 -95262
3703 -95262 155637 -313974 -291498 -198243 -143543 -1650 -23554 -132910 -357465 -225613 -195617
3692 -195617 -72703 -125056 -196305 57282 -293449 -302053 -6144 35608 -184591 -288862 2141
3681 2141 -29420 -180159 -279589 -152226 -209159 -478879 -414998 61462 -11410 -113910 -356369
3670 -356369 -205622 134029 -144745 -169129 -53695 -161049 -190145 -89837 -75092 -56608
3660 -56608 -424716 -227195 -116945 -58388 -152375 -91239 -100750 -86620 -126213 -299244 -153033
3649 -153033 49040 -166186 -212134 -142292 5976 -35838 -105555 -223996 -287248 37378 -34895
3638 -34895 -200250 -210281 -61408 -198771 -130096 66345 -226867 -372605 -71700 13038
3628 13038 -8759 -111095 -156239 -167889 -205203 -291194 -257470 -166643 -122224 -215464 -141970 -132258
3616 -132258 -73710 -123194 -167150 -251360 -227326 -150312 -77817 -121927 -190105 -349178 -173760
3605 -173760 -133944 -133484 -76136 -167485 -192905 -215107 -220082 -96731 -247645 -116036 -242534
3594 -242534 -323477 -98923 -37580 -212156 -174388 -24681 -192555 -103534 29482 -24769 -92766
3583 -92766 -171704 -157975 -196951 -157727 3152 -176014 -278369 -134535 -184363 -243618 -14421
3572 -14421 -38800 -322817 -219495 -154967 -219927 -229545 -146942 -88369 -256299 -199829 -185724
3561 -185724 -125468 -328075 -136283 -32737 -97258 -68373 -298589 -196784 -72092 -110942
3551 -110942 -28216 37923 -93553 -275870 -155816 -65020 -185357 -283841 -92452 -264473
3541 -264473 -151630 -24136 -71780 -90614 -447189 -225401 -124148 56321 -61547 -278573
3531 -278573 -299430 3357 -52171 -324554 -190563 63856 -294925 -164230 -4747 -276562
3521 -276562 -289788 -341941 -67464 125768 -292178 20963 -173450 -243331 -197437 -180045 -173525
3510 -173525 -14568 -22616 -360360 -303375 -122450 -100365 -44725 -112874 -125352 -57282 -117007
3499 -117007 -61316 -195012 -173185 -242256 -206165 -5022 7132 -136703 -164094 -114919 -208458
3488 -208458 -353809 -100760 -90516 -65299 -318822 -180040 -125873 -120596 -120202 -70148 -244314
3477 -244314 -85437 -205657 125014 -115872 -186831 -191027 -158673 -35471 -14900 -206620 -112337
3466 -112337 -295457 -362804 -216452 48887 -17026 -202725 9091 62225 -214792 -223122 -153110
3455 -153110 -5490 -282930 -138839 -204727 -250466 -147162 -176334 -35857 -328618 -59525
3445 -59525 -27399 -104393 53495 -63299 -288776 -318395 -95539 -38465 -340988 43305 28149
3434 28149 -117229 -181467 -235387 -96582 -128437 17842 -145302 -197441 -272355 -434093 -163361
3423 -163361 -31552 -70531 -131722 -217708 -170635 -311736 -231824 -123365 -135412 -120934 -272932
3412 -272932 -254395 28877 91332 -56473 -295689 -228773 -261990 -19728 -84453 -201695 -262236
3401 -262236 -135603 -183639 -135863 -11876 49026 -48514 -138528 18528 -190472 -131846 -75803
3390 -75803 -92780 -364323 -359143 -164371 -164315 105482 -119193 -202481 -66652 -66975 -42045 -206357
3378 -206357 -100986 101458 -226430 -2510 -182993 -98386 142778 20263 -48354 -22121
3368 -22121 4052 -108645 -29111 25057 -119526 -122748 -23115 -12476 -86881 -373472 -178312
3357 -178312 -88531 -180020 -105007 -205055 -138754 -6800 -21259 -58107 -232980 -272621 -330095
3346 -330095 -136745 38862 -100056 -212541 -337675 -239788 -260153 -241816 -64261 113230
3336 113230 -144662 -289754 -462239 -170953 -169175 -129792 -57514 -17371 -177465 -125185 27438
3325 27438 -245914 -238533 -156776 -196874 -177634 -309032 -166116 -212141 -201421 -62854 -211447
3314 -211447 -270529 -211701 52883 -236126 -426983 -44269 -29636 -315798 -208148 -121779
3304 -121779 -56978 -79268 -113644 -124074 -324690 -169751 -32579 -248964 -246912 -56320 -375258
3293 -375258 -235404 72368 -28278 -274988 -7319 -70973 -145457 -242093 -94594 -17827
3283 -17827 -390968 -448531 -157207 -86207 -456635 -114412 116454 -106413 -334467 -245835
3273 -245835 -94908 -188793 -237977 -250428 -171170 -275583 -93065 -179185 -248408 -237700 -186654
3262 -186654 -159916 3583 13426 -344647 -85501 -165228 -305722 -340556 -237334 179342 -207271
3251 -207271 -414016 -112395 -353170 -139983 -117538 -208824 -232493 -139551 -100404 -315271 -303989
3240 -303989 -341772 -60056 -112840 -330152 -294674 -416434 -146404 -10515 -221827 -246252
3230 -246252 -757 -185731 -353129 -167252 -129325 -193536 -103769 -230811 -215808 -259808 -189080
3219 -189080 -92819 -13784 -185546 -366347 -263638 -32217 81517 -264294 -171886 -260941
3209 -260941 -150892 -94021 -138970 34555 -33323 -153755 -386568 -229581 -117836 -248180
3199 -248180 -209037 7129 -81512 -373991 -137320 71077 -183150 -292985 -138621 -312405
3189 -312405 -284722 -76295 -257706 -341565 -331092 -217310 -92166 -204657 -214943 -79492
3179 -79492 -162168 -229523 -245170 -312315 -13997 -99478 -191976 6684 861 -240121 -245185 -142583
3167 -142583 -80438 -403516 -239446 -130409 -129756 -402316 -284915 -123960 -94082 -237737 -160338
3156 -160338 -67758 -262434 -154347 -196987 -57398 -243487 -334674 -3748 17318 -86151
3146 -86151 -328115 -190913 -210213 -258836 -70000 -164184 -79641 -201622 -193401 -207563 -383372
3135 -383372 -127979 -39185 -99190 -186873 -136623 -181507 -186227 -181636 -226880 -139076 -4745 -26644
3123 -26644 40780 -350341 -357349 -235557 -164414 -45301 -321026 -301107 -215780 -157004 -164005
3112 -164005 -207015 -177026 -120112 -131711 42515 -111332 -158648 -391357 -278601 -232269 -336430
3101 -336430 -299477 -74569 117226 -235345 -496543 -160958 -20842 -132841 -171362 -144518
3091 -144518 -323874 -309912 -82161 -265506 -207088 -68341 -104548 -322815 -91398 -80144
3081 -80144 -410297 -389484 66897 -94440 -450815 -171120 48768 -167379 -288976 -198028
3071 -198028 6657 -179112 -128468 -238256 -374478 -50511 -206544 -147633 -281911 -137663
3061 -137663 -152319 -263909 151210 -175756 -383912 -139715 -224966 -312899 -102345 -202753
3051 -202753 -37899 -324314 -183149 -208956 -199688 -122365 -175801 -212364 -340655 -244725 -76577
3040 -76577 -179951 -71125 -236459 -322233 -113294 -130716 -60270 -161234 -125720 -138135 -290261
3029 -290261 -305289 -123838 -2415 -230357 -162680 -297037 -147490 -86477 -273883 -218921
3019 -218921 -232319 -279403 -153803 -34259 -238811 -114632 -148530 -290020 -285621 -198776 -314206
3008 -314206 -126738 -141996 -89631 -144146 -285442 -95793 -41207 -129843 -159955 -187705 -514990
2997 -514990 -273176 -143850 -218942 -359595 -215898 -247985 -297701 -5680 154140 39955
2987 39955 -252227 -194189 -305693 -365577 18081 79424 -205974 -376071 -284942 -104979 -42745
2976 -42745 -74507 -47132 -311678 -154605 -164408 -280816 -210229 -165494 62953 -259953 -597
2965 -597 -145116 -34970 -48048 -278335 -283413 -143271 -6423 -205982 -296911 -268723 -228370
2954 -228370 -98588 -82099 -168977 -164739 -375935 -277202 -206408 -208428 -183466 -234803 -222072 -38508
2942 -38508 -183790 -168486 -59263 -44531 -472181 -133016 -194379 -126755 -132792 -362874 -337304
2931 -337304 -249084 -252939 -213483 82332 -43334 -218314 -273636 -373466 -95696 -70522 -171834
2920 -171834 -230253 -77129 -129390 -222611 -352887 -84611 -154123 -289354 -179898 -89142 -391895
2909 -391895 -185796 -137037 -108323 -307398 -228192 -67687 -238839 -212620 -263665 -267235 -293447
2898 -293447 -72312 -63807 -435693 -183797 43622 -346179 -422596 -129168 -204650 -310844
2888 -310844 -53728 -146492 -399100 -296454 -131900 -8684 -282709 -35199 -21538 -365962
2878 -365962 -368229 -114057 -9374 -430075 -254698 -372293 -215741 -78605 -108286 50599
2868 50599 -184522 -262897 -105071 -234127 -27896 -69883 -274049 -388328 -232135 -115715
2858 -115715 -105752 -158571 -99486 -350253 -227382 -110626 -108383 -249027 -335684 -197774 -257648
2847 -257648 -223118 5598 -358968 -247483 -10746 -124978 -557034 -153053 -30767 -223738
2837 -223738 -234756 6281 -243526 -203893 -230110 56373 -173376 -282015 79188 -4630
2827 -4630 -301641 -357598 -440255 -176984 -120660 -78303 -159044 -28354 -119658 -300996 -83038
2816 -83038 -216139 -213223 -325858 -336728 42221 -253363 -391563 -79264 -39042 -206723 -221734
2805 -221734 -46801 -127304 -112748 -211155 -329272 -375500 -187436 -53956 -106313 -48700 -106477
2794 -106477 -305647 -339583 -251246 -132509 -280564 -151539 -12026 -327483 -373847 -290196
2784 -290196 -207796 -162863 -152636 -108469 -109225 -247211 -250094 -89717 -63022 -255343 -212495 -202195
2772 -202195 -8080 -221715 -387937 -171017 -104140 -290586 -218970 -230282 -66001 -302245
2762 -302245 -310322 -202353 -243217 -278945 -253126 -140992 -205333 -363681 -106175 -264223 -98638
2751 -98638 -105206 -378614 -228603 -208978 -152650 -165539 -271507 -113634 -263349 -249091 -191123
2740 -191123 71397 -198284 -264438 65229 -347671 -487491 20201 -83705 -180275 -248905
2730 -248905 -230188 -188359 -421216 -123782 -57262 -198291 -215245 -154691 -11993 -280952 14074
2719 14074 -387400 -321705 -38931 -114253 -170145 -231248 -17511 -39898 -439168 -204619 -29184
2708 -29184 -206958 -179988 -256656 -385081 -144898 -93054 -321228 -384934 57000 -122637 -112708
2697 -112708 -127420 -345060 -163557 -464753 -129572 147060 -337884 -385537 17993 -106116
2687 -106116 -510404 -232118 -12329 -122934 -204944 -401046 -264030 -222280 -330612 -139884
2677 -139884 -85722 -305818 -107613 -192436 -166354 -299185 -461375 -122953 -16462 -434010
2667 -434010 -335130 -43787 -150703 -281233 -203029 -186204 -81026 -310315 -339923 -75137
2657 -75137 -201408 -296520 -8855 -164593 -247962 -104366 -260900 -240597 -166556 -301839 -232139
2646 -232139 -57824 45348 44465 -295202 -252338 46694 -226438 -241738 -41701 -196563 -178273
2635 -178273 -175500 -281655 -93568 -193034 -231485 98115 -89570 -415880 -42694 -325883
2625 -325883 -208252 49863 -330704 -341081 84134 -120291 -382377 -81684 -103389 -140611
2615 -140611 21294 -289867 -108575 -258980 -379156 59680 -200899 -370181 -138376 -38620
2605 -38620 -154846 -285424 -513904 -158331 -110720 -113608 -83489 -204824 -209813 -86634 -194922
2594 -194922 -319208 70337 -245446 -166542 41616 -338185 -342740 10440 -196726 -106452
2584 -106452 -132152 -287231 -170068 -84082 -406560 -39958 -154277 -259640 -141534 -186911
2574 -186911 -131267 -216035 -341139 -159087 -75346 -291188 -92315 -146528 -239792 -20869 -252025
2563 -252025 -280984 -60597 -214949 -123998 -79021 -287532 -167483 34858 -280143 -261835
2553 -261835 -61987 -176425 -87125 86225 -177992 -336369 -221183 -185176 96910 -263350
2543 -263350 -299835 -271965 -227017 -234697 -243086 -240918 -181043 -120617 -334885 -161789 -90395 -261605
2531 -261605 -47862 -148172 -340927 29877 -203138 -74052 -140203 -455534 -131275 -157346
2521 -157346 -442548 -326406 -117512 -18920 -250753 30271 -220715 -296910 -361765 -248798
2511 -248798 -125589 -103097 -412613 -31246 117385 -218988 -240430 -196937 -69956 -68018 -293749
2500 -293749 -86217 -79713 -230880 -257155 -418415 -451546 -74368 940 -37933 57002 -385131
2489 -385131 -339846 -195445 -237054 -224607 -268866 -58628 -205902 -337264 -216791 -146147 -153687
2478 -153687 -312337 -48547 -70823 -281249 -147864 -147828 -290183 -275986 -48642 -202566 19223
2467 19223 -28439 -209300 -386309 -254677 -49746 -203994 -358363 -250680 -23950 -299272
2457 -299272 -245365 -184790 -104368 -88067 -142960 -5035 -268165 -252766 -315543 -324373 -182452
2446 -182452 -118826 -164647 -292346 6889 -17958 -388064 -316087 -26491 -33094 -349867 -269249
2435 -269249 -275421 -222734 -215835 -363228 -347893 -192935 -88625 -22260 -9810 -172710 -149633
2424 -149633 -179286 -252996 -233990 -71536 -113267 -97253 -285325 -471769 -258670 -215569 -267379
2413 -267379 -90787 -189259 -176795 -446316 -119987 -54693 -155672 -160496 -212347 -371450 -376936
2402 -376936 -245263 -144495 -231135 -9983 -144911 -159415 -40368 -195234 -155431 -219385
2392 -219385 12140 -281694 -304544 -322606 -320022 -112891 -53067 -234795 -201264 -223580 -143312
2381 -143312 -243992 -169324 -86286 -221017 -314422 -224338 -217117 -186359 -232028 143676 -348657
2370 -348657 -338839 -191790 20668 -237141 -413436 -190370 -95866 -158889 -188599 -305564 -128297
2359 -128297 -181963 -264635 -289288 -93897 -251424 -261943 -184884 -271997 -399541 -200400 -175785
2348 -175785 -88253 -321027 -277987 -126688 -99422 -186638 -249645 -396678 -216208 -286034 -218693
2337 -218693 -192475 -80729 -302134 -306504 -175719 -141800 -93015 -147589 -247413 -201223 -184596
2326 -184596 -154871 -219190 -195919 -91375 -168482 -279729 -254329 -84741 -94731 -67956 22657
2315 22657 -309199 -263120 -77002 -265152 -159118 -311374 -244561 -147330 -196562 -123915 -408481
2304 -408481 -339201 -129057 -120565 -207955 -215794 -44831 -162158 -419965 -277287 -151610 -191099
2293 -191099 -164457 -296805 -394619 -393390 -72969 -160715 -171263 -245854 -218850 -30305 -238748
$$ [...]
##END NTUPLES=NMR SPECTRUM
##END=
