##TITLE=abcd
##JCAMPDX= 6.0         $$ Bruker NMR JCAMP-DX V2.0
##DATA TYPE= NMR FID
##DATA CLASS= NTUPLES
##ORIGIN= UXNMR, Bruker Analytische Messtechnik GmbH
##OWNER= root
$$ XWIN-NMR		Version 3.5
$$ Wed Jun 11 16:38:09 2025 Russian Standard Time (UT+4h)  servis@DPX200
##.OBSERVE FREQUENCY= 200.131235884673
##.OBSERVE NUCLEUS= ^1H
##.DELAY= (6, 6)
##.ACQUISITION MODE= SIMULTANEOUS
##.ACQUISITION SCHEME= undefined
##.AVERAGES= 32
##.DIGITISER RES= 18
##SPECTROMETER/DATA SYSTEM= spect
##.PULSE SEQUENCE= zg
##.SOLVENT NAME= CDCl3
##.SHIFT REFERENCE= (INTERNAL, CDCl3, 0, 16.5164)
##AUDIT TRAIL= $$ (NUMBER, WHEN, WHO, WHERE, WHAT)
$$ ##TITLE= Audit trail, XWIN-NMR		Version 3.5
$$ ##JCAMPDX= 5.01
$$ ##ORIGIN= Bruker BioSpin GmbH
$$ ##OWNER= servis
$$ F:\spectra/data/av/nmr/H1/1/audita.txt
$$ ##AUDIT TRAIL=  $$ (NUMBER, WHEN, WHO, WHERE, WHAT)
(   1,<2025-06-11 16:36:56.40 +0400>,<servis>,<DPX200>,
      <created by zg, POWCHK disabled, PULCHK disabled
       configuration hash MD5:
       00 E9 B6 7A A2 85 ED C7 34 08 36 98 17 FE 4E 26
       data hash MD5: 32K
       33 CA 4C 03 5F 8B 76 B4 9A 14 8B CD 41 35 3C 05>)
$$ ##END=
$$ 
$$ hash MD5
$$ 39 FF D9 17 A0 B4 0D B5 F9 8E 25 C5 07 BB C5 52
##$RELAX= 
##$RELAX= 
##$RELAX= 
##$RELAX= 
##$RELAX= 
##$RELAX= 
##$RELAX= 
##$RELAX= 
$$ Bruker specific parameters
$$ --------------------------
##$DU= <F:\spectra>
##$EXPNO= 1
##$NAME= <H1>
##$PROCNO= 1
##$TYPE= <nmr>
##$USER= <av>
##$AMP= (0..31)
100 100 100 100 100 100 100 100 100 100 100 100 100 100 100 100 100 100 
100 100 100 100 100 100 100 100 100 100 100 100 100 100 
##$AQSEQ= 0
##$AQ_mod= 1
##$AUNM= <au_zg>
##$AUTOPOS= <>
##$BF1= 200.13
##$BF2= 200.13
##$BF3= 200.13
##$BF4= 200.13
##$BF5= 500.13
##$BF6= 500.13
##$BF7= 500.13
##$BF8= 500.13
##$BYTORDA= 1
##$CFDGTYP= 0
##$CFRGTYP= 5
##$CHEMSTR= <none>
##$CNST= (0..31)
1 1 145 1 1 1 1 1 1 1 1 1 1 1 1 1 1 1 1 1 1 1 1 1 1 1 1 1 1 1 1 1 
##$CPDPRG= <>
##$CPDPRG1= <>
##$CPDPRG2= <>
##$CPDPRG3= <>
##$CPDPRG4= <mlev>
##$CPDPRG5= <mlev>
##$CPDPRG6= <mlev>
##$CPDPRG7= <mlev>
##$CPDPRG8= <mlev>
##$CPDPRGB= <>
##$CPDPRGT= <>
##$D= (0..31)
0 2 0 0 0 0 0 0 0 0.06 0 0 0 0 0 0 0.0002 0 0 0 0 0 0 0 0 0 0 0 0 0 0 
0 
##$DATE= 1749645415
##$DBL= (0..7)
120 120 120 120 120 120 120 120 
##$DBP= (0..7)
150 150 150 150 150 150 150 150 
##$DBP07= 0
##$DBPNAM0= <>
##$DBPNAM1= <>
##$DBPNAM2= <>
##$DBPNAM3= <>
##$DBPNAM4= <>
##$DBPNAM5= <>
##$DBPNAM6= <>
##$DBPNAM7= <>
##$DBPOAL= (0..7)
0.5 0.5 0.5 0.5 0.5 0.5 0.5 0.5 
##$DBPOFFS= (0..7)
0 0 0 0 0 0 0 0 
##$DE= 6
##$DECBNUC= <off>
##$DECIM= 32
##$DECNUC= <off>
##$DECSTAT= 4
##$DIGMOD= 1
##$DIGTYP= 9
##$DL= (0..7)
0 120 120 120 120 120 120 120 
##$DP= (0..7)
150 150 150 150 150 150 150 150 
##$DP07= 0
##$DPNAME0= <>
##$DPNAME1= <>
##$DPNAME2= <>
##$DPNAME3= <>
##$DPNAME4= <>
##$DPNAME5= <>
##$DPNAME6= <>
##$DPNAME7= <>
##$DPOAL= (0..7)
0.5 0.5 0.5 0.5 0.5 0.5 0.5 0.5 
##$DPOFFS= (0..7)
0 0 0 0 0 0 0 0 
##$DQDMODE= 0
##$DR= 18
##$DS= 0
##$DSLIST= <SSSSSSSSSSSSSSS>
##$DSPFIRM= 0
$$ [...]
##$SUBNAM0= <"">
##$SUBNAM1= <"">
##$SUBNAM2= <"">
##$SUBNAM3= <"">
##$SUBNAM4= <"">
##$SUBNAM5= <"">
##$SUBNAM6= <"">
##$SUBNAM7= <"">
##$SUBNAM8= <"">
##$SUBNAM9= <"">
##$SW= 20.6817932712277
##$SWIBOX= (0..15)
0 0 3 0 0 0 0 0 0 0 0 0 0 0 0 0 
##$SW_h= 4139.07284768212
##$TD= 32768
##$TD0= 1
##$TE= 0
##$TE2= 300
##$TE3= 300
##$TEG= 300
##$TL= (0..7)
0 120 120 120 120 120 120 120 
##$TP= (0..7)
150 150 150 150 150 150 150 150 
##$TP07= 0
##$TPNAME0= <>
##$TPNAME1= <>
##$TPNAME2= <>
##$TPNAME3= <>
##$TPNAME4= <>
##$TPNAME5= <>
##$TPNAME6= <>
##$TPNAME7= <>
##$TPOAL= (0..7)
0.5 0.5 0.5 0.5 0.5 0.5 0.5 0.5 
##$TPOFFS= (0..7)
0 0 0 0 0 0 0 0 
##$TUNHIN= 0
##$TUNHOUT= 0
##$TUNXOUT= 0
##$USERA1= <user>
##$USERA2= <user>
##$USERA3= <user>
##$USERA4= <user>
##$USERA5= <user>
##$V9= 5
##$VALIST= <valist>
##$VCLIST= <CCCCCCCCCCCCCCC>
##$VD= 0
##$VDLIST= <DDDDDDDDDDDDDDD>
##$VPLIST= <PPPPPPPPPPPPPPP>
##$VTLIST= <TTTTTTTTTTTTTTT>
##$WBST= 1024
##$WBSW= 30
##$XGAIN= (0..3)
0 0 0 0 
##$XL= 0
##$YL= 0
##$YMAX_a= 471808
##$YMIN_a= -371141
##$ZGOPTNS= <>
##$ZL1= 120
##$ZL2= 120
##$ZL3= 120
##$ZL4= 120
##$ABSF1= 10
##$ABSF2= 0
##$ABSG= 5
##$ABSL= 3
##$ALPHA= 0
##$AQORDER= 0
##$ASSFAC= 0
##$ASSFACI= 0
##$ASSFACX= 0
##$ASSWID= 0
##$AUNMP= <proc_1d>
##$AZFE= 0.1
##$AZFW= 0.1
##$BCFW= 1
##$BC_mod= 2
##$BYTORDP= 0
##$COROFFS= 0
##$CY= 19
##$DATMOD= 1
##$DC= 2
##$DFILT= <>
##$DTYPP= 0
##$F1P= 11.0000007629395
##$F2P= -0.999999237060547
##$FCOR= 0.5
##$FTSIZE= 0
##$FT_mod= 4
##$GAMMA= 1
##$GB= 1
##$INTBC= 1
##$INTSCL= 1
##$ISEN= 128
##$LB= 0.05
##$LEV0= 0
##$LPBIN= 0
##$MAXI= 10000
##$MC2= 0
##$MEAN= 0
##$ME_mod= 0
##$MI= 0
##$NCOEF= 0
##$NC_proc= 0
##$NLEV= 6
##$NOISF1= 0
##$NOISF2= 0
##$NSP= 1
##$NTH_PI= 0
##$NZP= 0
##$OFFSET= 16.51637
##$PC= 1
##$PHC0= -269.0715
##$PHC1= 1.101538
##$PH_mod= 0
##$PKNL= yes
##$PPARMOD= 0
##$PSCAL= 4
##$PSIGN= 0
##$REVERSE= no
##$SF= 200.13
##$SI= 16384
##$SIGF1= 0
##$SIGF2= 0
##$SINO= 400
##$SIOLD= 16384
##$SREGLST= <1H.CDCl3>
##$SSB= 0
##$STSI= 0
##$STSR= 0
##$SW_p= 4139.07284768211
##$SYMM= 0
##$S_DEV= 0
##$TDeff= 0
##$TDoff= 0
##$TI= <>
##$TILT= no
##$TM1= 0
##$TM2= 0
##$TOPLEV= 0
##$USERP1= <user>
##$USERP2= <user>
##$USERP3= <user>
##$USERP4= <user>
##$USERP5= <user>
##$WDW= 1
##$XDIM= 8192
##$YMAX_p= 0
##$YMIN_p= 0
$$ End of Bruker specific parameters
$$ ---------------------------------
##NTUPLES= NMR FID
##VAR_NAME=  TIME,          FID/REAL,        FID/IMAG
##SYMBOL=    X,             R,               I
##VAR_TYPE=  INDEPENDENT,   DEPENDENT,       DEPENDENT
##VAR_FORM=  AFFN,          ASDF,            ASDF
##VAR_DIM=   16384,         16384,           16384
##UNITS=     SECONDS,       ARBITRARY UNITS, ARBITRARY UNITS
##FACTOR=    0.0002416,     1,               1
##FIRST=     0,             0,               0
##LAST=      3.9581328,     0,               0
##MIN=       0,             -371141,         0
##MAX=       3.9581328,     471808,          0
$$ Real data points
##PAGE= N=1
##DATA TABLE= (X++(R..R)), XYDATA
$$ [...]
4603 -557 -129 774 449 -369 -574 185 583 -23 -693 -349 641 442 -454 -584 273 720 -96 -565 -222 650
4623 650 466 -517 -528 347 729 73 -775 -105 637 367 -538 -588 265 769 -120 -583 -117 675 246 -570 -372
4644 -372 389 623 -245 -705 1 688 408 -620 -598 449 576 -107 -791 -68 681 439 -451 -462 472 625
4664 625 -267 -767 -56 789 143 -558 -536 331 656 -261 -589 14 585 246 -618 -433 480 521 -250 -693 73
4685 73 815 230 -575 -409 586 612 -393 -674 205 801 154 -748 -406 545 660 -354 -659 176 703 88
4705 88 -710 -339 525 574 -456 -709 329 790 -19 -710 -247 666 499 -341 -592 93 704 -18 -775 -294
4725 -294 630 498 -505 -608 376 694 -22 -819 -65 718 510 -386 -632 426 677 -85 -729 -194 642
4744 642 430 -483 -485 271 675 -77 -734 -128 654 338 -518 -606 365 576 -163 -801 -6 656 239 -623 -513
4765 -513 380 727 -82 -715 97 812 245 -560 -500 442 576 -262 -613 -31 772 326 -746 -425 631 515
4785 515 -202 -803 69 726 191 -744 -364 546 629 -268 -592 244 705 49 -749 -321 624 560 -296 -743 28
4806 28 790 132 -710 -317 592 504 -469 -633 157 610 66 -617 -381 657 565 -307 -526 329 622 100 -679
4827 -679 -133 611 396 -315 -509 276 710 87 -715 -163 616 409 -394 -627 354 769 -35 -711 -170 620
4847 620 481 -476 -548 217 569 -26 -733 -103 571 376 -572 -523 335 692 -143 -668 -124 798 356 -572 -558
4868 -558 409 638 -247 -717 -51 753 177 -552 -503 362 725 -97 -602 -32 797 289 -644 -439 408 730
4888 730 -192 -723 26 655 144 -663 -416 580 594 -212 -535 24 658 227 -652 -370 558 497 -379 -626 16
4909 16 624 106 -635 -286 433 654 -251 -648 168 707 75 -602 -386 604 512 -512 -506 229 675 118 -664
4930 -664 -257 686 399 -374 -634 343 721 47 -741 -208 627 436 -432 -584 156 677 -72 -825 -99 689
4950 689 488 -364 -611 337 619 -117 -690 -166 549 288 -499 -557 256 654 -232 -654 -35 677 350 -741
4970 -741 -504 446 545 -102 -635 113 723 319 -619 -489 477 627 -199 -798 -139 706 227 -571 -517 508
4990 508 637 -206 -838 -20 797 234 -702 -493 444 652 -309 -767 62 741 161 -695 -387 582 574 -356 -628
5011 -628 110 684 30 -610 -362 643 593 -495 -784 184 771 168 -719 -183 576 629 -433 -683 171 693
5031 693 216 -716 -264 638 418 -385 -599 302 823 7 -676 -303 701 515 -468 -695 375 814 -58
5050 -58 -784 -323 652 533 -516 -657 289 649 39 -534 -227 672 384 -524 -477 315 652 -104 -614 -79
5070 -79 628 404 -552 -544 439 772 -124 -739 -69 846 342 -480 -673 433 824 -129 -709 -173 705 215 -597
5091 -597 -560 360 507 -220 -752 88 727 288 -650 -465 429 564 -152 -757 -34 739 92 -792 -448 529
5111 529 501 -264 -743 -97 699 309 -621 -338 626 553 -339 -661 148 758 120 -709 -425 505 667 -445
5131 -445 -636 151 765 52 -794 -291 738 597 -447 -655 119 767 84 -847 -397 549 510 -397 -598 129
5151 129 651 60 -678 -300 728 625 -397 -605 244 678 -29 -552 -303 507 488 -552 -678 368 826
5170 826 128 -664 -201 696 595 -532 -602 441 596 21 -825 -159 726 343 -539 -574 341 749 -253 -680
5190 -680 -188 665 463 -555 -632 338 595 -239 -685 -119 699 331 -615 -568 446 641 -224 -732 -64 807
5210 807 212 -539 -504 478 597 -237 -790 86 759 285 -656 -465 592 679 -314 -686 112 700 84 -673
5230 -673 -367 498 593 -240 -749 80 746 120 -665 -402 571 545 -376 -747 71 743 124 -638 -317 544 503
5251 503 -415 -719 106 665 -13 -773 -260 612 633 -516 -657 270 741 51 -748 -125 773 632 -431 -643
5271 -643 280 760 -30 -732 -193 641 529 -509 -613 231 670 -74 -715 -135 618 498 -609 -566 340 588
5291 588 -48 -699 -102 625 459 -572 -441 453 733 3 -850 -32 645 344 -490 -556 398 641 -178 -720
5311 -720 -72 803 379 -528 -464 426 616 -174 -797 49 698 183 -647 -437 422 560 -251 -780 102 691
5331 691 156 -656 -338 386 557 -222 -556 63 699 135 -657 -418 448 561 -374 -754 141 622 99 -620
5351 -620 -387 604 502 -446 -640 140 636 151 -601 -325 646 355 -406 -712 150 686 40 -586 -238 656
5371 656 517 -559 -622 159 821 -44 -717 -196 641 439 -507 -711 152 670 -61 -699 -220 637 360 -453
5391 -453 -547 170 617 -142 -792 -272 601 458 -520 -499 299 541 -147 -675 -80 595 448 -495 -332 404 707
5412 707 -86 -614 11 671 211 -640 -434 413 732 -222 -620 -23 634 330 -598 -496 532 647 -170 -615
5432 -615 35 741 227 -658 -418 456 702 -312 -730 -24 707 94 -674 -434 601 584 -354 -747 37 707
5452 707 89 -599 -356 562 358 -427 -690 104 665 119 -639 -364 798 619 -314 -542 139 646 58 -618
5472 -618 -328 653 444 -400 -642 194 675 -46 -568 -249 464 419 -389 -670 240 583 -100 -656 -170 545
5492 545 373 -504 -593 189 592 -69 -790 -188 623 392 -624 -538 412 776 -41 -786 -143 769 251 -562
5512 -562 -577 422 680 -155 -576 -82 775 399 -498 -398 442 593 -137 -757 -11 614 278 -660 -552 416
5532 416 601 -265 -692 38 630 251 -606 -522 541 642 -254 -734 38 660 151 -745 -443 479 533 -341
5552 -341 -758 32 733 86 -600 -288 444 669 -210 -572 -1 720 198 -674 -250 599 449 -317 -627 21
5572 21 690 85 -724 -334 483 532 -394 -595 75 670 69 -701 -256 489 485 -426 -634 184 675 -14 -597
5593 -597 -127 623 411 -409 -564 176 669 -51 -713 -151 715 487 -548 -632 382 596 -19 -706 -120 724
5613 724 297 -520 -453 411 692 -106 -834 -60 549 381 -401 -725 229 692 -60 -771 -99 613 424 -643
5633 -643 -538 406 650 -131 -556 -44 657 267 -554 -460 478 586 -186 -708 46 727 336 -629 -459 355
5653 355 637 -15 -739 -71 723 243 -545 -510 379 529 -337 -656 -84 663 249 -544 -352 379 555 -347
5673 -347 -667 101 574 129 -681 -514 418 527 -444 -606 93 679 172 -696 -178 462 586 -316 -594 175
5693 175 757 18 -749 -389 479 492 -462 -617 341 675 4 -545 -41 688 510 -448 -541 339 662 -167 -610
5714 -610 -176 649 355 -366 -553 262 672 31 -650 -74 550 383 -472 -559 178 545 -41 -749 -146 530
5734 530 386 -550 -474 287 677 -143 -668 -134 635 460 -446 -474 381 578 -228 -701 -20 672 300 -561 -385
5755 -385 455 695 -70 -624 148 689 191 -569 -461 546 514 -144 -642 -106 522 194 -619 -388 522 567
5775 567 -181 -618 34 520 83 -613 -540 462 436 -335 -695 54 562 51 -601 -370 454 450 -371 -595 123
5796 123 772 141 -526 -173 510 479 -258 -595 138 747 -107 -678 -166 500 465 -318 -548 252 672 -7 -551
5817 -551 -149 425 410 -486 -481 304 520 -30 -545 -131 556 367 -384 -613 311 629 -68 -690 -214 609 345
5838 345 -531 -529 234 532 -116 -585 -39 679 264 -447 -426 430 750 -123 -621 -67 651 378 -470 -439 309
5859 309 456 -143 -596 157 602 241 -686 -314 412 577 -308 -634 112 654 199 -621 -472 420 535 -336
5879 -336 -650 73 528 148 -390 -387 588 501 -234 -575 231 704 82 -582 -276 441 440 -420 -562 163 622 158
5901 158 -551 -345 508 443 -328 -568 180 737 -53 -550 -362 436 414 -401 -464 101 579 41 -646 -345 440
5922 440 475 -481 -652 320 704 -55 -625 -141 655 325 -446 -569 320 606 -151 -689 -166 559 338 -518
5942 -518 -485 286 526 27 -485 -196 666 403 -504 -523 277 571 19 -718 -35 578 389 -521 -489 369 672
5963 672 -67 -582 24 609 190 -683 -436 340 532 -270 -731 -38 635 243 -497 -400 372 637 -219 -681
5983 -681 -12 633 350 -600 -466 450 546 -326 -599 41 586 212 -575 -253 396 551 -178 -622 168 617
6003 617 221 -557 -336 443 389 -248 -650 28 673 48 -620 -316 576 558 -411 -529 221 660 65 -757 -326
6024 -326 366 384 -367 -652 299 618 8 -642 -204 514 519 -432 -519 322 676 -9 -804 -167 713 357 -356
6045 -356 -498 343 752 36 -670 -165 542 541 -451 -378 368 567 -111 -675 -227 581 297 -367 -530 310 627
6066 627 -72 -789 -114 632 261 -564 -339 381 479 -185 -762 37 496 145 -530 -552 372 519 -177 -599 -65
6087 -65 666 266 -562 -307 408 600 -191 -674 -12 592 146 -620 -350 464 533 -276 -612 -39 605 201 -526
6108 -526 -420 538 462 -301 -605 -41 637 3 -521 -263 403 433 -283 -453 53 672 257 -611 -216 490 436
6129 436 -322 -508 255 682 -6 -549 -249 616 414 -402 -583 140 588 -43 -569 -295 565 396 -244 -491
6149 -491 363 523 -29 -658 -226 450 348 -443 -492 307 603 66 -609 -202 399 358 -482 -420 248 497 -140
6170 -140 -695 -201 525 448 -489 -578 275 631 -140 -585 -125 699 346 -360 -508 410 511 -182 -599 -222 545
6191 545 310 -431 -409 383 609 -91 -496 73 577 225 -438 -292 442 547 -250 -472 -55 609 156 -653
6211 -653 -315 438 459 -254 -613 88 534 86 -509 -104 331 389 -102 -515 0 551 65 -661 -273 473 418
6232 418 -262 -515 153 566 136 -441 -165 475 385 -296 -527 112 573 26 -599 -195 473 397 -305 -596 189
6253 189 512 -52 -555 -193 531 379 -322 -491 312 411 -19 -576 -172 413 403 -460 -365 202 555 -105 -521
6274 -521 -196 439 287 -424 -428 287 588 -169 -631 -133 562 347 -465 -316 398 476 -90 -557 52 584 318
6295 318 -489 -338 329 397 -262 -713 -28 686 251 -494 -395 288 490 -227 -551 -17 577 159 -446 -355 413
6316 413 393 -287 -529 94 526 71 -586 -257 374 400 -291 -506 182 658 130 -466 -130 489 425 -377 -459
6337 -459 163 559 91 -599 -130 467 416 -363 -452 205 562 115 -449 -176 379 334 -401 -434 70 419 28
6358 28 -592 -197 519 330 -460 -584 246 451 -104 -429 -96 479 261 -444 -296 258 526 -92 -637 -126
6378 -126 464 287 -361 -406 382 605 -179 -437 23 631 309 -359 -375 334 502 -174 -534 39 449 220 -571
6399 -571 -287 409 486 -158 -623 -58 491 114 -360 -296 338 365 -255 -660 -71 509 61 -532 -321 335 375
6420 375 -157 -411 -27 569 207 -534 -380 295 501 -269 -452 154 494 232 -573 -376 521 365 -217 -552
6440 -552 175 543 156 -454 -271 430 408 -288 -537 121 447 -26 -520 -162 521 540 -266 -459 206 544 -152
6461 -152 -532 -120 486 276 -389 -431 160 499 134 -489 -103 565 505 -350 -412 250 531 49 -539 -141 441
6482 441 276 -255 -416 272 483 -90 -401 -112 499 431 -395 -304 283 585 -35 -502 -39 531 204 -485 -415
6503 -415 159 486 -142 -598 -26 541 313 -380 -446 319 477 -170 -628 36 444 112 -451 -367 295 381 -199
6524 -199 -499 -17 591 189 -419 -148 302 518 -173 -485 45 427 40 -462 -281 438 462 -233 -396 119
6544 119 508 41 -417 -281 329 355 -188 -383 13 395 120 -414 -165 407 344 -247 -556 75 404 109 -339
6565 -339 -115 382 471 -204 -429 155 530 76 -560 59 331 313 -340 -339 194 538 13 -381 4 351 355 -235
6587 -235 -374 146 451 99 -536 -84 385 247 -425 -353 298 390 -38 -469 -136 449 236 -410 -472 171 387
6608 387 -110 -495 -210 472 177 -349 -443 209 306 -102 -341 64 499 166 -400 -305 230 318 -123 -371 -13
6629 -13 493 208 -400 -270 265 302 -146 -381 -3 322 209 -383 -176 155 317 -166 -398 104 443 18 -537
6650 -537 -297 350 185 -252 -378 143 473 48 -455 -238 256 400 -183 -449 134 387 152 -304 -178 386
6670 386 319 -235 -467 201 298 35 -342 -128 337 321 -284 -195 121 451 -56 -428 -172 381 206 -263 -397
6691 -397 139 491 -33 -490 -131 476 153 -314 -348 142 210 -80 -406 -119 347 270 -281 -258 311 432 -65
6712 -65 -386 -42 415 178 -259 -334 229 424 -182 -396 72 525 109 -358 -222 290 337 -257 -406 -104 441
6733 441 136 -337 -191 244 292 -186 -470 -47 414 124 -453 -98 248 326 -98 -449 28 482 72 -361 -145
6754 -145 198 243 -142 -468 45 377 30 -402 -166 293 367 -192 -319 64 447 32 -262 -145 226 261 -242
6775 -242 -382 204 348 195 -399 -125 357 161 -328 -308 103 327 -7 -428 -18 298 170 -252 -255 17 273
6796 273 -1 -383 -114 393 298 -397 -195 166 426 -36 -418 10 336 216 -285 -253 279 366 -110 -299 13
6817 13 383 84 -199 -251 387 376 10 -259 75 456 129 -260 -351 229 346 -147 -309 88 433 101 -303
6838 -303 -364 156 242 -162 -376 60 417 67 -347 -308 254 292 -241 -451 82 342 105 -353 -186 155 313
6859 313 -237 -404 122 347 68 -437 -97 202 147 -128 -274 159 449 32 -365 -84 260 253 -119 -408 139
6880 139 302 -23 -364 -234 245 194 -257 -321 145 260 -16 -409 -101 394 302 -206 -432 106 294 -168 -464
6901 -464 16 212 104 -310 -342 186 348 -98 -371 -127 256 207 -378 -257 94 253 -18 -324 -81 302 106
6922 106 -179 -241 76 228 -17 -467 -52 321 131 -230 -274 181 320 -16 -413 -17 339 32 -389 -300 91
6943 91 198 -135 -359 34 264 82 -187 -220 401 303 -177 -332 66 388 141 -279 -124 172 347 -204 -231
6964 -231 96 361 98 -295 -59 287 305 -150 -148 13 432 44 -421 -122 248 104 -174 -236 78 299 -187
6985 -187 -171 -163 245 175 -276 -339 -41 363 37 -217 -136 306 137 -301 -256 147 275 64 -273 -10 218 132 -192
7008 -192 -238 122 326 -26 -239 -172 267 122 -212 -181 258 356 49 -283 -2 150 85 -67 -298 143 277 -125
7030 -125 -267 -129 295 109 -304 -210 171 224 -16 -314 28 284 166 -332 -199 228 260 -63 -266 -35 122
7051 122 151 -302 -111 221 285 -167 -301 95 246 118 -265 -132 225 208 -86 -209 -20 283 141 -249 -250 184
7073 184 261 -119 -325 -8 257 72 -159 -98 236 116 -143 -344 170 218 99 -362 -149 345 86 -58 -333
7094 -333 47 324 51 -244 -149 228 207 -126 -244 -46 297 -61 -243 -102 215 255 -148 -229 150 254 -60
7115 -60 -346 -45 226 220 -102 -122 107 140 -10 -183 -96 127 110 -160 -213 178 264 -85 -294 -3 185 174 -321
7138 -321 -228 -31 178 57 -270 -18 117 128 -255 -143 128 195 -94 -200 202 234 199 -216 -11 210 127 -13
7160 -13 -351 20 224 -7 -248 -102 232 115 -53 -50 2 285 151 -64 -178 171 258 -96 -261 -101 295 -37
7182 -37 -231 -168 256 125 -110 -155 24 278 48 -247 -114 189 141 -79 -230 154 166 -18 -222 -10 160 205
7204 205 -134 -128 120 369 142 -206 45 214 114 -147 -233 131 209 33 -193 -29 116 122 -213 -152 32 109 -67
7227 -67 -211 -16 151 200 -168 -200 134 120 -161 -338 -25 146 41 -123 -146 109 208 -73 -138 48 109 100 -80
7250 -80 -36 260 169 -103 -226 49 239 144 -74 -109 193 128 -10 -286 -139 109 -55 -177 -40 190 138 -80
7272 -80 -173 -7 262 137 -128 -216 81 93 -129 -164 98 199 71 -253 -131 125 28 -85 -163 31 203 65
7294 65 -152 -130 265 179 -168 -110 52 200 68 -231 -23 100 167 -163 -160 127 201 -41 -261 -12 218 153 -142
7317 -142 -217 148 234 27 -175 -73 126 110 -265 -124 90 63 5 -128 16 137 165 -191 -168 220 130 -34 -64
7340 -64 -30 80 49 -238 -191 111 126 -97 -129 56 180 -23 -9 -102 210 120 -179 -72 87 240 29 -100 -81
7363 -81 150 217 61 -248 79 208 -2 -148 -205 192 205 -70 -74 -5 150 -105 -256 -74 117 109 22 -241 34
7386 34 59 8 -94 -41 179 131 2 -135 116 244 37 -275 10 73 58 37 -56 78 194 -22 -226 -61 68
7409 68 187 -126 -286 54 205 -25 -284 -27 74 -18 -62 -45 54 245 42 -136 69 80 -25 -75 -216 -87
7431 -87 182 -19 -198 -93 95 83 -73 -221 114 141 -49 -168 2 214 75 30 -107 161 231 -20 -49 -25
7453 -25 104 103 -72 -47 245 179 49 -22 -33 165 -19 -109 -6 135 112 81 -92 35 51 90 -156 -108 -9 150 4
7478 4 -129 16 93 38 -133 -104 131 153 10 -208 -4 173 66 -155 -157 126 107 -117 -116 39 92 -5 -152 -1
7502 -1 58 180 60 21 50 113 40 -109 -97 77 -22 32 -92 -75 137 -28 -74 -158 169 72 -249 -134 -5 97 -183
7527 -183 -164 -10 120 109 -177 -70 93 95 -19 -97 -17 156 108 -131 -25 84 170 10 -22 61 87 -11 -63 -82 33
7552 33 -22 -48 -85 75 125 19 -65 -1 77 52 -19 -132 43 61 -77 -302 66 46 16 -72 -42 91 83 74 -122 -80 -23
7579 -23 70 -33 -179 55 122 -111 -22 1 -4 174 -4 -63 74 245 19 -7 -60 61 210 -190 -16 210 74
7602 74 -4 -33 12 -12 44 -119 -55 106 21 -25 -72 41 67 34 -37 -103 -83 40 -24 -53 36 47 24 -134 -17 18 148
7629 148 -36 -89 -20 155 31 -73 50 117 171 -41 -135 89 111 -97 -108 17 58 175 -22 84 -26 116 111
7652 111 -85 152 55 128 -49 -67 47 -1 46 -88 -57 60 24 -124 -78 42 62 1 -117 -42 9 144 -39 -12
7676 -12 162 93 -85 35 -24 -23 196 -73 -22 20 23 -65 88 -19 98 21 -32 -49 114 77 117 -75 103 -42 44
7701 44 14 -108 209 63 52 -158 -9 14 48 -20 -16 4 -74 -28 -138 -147 53 10 -23 28 -57 84 24 22 -15 -21 -76 -47
7729 -47 -125 -39 28 -88 -5 85 95 -32 -55 121 138 86 38 61 53 134 34 35 24 93 -47 -71 -57 38 194 -13 -89 -96
7757 -96 -49 -8 -24 -118 171 89 -16 -113 -14 52 36 -17 12 6 20 -6 -111 -86 34 45 -61 -170 68 198 -52 -80
7783 -80 49 135 14 20 23 108 48 -45 -64 -45 54 48 -90 -6 126 131 -78 -11 -3 -37 -14 -59 114 23 56 -46 -102 14 -53
7812 -53 68 -77 -24 -10 50 -198 -85 -5 23 13 12 10 105 172 -73 -177 -17 137 12 -1 90 -10 96 -42 -24
7837 -24 -20 77 -109 -17 12 8 79 -87 32 37 59 171 -161 16 37 7 -165 -101 36 83 6 -76 -3 90 -37 -131 -90
7864 -90 5 57 25 -53 -41 -52 61 -32 27 -3 -63 128 -33 67 33 -46 -83 -40 105 81 -28 -14 4 -90 54 113 20
7891 20 49 -31 -75 -121 -14 -2 9 -61 -5 51 40 106 -127 -62 -38 -33 -22 -44 -35 27 85 -98 -24 23 -119 56 53 42 -98
7920 -98 36 -76 18 23 48 -177 -126 21 49 -200 -107 41 -11 -42 -73 90 81 104 8 32 91 29 13 30 30 103 26 -10
7948 -10 122 38 -51 79 -96 48 22 -66 90 -187 42 12 30 -77 -68 -58 28 70 20 23 -64 62 93 -3 85 107 -62
7975 -62 29 93 53 35 -104 48 64 43 72 -59 37 34 -57 55 17 19 -48 -168 -34 -46 29 -57 -165 -6 27 29 -32 -126
8003 -126 73 23 -88 -45 -182 -12 -33 -9 -19 34 18 0 -74 80 -75 76 21 20 -35 152 5 -48 -35 93 -15
8028 -15 -35 41 137 15 22 101 98 -51 26 70 -73 38 -67 -2 82 14 94 -53 -32 -20 -8 32 -38 24 -5 10 -71 63
8056 63 -191 2 -37 -12 -24 37 -10 -68 -15 -33 104 36 -124 -79 -57 -106 -118 -10 -108 48 46 93 120 10 4 9 -61 72
8084 72 67 -66 -87 108 63 -18 12 -8 -40 67 -26 -122 29 11 116 -78 -51 -15 6 -111 52 108 62 -70 5 73
8110 73 86 19 -74 -54 -131 -41 -65 -60 30 27 138 22 -12 102 54 -24 -64 57 86 39 92 145 6 51 -44 -85 4 146
8138 146 104 79 36 87 -22 -54 -50 -41 140 13 4 7 68 86 -7 -65 22 98 -93 5 23 98 105 2 -80 155 151 129 -59
8167 -59 -8 -6 26 11 -71 18 155 -14 5 -78 90 -67 148 33 153 20 80 -23 -16 -65 15 -98 -5 129 53 27
8193 27 -10 -62 50 -9 46 2 -12 94 14 5 -24 38 19 -58 34 95 -74 3 -26 49 59 22 -35 -55 -13 123 -66 32
8221 32 110 -14 36 -110 -10 112 97 26 -33 -35 34 26 17 111 81 79 -31 -44 -27 76 -9 -73 -85 78 -24 6 -38 14
8249 14 -5 -147 -44 -86 -40 -24 -110 -66 -24 -15 42 40 -26 57 59 -23 27 36 0 -101 -57 -30 48 120 -52 -68 -23 -95 38 18
8279 18 80 86 95 58 12 81 33 -19 -51 108 106 -40 -58 -57 21 -70 -84 -24 -49 -105 110 -34 12 -13 118 -89 -14 -46 -8
8308 -8 40 12 -67 33 47 175 68 -90 78 -27 -40 35 -58 11 98 83 39 56 68 -33 73 73 21 174 63 30
8334 30 -85 -84 -55 82 -6 -80 -78 -3 -61 87 -88 20 30 -44 -39 -179 22 55 -43 -10 -17 10 52 5 15 19 54 16 -37
8363 -37 117 41 149 39 -32 -54 -62 128 -19 13 3 149 6 12 77 -48 72 -26 33 121 26 25 -70 11 122 64 -48
8390 -48 4 -12 -85 103 -41 34 -116 115 -50 -70 97 -24 -9 39 -78 -16 7 -70 -5 33 46 -16 80 24 42 149
8416 149 62 71 52 115 92 25 -32 97 1 -3 17 -57 132 -50 -2 -105 59 -34 -91 -114 74 -4 -68 -16 35 67 65 22
8444 22 6 55 19 46 60 54 60 24 -59 -69 50 -55 -70 -43 -15 103 -24 -5 88 39 95 23 5 15 86 101 -28 122
8472 122 164 -28 20 -28 36 -21 -40 -71 -56 56 44 -16 16 47 20 -141 -40 -34 31 -20 -35 -180 15 14 -76 -40 -134 7
8500 7 -162 -9 -16 141 -49 -21 7 -26 24 -56 -28 -72 -23 229 78 19 40 72 -60 -42 28 118 62 176 -60 -30 56
8527 56 170 3 21 -20 34 -79 -24 -27 3 19 8 39 68 49 -54 60 37 14 32 -39 -45 -23 63 -30 -111 -36 37 -5 -44
8556 -44 30 30 66 43 -43 -38 89 123 -31 -35 87 -46 -77 112 49 154 -140 -82 19 -58 60 -86 45 86 128 -2
8582 -2 -144 -4 26 38 -3 -134 -2 -88 66 -30 26 7 -74 -50 -136 80 131 -68 -110 -114 46 112 -120 -89 -43 110
8608 110 -15 21 -107 20 56 33 -60 105 6 98 -106 -50 40 87 66 -106 5 14 75 -18 45 -38 -133 -120 90 135
8634 135 -69 -79 -33 18 64 -86 -85 -131 80 21 9 2 -9 163 -30 -160 28 112 61 -141 -26 12 86 -90 30
8659 30 -53 114 75 11 -13 92 194 22 85 -71 25 -41 3 -12 -4 145 -20 51 71 -1 59 -39 -17 10 -43 26 -23
8686 -23 -45 104 87 -76 -36 -29 -71 -5 -45 -9 130 2 -31 -16 30 -16 48 -48 39 -6 33 -67 6 62 -86 117 -116
8713 -116 -29 65 -14 -33 15 -6 138 -2 -101 -98 55 22 -113 22 52 143 -11 -55 -5 -101 -13 -68 -85 -21 -40 1 -160
8740 -160 -11 101 -41 -20 37 -48 95 -52 13 -48 -38 -33 -67 27 41 151 -210 -26 126 -84 27 -50 110 45
8764 45 17 -146 42 -31 36 -39 150 -108 91 -70 -33 44 41 78 -27 -79 65 72 55 -146 -44 -51 -16 -77 -39 -26 -34
8791 -34 -9 -38 -58 -7 47 -47 60 114 168 21 -26 -85 3 94 -40 -40 39 -10 -69 -31 34 39 -107 59 -45 -5 125 21
8819 21 -50 -28 222 -66 -23 -103 74 162 67 -56 125 139 15 -95 -110 -72 -46 66 -31 -28 123 132 -65 -5 -16 -68
8845 -68 -25 18 -49 34 8 -68 25 48 111 50 -110 -67 199 22 44 -21 98 55 -58 -14 -76 48 38 -83 -68 49
8871 49 14 -14 -58 -47 95 16 -50 -66 -68 -9 5 -95 -89 122 72 -87 21 30 -14 -132 -157 -185 98 75 -58 25 29 60
8899 60 -6 -42 57 100 77 -50 34 45 63 6 -134 108 97 70 12 -17 -33 47 -29 -31 101 107 -64 -25 -83 109 63 -23
8927 -23 -177 -120 93 94 -48 18 190 58 -69 -84 78 58 -17 78 60 83 98 -8 -114 6 -29 47 -50 -22 68 95
8953 95 -85 61 80 168 -97 65 -18 23 59 -34 -68 -86 23 -88 -89 -95 135 67 -5 -110 45 13 36 -82 -98 -1
8979 -1 60 -81 -71 23 82 -30 -47 20 131 117 -54 -79 87 77 -82 -87 -51 182 91 -13 -78 43 31 -6 -29 185
9005 185 2 71 -47 -75 75 -17 -62 -172 40 44 19 -14 -13 23 -11 -32 7 -29 52 -16 -103 -33 65 -39 -91 -106 -82 79
9033 79 -12 -12 10 17 -46 51 -166 60 69 -18 35 40 81 106 71 -45 -21 48 -43 -27 42 125 -81 -61 -17 17 61 29 -92 -30
9063 -30 -38 -72 -18 65 -20 58 4 -233 88 57 -39 -128 -215 69 87 82 -129 -108 129 171 103 -41 35 81 2 -102 -74 94
9091 94 53 21 -181 -53 31 -28 -38 -59 102 -3 -47 -66 94 105 124 9 56 42 42 -31 -82 84 94 -20 -9 -73 -95
9118 -95 64 -72 -38 74 29 -53 -21 -62 84 -33 -154 174 58 -126 43 -99 152 -7 -27 -69 -74 80 92 -69
9142 -69 -1 -17 76 -56 -67 -24 143 166 -33 -10 64 -139 -20 31 -147 94 2 -78 -117 -51 64 -49 -63 -89 156
9167 156 59 -104 -199 15 160 40 12 -13 80 23 -3 -151 -131 -108 -29 -71 -175 -21 22 -14 68 -57 113 -37 -78
9192 -78 -87 -64 73 -12 -54 -35 124 31 -108 1 60 -4 -70 -65 88 -22 -76 -28 -22 -1 74 -137 -65 -48 -46 -64 29 78 108
9221 108 39 -115 101 63 52 -121 -106 69 -22 -30 44 -80 78 27 -78 -130 51 175 42 -61 -44 -25 152 -86
9245 -86 -7 94 103 -61 -112 7 117 33 -87 60 -50 63 -85 -38 -13 28 -42 14 -33 56 40 -41 15 -82 126 -68
9271 -68 -72 -183 -98 -53 49 -120 -5 -7 42 -95 -68 -43 25 -24 -47 -22 -87 37 -13 -10 125 17 79 -66 -94 161 17
9298 17 -28 -32 11 26 -132 -160 -45 -3 -83 -150 10 -23 -85 -129 2 56 91 107 -47 -15 94 45 -134 -97 74 -18 33
9325 33 -178 -158 35 8 67 -123 31 76 -34 22 -59 -55 95 -146 -22 120 120 24 -23 43 -20 67 -50 -9 254 85
9351 85 103 44 77 33 -13 206 19 -27 -63 -8 -47 -86 -32 42 -15 -142 19 66 -42 -89 106 48 29 19 46 17 73
9378 73 -6 -21 -74 55 -59 -38 -97 -52 100 -48 -37 3 -11 8 1 -95 92 138 -90 -73 67 64 -68 -54 146 -7
9404 -7 58 -16 -151 8 158 111 -132 -21 13 60 -42 -57 -31 5 16 -5 -8 128 150 -16 -130 -61 94 53 -70 0
9430 0 58 134 91 -27 95 18 38 -86 2 98 69 -167 -58 58 213 160 -98 -37 32 28 -56 -33 46 -55 -84 -63 -19
9457 -19 -4 95 -17 -18 71 -7 -22 -34 -108 89 54 -134 34 134 -49 58 -85 10 137 75 -46 -73 105 95 -72
9482 -72 -67 123 -72 -66 -56 55 90 75 26 -28 22 72 40 -16 119 -28 68 9 -131 -58 -29 81 -74 -46 131 44 -60
9509 -60 -95 -18 35 -40 -72 -68 13 -19 102 -93 -23 111 -26 -58 -102 -10 44 97 -23 78 48 1 -87 -74 161 -18 36
9536 36 5 16 134 22 -45 140 97 96 -153 -32 15 139 97 -145 4 15 71 -28 3 122 101 -58 -77 5 33 -19
9562 -19 -28 12 61 43 -39 -78 -118 -6 79 -15 -6 83 56 -88 26 7 109 146 -135 -38 111 181 88 -35 14 77 58 51
9590 51 -75 92 118 79 103 4 61 58 13 -53 52 42 37 -57 -54 141 65 27 -48 25 -53 -16 -1 115 113 18 -87 -95 78
9619 78 -26 55 -11 -104 96 65 -86 68 -42 4 94 -60 59 -32 7 -16 -88 47 -63 7 -149 116 171 -75
9643 -75 -133 -48 143 -13 -139 10 116 25 -5 57 9 -35 62 -25 29 53 -81 -66 -83 -114 -3 12 -133 -21 -34 54
9669 54 -128 -146 26 140 31 -101 84 63 50 100 -13 29 126 -36 -79 -34 23 123 -9 72 -12 -69 128 -38
9693 -38 -116 75 128 -24 -31 -76 -29 0 -163 -155 24 19 -91 24 148 -8 -45 -103 -54 -6 22 -49 -95 70 -2 -15 -103
9720 -103 101 152 -28 -10 -161 -26 25 -21 31 61 97 70 -62 65 58 35 -49 -63 115 125 39 -17 -24 -27 -20 22 -86 -22
9748 -22 15 8 4 -21 10 128 -97 -4 -20 41 10 -108 -95 20 33 72 -38 -175 54 -64 -84 62 50 32 -123 -88
9774 -88 51 67 41 -108 -24 5 60 -20 -116 49 -31 119 -78 10 50 3 11 -20 -69 124 -29 -127 -17 41 52 -27 -32
9801 -32 29 -71 99 -144 43 -87 -71 -30 -27 -24 97 7 39 -6 84 -88 -50 -1 18 123 -12 -104 60 115 222 -17
9827 -17 -52 54 66 56 -55 18 -43 34 41 -103 43 39 -64 -63 -4 111 95 -64 146 -26 -14 10 -159 -27 79 16
9853 16 -84 -61 105 -104 -94 -36 -94 144 2 -125 9 56 71 12 -84 14 9 48 -74 -100 36 79 110 -87 162
9878 162 170 -32 -73 -93 73 107 51 -48 -12 10 46 17 -60 -29 21 33 -81 -31 101 38 -111 -28 96 82 -47 -88 -70
9905 -70 1 72 -136 -92 2 79 17 96 29 25 82 4 -55 39 -9 1 -11 40 90 29 -187 20 30 6 -98 -22 92 54
9933 54 -18 -63 -82 161 68 27 -57 -46 -2 105 -183 -29 135 39 -29 -38 -36 24 95 -9 30 10 82 -44 -35 65 15 -64
9961 -64 -105 -8 10 75 21 21 -58 100 61 40 105 1 43 7 130 -54 -46 5 14 41 53 101 -84 5 44 72 -36 -143
9989 -143 61 51 -58 -44 -8 -29 -142 66 -35 61 -65 43 -69 -39 -79 -40 -26 -86 66 90 45 9 -71 41 65
10014 65 44 -27 -21 188 -54 20 62 11 6 -6 -12 -4 52 33 -40 51 97 39 -11 -80 53 58 -10 -1 -88 -2 60 -203 -67 -39
10044 -39 33 -43 -153 42 10 44 -54 -43 -83 -41 -31 -91 -8 -68 -115 -34 -74 70 160 -24 90 13 64 -25 -100 -60 97
10071 97 86 -65 -39 60 16 24 -147 -84 -16 -54 -39 -103 30 38 -81 -95 14 80 -61 -159 100 -115 29 -59 49 -48
10097 -48 -20 -25 -95 25 6 -5 31 -62 -68 -12 32 45 -79 54 61 1 -104 52 148 89 51 -13 -64 21 49 -1 140 77
10125 77 -40 -95 -106 -76 47 91 -1 -37 78 86 -16 -89 -1 46 -78 -10 42 -67 -82 31 -17 84 31 6 -18 -77
10151 -77 72 -85 -72 -58 63 28 1 -48 -92 76 140 -11 -16 -55 -40 -35 -46 4 -2 -24 -4 112 85 42 -16 -30 -14 125
10179 125 5 46 -64 25 100 3 -114 -37 61 -59 -62 -24 -6 -88 -31 -55 53 5 13 -36 -39 48 91 -28 25 27 127 8
10207 8 9 -9 157 97 41 9 27 101 50 -23 -23 94 103 20 -64 -6 -9 -6 -153 60 -65 10 24 -120 24 -36 -23 -47 -48 118
10237 118 33 -63 -34 114 138 -81 -143 -92 -15 -66 -94 -141 38 -41 -176 -27 -13 35 62 13 33 68 20 25 46 -87 24
10264 24 67 -105 11 12 29 -43 -92 141 7 22 -11 -30 56 -22 -100 -63 21 30 -96 -52 48 173 14 -121 -95 -114
10290 -114 -120 -35 -201 -108 -42 -24 82 -44 -103 40 -25 -99 -23 -3 135 -3 -18 53 36 -20 30 -90 65 -31 -43 -34
10316 -34 51 -52 40 103 -27 -9 38 -36 -99 78 110 23 -78 -9 82 45 -112 29 7 -47 -64 -59 2 6 70 -108 -113 12
10344 12 1 -6 10 -18 94 36 -119 21 17 45 -64 20 50 69 -39 39 -69 -19 60 121 -76 -53 59 -76 93 -32
10370 -32 -17 150 -39 -96 86 76 -2 11 -36 -30 -73 -92 -119 22 40 -30 -141 -69 23 55 30 3 -121 91 -30 -19
10396 -19 62 44 2 -6 18 123 -11 -67 -49 -12 80 -117 -38 -76 98 -62 26 -83 -39 27 19 -40 -73 -44 63 -38 -95
10423 -95 -35 41 24 -40 -157 -60 126 -25 -57 -60 11 35 -143 -4 -53 -70 -7 -84 73 28 -49 -124 -64 128 82 -26
10449 -26 -7 -53 43 -42 -5 -7 44 68 -22 71 64 27 123 64 4 -81 -30 26 -24 -16 -20 -79 24 48 115 47 -140 -117 -15 -22 -104
10480 -104 -127 -76 116 -81 -120 -136 4 111 -99 -113 -51 17 95 -174 -34 -99 -25 -76 11 -56 132 28 39 -54 60
10505 60 14 -94 -65 -45 61 142 51 53 78 147 -14 -59 -5 1 42 26 -53 132 9 -6 -155 43 127 17 -98 -157
10531 -157 9 -24 15 -88 13 42 85 -33 -25 18 7 104 25 54 17 16 -20 -29 14 -21 -49 5 83 44 17 11 105 100 -8
10560 -8 26 10 12 52 110 -66 -108 49 100 34 32 113 36 60 -10 -43 92 28 -106 -70 17 122 -12 -126 -52 -161 0
10587 0 -24 19 106 -25 -75 -113 101 217 3 -15 -7 46 108 -185 -125 25 13 101 116 31 70 95 -1 -18 -77 121 -58
10614 -58 -59 16 -16 184 -132 -200 -101 49 11 -69 -72 21 174 -82 -51 -37 42 12 -120 -166 52 81 -110 -135 108 143
10640 143 1 -80 -107 155 83 0 51 46 54 91 22 -194 16 13 -98 -37 53 157 -57 -85 -70 90 -56 -154 17 154
10666 154 13 44 33 -50 91 58 -9 -38 112 -52 41 3 10 -66 131 -72 -181 -6 -6 90 -109 45 -25 -1 -126
10691 -126 -52 -62 147 30 -127 105 27 139 -55 -47 105 54 7 22 -33 110 122 -13 -177 -13 10 57 -36 -118
10715 -118 -94 31 -174 -50 68 8 -106 -35 -73 5 -15 -48 -21 -74 96 1 -34 -14 98 46 -100 12 -64 59
10739 59 166 11 42 -67 88 -11 22 107 71 87 -23 98 85 31 -13 -127 57 -31 -28 -61 79 -62 -72 2 -104
10764 -104 -10 16 -65 -141 -77 -9 4 -101 36 30 4 -88 -58 6 -15 183 -28 -53 92 7 -9 -113 136 17 -4 -18
10790 -18 55 96 72 -54 -104 76 -14 -8 73 19 65 19 -50 -54 68 114 -84 47 30 -12 -9 43 -66 22 86 -38 -75 35
10818 35 36 -140 11 -154 38 -1 -186 -31 -98 -19 -83 -168 -126 -26 -33 -209 56 -114 35 21 -70 -33 76 73 -96
10843 -96 -176 19 19 52 -66 -9 93 40 -8 -70 62 -57 -68 -32 -60 78 94 -139 82 -21 1 120 -116 15
10867 15 38 49 -65 -36 -18 -73 -20 -90 -58 -18 48 -74 -35 32 4 -27 -43 -48 -7 46 -17 10 110 96 -51 12 41 11
10895 11 13 -56 81 59 121 33 -31 85 105 32 -85 -183 64 33 -92 -73 -69 61 34 10 26 87 25 -45 -99 33 52
10922 52 -11 -156 -33 65 81 -100 -34 31 -8 61 -104 -84 124 20 -109 -110 -95 28 -52 99 -55 109 -24 -180
10946 -180 -9 -39 166 36 -77 28 46 52 -98 -45 -18 -7 7 -117 -115 -17 14 -112 -109 44 -117 -81 0 -99 30
10971 30 13 -50 21 -80 72 -27 86 -6 75 2 -1 -19 37 25 -23 -146 -40 34 50 11 -53 48 21 54 -56 60
10997 60 107 100 -6 -22 37 32 39 19 41 6 -14 -114 -88 -14 63 0 -174 -19 18 101 25 12 29 49 44 -79 41 -67
11025 -67 3 -43 -92 21 98 81 -8 -33 -78 -12 -67 -48 65 84 -94 -131 3 24 -11 -19 -45 -8 137 55 -99 46 44
11052 44 -23 -89 30 -32 94 -57 -1 15 -33 22 -197 -9 2 37 -128 -67 51 79 -56 -27 -65 109 48 -213 105
11077 105 38 50 86 4 -18 46 149 -43 3 -32 136 43 15 148 46 96 48 71 -6 -33 -55 -182 41 -84 -75 -110
11103 -110 79 -74 103 -83 -94 -27 36 33 -55 -72 51 46 -34 -11 26 -35 -38 -80 15 67 61 46 -53 -9 13 -54 -55 19 67
11132 67 6 -12 -54 -34 117 76 -63 -25 142 284 10 33 64 125 -24 -10 -18 -58 76 8 -15 -9 97 22 -56 26 99
11159 99 -4 -28 -126 50 -6 26 5 -129 -170 121 35 -13 5 19 83 -132 41 106 -51 15 -59 72 8 -32 -39 -74
11185 -74 10 -38 57 -84 -49 -54 -80 76 -61 80 68 -38 -42 43 37 24 -49 68 23 20 -47 15 27 108 -58 -134 1 -95
11213 -95 81 -19 -150 40 155 -37 114 37 -74 11 -29 35 -51 72 134 -21 67 46 66 48 -48 35 133 -59
11237 -59 -57 104 70 -12 23 -90 45 18 45 -39 -91 60 -63 -113 -163 74 -55 32 -7 -2 68 -9 -59 -92 -32 67 76 -120
11265 -120 -6 115 -58 -51 -94 62 8 -33 -165 -59 133 -8 -14 -3 61 108 -141 -36 52 13 -2 57 11 98 -8
11290 -8 -85 -19 41 43 -88 70 47 110 66 -56 -4 -37 -56 -102 -69 23 46 38 -125 30 107 -47 -10 7 53 167 -72
11317 -72 74 61 -84 87 108 -70 99 87 -68 -15 -2 75 -74 -41 -51 190 74 136 36 -7 -8 -35 -48 22 -154
11342 -154 80 64 -39 21 -18 -33 83 33 14 27 -28 -133 -14 37 31 -73 56 -155 -76 -35 -45 84 38 39 -33 -53
11368 -53 -16 59 -87 -14 -136 52 74 -22 -18 49 95 -47 -8 102 114 -29 -38 -33 -81 29 -86 -77 131 191 1 77 -155
11395 -155 -21 38 -45 -47 -82 60 4 -30 -90 -95 -69 -116 -79 -155 -29 29 -40 -36 -28 35 48 58 27 20 12 -94 -3 -5 71 12 -78
11426 -78 60 20 71 -51 33 93 41 16 -4 22 31 91 -200 45 16 -23 2 -61 -66 -76 -41 69 -18 -47 23 -126 -46 -79
11454 -79 -81 -130 -33 -90 95 -75 -77 -228 -23 41 30 -35 -81 -4 2 22 -122 75 -2 77 23 -34 96 -24 -16 -34 44 30
11482 30 26 -51 -46 -14 -17 -27 -94 59 -79 70 -113 -22 -36 115 -126 -51 43 -69 19 -54 42 6 17 5 -199 -124 39
11509 39 -95 -72 58 -4 -106 -3 -53 43 -1 -15 24 -61 6 98 -14 -75 32 99 14 0 112 209 39 -38 27 -1
11535 -1 -6 38 42 11 -3 -158 -18 107 -14 8 -73 -97 -1 10 -37 2 -17 1 4 -89 -170 -40 -79 7 99 6 -40 -25 8
11564 8 -34 -9 -44 -85 -47 110 43 28 2 -27 10 -6 16 -155 -53 59 -22 36 -88 -11 -57 23 -78 -24 104 2
11590 2 90 -146 -107 -81 -70 -36 -18 -5 11 -137 -46 -71 87 -23 -35 37 -168 -8 -27 -77 -17 41 28 -22 50 41 23 -17
11618 -17 -23 34 66 19 -27 98 47 80 73 -10 39 120 -47 87 83 44 -106 -58 8 0 -20 93 -101 -38 -70 28 19 -17 -3
11647 -3 93 -49 -77 59 -19 -7 5 -145 -56 133 -31 -38 -99 70 89 -14 -54 187 18 23 72 82 -11 0 -78 23
11673 23 -26 88 -18 25 36 -14 46 -83 23 -31 -26 -1 -57 -51 -8 -46 -32 43 -43 -53 15 -36 -24 -11 -118 18 22 39
11701 39 32 8 -57 39 -116 -106 -26 -82 44 50 20 -3 -12 47 -20 11 -49 163 72 -50 51 97 119 -30 -29 12 -75 25
11729 25 -70 54 -34 151 -2 31 35 41 -87 -1 9 33 -16 -6 116 -130 38 -75 -4 -33 -109 -154 -28 -45 38 69
11755 69 -62 15 -29 141 97 48 -91 88 14 18 62 60 37 -33 27 -77 -40 43 -21 69 -89 -54 -4 6 -4 69 57 -5
11783 -5 -66 -5 -38 -71 -94 6 42 -74 -89 -29 61 -126 4 -174 -109 -8 30 -24 -26 65 120 40 -124 81 36 -19 -101
11810 -101 78 15 9 -12 -15 48 -26 78 -2 -73 65 40 -65 -199 -116 -54 72 -45 -49 -40 -42 -89 -99 -142 -45 38 21 -86
11838 -86 -43 81 -50 -57 41 74 67 -81 22 32 -16 36 -96 23 -38 -40 -141 -175 50 32 7 47 -115 175 6 23
11864 23 -110 4 41 -7 -18 114 6 18 -30 -23 43 -57 -43 -159 -157 -25 -8 -74 -21 -91 70 -23 31 -62 20 -13 -44
11891 -44 -9 -25 -142 -50 -21 -27 17 -56 -134 15 2 -157 -5 16 -57 -46 21 -55 -102 9 16 -86 -50 104 160 62 72
11918 72 15 117 74 -29 -91 33 -6 19 90 -29 51 -71 -17 -52 -39 -52 -37 -22 -38 28 28 1 -5 16 44 19 8 -15
11946 -15 -44 -81 -50 -120 -36 15 91 -40 -234 78 -32 7 25 77 -27 26 46 30 78 16 -36 -108 35 116 6 -42
11972 -42 -55 99 -51 -53 75 40 102 60 -53 -72 11 -101 -100 -143 59 -9 -46 -29 28 53 12 43 -20 -23 114 -62 1
11999 1 -69 1 14 4 3 16 74 113 41 4 18 -110 -53 -35 142 50 -18 -45 1 31 28 -36 18 92 57 -115 18 -4 56
12028 56 -8 -79 -29 28 -15 116 -40 -64 19 44 55 35 38 -44 -65 -114 20 5 -130 -56 -37 9 37 -13 -38 109 33 -45
12056 -45 23 93 -54 0 -40 -134 -145 35 49 20 -47 96 -94 1 24 -3 -94 -27 21 -62 38 53 -3 -109 -48 55
12082 55 -166 -54 -62 88 -49 -35 -112 -45 -52 -42 -190 62 -75 -156 72 -9 128 -4 -52 43 -83 151 123 39 153
12107 153 -10 -47 48 9 -34 -104 45 -7 60 -12 -85 -53 -130 -49 -108 56 136 -61 -31 114 47 65 -23 -126 83 -29
12133 -29 10 -9 5 -41 -7 7 -34 -9 -10 -65 3 -52 -29 68 -75 12 44 -3 -10 2 -94 43 115 -12 3 -32 -57 46 21
12162 21 3 -85 2 17 43 81 -44 110 -39 -24 -91 -121 20 -85 -22 -34 -139 -65 -204 -120 -2 37 -53 65 7
12187 7 -49 47 3 17 86 74 -34 -42 28 -85 -149 -85 -1 -51 118 134 -89 -39 33 4 -42 68 -1 -32 -25 48 -77 40
12215 40 170 22 42 -27 -36 107 -23 -31 -4 86 19 30 -3 -68 36 -134 15 23 -36 -68 -74 75 20 -49 22 -91 114
12242 114 33 -13 -94 90 191 -88 -62 32 -2 4 2 69 28 -7 -38 -51 48 54 -38 56 -147 100 108 -72 -8 35 18 25 38
12271 38 -91 40 -38 -27 -42 -53 40 -34 -57 -74 -46 13 72 -129 -31 8 29 -37 -76 -117 118 -74 -79 24 28 64 -42
12298 -42 -12 92 50 -10 -52 31 -11 -28 -19 -25 -42 22 4 101 140 -58 -9 -71 20 -54 53 -47 -180 63 -21 -116 -42 -175
12326 -175 79 -48 -38 -123 -33 -37 4 -33 -66 -47 9 -40 42 104 -12 -162 25 61 -42 80 -88 -40 11 49 -40 -7
12352 -7 -49 -21 22 -3 117 -12 11 -12 42 60 30 -6 -48 -123 8 25 -54 -78 -48 -35 11 -26 -129 -8 89 22 81 -2
12380 -2 26 -51 -92 -36 -87 -9 2 70 72 114 31 38 -36 53 42 99 -40 -102 110 -3 -77 -92 -60 7 -79 -20 50 -38 19 -36
12410 -36 0 26 98 -45 -93 15 -20 -55 -98 -9 86 -62 -47 -99 -41 32 -65 -6 -44 46 -7 77 -144 -27 -105 -51 14
12437 14 6 106 80 -63 -20 53 108 7 -37 -14 84 44 71 23 27 65 1 -29 -74 10 -35 -29 -49 -63 12 -72 -58 -53 49 -39
12467 -39 -89 -16 -22 -18 -45 -23 65 -53 65 -17 -41 76 63 -18 9 -184 -19 -18 2 -39 97 27 47 103 -48 10 30 -115
12495 -115 -170 -39 68 0 -37 73 160 -26 -17 -14 -14 62 -60 67 26 125 26 -133 41 42 -7 -64 -99 -118 -10 -61 -26
12522 -26 -40 41 -75 -126 -62 6 38 76 -13 -50 104 -34 -100 -11 27 -1 25 41 3 -40 55 -10 -62 -91 37 83 64 -75
12550 -75 77 -46 -39 54 -28 35 -19 -71 4 -22 12 66 19 52 -42 -145 -1 -50 -102 -26 135 5 -145 6 -48 -67
12576 -67 -20 100 -67 10 -55 -4 39 -20 -20 -77 -91 1 69 -2 -14 -28 5 144 76 -27 -8 -3 -40 80 115 -42 -38 -54
12604 -54 63 22 -24 -26 33 -12 47 -19 -38 38 -172 0 -51 -174 -71 -52 -79 25 36 -6 -130 95 -65 65 -85
12629 -85 -27 15 3 -3 57 92 32 -33 22 2 65 79 110 -91 142 63 29 86 -103 -5 41 -34 -58 -17 38 56 -36 125
12657 125 -92 15 -122 15 21 6 -30 -63 -13 60 222 22 -63 -78 110 -22 -29 -26 108 -102 -42 5 46 -55 27
12682 27 -29 19 53 96 90 52 0 -26 62 -9 80 -95 -6 -32 -104 33 -18 -88 -60 -97 -7 -61 -82 6 18 87 -30 3 -35
12711 -35 -56 47 -99 -48 70 -26 -47 23 41 13 53 31 -52 7 156 150 -161 51 4 79 -19 -37 48 26 31 3 -77 91
12739 91 49 11 5 58 -62 -15 -66 14 9 -18 46 62 -37 -37 26 -102 68 51 -24 -92 -44 -144 45 -90 -40 -60 84 -48
12767 -48 -26 13 -11 114 57 -18 -28 67 -82 -73 -44 -8 141 -25 127 47 17 18 52 -71 109 35 -41 -99 -2 36 81
12794 81 -63 69 63 -3 66 0 -90 -88 20 91 -33 -28 -5 -35 -7 -52 -54 -19 -10 -150 3 40 -149 -82 -75 35 -4 131
12822 131 -51 39 88 8 -68 33 7 -5 10 -102 29 133 -7 -39 19 -68 60 -26 14 -24 35 -81 -84 -61 47
12847 47 12 -51 -54 53 147 29 -38 -9 183 101 -110 73 29 -100 -29 -23 -48 -40 28 -59 -52 15 60 -31 28 28 94 13 -52
12876 -52 127 13 54 -25 -132 -5 34 -36 89 51 -71 52 -96 -3 178 85 70 37 96 -3 59 -102 0 109
12900 109 133 -61 -37 -95 47 69 -39 -14 120 16 -127 -100 42 67 78 -40 -7 -11 10 -123 -16 39 -26 60 -77
12925 -77 -32 1 149 54 -11 42 144 -57 -25 118 100 62 -4 -38 71 69 17 -1 52 -52 9 -29 -12 -11 9 69 -17 -62
12953 -62 -1 -33 -119 41 -9 41 -43 19 -68 -14 57 8 -40 67 82 -36 49 238 6 90 -31 -86 129 8 83 -116
12979 -116 11 -77 86 -32 -39 -50 -7 -35 -95 -60 -4 -28 49 8 11 90 -50 -196 31 160 -21 -88 -66 26 -1 -73
13005 -73 -26 -76 -10 -170 -108 -22 130 122 -5 -18 -4 2 -65 -87 10 -25 65 9 -70 89 24 16 -4 -153 59 3 -86 -58
13033 -58 -48 -35 -120 -76 -46 -18 35 77 3 70 129 -69 -92 -15 -50 26 -33 -69 116 53 12 -93 13 -19 18 -7 -63 -23
13061 -23 -18 11 -200 67 191 26 -13 -77 -23 38 97 -53 3 24 62 -33 -61 118 16 54 -16 90 98 31 -27 43 18
13088 18 -127 -1 -46 48 37 41 74 2 -104 -32 -151 16 3 125 104 -25 27 62 29 -31 8 -28 -3 53 -49 127
13114 127 89 -154 125 30 1 55 -1 1 45 120 61 88 28 -50 47 -32 48 -13 96 -64 -30 -5 32 -5 -10 -70 41 21
13142 21 14 -131 -43 17 -5 80 -31 -99 178 -11 -46 -11 58 -35 -101 -77 -79 -19 -69 -93 -51 4 78 -206 -37 2 21 150
13170 150 15 -31 157 173 -55 -138 20 -20 3 -107 -61 6 110 -91 -47 15 40 -18 47 27 17 4 -111 18 -76
13195 -76 -103 -53 -72 28 124 -19 66 -45 19 96 -60 -57 -26 91 144 -12 -76 45 7 50 68 86 -34 -1 -96 26
13221 26 25 12 -17 -97 57 -23 69 -51 100 -68 10 -67 -62 -33 124 45 -60 -54 -11 24 62 -24 -43 58 28 -28 15 66
13249 66 65 -13 -100 62 -21 46 -31 29 -8 -25 -55 33 49 -40 60 -62 68 86 148 -21 -96 44 -26 151 -14 -77
13275 -77 82 78 39 -12 55 104 -35 -29 -40 -33 35 122 -69 36 85 -20 -96 -148 -59 -36 81 48 80 95 63 -121 -5
13302 -5 -15 57 -43 -42 5 147 -27 49 36 99 36 51 -12 56 10 33 -104 -67 32 -20 99 -98 31 46 128 -26 72
13329 72 53 204 23 -47 60 83 -74 28 -7 -13 -47 -234 -63 45 49 -68 -51 -23 -50 -9 -77 -18 55 111 29 33 82
13356 82 38 4 21 92 -38 77 91 -45 30 -16 93 -58 192 103 -41 -26 -42 10 99 60 -129 45 -48 132 -81
13381 -81 23 -55 -15 -50 -37 -20 4 68 -110 72 16 161 -94 -91 -10 95 10 -79 -19 2 72 -68 -49 -57 44 -39 26
13408 26 -29 107 -49 39 -109 -44 5 4 -35 -48 232 114 -73 -1 -48 71 -16 -10 6 -80 41 3 -11 39 89 26 14
13435 14 -182 -16 149 156 -91 28 -101 -87 39 -83 8 -27 -132 -94 32 49 -49 -6 -45 26 39 -42 -113 22 31
13460 31 -51 62 53 -25 63 68 -17 76 43 -43 -31 -10 106 24 128 -90 21 47 -12 -50 31 146 148 -50 10 62 46 -31
13488 -31 -19 41 138 66 -26 28 -36 64 -43 -53 -80 -65 70 -99 -132 40 4 -11 -25 -107 -18 67 -63 -126 19 56
13514 56 28 42 12 45 118 20 -55 117 29 -97 -43 -31 10 26 -29 12 -15 16 -47 -35 22 45 -63 -38 -104 121 53 -64
13542 -64 60 84 14 33 -34 53 13 41 35 -62 116 56 89 21 21 37 -9 -64 -17 75 48 36 33 0 68 12 -37 -18 12 44
13572 44 -58 22 -96 111 10 -89 -66 53 97 65 -15 -74 -20 23 -58 -163 14 91 61 -59 -5 -60 -46 31 -54 76
13598 76 110 -57 -4 -18 -34 -51 65 -84 0 104 20 -5 -77 241 124 -140 -37 109 66 -74 -45 47 44 4 -28
13623 -28 39 -63 169 22 -125 -92 65 37 -32 -67 -98 78 -120 -83 -127 23 91 -7 -121 -118 93 -25 -15 -48 46
13648 46 -29 -35 49 -17 -48 1 -98 18 28 147 -3 -18 45 27 44 -159 17 -73 62 9 75 47 -67 -7 -80 83
13674 83 25 -102 -37 -54 -26 36 -8 45 -33 26 103 23 2 -8 82 -52 -62 16 -17 41 -50 59 -113 72 74 43 13 -24
13702 -24 -16 -51 47 149 35 -18 124 -37 11 -18 -1 -49 156 8 102 33 -21 -27 -54 68 -14 -46 20 27 -92 -64 -103
13729 -103 -95 8 -64 21 -11 21 -23 80 42 118 -40 -68 62 -14 -48 -5 65 71 -35 -51 47 52 39 12 -16 26 65 105
13757 105 -30 -47 31 108 -29 84 94 61 35 -32 25 29 136 -77 -75 26 -42 5 -14 -31 1 -11 -109 -41 65 9 5
13784 5 -166 -139 -21 -98 -77 -15 0 122 -16 24 -22 185 80 -131 1 46 37 -57 -73 45 7 12 -57 3 -3 41 -24
13811 -24 -6 56 61 97 -13 -22 61 84 18 59 -13 65 77 5 119 48 45 -173 -38 -10 -32 -8 -36 -42 -10 114 -172 -39
13839 -39 -81 -13 -42 -14 -69 -99 86 84 4 -21 11 -28 28 1 50 -23 36 55 -11 107 59 76 34 74 -60 2 -54 2 38
13868 38 -13 -54 68 6 58 -50 -62 -70 -16 123 -39 1 11 114 34 -147 58 -3 -116 -155 -18 -24 96 -73 -79 -28
13894 -28 -52 16 -32 -76 -45 39 -149 -61 146 75 33 92 -16 79 46 -101 50 113 114 -66 -183 -16 122 -19 -53
13919 -53 52 -56 -27 -12 -7 0 -92 -46 -116 1 -49 -4 7 -121 -108 66 -1 57 -9 61 8 -68 -12 27 30 -132 -100 61
13947 61 54 61 -49 140 -24 25 72 -137 93 49 161 -20 -47 49 34 -54 -164 42 2 -40 24 -10 73 -72 -77 -97
13973 -97 -5 55 7 27 6 -30 72 -105 -96 34 -40 3 30 3 23 -57 22 -74 -44 48 70 7 -19 21 5 70 -49 -38
14001 -38 13 165 -47 -11 10 12 -84 -10 -67 151 -26 42 -74 -54 -13 -102 -77 -6 125 97 -141 -11 40 64 -198 -17
14027 -17 0 47 -143 -149 10 54 -25 -52 9 -53 -31 -73 141 -73 70 106 98 83 -77 138 40 17 -13 40 -3 67 -13
14054 -13 -77 -1 79 -20 -27 29 -13 -66 -66 9 -16 118 -94 -102 60 -7 -132 -143 -13 61 -75 -95 64 78 13 -206 9
14081 9 35 -37 20 -124 86 74 103 -32 -129 79 158 -122 99 122 56 -20 -10 -28 33 -108 10 -28 57 133 43 80
14107 80 -42 -13 -36 14 -74 72 107 -32 -28 -10 -79 -87 -30 -22 3 -44 16 -114 -83 110 -40 -25 -25 36 33 94 -104 32
14135 32 101 -8 -67 98 -81 73 -3 -38 -36 -38 -67 19 -85 90 88 72 -42 -30 16 64 -44 28 136 29 -140 -15
14161 -15 -42 -35 111 -60 -78 -67 47 -51 -77 118 -71 28 -72 7 82 31 92 -13 -100 -22 8 -106 -46 54 27 -30
14187 -30 -59 92 -84 40 4 -21 54 100 41 -47 82 69 5 -21 -5 24 81 -78 -103 35 14 -47 -48 21 57 78 -67
14214 -67 54 -96 -19 117 -12 -4 -102 -9 -105 19 7 -44 64 64 -54 20 38 -40 -7 70 104 2 18 157 131 51
14240 51 -114 -161 -10 0 -31 -20 28 -33 10 84 58 -16 60 47 49 -26 54 15 -87 41 -12 126 46 -22 73 -2 -105
14267 -105 -23 -50 74 39 -13 -119 -56 -5 -105 -79 -30 89 56 -33 -22 5 106 47 -151 36 144 99 -44 -25 9
14292 9 108 129 26 7 88 16 -62 -125 46 57 24 -14 -14 44 27 -25 -75 -45 -74 -72 -22 31 -120 -74 -83 -158 91 -115 13
14321 13 -5 -56 -13 47 -24 -52 -19 -101 -27 -58 -25 93 82 -32 -81 56 79 53 -21 16 -36 45 74 -11 71 -79 48
14348 48 -17 159 -108 -42 -43 -72 64 172 -26 -32 9 101 8 80 -50 -124 -116 -30 -161 -146 28 -102 -133 -47 -16 -6 0
14375 0 4 41 10 68 -10 2 70 13 13 74 10 -62 68 -60 -6 31 40 -20 73 35 154 211 -9 -37 116 43 -124 -94 19
14404 19 137 22 35 -19 51 25 17 -58 12 -5 -15 27 -143 48 3 -35 -31 -60 -12 36 37 -30 47 7 7 -14 -50 76 -55
14433 -55 -95 46 15 32 91 -40 60 190 11 -30 -21 -19 7 177 -49 -12 23 33 15 10 23 16 37 -118 -110 103 19 29
14461 29 -18 32 56 -157 -45 20 -48 -102 63 -27 99 -62 9 -112 -31 20 61 31 -14 66 123 86 -42 88 45 40
14487 40 -56 98 129 -88 68 57 -5 57 141 -100 4 4 23 -104 10 -108 -64 -25 -54 42 -76 -81 26 -78 -32
14512 -32 104 7 -160 68 16 -101 8 -52 -20 34 28 -18 -17 18 -89 -17 73 68 76 62 -140 56 -3 -20 20 25 17 81 -24
14541 -24 -74 -27 77 -65 -27 -70 114 -80 -28 -76 -45 -129 96 -45 -95 -7 90 -54 -41 96 100 36 -120 21 101
14566 101 203 32 -57 33 61 -124 -74 34 33 108 -2 -21 140 30 -60 -26 0 -95 -43 89 60 123 10 -70 -11
14591 -11 -13 56 107 -55 -68 31 74 -64 -168 -77 24 53 7 -7 -55 46 -98 -87 -86 -58 -40 -7 68 -114 68 -41
14617 -41 46 -123 -108 -109 106 56 75 -59 -109 -18 98 47 -136 -168 -35 -53 84 -82 -9 11 -94 -60 -16 -53 100
14642 100 113 -90 15 21 -5 15 -115 -85 39 10 -34 -100 0 43 6 -98 21 43 -53 25 11 -119 -60 2 43 17
14668 17 -64 18 -81 79 144 126 -59 15 -23 14 96 -30 0 -60 -15 -3 19 -135 63 -72 28 -73 18 23 -25 119
14694 119 -50 -22 150 -20 32 18 14 87 -18 -45 -8 -9 -98 86 32 -29 -81 -3 -41 38 43 14 54 175 128 -52 -152
14721 -152 131 118 10 110 -35 -34 14 100 26 -62 70 92 15 32 5 16 -19 -28 23 135 72 -95 -203 -44 -27 21
14747 21 45 -148 -10 -45 -88 -44 84 20 -39 -33 -4 7 -77 4 -23 -5 89 2 -62 22 26 28 111 81 23 40 -35 123 -26
14776 -26 16 79 7 18 7 49 -21 45 -21 87 -5 -31 -39 -30 -53 -13 50 12 4 -83 20 39 107 20 -11 -11 20 -65 -4 18 -4
14807 -4 -54 26 -47 -68 4 -5 1 30 -20 72 21 9 -14 46 85 15 -37 -13 -22 20 -47 -53 -31 86 5 41 71 77 -51 -90 65
14838 65 76 54 3 -25 -81 -5 -14 -63 19 13 -5 32 -22 -9 -18 -2 -72 -99 -143 115 -46 -102 0 19 -7 -17 54 -29 16 34
14868 34 32 117 20 37 151 40 23 -9 -60 56 123 39 -80 -61 109 3 -56 -35 -100 1 34 -116 -35 67 -21 -59
14894 -59 95 -113 -14 66 -21 37 29 136 78 35 -15 -51 85 8 64 -55 -18 -10 72 -27 56 83 32 -71 -71 31 -6 -6
14922 -6 39 42 86 -42 25 -24 84 -32 49 -15 9 -24 -98 10 5 2 5 58 0 -20 28 9 -39 -30 -13 42 -6 106 -78 -62
14952 -62 -23 79 -61 34 1 14 -13 -6 -13 47 8 -45 -30 152 63 -12 76 116 3 -24 25 59 48 -62 137 120 16
14979 16 35 -26 -29 108 76 6 -13 -66 -35 -8 -134 0 -45 16 -126 -20 -25 -11 25 -82 87 22 3 -30 18 31 95
15006 95 9 72 64 64 25 -47 7 14 94 87 25 69 1 63 30 83 190 105 7 -64 29 36 -38 2 -86 156 24 -10 -93 72
15036 72 -20 30 -83 -70 81 -122 22 -62 24 5 -72 -29 -20 116 34 -102 -69 217 77 -38 -4 2 35 30 50 -62
15062 -62 57 55 54 29 -75 -39 119 -13 3 97 -43 -15 -3 -91 89 36 42 37 59 87 -37 11 83 -2 134 -16 -25 -56
15090 -56 -36 -21 42 -45 -103 -33 -28 10 -46 86 -125 -112 145 -11 10 -30 45 134 -26 15 57 4 89 -76 75 50 -20
15117 -20 85 -42 80 -17 75 -53 -62 34 -4 49 -38 -55 -12 58 -30 38 33 -111 117 65 -179 -13 -66 43 -28 31
15143 31 42 -19 -41 -35 -18 -6 -2 -34 135 84 35 -15 37 110 65 -5 -28 -189 85 32 95 12 -3 5 107 -13 -32 81
15171 81 65 -15 -7 -22 46 -1 -93 -36 14 56 -50 -19 -16 40 -8 -58 -67 67 55 -32 35 -25 92 -77 -65 48 79 -117
15199 -117 12 18 -66 74 -145 -11 -62 -4 106 -173 57 12 64 16 174 51 105 123 -108 -125 -21 24 2 -10
15223 -10 15 -4 -71 -70 -27 18 -28 39 15 -30 -50 80 -117 29 46 45 -22 -110 -80 35 -100 18 10 -82 86 -3 33 37
15251 37 -11 -43 -57 110 90 51 41 -47 33 45 22 -39 -102 40 97 42 99 -12 -8 12 -75 -15 -38 43 -93 -74 -13 53
15279 53 52 -18 37 -38 -52 -47 -93 16 41 -82 -1 -32 -53 -124 -5 -49 63 45 53 -108 19 -13 -112 -23 171 0 -10
15306 -10 52 8 48 -32 -107 -24 116 -61 3 -33 24 106 129 -34 -76 -43 -19 -129 -29 -38 -31 19 -7 -120 -102 -16 8 -10
15334 -10 -18 -23 4 -101 18 -60 21 -56 -25 -122 -34 25 -50 114 -3 60 125 76 -83 121 100 -81 -5 19 53 100 1
15361 1 70 56 -32 -32 -69 -33 -103 -22 8 29 44 -42 -89 -50 -97 17 -55 -41 -26 -27 -16 90 108 5 11 -26 -60 -13 -57 159
15391 159 -26 -17 -123 -15 30 97 -59 9 32 -78 33 38 41 1 -19 20 26 -70 -52 -10 65 13 -52 2 -28 56 -45 -46
15419 -46 -49 103 119 -37 129 -134 -64 -115 -50 -146 17 -83 -85 54 61 -88 -30 44 -11 -73 10 -37 -58 30 -19 -19 -24 57
15447 57 -57 18 46 -80 107 46 26 10 56 117 12 77 61 -39 59 124 91 50 -11 11 -62 -115 -136 -67 29 -63 -18
15474 -18 71 -169 9 16 -40 -29 -47 -34 18 17 31 -89 6 -88 91 -36 -57 -17 -57 -80 64 22 -5 17 -100 21 -2
15501 -2 84 -95 -7 -75 -40 51 36 40 3 -1 -73 10 -32 -45 42 -46 19 72 -27 -8 -154 -135 -33 95 9 -74 -13 33 -18
15530 -18 -107 -84 45 21 -122 -84 94 78 23 43 -39 5 18 80 -74 -34 -43 83 21 123 -65 77 -11 92 52 49
15556 49 -44 8 20 57 13 -122 -110 82 22 -57 -30 -25 -52 -12 12 -92 -41 9 19 47 53 -32 -55 27 -43 6 -31 -27 84
15585 84 81 57 40 -33 -55 -54 -27 20 -14 -123 84 115 33 -98 48 6 31 44 -66 80 114 90 -54 13 -50 81 -7
15612 -7 -20 30 8 19 -3 -106 15 -11 -71 -94 29 -68 24 -141 31 -29 -130 -15 12 47 -44 11 54 -71 101 -47
15638 -47 -21 176 77 6 136 52 35 38 86 51 -51 -34 89 6 21 13 52 40 -24 1 73 -29 -22 92 32 -78 -12 0
15666 0 40 84 -100 72 96 -17 92 -23 -91 11 -77 122 47 -4 95 -10 34 -36 -36 58 -98 5 56 67 -95
15691 -95 31 -109 -5 -92 93 -37 -5 76 8 46 -61 206 -14 121 83 126 29 -4 79 -28 69 19 24 48 -122
15716 -122 -62 20 -7 102 38 29 34 32 -15 69 -75 -34 -15 69 -3 29 51 -10 114 -83 -9 -73 54 -59 -81 -63 13 26
15744 26 -87 -3 117 -18 -102 -35 -7 1 -38 -95 13 19 88 -185 82 39 -30 -81 -2 -2 -51 -49 70 -71 -39 -3 -74 -116
15772 -116 -95 35 -36 65 -146 -2 2 -84 -31 40 28 -58 89 -6 -54 -10 -18 -59 -24 -37 12 21 16 20 -29 -11 12 -72 -17
15801 -17 -8 1 -85 -49 -76 8 -26 -86 17 3 -17 -26 99 -36 23 -58 -46 -16 -60 -1 -10 51 24 -70 -43 -78 126 -79 2
15830 2 75 112 -15 149 220 129 42 20 -204 -36 -7 75 39 21 -8 -42 38 79 91 104 93 106 -22 74 161 -111 -142
15857 -142 58 -93 -2 -25 43 12 -118 27 -23 -68 -84 32 -44 -69 -35 -12 -76 -32 -9 -5 156 50 -19 -91 -91 94
15883 94 65 -68 -25 37 106 -54 -114 34 141 -22 -14 65 -73 -3 -34 -80 -48 43 84 80 -33 -99 -52 -16 -80 -30 -23 -38
15911 -38 36 74 17 75 -132 -23 29 -2 -16 -27 -74 -43 -11 -51 15 49 31 -121 -29 64 6 72 -7 73 -1 18 -3 23
15939 23 -100 8 67 -45 62 68 -11 164 68 -5 97 -52 38 27 -69 46 -15 -2 89 -72 26 -25 -16 -84 -54 -25
15965 -25 -16 57 -21 64 -74 -96 -121 15 26 -108 107 32 153 -56 -32 87 41 34 40 25 152 69 18 -47 -18 -75 145
15992 145 -47 -71 79 118 -57 32 -39 6 -130 -18 -1 -14 82 -70 -31 -40 -27 19 -60 63 28 36 -14 -40 25 122 -70
16019 -70 52 22 41 106 15 -16 31 69 -63 59 71 -11 32 92 -2 -43 35 -45 35 -26 0 8 33 -76 31 31 -65 -44
16047 -44 13 -32 129 18 97 -10 23 88 28 36 -47 -40 1 -7 90 114 -120 36 46 0 17 -15 -50 -122 -113 92 -20 10
16075 10 -87 39 76 -75 53 50 58 9 110 81 23 13 -82 -4 99 10 69 -51 85 7 98 25 78 52 25 15 -52
16102 -52 -29 50 -34 6 -76 32 113 5 -91 -14 -78 13 120 -49 -20 59 48 -71 11 70 90 -15 15 35 -103 -25
16128 -25 27 14 38 -51 -34 59 -26 -83 -32 59 -41 -48 -52 58 47 -110 -66 -75 54 23 -133 -9 -5 41 -33 -31 -93 16 74
16157 74 62 4 -98 -13 -82 -29 61 51 68 -53 -1 42 -65 -64 -20 -76 -40 -17 -129 -27 1 -133 12 6 18 88 30
16184 30 6 71 66 81 12 37 17 70 101 -95 -6 35 -110 13 -108 -23 -44 32 -75 -69 -48 47 -188 16 -39 -78 -94
16211 -94 48 33 -39 14 -71 -28 64 -141 68 50 -90 -97 46 -6 16 171 73 -33 55 -18 101 -38 36 -58 -19 97
16237 97 94 18 -43 56 71 -1 -34 -11 112 -23 -101 -61 -36 -34 -156 14 -62 -62 -97 -96 -24 -13 32 -1 14 -114 89 42 90
16266 90 -1 32 -27 -59 -36 -208 82 -25 -38 51 -22 5 23 -106 -51 28 -64 68 -6 -29 8 13 -67 68 -60 62
16292 62 -159 -16 -52 48 -37 -103 -74 19 77 -17 -45 -54 1 -68 -2 -57 -40 20 75 -1 -17 -30 91 111 39 -34 -37 -23 47
16321 47 -62 -41 -20 14 104 -94 -157 48 -5 31 151 106 55 7 143 60 22 -27 -60 -119 94 -17 -50 -81 8 25
16347 25 9 39 60 -16 -48 -123 28 -12 -27 -43 -19 19 -39 -15 32 -107 -46 70 100 71 -42 -68 -94 111 36 80 -24
16374 -24 -40 20 57 -5 14 64 86 63 75
16383G5
$$ Imaginary data points
##PAGE= N=2
##DATA TABLE= (X++(I..I)), XYDATA
0 0 0 0 0 0 0 0 0 0 0 0 0 0 0 0 -32 32 -32 32 -32 59 -64 64 -96 96 -128 128 -160 192 -202 226 -267 320 -352
33 -352 392 -449 512 -576 641 -705 800 -891 990 -1089 1213 -1340 1473 -1632 1794 -1980
49 -1980 2181 -2403 2644 -2917 3217 -3557 3939 -4372 4871 -5457 6140 -6965 7983 -9265
63 -9265 10940 -13246 16612 -22034 32194 -57875 265669 317475 -364944 -371141 47295 312587
75 312587 14781 -230762 -86746 197103 108126 -133118 -114678 154074 165630 -129431 -293093
86 -293093 -34972 254452 185120 -95431 -139590 39856 99126 -62134 -126613 32551 146968
97 146968 -857 -164260 -58305 168252 146874 -92110 -182137 -5434 128559 24911
107 24911 -94525 5580 148139 54030 -156649 -134185 103711 174646 -49294 -212618 -47024
118 -47024 190751 131548 -110781 -141248 64110 134349 -57727 -174732 10741 210271 86540
129 86540 -172034 -142739 129427 189446 -80856 -250656 -32785 237015 131606 -175856
139 -175856 -187801 116418 246656 -10654 -254743 -114367 176425 174824 -75737 -158653 28755
150 28755 146658 3041 -143585 -44790 119607 61132 -119885 -104581 101179 166071 -19080
161 -19080 -162426 -48244 120248 71387 -92337 -85849 73809 108517 -40543 -115718 11294
172 11294 117108 8818 -137291 -65136 122281 122537 -64151 -130099 29998 141820 7931
183 7931 -155776 -74389 126642 122318 -75849 -138177 36460 151953 7975 -163930 -79300
194 -79300 126824 121276 -77519 -132117 51155 163968 9165 -167649 -78938 127836 112805
205 112805 -95292 -145166 55072 180394 17970 -179581 -100349 126520 143310 -62396
215 -62396 -152989 6879 148795 52640 -107599 -73345 72654 68988 -73766 -97815 53807
226 53807 130732 -4538 -138472 -53124 114201 95082 -73164 -116622 26176 115701 16283
237 16283 -90092 -24495 86645 37753 -96683 -82664 69655 112380 -29012 -122996 -13644
248 -13644 119346 56027 -97948 -87222 67733 106052 -36251 -116119 8067 133395 44262
259 44262 -124535 -101950 75037 120870 -32623 -128497 -10928 122607 52274 -99207 -77062
270 -77062 78948 102307 -52253 -127734 8918 140994 52531 -116645 -98078 70310 112873
281 112873 -33699 -124375 -13717 111937 50355 -85779 -66328 71166 90834 -43634 -108787
292 -108787 4687 109759 35004 -92300 -61408 71257 80220 -50726 -103154 10384 100867
303 100867 20383 -92031 -45035 84622 80076 -53344 -96495 18294 97117 10134 -92077
314 -92077 -35124 84834 61990 -69577 -90128 37409 101058 -8288 -110056 -30887 105128
325 105128 77092 -69177 -96016 35086 104046 -2470 -104648 -32441 92816 61710 -73471
336 -73471 -86764 44320 100388 -14206 -111131 -28119 101204 68035 -69609 -84988 43095
347 43095 99486 -9124 -102641 -27614 88937 54258 -71371 -77635 45287 92125 -14768
358 -14768 -97887 -20809 87439 49220 -67144 -64916 51602 85935 -21406 -92840 -10540
369 -10540 86154 35095 -78685 -64486 55799 83404 -26773 -91535 -4871 87329 31515
380 31515 -76800 -53822 63545 79351 -34289 -88775 6139 90719 21577 -88354 -56050
391 -56050 66846 78605 -38712 -90123 9009 92969 22115 -84861 -49946 68877 74585
402 74585 -41344 -85779 14654 91546 15686 -88815 -50521 66132 68853 -43602 -82148
413 -82148 17290 88724 13616 -82314 -39563 70179 64221 -47527 -79711 21215 88075 10621
425 10621 -82774 -40542 63471 55151 -48399 -70788 27133 81731 777 -81030 -26228 75462
437 75462 54618 -56090 -75174 27901 83192 2076 -78632 -26989 66144 42196 -58184
448 -58184 -63585 38560 78878 -11240 -82845 -15240 81261 47495 -61526 -67835 35939 76371
460 76371 -11313 -78646 -12950 74456 35313 -66755 -61746 43755 76679 -16066 -80300 -10389
472 -10389 76989 38627 -59540 -54553 42002 66169 -23050 -76085 -3287 74915 28245 -66368
484 -66368 -52523 45647 65372 -23984 -71512 3241 75304 23461 -66855 -44880 54245 66392
496 66392 -30604 -78919 -1244 73724 25254 -62433 -43754 46405 54488 -32879 -66288 14204
508 14204 76421 15248 -71190 -41028 56695 63072 -29905 -69999 2813 61586 9981 -58883
520 -58883 -23661 56567 41513 -49548 -64140 29380 81674 5574 -78371 -36534 61790 58891
532 58891 -34842 -64103 13509 62445 74 -66550 -22295 61289 44376 -47679 -63686 23259
544 23259 72622 6885 -63833 -26254 51582 39510 -38111 -46972 27300 55933 -14479 -67486
556 -67486 -11473 64701 35739 -51947 -54380 32438 65721 -8396 -66075 -12292 63040 34327
568 34327 -50980 -51351 33668 63474 -11515 -68258 -15298 57592 30944 -47052 -44391 34504 57142
581 57142 -14463 -60718 -4881 59645 26313 -48254 -40619 32946 46920 -20329 -52032 7792
593 7792 56129 5596 -63422 -31561 56744 59134 -31783 -72315 1265 71294 28583 -52737
605 -52737 -43159 33909 47203 -21726 -52722 7906 56651 8245 -59558 -33252 47211 53546
617 53546 -22272 -56632 1758 52121 13296 -43704 -20695 40678 31123 -37561 -48103 23359
629 23359 61189 -851 -65526 -28406 51474 47170 -30484 -52913 13371 55850 4318 -52867
641 -52867 -18561 49044 35490 -39556 -52711 18171 57509 2674 -54531 -21105 44582 33121
653 33121 -32933 -40837 22219 48927 -6789 -50865 -8221 50010 25418 -42068 -39785 28457
665 28457 47283 -16707 -57140 -3549 58391 26402 -49307 -45875 31840 58992 -5951 -56544
677 -56544 -13715 47874 27241 -37209 -36059 26239 42159 -17100 -51886 -1295 53786 22806
689 22806 -44201 -39087 27661 46543 -9521 -43889 -312 43977 11490 -43253 -25403 38210
701 38210 40333 -27630 -56257 3245 56679 20128 -45223 -33885 31151 41516 -16543 -42796
713 -42796 6693 46241 6232 -47499 -23622 41184 40475 -26238 -51630 4144 48569 11598
725 11598 -41366 -22076 34295 31451 -25048 -37666 16867 46611 -1353 -49874 -17277 44037
737 44037 33314 -32837 -46728 13560 48957 2901 -46490 -17372 41279 31696 -29820 -40773
749 -40773 16675 47040 375 -45618 -15022 39723 27317 -31614 -38870 17196 42988 -4426
761 -4426 -45157 -10608 42248 26094 -32170 -35509 21216 43415 -5751 -44357 -8714 40985
773 40985 21152 -35179 -34094 22620 40723 -9741 -44196 -4890 42573 19310 -35305 -29997
785 -29997 26545 40257 -12105 -43436 -1986 42950 16144 -38350 -30520 25832 37273 -14367
797 -14367 -42187 446 42188 14106 -36594 -24927 29633 35565 -17258 -41053 4179 42906
809 42906 10286 -40307 -25263 30041 34394 -19041 -41388 4438 42426 10351 -37595 -21799
821 -21799 30785 32360 -18795 -36936 8150 40306 4716 -40213 -19710 32283 29691 -23138
833 -23138 -38280 9809 41429 4878 -38533 -16732 33357 28267 -23028 -34664 12499 39282
845 39282 456 -39600 -14360 33610 24261 -26895 -34311 14473 38814 -1316 -38527 -10602
857 -10602 36175 23638 -27232 -32254 16703 38196 -3425 -39041 -10239 34029 19930 -28608
869 -28608 -30137 18216 36091 -6233 -37642 -5750 36618 19058 -29348 -28133 20553 35647
881 35647 -8075 -38312 -5400 35142 15571 -31362 -27178 21442 33998 -9950 -36867 -1877
893 -1877 36788 15080 -30541 -23774 23346 32052 -12639 -36297 211 35484 10475 -33547 -23219
906 -23219 24990 31061 -14443 -35619 2415 36866 10609 -31683 -19714 25661 28552 -16215
918 -16215 -33757 4802 34783 5345 -34505 -18228 27452 27145 -18486 -33573 7066 36100
930 36100 6016 -32595 -15692 28072 25462 -19009 -31381 8734 33807 1508 -34848 -14553
942 -14553 28937 23761 -21064 -30936 10513 34562 1578 -33246 -11696 29958 22540 -21919 -29411
955 -29411 12156 33085 -2001 -34958 -11034 29753 20345 -23369 -27984 14287 32950 -2832
967 -2832 -32948 -7273 31597 18860 -24434 -26347 15637 31250 -5867 -34011 -6489 30545
979 30545 15499 -25957 -24503 17812 30785 -6802 -32032 -3207 31556 14358 -25695 -21864
991 -21864 19015 27835 -10626 -32443 -909 31566 10964 -28824 -21670 20876 28913 -10244 -31076
1004 -31076 428 31653 10438 -27252 -18684 21821 26023 -13897 -31863 1992 31929 8261
1016 8261 -29452 -19082 22325 26096 -13042 -29419 4311 31868 6810 -29002 -16032 24109
1028 24109 24610 -15711 -30625 4226 30586 5043 -29324 -15030 23770 22513 -16363 -27449
1040 -27449 7889 31306 3984 -28825 -13158 24052 20867 -16823 -26006 7737 27145 -1060
1052 -1060 -28575 -8562 26171 17612 -20922 -25176 12474 30543 -556 -29281 -8509 26045
1064 26045 16814 -20424 -23244 12923 27168 -5271 -30853 -6391 28744 17113 -22099 -24543
1076 -24543 13071 28800 -2247 -27253 -5183 25723 12878 -22427 -20568 16056 26183 -8035
1088 -8035 -30514 -3939 28640 13922 -23049 -21118 15901 26179 -6753 -27432 -1043 28138
1100 28138 11094 -24839 -20353 17258 25945 -8202 -29023 -3123 25964 10940 -21763 -16865
1112 -16865 16637 22355 -8688 -24204 1832 25327 6588 -23355 -14061 18537 19332 -13186 -24203
1125 -24203 5160 25998 2447 -26623 -12174 23060 21460 -14669 -25970 5948 28339 4518
1137 4518 -25725 -12730 21099 19001 -16045 -25709 6494 27582 2804 -26631 -12752 21783
1149 21783 20494 -13252 -23044 6201 24433 1147 -23736 -7880 22224 15153 -18538 -23288 9809
1162 9809 26712 -704 -27289 -9799 22677 17268 -15806 -20856 9888 24745 -1522 -25021
1174 -25021 -6881 22870 14731 -18057 -21754 8890 23394 -1060 -22761 -5997 20019 11623
1186 11623 -15917 -15404 12382 20048 -6191 -22287 -570 22844 8269 -20712 -16057 14735 20148
1199 20148 -9165 -24740 586 25060 8654 -21862 -15804 17240 22814 -8479 -25198 -453
1211 -453 24765 8706 -21895 -16567 15568 21117 -8688 -24436 -221 23671 8071 -20318 -14009
1224 -14009 15644 19334 -8980 -21345 3040 22997 4375 -22390 -12861 17493 18483 -11602 -23070
1237 -23070 2634 23122 5420 -20238 -11048 17034 16861 -11143 -20049 5073 21951 2358 -21373
1250 -21373 -10187 17262 15311 -12136 -19339 4935 19788 505 -19347 -5777 18467 12306
1262 12306 -14440 -16840 9987 21399 -2572 -22813 -5990 20192 12154 -16743 -18518 10103
1274 10103 21916 -2558 -22886 -4712 21846 12838 -16964 -18443 10897 22717 -2482 -23219
1286 -23219 -5588 20695 11998 -16998 -18247 9980 20735 -3485 -21720 -3682 20903 11292
1298 11292 -16068 -15859 11337 19790 -4534 -21289 -2922 19572 8784 -16934 -14764 11533 18079
1311 18079 -5647 -19849 -633 19661 7450 -16749 -12122 13516 17062 -7281 -19312 721
1323 721 19270 5085 -18112 -11710 13510 15317 -8981 -18622 3366 20198 3904 -18476 -9386
1336 -9386 16357 15466 -10951 -19442 4188 20710 2690 -20275 -9971 16568 15300 -11643 -19739
1349 -19739 4735 21228 2798 -19830 -8924 17506 15636 -11569 -19308 4841 20533 1901
1361 1901 -20347 -9278 16231 14119 -11807 -18096 5537 19918 1681 -18565 -7117 16526
1373 16526 12908 -11815 -16495 6423 18331 -337 -18523 -6027 15899 10382 -13083 -15011 8000
1386 8000 17732 -2044 -17929 -3328 17627 9661 -13813 -14022 9060 16956 -4017 -18736 -2705
1399 -2705 17413 7891 -15347 -13345 10986 17262 -5160 -18825 -992 19089 8063 -15812 -12874
1412 -12874 11766 17011 -6170 -19568 -1040 18807 7093 -16874 -13327 11849 17318 -5756
1424 -5756 -18751 -95 19040 7218 -15956 -12213 12007 15939 -6740 -18591 -1 17948
1436 17948 5801 -16148 -11417 11714 14838 -6814 -16754 1565 17490 4702 -15319 -9103 12676
1449 12676 13233 -8335 -16330 2657 16841 2406 -16285 -8191 13276 12188 -9415 -15115 4931
1462 4931 17464 1415 -16583 -6512 14610 11550 -10919 -15502 5380 17077 -146 -17566
1474 -17566 -6316 15041 11180 -11531 -14997 6741 17832 -90 -17253 -5366 15748 10882
1486 10882 -12071 -14914 6536 16788 -1412 -17589 -5202 15349 10040 -12165 -13970 7544
1498 7544 16690 -1301 -16451 -3618 15674 9035 -12218 -13176 7526 15157 -2817 -16531 -3182
1511 -3182 14828 7801 -12365 -11859 8464 14722 -3311 -15145 -1181 15172 6340 -12986 -10743
1524 -10743 9381 13308 -5250 -15845 -360 15233 5230 -13816 -9854 10631 13624 -5688
1536 -5688 -15004 1348 16074 4533 -14610 -9413 11004 12958 -6986 -15731 1245 15708 3669
1549 3669 -14721 -8901 11650 12852 -6910 -14550 2518 15747 3022 -14665 -7866 11796 11707
1562 11707 -7963 -14547 2903 14919 1921 -14538 -6928 12304 11112 -8198 -13350 4130 15233
1575 15233 1440 -14463 -6086 12248 10033 -9036 -13135 4243 14024 -54 -14369 -5007 12671
1588 12671 9188 -9515 -11874 5982 14354 -857 -14114 -3756 13037 7979 -10707 -11983 6239
1601 6239 13734 -2111 -14872 -3208 13627 7831 -10700 -11103 7254 13934 -2220 -14235 -2162
1614 -2162 13521 6583 -11501 -10869 7515 12937 -3469 -14373 -1633 13529 5954 -11407 -9426
1627 -9426 8735 12660 -4153 -13774 -151 13847 4955 -12374 -9485 8754 11982 -5035 -14073
1640 -14073 -155 13442 4472 -11991 -8150 9755 11666 -5388 -13079 1184 13407 3448 -12370
1653 -12370 -7668 9499 10420 -6539 -12922 1852 13231 2331 -12678 -6380 10868 10596 -6773
1666 -6773 -12332 2985 13703 1699 -13156 -6246 10684 9566 -7841 -12642 3081 13543 1290
1679 1290 -12778 -5358 11027 9389 -7397 -11390 3993 12651 69 -12667 -4354 11135 7727
1692 7727 -8972 -11089 4878 12447 -1116 -12915 -3263 12012 7527 -9174 -10144 6312 12830
1705 12830 -1645 -13421 -3049 12050 6864 -9841 -10732 5762 12163 -1872 -12577 -2269 11900
1718 11900 6402 -9490 -9239 6883 11701 -2941 -12555 -1225 11862 5034 -10437 -8966 7219
1731 7219 10984 -4012 -12626 -118 12762 4847 -10747 -8111 8431 11481 -4168 -12759 -342
1744 -342 12229 4335 -11049 -8252 7806 10408 -4479 -11995 628 11964 3726 -10413 -6482
1757 -6482 8732 9700 -5118 -11133 1754 11785 2125 -11482 -6125 8961 8838 -6533 -11337 2543
1771 2543 12356 1709 -11481 -5185 9856 9141 -6716 -11200 2944 12238 1177 -11884 -5427
1784 -5427 9677 8361 -7084 -10941 3221 11704 635 -11291 -4018 10189 7814 -7259 -9997
1797 -9997 4156 11333 -559 -11893 -3989 10076 6854 -8271 -9783 4793 11563 -615 -11623
1810 -11623 -2863 10928 6897 -8114 -9457 5090 11061 -1352 -11587 -2743 10366 5745 -8567
1823 -8567 -8915 5132 10388 -1889 -10989 -1398 10658 5324 -8640 -7757 6177 10013 -3016 -11208
1837 -11208 -1072 10528 4111 -9472 -7653 6806 9958 -3491 -11085 -216 11252 4279 -9605
1850 -9605 -7137 7246 9885 -3746 -11112 -63 10695 3401 -9895 -7009 7303 9125 -4240
1863 -4240 -10480 938 11069 3145 -9583 -5928 7884 8674 -4858 -10504 1204 10453 1920 -10052
1877 -10052 -5578 7946 8134 -5337 -9837 2059 10687 1917 -9819 -4652 8539 7756 -5584 -9448
1891 -9448 2289 9946 507 -10113 -4419 8293 6842 -6092 -8792 3403 10136 309 -9812
1904 -9812 -3399 9052 6386 -6762 -8706 3771 9964 -583 -10378 -3238 8957 6034 -6935
1917 -6935 -8498 4379 10101 -694 -9928 -2340 9481 5870 -7149 -8142 4368 9338 -1578 -10355
1931 -10355 -2256 9198 5061 -7480 -7597 4976 9405 -1743 -9557 -1187 9507 4480 -7786
1944 -7786 -7105 5342 8695 -2526 -9891 -1072 9186 3951 -8117 -6716 5860 8534 -2539 -9299
1958 -9299 -9 9483 3357 -8152 -6068 6070 7647 -3850 -9191 271 9158 2442 -8493 -5300
1972 -5300 6597 7539 -3974 -8890 1158 9663 2196 -8620 -4925 6883 7354 -4603 -9036 1229
1986 1229 9022 1627 -8686 -4667 7131 7020 -4660 -8293 2116 9215 1337 -8640 -3930 7266
2000 7266 6227 -5255 -8307 2344 8886 317 -8907 -3668 7582 6010 -5490 -7677 3197 8996
2014 8996 192 -8664 -2890 7641 5383 -5908 -7507 3175 8277 -758 -8773 -2441 7918 4997
2028 4997 -6068 -6795 4025 8323 -1045 -8432 -1608 8010 4374 -6536 -6638 4217 7823 -1818
2042 -1818 -8868 -1272 8111 4030 -6724 -6120 4794 7957 -1885 -8258 -693 8228 3514 -7020
2056 -7020 -5927 4703 7340 -2544 -8402 -198 8117 2904 -7063 -5239 5462 7241 -2733 -7907
2070 -7907 283 8212 2505 -7317 -5071 5514 6698 -3416 -8003 371 8071 2002 -7224 -4451
2084 -4451 6005 6642 -3479 -7485 1251 7817 1515 -7559 -3944 5938 5830 -4310 -7432 1751 7748
2099 7748 755 -7551 -3329 6689 5808 -4513 -6887 2313 8032 416 -7670 -3201 6464 5183 -5057
2114 -5057 -7124 2384 7607 25 -7700 -2627 6774 4973 -4878 -6315 3036 7409 -408 -7591 -2014
2129 -2014 6870 4193 -5538 -6223 3308 7178 -1069 -7560 -1553 7188 4138 -5668 -5871 3923 7277
2144 7277 -1284 -7555 -1319 7073 3412 -6029 -5645 3767 6635 -1807 -7362 -577 7089 3142 -5951
2159 -5951 -4890 4479 6521 -2187 -7070 -119 7168 2470 -6597 -4818 4618 6045 -2765 -7268 317
2174 317 7341 2315 -6476 -4267 5341 6238 -2858 -7046 523 7138 1787 -6769 -4186 5010 5478 -3408
2190 -3408 -6868 1126 6970 1276 -6477 -3227 5588 5316 -3700 -6350 1680 7008 657 -7002 -3259
2205 -3259 5609 4882 -4208 -6490 1770 7085 549 -6760 -2613 5897 5030 -4023 -5886 2187 6675
2220 6675 -13 -6769 -2389 5602 4140 -4545 -5763 2450 6553 -372 -6644 -1830 6246 3959 -4781
2235 -4781 -5308 2990 6577 -872 -6824 -1634 6208 3445 -5277 -5528 3185 6418 -1035 -6635 -1142
2250 -1142 6317 3526 -4872 -4815 3509 5966 -1469 -6558 -908 6021 2601 -5408 -4611 3888 5671 -1942
2266 -1942 -6429 -216 6531 2473 -5394 -4204 4212 5759 -2241 -6348 21 6231 1958 -5843 -4107
2281 -4107 4272 5400 -2482 -6332 418 6331 1753 -5626 -3428 4632 5139 -2669 -6096 801 6132
2296 6132 1127 -5938 -3256 4693 4618 -3163 -5781 1447 6298 850 -5827 -2809 5213 4689 -3334 -5791
2312 -5791 1456 6024 505 -6193 -2755 4906 4245 -3646 -5371 1827 6007 392 -5644 -1973 5189
2327 5189 3792 -3775 -4924 2151 5627 -535 -5992 -1757 5149 3438 -4142 -4771 2664 5769 -566
2342 -566 -5775 -1113 5580 3268 -4500 -4669 2719 5564 -1040 -5969 -1289 5417 2890 -4460 -4461 3159
2358 3159 5455 -1196 -5624 -484 5695 2690 -4552 -4013 3279 4987 -1569 -5831 -682 5399 2210
2373 2210 -4794 -3861 3546 5158 -1648 -5576 -12 5584 2078 -4795 -3422 3514 4656 -2125 -5418
2388 -5418 155 5157 1497 -4887 -3115 3677 4375 -2233 -4976 895 5466 1086 -4759 -2584 4184
2403 4184 3995 -2831 -5019 1020 5193 614 -5145 -2486 4272 3985 -3000 -4855 1377 5240 413
2418 413 -5102 -1936 4566 3562 -3272 -4831 1446 5090 20 -5225 -1985 4501 3380 -3273 -4567
2433 -4567 1955 5255 -40 -4991 -1454 4551 3019 -3560 -4321 2070 4887 -388 -5135 -1323 4549
2448 4549 2806 -3607 -4029 2293 4699 -495 -4837 -936 4596 2417 -3654 -3673 2359 4238 -1272 -4891
2464 -4891 -496 4537 2048 -3840 -3226 2878 4342 -1323 -4690 -53 4642 1616 -4078 -3081 3181
2479 3181 4106 -1890 -4787 195 4675 1359 -4266 -2818 3373 3952 -1878 -4379 467 4805 1251
2494 1251 -4389 -2684 3323 3667 -2294 -4605 571 4623 943 -4409 -2420 3582 3697 -2225 -4465
2509 -4465 941 4768 628 -4424 -2076 3701 3306 -2610 -4251 989 4327 335 -4390 -1768 3732
2524 3732 3133 -2663 -3678 1462 4305 -17 -4296 -1526 3804 2466 -3057 -3681 1707 4049 -501
2539 -501 -4197 -852 4024 2310 -3181 -3287 2182 4143 -637 -4340 -709 4086 2042 -3514 -3394 2192
2555 2192 3864 -1086 -4381 -476 4245 1948 -3542 -3115 2572 4012 -1165 -4258 -254 4180 1523
2570 1523 -3700 -3003 2607 3738 -1448 -4352 -74 4219 1468 -3636 -2663 3008 3698 -1399 -4039 173
2586 173 4042 1101 -3710 -2473 2790 3280 -1827 -4011 507 3979 853 -3654 -1953 3125 3050 -2025
2602 -2025 -3684 946 4072 441 -3961 -1747 3237 2575 -2495 -3624 942 4028 130 -3953 -1367
2617 -1367 3638 2670 -2523 -3369 1446 4035 -124 -4002 -1325 3426 2258 -2898 -3440 1439 4062 -375
2633 -375 -4115 -936 3877 2313 -2882 -3207 1922 3995 -529 -4075 -876 3597 1992 -3017 -3232 1775
2649 1775 3707 -693 -3911 -622 3671 1900 -2830 -2825 2041 3420 -877 -3795 -465 3509 1494 -3259
2665 -3259 -2559 2154 3306 -1152 -3686 7 3749 1227 -3179 -2297 2568 3239 -1379 -3661 347 3603
2681 3603 895 -3532 -2218 2530 2919 -1584 -3632 564 3787 933 -3513 -1917 3102 2903 -1733
2696 -1733 -3403 706 3682 478 -3563 -1737 2851 2725 -2168 -3521 899 3788 385 -3539 -1449
2711 -1449 2990 2684 -2113 -3316 1021 3526 190 -3530 -1480 2824 2293 -2201 -3020 1078 3434 37
2727 37 -3244 -1088 3018 2169 -2243 -2609 1426 3152 -285 -3495 -852 3040 1736 -2557 -2811 1524
2743 1524 3360 -478 -3452 -665 3312 1799 -2582 -2430 1800 3224 -677 -3426 -451 3113 1452
2758 1452 -2794 -2438 1859 3006 -929 -3316 -40 3340 1285 -2817 -2141 2076 2798 -1209 -3331 -59
2774 -59 3341 925 -3000 -2100 2176 2843 -1203 -3166 236 3251 881 -2813 -1827 2296 2738 -1237
2790 -1237 -3026 216 3008 512 -3022 -1646 2284 2286 -1477 -2927 736 3194 474 -2736 -1335 2327
2806 2327 2142 -1745 -2844 733 2968 175 -3086 -1245 2433 1972 -1977 -2680 978 3003 150 -2898
2822 -2898 -1020 2676 1910 -2016 -2525 1138 2637 -248 -3034 -840 2400 1638 -2013 -2346 1300 2785
2838 2785 -273 -2741 -502 2738 1489 -2210 -2144 1381 2629 -635 -2967 -557 2784 1286 -2295
2853 -2295 -2169 1661 2811 -561 -2792 -186 2733 1373 -2279 -1942 1591 2340 -941 -2792 -136 2550
2869 2550 948 -2447 -1840 1937 2239 -1028 -2521 149 2649 822 -2470 -1671 1878 2249 -1277 -2572
2885 -2572 339 2597 502 -2434 -1382 2056 1973 -1326 -2418 595 2698 309 -2455 -1276 1996
2900 1996 1866 -1491 -2525 519 2480 167 -2535 -1132 2129 1704 -1522 -2368 791 2582 158 -2506
2916 -2506 -913 2259 1473 -1781 -2172 829 2413 -227 -2537 -864 2130 1497 -1838 -1839 1112 2395
2932 2395 -170 -2446 -634 2425 1282 -1875 -1837 1337 2308 -573 -2481 -482 2367 1150 -1781 -1721
2948 -1721 1431 2211 -449 -2329 -191 2345 906 -2047 -1650 1348 2067 -837 -2534 -165 2375 795
2964 795 -2013 -1387 1681 2021 -771 -2277 187 2366 590 -2096 -1488 1626 1908 -1095 -2279 275
2980 275 2308 657 -2019 -1197 1774 1857 -1167 -2077 375 2285 358 -2144 -1101 1838 1565 -1401
2996 -1401 -2119 554 2259 163 -2090 -829 2031 1588 -1488 -1936 779 2282 54 -2203 -794 1942
3012 1942 1337 -1529 -2048 726 2177 -3 -2161 -579 2111 1332 -1473 -1840 1021 2055 -224 -2069
3028 -2069 -578 1976 1120 -1773 -1797 1085 1941 -307 -2240 -468 2011 1077 -1741 -1553 1196 1924 -466
3045 -466 -2086 -247 1970 917 -1892 -1454 1134 1726 -679 -2049 -55 2051 841 -1829 -1390 1465
3061 1465 1676 -810 -2000 61 2152 457 -1985 -1253 1480 1720 -974 -2052 348 2137 512 -1896
3077 -1896 -1144 1584 1775 -943 -1898 383 2040 355 -2065 -1128 1455 1690 -1205 -1821 473 2012
3093 2012 376 -1850 -725 1512 1444 -1112 -1842 607 2020 56 -2006 -726 1573 1174 -1425 -1682
3109 -1682 677 1848 -75 -1839 -511 1815 1271 -1240 -1503 842 1921 -285 -2103 -523 1704
3124 1704 967 -1446 -1653 1005 1698 -266 -1901 -426 1886 884 -1577 -1405 1066 1779 -460 -1893
3140 -1893 -270 1848 749 -1646 -1508 1155 1675 -492 -1972 -48 1866 692 -1417 -1245 1020 1612
3156 1612 -566 -1830 -23 1660 548 -1563 -1134 1019 1513 -731 -1836 217 1696 406 -1677
3171 -1677 -968 1347 1549 -804 -1745 282 1588 233 -1777 -917 1341 1260 -958 -1633 405 1751 314
3188 314 -1682 -849 1529 1265 -974 -1683 579 1685 -14 -1769 -685 1479 1044 -1048 -1541 592
3204 592 1627 69 -1674 -498 1634 1146 -1240 -1307 684 1653 -139 -1791 -648 1572 987 -1226
3220 -1226 -1366 770 1549 -212 -1607 -475 1386 917 -1164 -1372 800 1474 -292 -1700 -364 1438
3236 1438 709 -1335 -1087 775 1415 -287 -1462 -105 1576 615 -1295 -1000 1041 1395 -588 -1634
3252 -1634 -95 1592 613 -1362 -1049 988 1272 -592 -1493 189 1523 311 -1358 -926 1098 1248
3268 1248 -638 -1483 135 1516 293 -1507 -933 1177 1316 -817 -1444 294 1732 300 -1423 -685
3284 -685 1130 1033 -791 -1401 260 1350 25 -1443 -585 1092 1051 -912 -1298 359 1466 162 -1429
3301 -1429 -492 1315 917 -878 -1216 395 1315 -107 -1412 -421 1211 825 -1014 -1145 673 1318 -122
3318 -122 -1422 -327 1388 842 -1039 -1185 635 1240 -123 -1388 -123 1245 692 -1024 -972 825 1261
3335 1261 -260 -1321 2 1190 594 -1016 -903 798 1228 -393 -1368 -52 1239 543 -1168 -888
3351 -888 803 1138 -506 -1117 42 1354 366 -1154 -868 763 944 -455 -1276 -7 1151 230 -1169
3368 -1169 -664 843 930 -505 -1116 167 1349 73 -1111 -567 1031 847 -743 -1157 325 1139 109
3385 109 -1238 -543 877 842 -620 -1093 319 1183 -101 -1137 -498 1040 635 -741 -1089 381 1141
3402 1141 16 -1184 -415 1031 650 -721 -944 592 1095 -136 -1135 -214 1041 576 -876 -904 630
3419 630 995 -329 -1310 -315 1158 536 -865 -836 589 973 -268 -1143 -1 1021 441 -899 -779 699
3437 699 929 -309 -1021 2 999 339 -804 -650 759 947 -381 -977 45 1024 266 -999 -598 806
3455 806 821 -440 -950 32 1137 207 -985 -506 662 826 -429 -998 156 994 143 -1009 -487 847
3473 847 840 -596 -831 142 888 -29 -1080 -421 845 629 -560 -770 288 953 -22 -980 -439 881 656
3492 656 -701 -828 368 1063 -85 -991 -140 945 537 -792 -833 569 873 -85 -1074 -228 879 502
3510 502 -733 -887 547 958 -155 -925 -120 949 446 -768 -676 525 789 -194 -1003 69 881 245
3528 245 -817 -708 584 610 -238 -900 -14 813 233 -803 -531 600 755 -371 -897 2 905 286 -747
3547 -747 -571 691 686 -425 -816 39 946 51 -730 -462 589 663 -361 -901 162 904 -6 -805 -483
3566 -483 592 561 -471 -867 150 919 57 -907 -311 710 736 -444 -727 125 705 1 -875 -451 740
3585 740 534 -532 -630 233 825 100 -794 -319 774 511 -499 -668 307 688 9 -769 -144 729 440
3604 440 -602 -710 410 714 -111 -721 -187 620 442 -538 -566 357 699 -167 -800 -144 704 287 -643 -480
3624 -480 477 731 -230 -675 -3 688 215 -533 -618 544 692 -184 -771 -157 532 321 -617 -633 384 554
3644 554 -164 -575 -72 728 180 -644 -517 450 610 -112 -644 35 547 116 -550 -368 472 476 -255 -570 126
3665 126 736 100 -522 -226 431 441 -260 -587 43 575 15 -510 -302 440 301 -309 -473 177 468 26
3685 26 -551 -173 547 269 -378 -433 180 551 -61 -438 -170 523 267 -277 -316 182 385 -58 -443 -42 477
3706 477 196 -380 -349 162 323 -127 -413 -72 497 146 -347 -467 186 335 -136 -491 -21 339 144 -248
3726 -248 -251 311 146 47 -443 -99 372 235 -400 -302 239 232 -17 -220 88 347 160 -316 -181 313 186 -129
3748 -129 -358 142 169 122 -272 -164 253 322 -203 -223 -6 326 -51 -332 -52 185 199 -232 -267 71 277 -94
3770 -94 -255 -144 184 179 -196 -275 109 146 -166 -233 -8 194 129 -274 -237 133 228 -127 -237 -9 163 112 -205
3793 -205 -157 66 272 -52 -194 -79 296 121 -313 -10 156 218 -78 -165 45 223 -10 -287 -45 98 79
3814 79 -13 -140 54 199 -22 -251 -90 73 82 -182 -188 96 176 -25 -183 -50 127 230 -146 -167 108 196 8
3837 8 -142 15 222 29 -217 -71 130 238 57 -231 -27 255 194 -41 23 105 201 -96 -171 78 213 -1
3859 -1 -226 -182 59 215 -87 -127 90 103 17 -200 -82 102 92 -118 -162 33 270 58 -185 -13 45 -116 -246
3882 -246 -113 147 112 67 -49 2 -47 -17 -103 -115 182 -79 -111 -191 13 224 52 -120 -154 121 104 21 -172 -12
3906 -12 219 -9 -173 -87 177 146 -19 -268 83 118 -18 -183 6 144 112 -121 -191 9 203 -104 -197 -47
3928 -47 45 -27 -153 -39 -13 99 18 -133 -5 144 106 -124 -57 21 60 53 -322 -44 91 15 -179 -2 105 76
3952 76 -91 -61 -149 164 70 -112 -84 187 27 -129 -137 161 153 -86 -115 -29 237 6 -147 -154 3 59 82 -133 44
3977 44 43 -54 61 -63 67 60 -110 -227 52 145 -126 -128 -113 116 86 -49 -52 43 155 9 -67 -164 41 35 -190 -206
4003 -206 29 150 -84 -192 -18 68 76 -75 -97 16 165 10 -187 -100 162 6 -76 -142 130 79 -20 -107 18
4026 18 157 -68 -193 -147 56 178 -85 -143 -58 26 5 -215 -125 171 100 46 -177 76 169 -57 -42 -123 243 102
4050 102 -122 -135 77 208 -97 -143 -1 189 224 -124 -122 167 131 -255 -271 -157 154 -22 -154 -106 97 117 -120
4073 -120 -202 -38 247 88 -127 -33 188 238 -161 -261 145 199 157 -255 -133 228 122 -134 -234 34 179 -207
4095 -207 -249 -75 226 155 -240 -223 120 325 -141 -291 -107 436 96 -260 -129 132 230 -18 -302 -43 227
4116 227 224 -222 -207 69 214 4 -251 -68 197 122 -346 -241 138 340 16 -252 -56 354 20 -283 -227 306
4138 306 307 -115 -221 -44 434 95 -367 -178 188 365 -88 -247 -54 380 21 -360 -155 276 341 -176 -366
4159 -366 74 369 134 -357 -179 242 272 -237 -407 35 421 16 -477 -69 324 179 -221 -261 239 342 -50
4180 -50 -504 -272 310 190 -194 -371 132 521 -140 -380 -108 373 330 -274 -416 180 475 -35 -475 -248 361
4201 361 204 -365 -397 177 536 -55 -447 -157 427 159 -327 -474 281 472 -145 -452 -132 449 264 -381
4221 -381 -273 298 331 -85 -460 20 492 139 -488 -450 314 469 -52 -476 58 553 153 -419 -393 421 470
4242 470 -164 -561 -12 486 205 -472 -281 239 390 -226 -489 -25 542 94 -501 -291 308 484 -135 -549
4262 -549 55 536 14 -441 -280 444 276 -284 -568 150 392 -39 -577 -260 272 304 -277 -444 186 473
4282 473 -82 -512 -276 371 452 -403 -449 191 418 -36 -576 -167 384 321 -323 -450 221 581 5 -516 -154
4303 -154 479 198 -477 -460 165 514 -179 -569 -123 475 186 -402 -467 196 472 -8 -473 -129 474 263 -390
4324 -390 -368 299 393 -155 -501 -147 535 238 -434 -343 402 515 -100 -555 1 516 224 -522 -492 329 502
4345 502 -138 -574 -46 547 206 -438 -352 433 416 -231 -553 36 559 78 -512 -338 258 441 -273 -502 -5
4366 -5 588 171 -622 -334 440 490 -288 -401 201 594 -2 -572 -319 533 373 -249 -434 72 552 -3 -438
4387 -438 -262 535 343 -341 -424 258 444 -14 -552 -234 512 364 -477 -502 261 486 53 -587 -201 574 288
4408 288 -372 -442 266 527 -40 -580 -115 453 175 -572 -628 324 393 -127 -519 -155 537 179 -324 -395 382
4429 382 516 -57 -582 -55 489 190 -386 -442 324 523 -200 -508 -22 551 232 -350 -361 465 551 -193 -656
4450 -656 27 529 156 -536 -309 526 492 -237 -517 60 617 123 -541 -330 449 457 -266 -534 168 522 191
4471 191 -464 -299 471 389 -273 -617 230 564 242 -606 -159 522 351 -324 -548 138 582 -6 -658 -198
4491 -198 562 377 -346 -551 206 514 -23 -547 -241 537 271 -343 -450 179 663 -50 -649 -119 607 410
4511 410 -400 -416 234 536 -38 -574 -51 468 269 -442 -438 350 507 -200 -546 -92 593 290 -504 -510 411 511
4533 511 -279 -657 -36 651 269 -559 -414 464 464 -271 -701 120 627 160 -572 -357 426 539 -268 -589 -49
4554 -49 775 204 -514 -440 565 515 -246 -621 -9 715 57 -629 -297 525 534 -201 -584 146 792 134 -586
4575 -586 -243 567 387 -416 -565 255 683 -61 -550 -291 634 535 -411 -510 310 602 28 -723 -156 590 538
4596 538 -468 -533 238 638 -32 -575 -203 637 431 -595 -538 367 698 -83 -659 -164 735 338 -390 -689
4616 -689 365 578 -214 -573 -276 580 369 -600 -354 304 692 -228 -603 -142 672 318 -541 -484 357 523
4636 523 -262 -669 24 730 125 -587 -481 544 613 -181 -519 43 721 178 -600 -520 421 670 -334 -761
4656 -761 32 739 162 -574 -454 569 494 -231 -698 237 814 160 -533 -389 650 539 -409 -745 261
4675 261 585 78 -701 -322 512 485 -310 -635 173 674 21 -574 -343 619 423 -584 -705 80 734 -43
4695 -43 -777 -311 587 476 -404 -676 192 735 -21 -604 -175 743 464 -429 -684 206 696 -104 -715 -260
4715 -260 597 410 -576 -578 314 740 15 -684 -41 641 313 -534 -632 378 725 -192 -777 -144 747 397 -579
4736 -579 -508 468 729 -182 -608 -53 686 257 -543 -448 481 641 -238 -700 -122 631 274 -725 -462 470 668
4757 668 -144 -685 31 594 158 -697 -396 526 586 -372 -708 68 734 261 -689 -487 564 659 -334 -648
4777 -648 279 733 205 -607 -395 588 413 -407 -675 142 814 55 -587 -224 691 550 -325 -602 187 728
4797 728 160 -711 -453 450 461 -395 -579 231 674 -58 -698 -152 629 456 -453 -629 216 708 -43 -717
4817 -717 -99 712 385 -569 -633 253 690 -76 -830 -108 631 520 -397 -565 426 764 -49 -670 -76 672
4837 672 332 -681 -621 287 573 -73 -788 -92 681 278 -582 -452 388 652 -141 -670 18 703 332 -687
4857 -687 -534 361 647 -292 -662 -16 657 259 -584 -389 434 516 -263 -644 55 705 224 -782 -390 516
4877 516 504 -319 -615 92 725 246 -727 -359 511 637 -313 -596 222 721 46 -633 -366 545 475 -400 -739
4898 -739 100 700 97 -562 -112 667 445 -394 -695 221 586 -28 -743 -237 594 324 -365 -648 271 701
4918 701 -23 -651 -142 607 466 -504 -605 169 602 19 -788 -220 573 319 -521 -480 370 621 -11 -777
4938 -777 -77 634 385 -578 -360 323 501 -193 -750 -201 698 153 -608 -446 439 596 -187 -861 -92 810
4958 810 182 -560 -375 458 493 -195 -682 39 639 212 -696 -431 454 581 -257 -741 146 672 103 -702
4978 -702 -432 552 534 -254 -680 179 736 232 -632 -446 649 493 -441 -770 82 683 63 -734 -374 670
4998 670 537 -421 -703 93 708 61 -805 -368 639 461 -436 -597 305 734 160 -753 -174 700 558 -506
5018 -506 -637 317 688 -6 -776 -267 613 470 -522 -577 363 719 -34 -712 -158 686 435 -554 -533 324 700
5039 700 -136 -700 -44 719 277 -710 -503 430 734 -121 -848 5 658 260 -580 -579 372 759 -225 -705 -14
5060 -14 732 368 -680 -628 525 693 -246 -671 -87 783 241 -599 -578 593 686 -293 -712 -31 784 212
5080 212 -686 -445 437 647 -356 -759 -9 784 74 -719 -388 641 669 -359 -791 94 724 226 -660
5099 -660 -505 583 496 -416 -687 50 781 137 -623 -190 675 541 -438 -751 153 849 74 -735 -294 657
5119 657 535 -407 -702 219 941 90 -764 -223 660 445 -474 -735 183 724 -52 -823 -280 650 543 -565
5139 -565 -558 309 774 -85 -819 -125 537 450 -518 -552 347 716 -68 -719 -265 626 249 -494 -577 320 719 -87
5161 -87 -714 -76 781 339 -630 -461 418 761 -217 -860 0 758 258 -515 -399 340 776 -113 -826 34
5181 34 617 369 -579 -553 469 634 -311 -755 -143 712 183 -614 -522 520 625 -269 -602 56 768 164
5201 164 -621 -458 435 595 -269 -809 -1 709 208 -600 -432 566 590 -341 -670 171 721 93 -550 -378
5221 -378 466 502 -408 -719 213 743 -48 -725 -328 592 643 -347 -654 163 712 111 -712 -334 527 587 -493
5242 -493 -650 190 698 86 -654 -178 604 590 -327 -540 344 731 -105 -706 -247 740 409 -555 -560 216 707
5263 707 -61 -712 -285 628 400 -572 -681 353 726 -159 -677 -125 633 266 -629 -526 325 554 -245 -693
5283 -693 -11 727 311 -644 -536 434 679 -79 -582 35 623 183 -575 -474 353 530 -172 -665 -113 700
5303 700 196 -783 -452 413 601 -112 -676 -38 728 210 -629 -453 450 487 -375 -718 65 695 62 -657
5323 -657 -389 579 375 -417 -614 144 624 73 -623 -276 537 437 -459 -564 111 687 12 -711 -274 531
5343 531 467 -395 -593 234 702 1 -572 -198 630 426 -566 -526 174 703 -83 -639 -226 601 521 -579 -538
5364 -538 345 680 -81 -717 -206 724 393 -596 -552 356 549 -124 -814 -105 598 374 -585 -457 428 580
5384 580 -260 -776 -112 522 320 -637 -495 481 550 -219 -691 -17 734 356 -632 -489 445 663 -208 -663
5404 -663 63 697 232 -559 -506 407 603 -358 -675 92 639 71 -699 -384 576 472 -348 -711 91 721
5424 721 182 -653 -472 488 546 -401 -595 41 608 145 -730 -334 557 526 -363 -603 155 613 -94 -681 -328
5445 -328 710 566 -457 -604 273 785 42 -628 -254 533 444 -386 -554 223 711 -123 -759 -198 703 438
5465 438 -412 -741 284 710 -78 -639 -201 664 285 -548 -738 371 578 -149 -706 -251 740 396 -656
5484 -656 -553 374 727 -118 -751 -47 617 376 -629 -515 412 617 -142 -795 -47 580 307 -638 -426 399
5504 399 580 -223 -674 84 783 204 -530 -462 407 623 -328 -753 10 756 83 -545 -492 496 662 -253 -665
5525 -665 35 734 128 -636 -309 557 544 -408 -724 151 794 17 -581 -389 670 560 -316 -554 165 707
5545 707 200 -672 -187 525 478 -382 -708 165 684 73 -657 -225 649 572 -422 -476 191 616 22 -690 -144
5566 -144 674 566 -430 -590 225 715 -159 -730 -262 582 427 -461 -643 370 730 -91 -636 -133 683 394
5586 394 -415 -557 335 697 -91 -693 -111 563 227 -621 -518 409 629 -57 -638 -26 767 295 -568 -428
5606 -428 383 665 -305 -726 -110 664 226 -536 -443 542 564 -129 -662 -8 721 174 -644 -455 449 592 -287
5627 -287 -646 -10 591 279 -537 -539 418 539 -191 -659 107 768 220 -676 -363 457 527 -340 -530 133 516
5648 516 158 -673 -293 502 594 -373 -662 192 615 120 -599 -357 536 524 -494 -760 202 580 3 -670
5668 -670 -322 600 414 -480 -450 168 567 22 -594 -234 573 420 -548 -607 209 634 -70 -697 -234 663 433
5689 433 -472 -573 285 723 -61 -730 -130 542 300 -516 -508 267 647 -101 -702 -63 621 431 -464 -539 215
5710 215 591 -181 -729 -43 667 241 -515 -619 386 596 -74 -719 -128 778 353 -582 -335 338 694 -100
5730 -100 -691 -60 634 234 -575 -466 314 557 -242 -611 101 629 207 -452 -422 436 488 -281 -604 112 711
5751 711 156 -698 -353 564 421 -341 -719 102 672 242 -594 -235 470 432 -370 -496 141 685 149 -596
5771 -596 -289 434 306 -442 -646 107 697 47 -668 -202 656 343 -497 -563 226 752 -42 -543 -299 471
5791 471 407 -491 -528 217 605 -181 -687 -162 620 410 -382 -602 112 627 -39 -673 -355 503 295 -515 -538
5812 -538 286 602 -133 -657 -85 640 282 -466 -533 376 528 -103 -611 -115 639 218 -617 -480 411 461 -199
5833 -199 -552 -83 709 400 -547 -456 389 511 -140 -679 -95 584 146 -609 -398 347 500 -288 -569 128
5853 128 597 140 -561 -310 457 544 -335 -614 59 649 192 -605 -230 534 473 -308 -593 67 718 -15 -711
5874 -711 -269 490 575 -310 -557 205 608 2 -760 -276 445 370 -444 -539 220 671 5 -644 -88 538 419
5895 419 -420 -479 287 658 -18 -654 -236 470 390 -424 -537 278 499 -131 -661 -159 594 385 -388 -502 390
5916 390 698 -40 -573 -105 508 198 -492 -450 154 652 -136 -520 -98 664 262 -540 -301 330 681 -150
5936 -150 -682 -43 599 179 -534 -523 458 590 -214 -631 -21 742 252 -562 -352 451 607 -289 -662 6
5956 6 581 246 -505 -373 400 577 -326 -586 32 519 195 -597 -405 469 558 -308 -645 71 671 131 -621
5977 -621 -372 313 559 -244 -660 190 786 154 -627 -407 465 507 -306 -512 157 533 85 -667 -243 439
5997 439 485 -387 -605 191 733 21 -678 -133 557 396 -472 -513 220 624 23 -684 -198 545 416 -503 -434
6018 -434 256 536 -48 -555 -14 705 361 -455 -424 263 692 -215 -728 -144 549 342 -544 -434 340 562
6038 562 -38 -706 -52 483 134 -456 -480 503 521 -92 -669 -193 624 254 -513 -469 387 582 -155 -540 41
6059 41 688 251 -453 -522 452 511 -261 -711 -109 778 142 -601 -466 493 511 -101 -559 151 627 65 -400
6080 -400 -392 443 455 -267 -612 142 629 10 -558 -420 452 439 -340 -559 57 578 66 -691 -414 416 490 -389
6102 -389 -583 35 558 -13 -692 -233 564 454 -362 -529 230 654 161 -579 -271 488 476 -395 -502 202
6122 202 481 68 -611 -212 471 454 -593 -421 122 551 24 -585 -136 559 502 -452 -588 176 477 -158
6142 -158 -505 -55 617 389 -500 -351 317 559 -193 -609 -166 515 303 -557 -340 390 578 -218 -671 -55
6162 -55 458 276 -430 -327 367 600 -149 -477 41 610 294 -597 -403 157 397 -238 -700 -27 542 183
6182 183 -498 -269 330 490 -205 -632 -11 585 141 -505 -260 414 344 -363 -594 40 586 85 -410 -238
6202 -238 425 499 -213 -599 286 505 112 -572 -364 340 400 -382 -579 242 556 17 -553 -226 517 294 -362
6223 -362 -452 289 623 -35 -531 -173 506 317 -368 -487 61 617 -46 -544 -198 519 393 -430 -427 260 534
6244 534 47 -470 -187 464 374 -418 -493 310 486 -145 -495 1 513 266 -495 -354 505 466 -131 -648 -98
6265 -98 571 169 -518 -428 332 542 -99 -509 166 566 245 -440 -214 309 556 -218 -596 70 541 157 -469
6286 -469 -263 357 413 -260 -676 61 582 137 -486 -278 363 405 -274 -516 59 507 82 -632 -293 523 474
6307 474 -352 -386 184 554 206 -405 -182 412 385 -404 -524 177 580 -62 -644 -162 458 355 -281 -467 204
6328 204 561 91 -568 -179 567 330 -297 -471 265 630 -64 -511 -207 546 387 -482 -273 226 587 -237
6348 -237 -581 -100 325 292 -371 -418 330 560 -164 -584 -95 462 322 -416 -369 384 409 -194 -502 -15 619
6369 619 240 -412 -346 251 582 -153 -601 -36 561 232 -392 -325 205 389 -257 -465 120 504 151 -582 -323
6390 -323 510 448 -162 -482 65 465 237 -453 -429 425 440 -249 -565 140 605 167 -533 -220 498 528 -210
6411 -210 -437 212 465 -52 -441 -257 475 511 -271 -553 179 566 75 -465 -199 398 333 -351 -549 171 556
6432 556 -25 -559 -185 463 317 -395 -553 274 585 35 -663 -141 509 311 -371 -500 255 504 25 -639
6452 -639 -149 447 289 -424 -413 287 527 41 -474 24 620 327 -386 -378 404 415 34 -413 11 485 318
6473 318 -341 -402 205 463 -147 -457 -38 593 203 -395 -382 333 549 -174 -592 -70 450 252 -505 -286 464
6494 464 416 -254 -513 125 664 126 -578 -395 293 423 -202 -544 89 464 154 -407 -334 493 449 -233 -465
6515 -465 69 534 -16 -497 -354 374 431 -278 -441 110 464 -55 -562 -281 521 480 -181 -514 194 471 -56
6536 -56 -474 -125 291 199 -399 -453 198 487 -124 -437 -168 310 173 -455 -394 250 578 -6 -528 -246 280
6557 280 290 -246 -452 153 425 -67 -539 -288 402 259 -485 -374 235 338 -57 -587 -65 516 276 -362
6577 -362 -343 368 540 66 -425 -10 577 122 -424 -399 276 540 -36 -432 -54 417 235 -474 -336 230 346
6598 346 -160 -470 46 528 175 -395 -225 385 430 -112 -419 99 578 201 -278 -242 278 335 -196 -369 6
6619 6 499 129 -459 -117 263 298 -193 -394 102 638 156 -401 -161 249 287 -334 -362 71 415 155 -384 -179
6641 -179 302 264 -256 -381 136 347 -28 -428 -77 278 272 -267 -470 106 410 -25 -393 -141 362 377 -295
6662 -295 -213 108 439 -97 -389 -70 367 144 -299 -247 174 377 -118 -380 19 407 242 -254 -442 280 355
6683 355 7 -397 -73 358 118 -425 -405 202 402 -183 -534 29 340 188 -456 -241 243 326 -125 -454 -6
6704 -6 482 168 -395 -182 159 328 -230 -329 -50 332 143 -311 -229 307 330 -264 -360 179 386 43 -488 -282
6726 -282 259 427 -251 -437 117 424 65 -329 -222 254 292 -118 -387 41 447 -2 -365 -187 256 211 -317
6747 -317 -415 63 430 92 -386 -109 347 307 -279 -371 141 371 -1 -297 -124 259 59 -292 -258 202 398
6768 398 18 -462 -74 376 200 -289 -265 246 384 -81 -421 16 389 270 -482 -344 203 351 -27 -312
6788 -312 67 319 194 -203 -222 256 405 -24 -330 54 366 46 -274 -217 252 360 -60 -397 46 478 58
6809 58 -346 -165 309 338 -207 -397 -52 352 167 -252 -87 340 338 -168 -345 41 569 27 -245 -154 278 237
6831 237 -95 -371 55 303 -79 -528 -187 281 212 -114 -364 12 429 126 -321 -98 336 381 -196 -245 166
6852 166 390 -51 -385 -191 291 121 -181 -218 139 467 -66 -275 -68 320 234 -242 -254 82 355 -30 -356
6873 -356 -150 387 203 -194 -370 229 376 15 -305 -27 371 165 -187 -362 53 464 -148 -446 -100 279
6893 279 242 -273 -214 172 324 -200 -251 13 360 65 -181 -223 188 264 -135 -396 -130 282 113 -242 -338 190
6915 190 233 -147 -344 90 438 158 -242 -177 254 223 -247 -229 32 351 72 -256 -158 253 240 -132 -365 96
6937 96 326 -61 -301 -112 341 293 -261 -231 29 343 30 -324 -156 377 280 -125 -252 72 388 -29 -198
6958 -198 -157 399 229 -110 -214 151 292 -59 -309 -119 296 101 -24 -241 116 307 5 -162 -26 386
6978 386 241 -214 -324 137 266 -156 -292 -96 234 239 -287 -291 117 231 -69 -365 44 345 223 -235 -217 268
7000 268 266 -95 -290 -49 314 233 -222 -185 244 235 -180 -358 -73 430 237 -290 -187 290 197 -25 -448 -64
7022 -64 294 49 -281 -198 263 323 -131 -465 79 311 96 -253 -88 270 215 -130 -190 -15 372 33 -245 -82
7044 -82 283 290 -110 -208 156 229 -58 -232 -216 206 208 -182 -241 10 379 56 -243 -226 380 279 -174 -202 86 269
7068 269 34 -216 -137 154 300 -201 -189 94 257 -31 -221 -149 248 104 -241 -218 -4 216 89 -261 8
7089 8 193 109 -200 -188 64 238 -90 -358 -37 265 271 -191 -239 271 372 97 -287 -62 322 196 -163 -169 34
7112 34 260 -84 -169 3 165 39 -326 -75 211 269 79 -225 103 255 13 -230 -245 89 246 -44 -162
7133 -162 26 264 76 -301 -165 239 240 -77 -244 14 316 51 -235 -182 223 167 -131 -155 -17 194 -104 -216
7155 -216 -96 178 198 -5 -286 87 345 101 -390 -154 84 170 -77 -329 130 235 -12 -179 -149 213 110
7176 110 -199 -202 109 192 4 -314 -141 270 87 -92 -237 55 268 18 -191 -119 179 136 -127 -35 201 252
7198 252 46 -342 71 243 99 -150 -211 113 216 -27 -239 69 182 112 -145 -202 107 221 -131 -270 -32
7219 -32 237 64 -203 -169 103 79 -66 -286 -130 271 -31 -197 -148 132 190 -92 -223 -35 181 71 -246 -28
7241 -28 204 153 -168 -192 -38 150 52 -135 -187 138 115 -82 -222 89 278 -30 -214 -68 156 286 -117 -171
7263 -171 111 219 4 -265 -114 247 57 -70 -194 100 209 -46 -158 -16 98 201 -208 -192 38 240
7283 240 114 -148 45 115 206 -174 -100 95 124 -238 -260 -28 164 127 -119 -160 129 274 46 -234 -87 214
7305 214 41 -113 -161 -10 186 80 -97 7 283 20 -108 -147 38 167 -69 -221 40 110 57 -105 -90 171
7327 171 102 38 -239 -45 149 28 -129 -40 230 225 -2 -189 21 163 16 -76 -44 205 128 -155 -89 -73 261
7350 261 -25 -148 -100 129 192 -125 -170 -15 140 43 -151 -22 164 115 -18 -129 185 214 58 -156 -18 63
7372 63 171 -57 -177 159 88 -28 -88 -22 228 92 -115 -172 28 360 96 -93 -119 179 44 -75 -104 149
7394 149 196 -42 -241 -86 206 191 -76 -126 115 -47 -38 -220 5 117 108 -71 16 86 297 -42 -201 -12 182
7417 182 30 -199 -104 73 146 -11 -88 -8 21 47 -59 -136 110 147 -63 -99 4 95 165 19 -72 42 184 -8
7441 -8 -185 -48 155 145 -189 -142 77 211 -145 -107 21 200 -79 -204 -50 99 98 -30 -132 -4 115 8
7463 8 -184 110 116 75 -153 -76 -85 114 131 -276 -126 217 156 -173 -124 -32 43 91 -158 -65 30 88 18 10 -12 215 119
7490 119 -176 -135 210 174 -175 -127 10 166 38 -72 -126 165 252 -60 -137 52 65 40 -148 33 96 53 -121
7513 -121 -82 134 80 2 -208 13 41 -53 -154 -32 181 72 15 -93 -114 52 -1 -148 -148 -63 96 54 -161 -62
7537 -62 96 20 -12 -218 -1 30 -4 14 -34 107 74 -16 -164 45 102 -100 -233 66 97 11 -5 -75 72 132 -13
7562 -13 -78 106 76 -45 -81 6 42 39 -106 -149 31 -14 -49 -114 -91 43 -10 3 -188 72 63 -41 -57 3 203 24
7588 24 -53 -169 45 64 93 -127 -58 44 79 -38 -7 -44 135 -6 -81 -61 110 1 43 -121 -13 48 13 -71 -66
7613 -66 32 111 -108 -19 -44 -5 -82 -141 73 77 -37 -50 36 -69 107 -73 5 -8 97 -66 -28 -24 -20 30 -17 -8 82 102
7641 102 1 -169 -5 -60 98 -97 -35 -12 88 71 -93 69 -10 129 -157 -81 -7 107 15 -83 78 135 140 -70
7665 -70 -24 -63 14 10 2 50 56 -8 -75 -71 -31 110 12 -99 222 121 -56 -54 36 141 51 11 15 56 85 7 -165 -143 50
7694 50 -6 -122 -32 86 61 -3 -6 -36 -8 89 -98 -167 -55 98 49 -94 -58 26 -52 -93 -66 -110 143 -25 -20 11 40
7721 40 117 -128 -25 106 16 15 -127 -20 73 8 -95 -34 -4 75 23 -135 8 84 0 90 -136 140 38 30 -80
7746 -80 1 34 57 58 6 -30 7 -45 -27 -51 16 -9 -107 -110 9 23 -11 144 9 83 0 -182 59 -68 62 -26 -61 55
7774 55 33 55 -90 58 -43 59 -8 -176 2 32 74 -1 -80 23 71 43 -142 -129 126 -44 -79 -31 -21 35 10
7799 10 -86 -59 45 87 7 -86 9 48 -196 -9 -64 148 30 -140 30 -36 170 -37 -92 39 52 69 -51 -12 15
7824 15 69 145 -58 7 69 -7 -24 96 61 -84 67 38 -14 -25 -48 -137 -127 -16 93 -196 15 7 88 161 -133 70
7850 70 50 -59 -137 -20 41 34 -88 31 -19 64 14 -20 56 52 -14 29 -23 -28 19 -32 105 3 -77 42 -81 -43 18 89
7878 89 -28 -36 -12 85 123 1 38 22 42 -48 -35 -109 -71 -75 -154 5 28 85 70 -64 -113 -24 -46 -42 -135 0 5 -105 -51
7907 -51 -21 124 4 -78 -37 -14 42 37 83 -99 -30 81 -18 -96 31 84 -182 4 -43 -55 118 -52 -24 78 69 46
7933 46 -39 -99 74 63 34 -131 -21 0 -16 15 -21 -27 81 38 74 -41 -87 -61 -24 27 -23 100 -17 146 26 25 -121
7960 -121 -108 7 -10 -57 54 -151 57 112 64 9 31 46 -9 -94 39 31 27 59 -26 -11 -38 -11 -75 29 80 -136 -114
7987 -114 27 -47 15 -117 -76 -13 74 -46 37 -4 47 -31 78 6 -72 114 -36 -47 -96 9 -36 -87 -106 -44 59 48
8013 48 38 -68 -14 7 -120 -142 57 7 10 -52 90 98 26 -31 -101 7 31 6 -105 -11 69 17 104 21 2 71 36 26
8041 26 19 12 145 -217 -137 3 61 21 -69 15 25 57 31 -9 35 29 5 -53 43 -25 20 -33 -61 -62 24 -37 32 93 120 53 -28
8072 -28 -35 -46 36 -44 -55 -6 100 67 -65 18 -34 119 75 -79 28 -139 -118 -27 -51 1 -70 -92 -48 30 84 -28 -11
8099 -11 -55 -47 -91 -74 -65 68 -2 19 -99 99 121 -23 -10 -127 -143 72 65 -57 29 -30 -12 55 17 -33 64 82 61 -15
8127 -15 53 48 -7 -3 -49 73 -78 -4 132 -61 62 -100 -16 -39 -23 -65 -32 -11 11 5 -4 -17 35 -27 -94 22 -47 52 70
8156 70 -115 -84 -6 53 57 -59 93 118 13 24 64 43 -42 -39 36 -56 -64 17 60 -12 25 -37 -117 -58 -5 116 92 49 53 116
8186 116 -28 23 -47 -43 94 -55 -45 71 -4 -79 30 -116 -84 -51 42 -14 -54 -46 51 1 -73 64 -76 -8 -182 -56
8212 -56 46 -14 -22 31 40 19 11 49 148 51 63 -17 -72 31 60 -27 -42 -64 17 -41 -126 -74 64 24 -58 18 -86 -81 4 -56
8242 -56 -60 -70 -77 -75 -16 52 -18 7 -27 9 49 90 39 -63 -11 15 -40 -65 106 111 14 -172 -36 -59 -81 -18 -49 76 26 59
8272 59 -22 -107 174 141 0 103 -16 47 -42 -5 70 66 32 -73 -107 -23 82 -122 -18 -61 156 72 -79 36 2
8297 2 22 31 -112 23 -66 -13 51 56 -115 10 -68 -45 -80 100 99 -136 17 30 -52 -3 -66 -156 116 40 16 57 42 -91
8325 -91 42 51 54 -100 -4 25 62 141 73 -25 -55 -9 3 31 -58 31 64 115 51 -35 17 17 55 -124 141 132 -2 -12 -116
8354 -116 -97 5 127 -101 -28 41 -53 -70 35 -125 66 53 5 77 19 143 30 -127 5 11 -12 -73 84 -68
8378 -68 -9 31 -35 27 -15 -53 -70 82 -6 24 -98 16 28 31 29 58 4 57 25 -74 -62 84 51 31 22 -72 42 -6 17
$$ [...]
16383g5
##END NTUPLES=NMR FID
##END=
