##TITLE=abcd
##JCAMPDX= 6.0         $$ Bruker NMR JCAMP-DX V2.0
##DATA TYPE= NMR SPECTRUM
##DATA CLASS= NTUPLES
##ORIGIN= UXNMR, Bruker Analytische Messtechnik GmbH
##OWNER= root
$$ XWIN-NMR		Version 3.5
$$ Mon Jun 30 18:38:48 2025 Russian Standard Time (UT+4h)  servis@DPX200
##.OBSERVE FREQUENCY= 200.131235884673
##.OBSERVE NUCLEUS= ^1H
##.ACQUISITION MODE= SIMULTANEOUS
##.ACQUISITION SCHEME= undefined
##.AVERAGES= 32
##.DIGITISER RES= 18
##SPECTROMETER/DATA SYSTEM= spect
##.PULSE SEQUENCE= zg
##.SOLVENT NAME= CDCl3
##.SHIFT REFERENCE= (INTERNAL, CDCl3, 0, 16.4885)
##AUDIT TRAIL= $$ (NUMBER, WHEN, WHO, WHERE, WHAT)
$$ ##TITLE= Audit trail, XWIN-NMR		Version 3.5
$$ ##JCAMPDX= 5.01
$$ ##ORIGIN= Bruker BioSpin GmbH
$$ ##OWNER= servis
$$ F:\spectra/data/av/nmr/H1/1/pdata/1/auditp.txt
$$ ##AUDIT TRAIL=  $$ (NUMBER, WHEN, WHO, WHERE, WHAT)
(   1,<2025-06-30 18:37:00.32 +0400>,<servis>,<DPX200>,
      <created by zg, POWCHK disabled, PULCHK disabled
       configuration hash MD5:
       00 E9 B6 7A A2 85 ED C7 34 08 36 98 17 FE 4E 26
       data hash MD5: 32K
       B9 BF 38 BC 6F 95 C6 EB EA F4 5C 65 50 10 AE 10>)
(   2,<2025-06-30 18:37:02.01 +0400>,<servis>,<DPX200>,
      <Start of raw data processing
       efp BC_mod = 2 LB = 0.05 FT_mod = 6 PKNL = 1 PHC0 = -271.4733 PHC1 = 1.101538 SI = 16K 
       data hash MD5: 16K
       5D 31 98 6F 90 A8 77 03 6C B7 46 0A 96 AF DF F9>)
$$ ##END=
$$ 
$$ hash MD5
$$ 79 5F D4 8E 22 12 AD D0 39 15 C1 0B 2C FD 6A CD
##$RELAX= 
##$RELAX= 
##$RELAX= 
##$RELAX= 
##$RELAX= 
##$RELAX= 
##$RELAX= 
##$RELAX= 
$$ Bruker specific parameters
$$ --------------------------
##$DU= <F:\spectra>
##$EXPNO= 1
##$NAME= <H1>
##$PROCNO= 1
##$TYPE= <nmr>
##$USER= <av>
##$AMP= (0..31)
100 100 100 100 100 100 100 100 100 100 100 100 100 100 100 100 100 100 
100 100 100 100 100 100 100 100 100 100 100 100 100 100 
##$AQSEQ= 0
##$AQ_mod= 1
##$AUNM= <au_zg>
##$AUTOPOS= <>
##$BF1= 200.13
##$BF2= 200.13
##$BF3= 200.13
##$BF4= 200.13
##$BF5= 500.13
##$BF6= 500.13
##$BF7= 500.13
##$BF8= 500.13
##$BYTORDA= 1
##$CFDGTYP= 0
##$CFRGTYP= 5
##$CHEMSTR= <none>
##$CNST= (0..31)
1 1 145 1 1 1 1 1 1 1 1 1 1 1 1 1 1 1 1 1 1 1 1 1 1 1 1 1 1 1 1 1 
##$CPDPRG= <>
##$CPDPRG1= <>
##$CPDPRG2= <>
##$CPDPRG3= <>
##$CPDPRG4= <mlev>
##$CPDPRG5= <mlev>
##$CPDPRG6= <mlev>
##$CPDPRG7= <mlev>
##$CPDPRG8= <mlev>
##$CPDPRGB= <>
##$CPDPRGT= <>
##$D= (0..31)
0 2 0 0 0 0 0 0 0 0.06 0 0 0 0 0 0 0.0002 0 0 0 0 0 0 0 0 0 0 0 0 0 0 
0 
##$DATE= 1751294219
##$DBL= (0..7)
120 120 120 120 120 120 120 120 
##$DBP= (0..7)
150 150 150 150 150 150 150 150 
##$DBP07= 0
##$DBPNAM0= <>
##$DBPNAM1= <>
##$DBPNAM2= <>
##$DBPNAM3= <>
##$DBPNAM4= <>
##$DBPNAM5= <>
##$DBPNAM6= <>
##$DBPNAM7= <>
##$DBPOAL= (0..7)
0.5 0.5 0.5 0.5 0.5 0.5 0.5 0.5 
##$DBPOFFS= (0..7)
0 0 0 0 0 0 0 0 
##$DE= 6
##$DECBNUC= <off>
##$DECIM= 32
##$DECNUC= <off>
##$DECSTAT= 4
##$DIGMOD= 1
##$DIGTYP= 9
##$DL= (0..7)
0 120 120 120 120 120 120 120 
##$DP= (0..7)
150 150 150 150 150 150 150 150 
##$DP07= 0
##$DPNAME0= <>
$$ [...]
##$SUBNAM4= <"">
##$SUBNAM5= <"">
##$SUBNAM6= <"">
##$SUBNAM7= <"">
##$SUBNAM8= <"">
##$SUBNAM9= <"">
##$SW= 20.6817932712277
##$SWIBOX= (0..15)
0 0 3 0 0 0 0 0 0 0 0 0 0 0 0 0 
##$SW_h= 4139.07284768212
##$TD= 32768
##$TD0= 1
##$TE= 0
##$TE2= 300
##$TE3= 300
##$TEG= 300
##$TL= (0..7)
0 120 120 120 120 120 120 120 
##$TP= (0..7)
150 150 150 150 150 150 150 150 
##$TP07= 0
##$TPNAME0= <>
##$TPNAME1= <>
##$TPNAME2= <>
##$TPNAME3= <>
##$TPNAME4= <>
##$TPNAME5= <>
##$TPNAME6= <>
##$TPNAME7= <>
##$TPOAL= (0..7)
0.5 0.5 0.5 0.5 0.5 0.5 0.5 0.5 
##$TPOFFS= (0..7)
0 0 0 0 0 0 0 0 
##$TUNHIN= 0
##$TUNHOUT= 0
##$TUNXOUT= 0
##$USERA1= <user>
##$USERA2= <user>
##$USERA3= <user>
##$USERA4= <user>
##$USERA5= <user>
##$V9= 5
##$VALIST= <valist>
##$VCLIST= <CCCCCCCCCCCCCCC>
##$VD= 0
##$VDLIST= <DDDDDDDDDDDDDDD>
##$VPLIST= <PPPPPPPPPPPPPPP>
##$VTLIST= <TTTTTTTTTTTTTTT>
##$WBST= 1024
##$WBSW= 30
##$XGAIN= (0..3)
0 0 0 0 
##$XL= 0
##$YL= 0
##$YMAX_a= 20542
##$YMIN_a= -15356
##$ZGOPTNS= <>
##$ZL1= 120
##$ZL2= 120
##$ZL3= 120
##$ZL4= 120
##$ABSF1= 0
##$ABSF2= 0
##$ABSG= 0
##$ABSL= 0
##$ALPHA= 0
##$AQORDER= 0
##$ASSFAC= 0
##$ASSFACI= 0
##$ASSFACX= 0
##$ASSWID= 0
##$AUNMP= <proc_1d>
##$AZFE= 0.1
##$AZFW= 0.1
##$BCFW= 0
##$BC_mod= 2
##$BYTORDP= 0
##$COROFFS= 0
##$CY= 18.4799938201904
##$DATMOD= 1
##$DC= 0
##$DFILT= <>
##$DTYPP= 0
##$F1P= 9.9274215381318
##$F2P= -0.165520771350173
##$FCOR= 1
##$FTSIZE= 16384
##$FT_mod= 6
##$GAMMA= 0
##$GB= 0
##$INTBC= 1
##$INTSCL= 4.127829e-11
##$ISEN= 128
##$LB= 0.05
##$LEV0= 0
##$LPBIN= 0
##$MAXI= 10000
##$MC2= 0
##$MEAN= 0
##$ME_mod= 0
##$MI= 50
##$NCOEF= 0
##$NC_proc= -9
##$NLEV= 6
##$NOISF1= 3.799351
##$NOISF2= 2.8
##$NSP= 0
##$NTH_PI= 0
##$NZP= 0
##$OFFSET= 16.48848
##$PC= 4
##$PHC0= -271.4733
##$PHC1= 1.101538
##$PH_mod= 1
##$PKNL= yes
##$PPARMOD= 0
##$PSCAL= 4
##$PSIGN= 0
##$REVERSE= no
##$SF= 200.130005582386
##$SI= 16384
##$SIGF1= 3
##$SIGF2= 2
##$SINO= 400
##$SIOLD= 16384
##$SREGLST= <1H.CDCl3>
##$SSB= 0
##$STSI= 16384
##$STSR= 0
##$SW_p= 4139.07284768211
##$SYMM= 0
##$S_DEV= 0
##$TDeff= 32768
##$TDoff= 0
##$TI= <>
##$TILT= no
##$TM1= 0
##$TM2= 0
##$TOPLEV= 0
##$USERP1= <user>
##$USERP2= <user>
##$USERP3= <user>
##$USERP4= <user>
##$USERP5= <user>
##$WDW= 1
##$XDIM= 16384
##$YMAX_p= 272797830
##$YMIN_p= -6024254
$$ End of Bruker specific parameters
$$ ---------------------------------
##NTUPLES= NMR SPECTRUM
##VAR_NAME=  FREQUENCY,     SPECTRUM/REAL,   SPECTRUM/IMAG
##SYMBOL=    X,             R,               I
##VAR_TYPE=  INDEPENDENT,   DEPENDENT,       DEPENDENT
##VAR_FORM=  AFFN,          ASDF,            ASDF
##VAR_DIM=   16384,         16384,           16384
##UNITS=     HZ,            ARBITRARY UNITS, ARBITRARY UNITS
##FACTOR=    0.252644378177508, 1,           1
##FIRST=     3299.83951724647, 0,            0
##LAST=      -839.233330435636, 0,           0
##MIN=       -839.233330435636, -6024254,    0
##MAX=       3299.83951724647, 272797830,    0
$$ Real data points
##PAGE= N=1
##DATA TABLE= (X++(R..R)), XYDATA
$$ [...]
11859e67065J86821K627323p71504R115j0067M28322r93498J125391k346883J113857
11849H01812Q16936P40494j500312K94467N26795p35603q26313O17917M64993
11840A201186q30127J598065m72709n94690J408627j608447J13863J85366o29251
11831C71883K62372R89153o14167J237394j706327j041997J652339l00892M12409
11822A262167R90422K2148j093005Q57017K2292j311099l44280l11493J422212
11813A516381o95034m57759J264866K65135k66623p28549N70524n44882m3487
11804H80572N88586j55242P08233o31692J31053m38352k59131R93411j217797
11795E99641P3098L63751J12703j388930J263916n23295k99995J060570j161183
$$ plain form
11859 -567065 -380244 2247079 1475575 1484690 1474623 1902945 909447 2034838 -312045 801812
11849 801812 1618748 2359242 858930 1153397 1680192 944589 118276 736193 1201186
11840 1201186 371059 1969124 1496415 901725 2310352 701905 815768 1001134 371883
11831 371883 634255 1623408 1009241 2246635 540308 -501689 1150650 849758 1262167
11822 1262167 2252589 2274737 1181732 2038749 2061041 749942 405662 94169 1516381
11813 1516381 821347 363588 1628454 1893589 1626966 898417 1468941 924059 880572
11804 880572 1469158 1313916 2022149 1390457 1521510 1083158 824027 1817438 599641
11795 599641 672739 1036490 1149193 -239737 1024179 500884 200889 1261459 100276
11786A00276J223374r08997K249802m36035j076958l12931M39871R81673m79677
11777A780398p00039O78812J08317p58689K18551j597184N45052J265178j400725
11768A39671J033705j615834L248767j656563J299950j925580K6351k7504O39906
11759A162869N1458p3037n20650o29253J137968K9625J390826q91487Q40217m43237
11749B055299j360964J471196k56393r93038O17880n66139l01323j042485J189451
11740H13484M42328M74639l00603k48401K34704j265275K81811K98746J304893
11731B036326j041074o03107K322390r40094j040902M32622M71777j37650l80267
11722A120021o19926K125272q70100j067177R46861n62615M25068l48420j52550
$$ plain form
11786 100276 1323650 414653 2664455 2228420 1151462 838531 1278402 2260075 1780398
11777 1780398 1080359 1759171 1867488 1108799 1327350 -269834 275218 1540396 139671
11768 139671 1173376 -442458 2806309 1149746 2449696 524116 550467 522963 1162869
11759 1162869 1214327 1141290 620640 -8613 1129355 1158980 2549806 1658319 2498536 2055299
11749 2055299 694335 2165531 1909138 916100 1533980 967841 666518 -375967 813484
11740 813484 1255812 1730451 1429848 1181447 1416151 150876 432687 731433 2036326
11731 2036326 995252 392145 2714535 1774441 733539 1166161 1637938 1500288 1120021
11722 1120021 500095 2625367 1755267 688090 1634951 1072336 1497404 1148984 996434
11713I96434J379205J65489o75187o17026p64991J313566J05600r18076P73923
11704A758937L65710j284986m11465K043090j308444q76227M74961J565439j000890
11695A326125j939373J202860K32127M25708j331488M90151M70968p05861n66577
11686c95360N41982J07269J560624k82810Q58403j641012J048420j08861k07198
11677A481457l34781J799092p31630m71687L18499j751936J575917j916139n70419
11668f01627K747345j686589K68907k09285p70289L306715k006872j186609M54825
11659C16521j60337J311921p43760Q00434k001087K818404N80119n89719j443085
11650H89411j33777J188870K72263o62737m16395n19902N49810q3207j797933
$$ plain form
11713 996434 2375639 2541128 1865941 1248915 483924 1797490 1903090 985014 1758937
11704 1758937 2124647 839661 428196 2471286 1162842 286615 761576 2327015 1326125
11695 1326125 -613248 589612 821739 1247447 -84041 406110 877078 171217 -395360
11686 -395360 146622 253891 1814515 1531705 2390108 749096 1797516 1688655 1481457
11677 1481457 1146676 2945768 2214138 1742451 2060950 309014 1884931 -31208 -601627
11668 -601627 2145718 459129 728036 518751 -251538 3055177 1048305 -138304 316521
11659 316521 156184 1468105 724345 1524779 -476308 2342096 2922215 2332496 889411
11650 889411 755634 1944504 2216767 1554030 1137635 617733 1167543 1084336 -713597
11641g13597K758844p34425O00088m49283j154642K258504j88999j309978Q71746
11632A938258j998839R85979q1721k50067k41279P72740J69161J8461J00675j043470
11622C69898J434856m45255n84892J23870P92189l47893p73791k12542K022681
11613B379121j797816k62898J973533j66595n21968p86156O79402j940908J717429
11604A273144K3491J43534Q34009j4700m76459l15214J5080n80637k3095K24043
11594A103196N13438j180264O18346J674918k978893M12181L132658k893891N31878
11585I33567j84860J104973j028151Q95077K20447k77759m99996J022555j95401
11576A990452j175207J48027k70298o4265N14906N42857j227751M99125N62425
$$ plain form
11641 -713597 2045247 1310822 1910910 1461627 306985 2565489 2376490 1066512 1938258
11632 1938258 -60581 925398 843677 593610 352331 1125071 1294232 1312693 1413368 369898
11622 369898 1804754 1359499 774607 898477 1690666 1342773 568982 356440 2379121
11613 2379121 581305 318407 2291940 2125345 1603377 817221 1496623 -444285 1273144
11604 1273144 1296635 1440169 2274178 2259478 1783019 1467805 1482885 902248 879153 1103196
11594 1103196 1616634 436370 1054716 2729634 -249259 162922 3295580 401689 933567
11585 933567 748707 1853680 825529 1720606 1941053 1663294 1163298 2185853 1990452
11576 1990452 815245 963272 692974 628709 1143615 1686472 458721 957846 1520271
11567A520271r81476J447131O40499j416279K165004k749173K87754J543764j42561
11558B314934q20287N40352k202331L58642K218061j447632J340371k138993R48027
11549A111144l99806p54629L91658J367329o41275j526114J321326L05658r53545
11540B21746Q26894j32779l36412N58314n00801J008207k32512r99416l29931
11531H3310l02244J418137K48098K24980J213435k590681M25588P46235j53825
11522A313033k609961L114198j815750P49572n36487K510318k707840J111750
11514A128833P65564j349609J056997k45626O70734J95963p07001K19924O2745
11505A798524j847377Q91534j94400j75675J218852j16552k120600K198896j5469
$$ plain form
11567 1520271 538795 1985926 2626425 1210146 3375150 625977 913731 2457495 2314934
11558 2314934 1494647 2034999 -167332 191310 2409371 961739 2302110 163117 1111144
11549 1111144 711338 -43291 348367 1715696 1074421 -451693 869633 1175291 221746
11540 221746 1048640 915861 579449 1137763 636962 1645169 1412657 413241 83310
11531 83310 -218934 1199203 1447301 1672281 2885716 295035 720623 1466858 1313033
11522 1313033 -1296928 1817270 1520 751092 214605 2724923 17083 1128833
11514 1128833 1894397 544788 1601785 1356159 2026893 2222856 1515855 1735779 1798524
11505 1798524 -48853 842681 648281 472606 1691458 1574906 -545694 1653202 1637733
11496A637733n88910O63661k36471J9615j184113L36733K333713j518775m5106
11487A418080q76596k6733J652612k68181j334770K217118j530713n808Q72930
11478B117939q37156J020118J709928l505204R88712Q81734p09253l63114R80635
11469B284339j121911l01691j069087Q62134o81124o60842J410306J695539k049609
11460C68054P36423m85037J275789o60163J1742J03122L56739n28529k91380J314274
11450B201034N05946q49843m68912m79833M99910L68184l57393j094061J267542
11441A592574J30019r52116q43676Q10074l92049R17945o71558J467754R43373
11432C002340k016295j217291Q02655K265258j557461j72614K31197r96922J98364
$$ plain form
11496 1637733 1048823 1712484 1476013 1495628 311515 648248 2981961 1463186 1418080
11487 1418080 541484 514751 2167363 1899182 564412 2781530 1250817 1245009 2117939
11478 2117939 1280783 2300901 4010829 505625 1494337 2376071 1666818 1303704 2284339
11469 2284339 1162428 860737 -208350 653784 -27340 -688182 722124 2417663 368054
11460 368054 1104477 619440 1895229 1235066 1246808 1349930 1706669 1178140 886760 2201034
11450 2201034 2706980 1857137 1388225 908392 1408302 1776486 1419093 325032 1592574
11441 1592574 1722593 770477 -73199 736875 344826 1262771 591213 2058967 3002340
11432 3002340 986045 -231246 571409 2836667 1279206 1106592 1337789 340867 539231
11423E39231Q30216M81796j162505Q09911m96131J281145M53978j481472O22182
11414A878351Q02316j621463P8000N59526l88001J644178k090825l96770J477633
11405A942945k72728o3260j71832l57366J370649j406938P42014j890778J677584
11396A570290p57466J117723m52908N90918j457655K77796n30176J126245k57485
11387A227282k14085p66031N58881J399220q78642j79331o36910K14812J427632
11378B152828j109437o7551J112237j55198P00060j146403L11329j608792J130328
11369A319401P28331r95788K38353l69733O86501o79759N67971j328115p64081
11360e96919J105953N21288J409286j18844p86597r69089L24461N20999j70731
$$ plain form
11423 539231 1369447 1851243 688738 1498649 1002518 2283663 2737641 1256169 1878351
11414 1878351 2680667 1059204 1137204 1696730 1308729 2952907 862082 465312 1942945
11405 1942945 1670217 1606957 1435125 1077759 2448408 1041470 1783484 -107294 1570290
11396 1570290 812824 1930547 1477639 2068557 610902 888698 358522 1484767 1227282
11387 1227282 1013197 247166 806047 2205267 1326625 1147294 510384 725196 2152828
11378 2152828 1043391 975840 2088077 1932879 2632939 1486536 1797865 189073 1319401
11369 1319401 2047732 1051944 1290297 920564 1607065 927306 1495277 167162 -596919
11360 -596919 509034 1030322 2439608 2320764 1534167 565078 889539 1410538 1239807
11351A239807j543324k24512J300406O57489M65770r04587l69891n15010K7509
11342A33657M93238O4922J71514j005766q11150K148736j08100J181740n09999
11333A758792o17891o3362o87762L25177N72010O91654j416947j37822J097738
11324A521587P2110L57528j346081R11724j28777q83451O99934N6112m47648n68566
11314B44472J178483r20549J871116p65950j038898j817421L518028q52520q65782
11305E50979P93431P84292j348523Q07519P56703r42435O4276j025919K142278
11296B582601k53199k145267J883583L73408N36601j675593p74420J327675l32967
11287A522422K78336M7263j917753J939432L24971k486452K516426j244433J902196
$$ plain form
11351 1239807 -303517 -528029 772377 1429866 1895636 991049 621158 106148 133657
11342 133657 626895 691817 863331 -142435 -953585 1195151 1087051 2268791 1758792
11333 1758792 1140901 1077539 389777 714954 1286964 1978618 561671 423849 1521587
11324 1521587 1593697 1951225 605144 1516868 1388091 504640 1204574 1260686 813038 244472
11314 244472 1422955 502406 2373522 1607572 568674 -1248747 2269281 1416761 550979
11305 550979 1344410 2128702 780179 1587698 2344401 1401966 1466242 440323 2582601
11296 2582601 2329402 184135 2067718 2441126 2977727 1302134 527714 1855389 1522422
11287 1522422 1800758 1848021 -69732 1869700 2194671 -291781 2224645 980212 2882408
11278B882408j333148j104507J749829k450904J072600N93555o19750M76443k48124
11269A018402j148303J83169R81602j007906J235468r0261p44035J555930r77627
11260A006439O481j94137j58105p213J081104j11892K23845j267088l34491J163046
11250A407989L77239M1607J066723k665777Q76836j114345R11823J591984j124340
11241A369739r03064j32680r42724J773742j21179K83070N04888l64291n03235
11232I64266N72541k693m10963o83046J000193q46456J6028O23789R72957k800614
11222e93998J036835o68306R56956J456926p04398m25522L42166R60796j943130
11213D18325J220609m5039j15673k6852p55735J190338j332616J000037n53060
$$ plain form
11278 2882408 1549260 444753 2194582 -256322 816278 1409833 790083 1266526 1018402
11269 1018402 -129901 53268 1034870 26964 1262432 1172171 428136 1984066 1006439
11260 1006439 1012920 818783 660678 653465 1734569 1622677 1846522 579434 244943 1407989
11250 1407989 1785228 1826835 2893558 227781 1104617 -9728 902095 2494079 1369739
11241 1369739 466675 333995 -608729 1165013 1043834 1326904 1831792 1467501 964266
11232 964266 1536807 1534114 1123151 440105 1440298 593842 609870 1233659 2206616 -593998
11222 -593998 442837 -225469 731487 2188413 1484015 1058493 1400659 2361455 418325
11213 418325 1638934 1593895 1478222 1451370 695635 1885973 553357 1553394 1000334
11204A000334n01112L87155k76665L66499J4897j138424L92463N55202M09218
11195A209567P12505j057733J865920j281007J240905r16952m68904P28362j613288
11186D19375P92968J391858q75289O3964l60853J5546m55951K070883k010495
11177A052006k36969q12140J017402j128586K550479j228805O9091J816131n22062
11168B576547j656048n13730j180210J474587J048658j177919l89823k52773J249917
11159A179206q75440K210678r53362J845j482529J712294p38856j647595P04036
11150A10277J217713N61781L67529j210599l16030p5844K465422l930886K713891
11141A903254J60908q54311L36762L7104O7171L23301m19614j502727K756935
$$ plain form
11204 1000334 499222 886377 609712 976211 991108 -147316 245147 800349 1209567
11195 1209567 1922072 864339 2730259 1449252 2690157 1773205 1304301 2032663 419375
11186 419375 1212343 2604201 1728912 1792876 1432023 1447569 991618 3062501 1052006
11177 1052006 815037 2897 1020299 -108287 2442192 1213387 1282478 3098609 2576547
11168 2576547 920499 406769 -773441 701146 1749804 571885 182062 -70711 1179206
11159 1179206 303766 2514444 1561082 1562927 80398 1792692 1053836 -593759 110277
11150 110277 1327990 1889771 2257300 1046701 730671 654827 3120249 -810637 1903254
11141 1903254 2064162 1209851 1546613 1583717 1650888 1974189 1554575 51848 2808783
11132B808783j811381j749312L013847j174204n4983R19136M81402k343960R5297
11123A84625J494532j372793K111718j447527r4426j011929J728922j217088o60897
11114b84863K722157R59794j884719o99199N79512p024q52092J575256j518121
11105E90701J601739k68521j441779J169695o61182J094424j740699l36674J293419
11096A301123K49478m21236p01226J870381j929104L89100P5676K08810q12620
11087B30382J300304O79585l70362j098763m59202J160401P43633j640653R0067
11078F35392J862664j508257p03101N79656j568945K281777m33275j337367K75878
11069H4422O66797J843746j544589j052653R98074K36963K58848l61855p5486
$$ plain form
11132 2808783 997402 -751910 2261937 1087733 1032750 1951886 2433288 89328 184625
11123 184625 1679157 306364 2418082 970555 876129 -135800 1593122 376034 -284863
11114 -284863 2437294 3397088 1512369 813170 1392682 1385658 533566 2108822 590701
11105 590701 2192440 1923919 482140 1651835 990653 2085077 344378 7704 1301123
11096 1301123 1550601 1129365 428139 2298520 369416 758516 834192 1043002 230382
11087 230382 1530686 2210271 1839909 741146 281944 1442345 2185978 545325 635392
11078 635392 2498056 989799 286698 866354 -702591 1579186 1145911 -191456 84422
11069 84422 751219 2594965 1050376 -2277 995797 1232760 1491608 1129753 1054267
11060A054267O53299K71900N80813j137243O27765R14855k030091j006049J284729
11051A214245m15047n1188J032441l14602j901610J870249K53281j382632k80887
11042B4250J093870p1248r38071J918552r41824j122672P67492J398761j95152
11033A933958r83107J773488j868124j9811J253345k54315j845964J256269n21331
11024G24408O10969J281091j064534L8233m25659L11933J421369j080016j473737
11015C44057j498554K237551m42292Q02104l63932K83686K83682k25600l39383
11006A081319N55491j531367K067376k603250K392529r67224m32295J284230J082480
10997B929289k24925k275900J253018p69658O21807j128844N53650r8736K26744
$$ plain form
11060 1054267 1707566 1979466 2560279 1423036 2050801 2965656 935565 -70484 1214245
11051 1214245 799198 748010 1780451 1465849 -435761 1434488 1687769 305137 24250
11042 24250 1118120 1046872 108801 2027353 1085529 -37143 730349 2129110 1933958
11033 1933958 950851 2724339 856215 836404 2089749 1835434 -10530 1245739 724408
11024 724408 1335377 2616468 1551934 1590167 1164508 1476441 2897810 1817794 344057
11015 344057 -1154497 1083054 640762 1442866 1078934 1362620 1646302 1420702 1081319
11006 1081319 1636810 105443 2172819 -430431 1962098 994874 562579 1846809 2929289
10997 2929289 2704364 428464 1681482 911824 1533631 404787 958437 859701 1086445
10988A086445L47152r52197N75714l21155M36705N96737n03625k76837J512398
10979B501337q02724j044098L2555P155K211632j783906r4627K3752o74647J233816
10969A610245j154111J379079j47156k0615q85990l18400J712885p07187n17262
10960I51488R5496N3560K25550l95761J194238J6214j314297n00174J500798k422752
10950e95640J311267o05252l16033J900432n90729m58512k67543Q87715N16546
10941A782251j348150N07028J552967o79646j358097J990703j925793J197361
10933A718624O22897k379909K323382q61193q55615L4176L28109k42089M37753
10924A126135P18608r32025J568120j145994j55406O30563m77132k70414j31317
$$ plain form
10988 1086445 1433597 481400 1057114 735959 1172664 1769401 1265776 988939 2501337
10979 2501337 1698613 654515 687070 694225 2905857 1121951 1027324 1051076 376429 1610245
10969 1610245 456134 1835213 1688057 1667442 781452 463052 2175937 1468750 951488
10960 951488 1046984 1100544 1326094 930333 2124571 2140785 826488 326314 1827112 -595640
10950 -595640 715627 110375 -205658 1694774 1104045 645533 377990 1265705 1782251
10941 1782251 434101 941129 2494096 1814450 456353 2447056 521263 1718624
10933 1718624 2341521 -38388 2284994 1423801 568186 602362 930471 688382 1126135
10924 1126135 1844743 912718 2480838 1334844 1179438 1810001 1332869 1062455 931138
10915I31138N1450J73707j101527J207560P16296o75163J80869M66777j105429
10906H45678J246307j646546P78333M91767J70389Q40602j701987k8514M97206
10897A493235j179143j07663J245051p17973N9604K37651J126127r09076J84585
10888A432398K54706p21527j87263O18573n00344j21687m4124N82405K64684j300670
10878B77151j002301K579758p33027Q14326K66555j152806O99260k03104o66454
10869H79358O66272M6786N38658j204037K367001j091740j93657l69655j080181
10860E58805J449885j584814J652062r53517p82718J243924K61512j94713j182626
10851D67800J362968L01339q77892r1369R05460P09140r22099p92160M97723j156700
$$ plain form
10915 931138 982588 1156295 54768 1262328 1978624 1303461 1484330 1951107 845678
10906 845678 2091985 445439 1223772 1715539 1885928 2726530 1024543 996029 1493235
10897 1493235 314092 206429 1451480 733507 793111 1030762 2156889 1247813 1432398
10888 1432398 1687104 965577 778314 1396887 896543 774856 730732 1313137 1577821 277151
10878 277151 -725150 1854608 1121581 1935907 2202462 1049656 1748916 1545812 879358
10869 879358 1545630 1592416 2131074 927037 3294038 2202298 2008641 1638986 558805
10860 558805 2008690 423876 2075938 1122421 339703 1583627 1845139 1650426 467800
10851 467800 1830768 2132107 1254215 1162846 2068306 2777446 1855347 1063187 1560910 404210
10841D04210L14321M50827q38229J428434M0984p23540m22039J23162J969721
10832B747851j323876k9943j66121J277524r73087o34678L22351K41068Q1831
10823A542920n48942P46553L86936k28645j129662R4123J630881j692383M1880
10814H43661k17599J633893L52944m73005j412160J47614R21536m63159J035692
10805B369417j472483o19857k226K259551j267966J321060j447714j324605N00341
10796C15518J087021O2425k65592p64360K100182j755491O05926o22376J502892
10787B266145m26157k300103K239375j652036Q46921J089767k74043N8797J23862
10778A972528o57200q80433J473034j071161J258264j429897K98260Q14830N99068
$$ plain form
10841 404210 718531 1169358 331129 1759563 1800547 1077007 654968 778130 2747851
10832 2747851 1423975 1394032 1227911 2505435 1532348 897670 1220021 1461089 1542920
10823 1542920 993978 1740531 2127467 1898822 769160 863283 2494164 801781 843661
10814 843661 626062 2259955 2612899 2139894 727734 875348 1796884 1333725 2369417
10805 2369417 896934 277077 274851 2534402 1266436 2587496 1139782 -184823 315518
10796 315518 1402539 1464964 1199372 435012 2535194 779703 1385629 763253 2266145
10787 2266145 1839988 -460115 1779260 127224 974145 2063912 1789869 1848666 1972528
10778 1972528 1315328 434895 1907929 836768 2095032 665135 963395 1778225 2377293
10769B377293o52549j596588J390864j263511J502521J813960j646360j828080
10761I7550J087398m97800J544381j66751r54432j618571J519863m4743R8391
10752A065286Q48572j59091j25282j318628N55471J308564j689165K8948l82880
10743A31795J143255l8524r75186K199137m71663j212482J718047j852848J313196
10734A954727r52773m46869k60531N63188K64068q47176K228653q52582j898831
10725b48126J179117O45729j194815K131650j288621L42379q78291J393324j222332
10716H60014p5224M25031j50076l63479J64320m1063J020501k26739m26879q00030
10706C86376R18983J068319j537668R36059j240339m29920J491601o99524M95233
$$ plain form
10769 2377293 1724744 128156 1519020 255509 1758030 3571990 1925630 97550
10761 97550 1184948 687148 2231529 2064778 1110346 -508225 1011638 966895 1065286
10752 1065286 1913858 1754767 1629485 310857 866328 2174892 485727 514675 131795
10743 131795 1275050 1236526 261340 2460477 1988814 776332 2494379 641531 1954727
10734 1954727 1001954 555085 294554 857742 1121810 274634 2503287 1650705 -248126
10725 -248126 930991 1576720 381905 2513555 1224934 1567313 689022 2082346 860014
10716 860014 784790 1209821 1059745 696266 860586 819523 1840024 1613285 1186406 386376
10706 386376 1305359 2373678 836010 1772069 531730 101810 1593411 893887 1389120
10697A389120m2053n57827k79415N81550n98571R86159j15861j633409J045552
10688G75245L08615r68168l66691K729285j289289N45362q98913r04195R66656
10679H97907K9336J839680r98134q22324q751O92922r18530k13497j723754M350701
10669C125556k022202m55904j5208J90419J548826J29205k972089J448861o4189
10660I13275o42767J127559M31303O74545o10601p12790q4810J861722k007659
10651I49777k81989j355816K240089K50863p92756M83574j045944J52829j5831
10642E84796J248992m83684p20271q23590J490308J78593L82619j179059P18426
10633A397130m99201l77330R72226k29794L93562r24634K214284k216105J572579
$$ plain form
10697 1389120 1347067 789240 509825 1091375 492804 1478963 1363102 -270307 775245
10688 775245 1083860 115692 -250999 2478286 1188997 1734359 835446 -68749 897907
10679 897907 927243 2766923 1768789 946465 937714 1630636 712106 498609 -1225145 3125556
10669 3125556 1103354 647450 632242 822661 2371487 2500692 -471397 977464 913275
10660 913275 270508 1398067 1829370 2503915 1893314 1180524 1095714 2957436 949777
10651 949777 667788 -688028 1552061 1802924 1010168 1493742 447798 600627 584796
10642 584796 1833788 1350104 629833 -193757 1296551 1475144 1857763 678704 1397130
10633 1397130 897929 520599 1492825 1263031 1656593 731959 2946243 730138 2302717
10624B302717k27868l04442l66777L15119o66387j308286L165970n90042n76732
10615A743272M55155n62564j090673P85514j430790K069585j130858J713541j143457
10606A408725r27781M73527J022870J376567k105472j90098Q21203J76374r57839
10597A098076J315069r42817n95483p35537k009525M114261n46363q33912P47852
10588A611621k154377L253328j327982j139011Q24470m76052O35729k49141L16255
10579A294840J08401L4762p84551J818598o33495m03264j049827O76746P56652
10570A818862p2797P71335m18582q64778Q39415o26776K11846n55633N26285j559008
10560G0169n69387O02810M12073J129872J212974j566779L1425o60474j524797
$$ plain form
10624 2302717 2074849 1770407 1403630 1718749 1052362 -255924 2910046 2320004 1743272
10615 1743272 2198427 1635863 545190 1330704 -100086 1969499 838641 2552182 1408725
10606 1408725 480944 954471 1977341 3353908 1248436 1058338 1879541 2055915 1098076
10597 1098076 2413145 1470328 874845 139308 -1870217 2244044 1697681 863769 1611621
10588 1611621 -542756 2710572 1382590 243579 1068049 591997 1227726 978585 1294840
10579 1294840 1403241 1438003 653452 2472050 1838555 1435291 385464 1062210 1818862
10570 1818862 1746065 2517400 2098818 1234040 2073455 1446679 1658525 1102892 1629177 70169
10560 70169 -499218 103592 515665 1645537 2858511 1291732 1323157 662683 -862114
10551h62114J858055L066319l509239K162045k830912R06293J070386k47083r42065
10542F71685L72886N56121j328846k54730L17016N79551K40610j583361J356785
10533I27717j504304j4018K957844j851845L71002J002143p38570K84833O56208
10524B091010K10790j911175K34307K77220n03468K034253p04868J82997k76643
10515A634423K02662L3395k240095N00541K099493j914393K01016L83927J820194
10506B721163r68863l33154j939034J434420k13952J275490o57115r83983J203706
10497A538678k001225J777241j57690J379336k539398K209592j857907L66837
10489G15464L61460o27378Q84852k00559j166071J462140J455636j972517q88746
$$ plain form
10551 -862114 995941 4062260 553021 2715066 -115846 790447 1860833 1613750 671685
10542 671685 1044571 1600692 271846 17116 334132 913683 1154293 -429068 927717
10533 927717 -576587 -590605 2367239 515394 886396 1888539 1149969 1434802 2091010
10524 2091010 2301800 390625 624932 902152 398684 2432937 1728069 1911066 1634423
10515 1634423 1837085 1870480 -369615 130926 2230419 316026 517042 900969 2721163
10506 2721163 1752300 1419146 -519888 914532 700580 1976070 1318955 334972 1538678
10497 1538678 -462547 1314694 1157004 2536340 -3058 2206534 348627 715464
10489 715464 1076924 449546 1334398 1133839 -32232 1429908 2885544 913027 24281
10480B4281K101814p43299L31824r18348K95927r46125J889700N99202k804770
10471a69794J471012J72141j101908J672017N43380j088262l84273o37769K056388
10462B532932k049990o98874J775233k123907R88573L93598n36412J005226k10889
10453A075490O82159J355807k182837l64811J087375q212k09060J091638n54168
10444A973381j965876J211430j323796J617589K52841j189110m67240O51175Q43120
10435A603514q881j138487J482962M0328j440891K290309j675768o16413R55790
10426A492463J379119k205476n99100J045420R41722j902608N34576j188654K032708
10417A530170p54826N46535j452205J309636J867871k529634J35597O15400p90257
$$ plain form
10480 24281 2126095 1382796 1714620 796272 1092199 146074 2035774 2634976 -169794
10471 -169794 1301218 1473359 371451 2043468 2586848 1498586 1114313 476544 2532932
10462 2532932 482942 -215932 1559301 -564606 423967 817565 281153 1286379 1075490
10453 1075490 1757649 3113456 930619 565808 1653183 1644971 1435911 2527549 1973381
10444 1973381 7505 1218935 -104861 1512728 1765569 576459 109219 760394 1603514
10435 1603514 1594633 456146 1939108 1979436 538545 2828854 1153086 536673 1492463
10426 1492463 2871582 666106 67006 1112426 2054148 151540 686116 -502538 1530170
10417 1530170 775344 1321879 -130326 1179310 3047181 517547 653144 1268544 478287
10408D78287K472412k059378j55080R06202p85633N26752j563752K323005l55496
10399A787319J537376j254080j566745O50737m98889R83487m12289O68462n89951
10390A305427j095603K84696n85031M72395J030490O64494j115205j6785O51728
10381A596606q3616j54751L67939n3742r09552n19680J072886J052058p57343
10372A610805j02657P87072j24533k521981K246170j125633o51024L89590J608770
10363B116579p85731J71027j624061J249125O35254k86060k40169J90398Q52264
10354B278626L1930j020952J948407j907162l27493j721834J806741r94303J230249
10345A324209K76762R38107q42557j473233R92766k8974l70270Q86916q18266
$$ plain form
10408 478287 2950699 891321 736241 1642443 856810 1383562 -180190 2142815 1787319
10399 1787319 3324695 2070615 503870 1154607 655718 1639205 1226916 1895378 1305427
10390 1305427 209824 494520 -90511 381884 1412374 2076868 961663 944878 1596606
10381 1596606 1512990 1358239 1726178 1672436 762884 243204 1316090 2368148 1610805
10372 1610805 1508148 2295220 2170687 -351294 1894876 769243 118219 507809 2116579
10363 2116579 1330848 1501875 -122186 1126939 1762193 1476133 1235964 1426362 2278626
10354 2278626 2310556 1289604 3238011 1330849 1003356 -718478 1088263 93960 1324209
10345 1324209 1600971 2539078 1696521 223288 1216054 1187080 816810 1703726 885460
10336H85460r51062J368934K40762q13459j11142J507536r44466j55337k74311
10327G52915M0427O704l30350L32737J49180k71736J230594j383198j91094J854212
10317B190391r31244O69106j471422j3024K030878j560941J82807l97995k7294
10308F71262Q04792j291350J030589Q1844o35079o29444K095985o25665j213027
10299B89907K685082j453770p2597j129646Q64132J20209j08807M91502L21606
10290B007618j180094J094901j497083Q54482o78258J454604k38486m4760P66939
10281B539863j067582M46780k500439K445217k03181L09662k257160K324314q98268
10272A139206r17912M84305P45389j68554r02905j66454J138665R31759k128008
$$ plain form
10336 885460 -65602 1303332 1544094 730635 619493 2127029 1182563 1027226 752915
10327 752915 793342 800046 469696 802433 951613 679877 1910471 527273 336179 2190391
10317 2190391 1259147 1928253 456831 443807 2474685 913744 1096551 698556 671262
10308 671262 1476054 184704 1215293 1297137 662058 32614 2128599 1502934 289907
10299 289907 2974989 1521219 1448622 318976 1183108 1303317 1194510 1686012 2007618
10290 2007618 827524 1922425 425342 1279824 601566 2056170 1817684 1772924 2539863
10281 2539863 1472281 1919061 -581378 1863839 1660658 1970320 -286840 2037474 1139206
10272 1139206 221294 705599 1450988 1282434 379529 213075 1351740 2283499 155491
10263A55491P86351J420589k333448j19916Q63826O11316R41057k048941J251355
10254A527680m86141P28200j468194J878405o11162j332995K06905J388668j162471
10245F68895Q76988j011726N59483N94723j925912K076220J49170r87581K8176
10236A028436k42094Q29222j621207J842178q03157p66738R76033n35052O65744
10227A373365J37450M46589o75411k82176R21843r79059P32877k31088K48347
10218A692737O23701m27158r05449P18687K40085j109217o12006m77055J786013
10209A530338r0037j41616P42715K75656j308387R8121j79916k398015K057295
10200E86154J07234J432363Q55400m04521j772761O91237J439033k073102n94612
$$ plain form
10263 155491 941842 2362431 28983 -90933 772893 1384209 2325266 276325 1527680
10254 1527680 1041539 1769739 301545 2179950 1568788 235793 442698 1831366 668895
10245 668895 1545883 534157 1093640 1688363 -237549 1838671 1987841 1000260 1028436
10236 1028436 786342 1615564 -5643 1836535 1033378 266640 1242673 707621 1373365
10227 1373365 1510815 1957404 1281993 999817 1921660 942601 1675478 1444390 1692737
10218 1692737 2316438 1889280 983831 1702518 1942603 833386 221380 -255675 1530338
10209 1530338 1440301 1298685 2041400 2317056 1008669 1106790 926874 -1471141 586154
10200 586154 693388 2125751 2981151 2576630 803869 1495106 2934139 861037 266425
10191B66425J341138r31805k17848o77567K268741j441306K015894j146552P15630
10182B192750j082395q89129j2744K027120k817482K805873k342977J208250k37210
10173H52056j66216l15543N57953k70748l94536P74399q27404J189073J74819
10164A573853j087982J640150K06849j519315L46020Q98610j660645O3478O43297
10155A104315j390783J356294L40525n61546J815606j047000L02550j878295J115464
10146A157130N46875r4761m76167J00207j342837K376390j246319J680403j359132
10137A341789n0642j238527Q31020r16904J428819O34152p89670M23729j065546
10128E98220J963390j434895r05873J009265o01233J407584k533346J766733o98089
$$ plain form
10191 266425 1607563 675758 457910 -219657 2049084 607778 2623672 1477120 2192750
10182 2192750 1110355 221226 208482 2235602 -581880 2223993 -118984 1089266 852056
10173 852056 685840 370297 928250 657502 262966 1037365 209961 1399034 1573853
10164 1573853 485871 2126021 2332870 813555 1159575 2058185 397540 461018 1104315
10155 1104315 -286468 1069826 1410351 848805 2664411 1617411 1919961 41666 1157130
10146 1157130 1704005 1609244 1133077 1233284 -109553 2266837 1020518 2700921 1341789
10137 1341789 1291147 52620 883640 -33264 1395555 2029707 1240037 1663766 598220
10128 598220 2561610 1126715 220842 1230107 628874 2036458 -496888 1269845 571756
10119E71756k29172J405681j371029J978452R56000j423849j094685L34940n43985
10110E84109P76795n68914o2727J063057R54289k494356o82107M70347K078108
10101B118601m40257L60404k446778L149332j026015j162467O55380j49460k00642
10092H58098J104732p90059j49269J853397k398079n98908l62214J130082J630591
10083B278371j46171k419678K015114o24328L53013M81396J724770k819985M66862
10074A309364n03033J99620q66475J154775l01237j91450K562224k277823n84977
10065E00988N75797o97056J349506k99466j112917J507336j299471R74664O04027
10056B103408J203998j626375o30334P61806Q4522j780592J973409k203450M71308
$$ plain form
10119 571756 342584 1748265 377236 2355688 3311688 1887839 793154 1128094 584109
10110 584109 1360904 791990 729263 1792320 2746609 252253 -429854 40493 2118601
10101 2118601 1678344 2038748 -408030 2741302 1715287 552820 1208200 1058740 858098
10092 858098 1962830 1172771 1023502 2876899 478820 -120088 -482302 647780 2278371
10083 2278371 2132200 -287478 1727636 1103308 1456321 1937717 3662487 842502 1309364
10074 1309364 806331 1005951 139476 1294251 993014 801564 3363788 1085965 500988
10065 500988 1076785 379729 1729235 1429769 316852 1824188 524717 1499381 2103408
10056 2103408 3307406 1681031 1050697 1812503 1897025 116433 2089842 -113608 357700
10047C57700M06072J135985j205822N51174J84492q04457M41666o12144J889447
10038B344113r2175j39150k581052J992986l4172q92729o9585J325640N6295l44286
10028A565885L03949n57194K01799q73158m91268m59931K087662o06441J365057
10019B536360k021767O82656j090371N15413J224100m28513k5724q22545J239259
10010A808868j093390o53183M11227m52549p0154J130993K24436l11885K517305
10001C511668j125405m70581j772816O38861J550340q93948r47845L22487k5942
9992G86819K64540K14205j989626J252078K03969M69356k8540n65756J317988
9983A925033j757447J972595j401582K149020j576299m360l86729L11252L61083
$$ plain form
10047 357700 763772 1899757 693935 1245109 1429601 625144 1066810 454666 2344113
10038 2344113 2251938 2112788 -468264 1524722 1490550 597821 528236 1853876 1910171 1565885
10028 1565885 1869834 1312640 1514439 641281 150013 -309918 1777744 1171303 2536360
10019 2536360 514593 1197249 106878 622291 1846391 1417878 1392154 569609 1808868
10010 1808868 715478 62295 473522 20973 -49181 1081812 1306248 994363 3511668
10001 3511668 2386263 1915682 142866 781727 2332067 1438119 490274 812761 786819
9992 786819 1051359 1265564 -724062 528016 731985 1201341 1172801 607045 1925033
9983 1925033 167586 2140181 738599 2887619 1311320 1306960 920231 1231483 1592566
9974A592566J85423k282295N58016J33791J461907N81576l06476j191444K31881
9965I64945k56236J412207n22242J81781k12828J24856k009789K064670J43301
9956A890665j246692O579J159546p6436j019171J065195j473922L21546J193011
9947A820321M44695j527076Q22827J172551n98380K39466j039391l21457j112359
9938i8803L44240R15595M33770O77061p31937j450648J672298n40164Q18716q59537
9928A180591J98290J607677l054897L88926J560603j308257m49103L54709R49234
9919A427773k11756L68194Q81271j539493Q96055j180615P32808j498638K145681
9910B021280n32596m8916R35326m32825j562388K66497O90910L52735m77930J72987
$$ plain form
9974 1592566 1777989 -504306 53710 187501 1649408 2230984 1924508 733064 964945
9965 964945 708709 2120916 1598674 1780455 1567627 1692483 -317306 1747364 1890665
9956 1890665 643973 650552 1810098 1733662 714491 1779686 305764 627310 1820321
9947 1820321 2265016 737940 1560767 2733318 2134938 2374404 1335013 1013556 -98803
9938 -98803 245437 1161032 1594802 2271863 1539926 89278 1761576 1221412 2040128 1180591
9928 1180591 1378881 2986558 -68339 320587 1881190 572933 123830 478539 1427773
9919 1427773 1216017 1584211 2465482 925989 1822044 641429 1374237 -124401 2021280
9910 2021280 1488684 1439768 2375094 1942269 379881 646378 1337288 1690023 1212093 1385080
9900A385080Q50781k3748r48585J04388M12692K42745j186034J573288j230882
9891A179725M06014j460686O62140n49783J332960j323821K70907J205268j143403
9882E79321j47243K44476K18645J98724J205563j889028Q71300J76205m13086
9873A044877P48791j279863J332015n37404J99304n63517N58114N47144j158139
9864H91322j606517J147982m98261J597441l26140J163149k880570J914817j6835
9855A386388K79314J50492j769305J651843j167727J42666o10823L25479J028134
9846A416461j236687P71985O14373p15324O210r233J339071J645422j253763n8312
9836B520203p31106j126173O75673J083482q7577m31900J80649j199654K98291
$$ plain form
9900 1385080 2235861 2212113 1263528 1367916 1780608 2023353 837319 2410607 1179725
9891 1179725 1585739 125053 787193 237410 1570370 246549 517456 1722724 579321
9882 579321 432078 676554 895199 1093923 2299486 410458 1281758 1457963 1044877
9873 1044877 1793668 513805 1845820 1308416 1507720 944203 1502317 2049461 891322
9864 891322 -715195 432787 -65474 1531967 1205827 2368976 -511594 1403223 1386388
9855 1386388 1665702 1816194 46889 1698732 531005 673671 62848 388327 1416461
9846 1416461 179774 951759 1566132 850808 857018 847785 2186856 3832278 2578515 2520203
9836 2520203 1789097 662924 1338597 2422079 2334502 1902602 2083251 883597 1181888
9827A181888Q39561j550424j15713K925491j715805M39210q65170j27318J087191
9818B098911j287133J492334j367934M09819l26071M44837L9544q77466O96872
9809A323713j044928R75939o95703J840231J162209j875834q85594M44003L01451
9800A545487j427421J572806r70835K75664O98757L45774r40576J918416j873454
9791A144618m77172J083012j112750J475001j693306P36990K53506l57570J233854
9782B286183k653898J595526n62882q24249Q23850O82976K82994n9297K73205
9773A844408R7673n98037J786544k148487J800176j412132J034445j116718J339463
9764B627335j103730Q09771j786069K57413k13631n9751M23745J224692n71807
$$ plain form
9827 1181888 2021449 471025 355312 3280803 1564998 2004208 1139038 1011720 2098911
9818 2098911 811778 2304112 936178 1345997 1019926 1464763 1504307 626841 1323713
9809 1323713 278785 1254724 559021 2399252 3561461 1685627 800033 1244036 1545487
9800 1545487 118066 1690872 720037 995701 1694458 2040232 1099656 3018072 1144618
9791 1144618 667446 1750458 637708 2112709 419403 1156393 1409899 1052329 2286183
9782 2286183 -367715 1227811 664929 -159320 664530 1347506 1630500 1571203 1844408
9773 1844408 1942081 1344044 3130588 982101 2782277 1370145 2404590 1287872 2627335
9764 2627335 1523605 2333376 547307 804720 591089 531338 955083 2179775 1607968
9755A607968o88386J098758q30969J424006j644289j2454J23930Q3973j075916
9746H6621J689867p58344p13898j67094J210140P1928n14455q97062J751445l94504
9736A364644L38876M8327L60049o27952r739N51361o69554L31833o71841L31341
9726A347345M65358j41335l74735j776154R9648J374901p2976P50860j410358
9717B62554J529042J13817j028729j98282R16332P9092j429306J480063n10928
9708A213655n00269J76304n56438J287744M76029Q1490k51412M919j872769K7508
9698H6761J87454J877414l70438l71505J506386R2554k494385M97946P74343r61594
9688H24936O54714m75135Q37488j061333O89485M16615r15785K34979l79418J466455
$$ plain form
9755 1607968 919582 2018340 1187371 2611377 967088 954634 1078564 1162537 86621
9746 86621 1776488 1018144 304246 137152 1347292 1419220 904765 7703 1759148 1364644
9736 1364644 1703520 1751847 2111896 1483944 1474205 2025566 1356012 1687845 1016004 1347345
9726 1347345 1812703 1671368 1296633 -479521 -379873 995028 922052 1672912 262554
9717 262554 1791596 1905413 876684 678402 1594734 1673826 244520 1724583 1213655
9708 1213655 713386 889690 333252 1620996 2097025 2178515 1927103 1932022 59253 86761
9698 86761 274215 2151629 1781191 1409686 2916072 3008626 514241 1012187 1786530 824936
9688 824936 1479650 1004515 1842003 780670 1470155 1886770 970985 1205964 826546 2293001
9678B293001r01103r01251M27082J667723k188973K65769J957601j688580L22202
9669A253471j50595m99092l98298J932557n40294q75928L13804j17054J820365
9660B738936n51198j080799l41343k71916K21148J974356k037652L42973O07304
9651A601809K67746L73007j69250j081084N22990j854536K273707P72662k880004
9642a72953J592965k03407L36274j69954L26586k320087K456305L599k72468N57638
9632B134498R05613k243882O57355J198832k264473J19534j030891J140742J542005
9623B159333p64859k64142J117830k736675K478491l55456O70066j205998J416417
9614B515007K01177n40283j015410J584226k599672L064518l75503k071250J107763
$$ plain form
9678 2293001 1391898 490647 917729 2585452 396479 662248 2619849 931269 1253471
9669 1253471 1102876 603784 205486 2138043 1597749 721821 1035625 918571 2738936
9660 2738936 2187738 1106939 765596 493680 714828 2689184 651532 994505 1601809
9651 1601809 1869555 2242562 2073312 992228 1515218 -339318 1934389 2707051 -172953
9642 -172953 1420012 1216605 1552879 1382925 1709511 -610576 1845729 1849328 1576860 2134498
9632 2134498 3040111 796229 1453584 2652416 387943 507477 -523414 617328 2159333
9623 2159333 1394474 1130332 2248162 -488513 1989978 1634522 2304588 1098590 2515007
9614 2515007 2716184 2175901 1160491 2744717 145045 3209563 2834060 762810 1870573
9605A870573r16237M80755J152203p55162j16804j445203q72583R83630N10548
9596H91720N29873j00988L06206M68080o49948J79259l54290j314159N94961J360988
9586A911702L31926p79872O61413j013252J78850J0046P16122l57087J272098
9577B931946k342185K272784j205085P3260l97020r9211K077192k582343K52996
9568I82334K04954m69579J734017k01769j29205K15152j282257o398k97140J86863
9558I36972l50636l24734J516724k70243J30869r80898m66496J744931j012589
9549I23900M27548J987088j441431j76489m75466J451453j548920m7602K71486
9540A371567P79866j333770j41964n99935O97875R32289k175816K509616M10627
$$ plain form
9605 1870573 954336 1435091 2587294 1832132 1715328 270125 -602458 381172 891720
9596 891720 1421593 1320605 1626811 2094891 1444943 1624202 1269912 -44247 550714 1911702
9586 1911702 2243628 1463756 2125169 1111917 1290767 1300813 2016935 1659848 2931946
9577 2931946 589761 2862545 1657460 1730720 1333700 1234489 3311681 729338 982334
9568 982334 1187288 717709 2451726 2249957 2120752 2335904 1053647 1047249 750109 936972
9558 936972 586336 261602 1778326 1508083 1638952 658054 191558 1936489 923900
9549 923900 1351448 3338536 1897105 1720616 1245150 2696603 1147683 1100081 1371567
9540 1371567 2151433 817663 675699 75764 773639 1705928 -469888 2039728 2450355
9531B450355k039471N27981j66733K64879J395212j01471p18536n54581j816r09725
9521A46094K056150p1980j901793k11119R99600J269164l76223P8370j187682
9512H00581J736847o4276L83959k715171J786239q55133Q47762l16041J019345
9503B624112j508841J478668N1899q70911n75645J392596p2741K66359j976931
9494H08565O4599J711593l589361K757635l34023L65164r26860Q84886K26666
9485A968864O69072L87024j946365M82317M84840k40479o68792K48010j86748
9476A197743J396627j085062L58957k74263q48906J50332K84085J403745o79883
9467A903375J183521j392333j049477N68365J374201j445112n06236N49114N95078
$$ plain form
9531 2450355 410884 938865 772132 1037011 2432223 2330752 1612216 1057635 1055819 146094
9521 146094 2202244 2130264 228471 17352 1016952 2286116 1909893 1988263 800581
9512 800581 2537428 2473152 2857111 141940 1928179 1073046 1920808 1604767 2624112
9503 2624112 1115271 2593939 2645838 1774927 1199282 2591878 2519137 2785496 808565
9494 808565 873164 2584757 -1004604 1753031 1419008 1784172 857312 1742198 1968864
9485 1968864 2637936 3024960 1078595 1560912 2045752 1805273 1136481 1384491 1197743
9476 1197743 2594370 1509308 1868265 1594002 745096 895428 1179513 2583258 1903375
9467 1903375 3086896 1694563 645086 1213451 2587652 1142540 636304 1185418 1780496
9458A780496J65321j183777O31172k84855K57271P18212J06068j147883j89922
9449H52103J016850r08042k6880J197467M37847j974479K55517P99143j4792p94892
9439H39842m71330j33107J114153J026795j324145Q27764m6257J94862K79271
9430B307848k830432L439127k449368K096487o98183l2958j96081m33987M39970
9421A642423K29316Q4084N25957p18322j051606N57617L31599j458120O48691
9412G91639M01830O03662m74125k80374J307858j115794j124492J396854K5268
9403A532326K07680j073604J354806J91925j09174j216513J066127L74682j061252
9394A267003k40725p31102J523237J87759j644765J555615j649460L65076m6669
$$ plain form
9458 1780496 1945817 762040 1393212 1108357 1365628 2083840 2189908 1042025 852103
9449 852103 1868953 960911 934031 2131498 2569345 594866 850383 1649526 1634734 839842
9439 839842 368512 235405 1349558 2376353 1052208 1879972 1833715 2028577 2307848
9430 2307848 -522584 2916543 467175 2563662 1865479 1832521 1636440 1202453 1642423
9421 1642423 1871739 1955823 2481780 1763458 711852 1269469 1601068 142948 791639
9412 791639 1193469 1797131 1323006 1042632 2350490 1234696 110204 1507058 1532326
9403 1532326 1740006 666402 2021208 2213133 2103959 887446 1953573 2328255 1267003
9394 1267003 1026278 295176 1818413 2006172 361407 1917022 267562 632638 585969
9385E85969R68260m33718j65667J080740K35685j446078M82351r46252J634380
9376A995670q17606J061194p12906J247162J85625q41241m64417R11175n51204
9367B013452j85745M59883l73367O6547L22945Q89924j618294j419272J547835
9358A703908Q98440j585676l20419M47606R23727j781983J262667n21450Q38153
9349A864973l143219L309536j277852J272259k4963M05008l36987l6073n52783
9340A479899j110145Q74038J19204L38081m20926N08697k9463K33556P2761j224712
9330H40990J186224j871735J679785j054067j207311J754264m63255K046224o16686
9321B294433m50476O08860J743j108291J080106m39716l68164P64010K83736j284230
$$ plain form
9385 585969 1554229 1120511 954844 2035584 2271269 825191 1307542 361290 1995670
9376 1995670 1178064 2239258 1526352 2773514 2959139 2117898 1653481 2564656 2013452
9367 2013452 1827707 2287590 1914223 1980770 2303715 3193639 1575345 156073 1703908
9358 1703908 2602348 1016672 696253 1143859 2067586 285603 1548270 1026820 1864973
9349 1864973 -1278246 2031290 753438 2025697 2000734 2405742 2068755 2032682 1479899
9340 1479899 369754 1243792 1362996 1701077 1280151 1788848 1759385 1992941 2065702 840990
9330 840990 2027214 155479 1835264 781197 -426114 1328150 864895 2911119 2294433
9321 2294433 1843957 2452817 2454560 1346269 2426375 1986659 1618495 2382505 2666241 1382011
9311A382011p53633O90534O3933q454r04835L13807K044605J99541j732154P71583
9301B066938n59631J09106o09910J205967P32749q71834O79900p87109K51812
9292B217988r8891J4283K23258j350682J297194j193120J554883j12671k90639
9283B261603k93521J67465m14158J31783q82441K636739j898709J117549j264588
9274A561722p89808n5509J232663K5535n92435r51051J636064r37772j194353
9265f4944N66494J112473Q11748n0255J753801k843163l7473j51082N57934J248458
9255B903991j107316j173476J387776P52533j228322K451731l003422M46075R89830
9246B419400l67427Q8592q24460L40357J145344k45583J48678m21261q792j475380
$$ plain form
9311 1382011 628378 1318912 1382845 1374391 469556 783363 2827968 3027509 1295355 2066938
9301 2066938 1507307 1616413 1006503 2212470 2945219 2073385 2753285 1966176 2217988
9292 2217988 2119097 2133380 2356638 1005956 2303150 1110030 2664913 2552242 2261603
9283 2261603 1968082 2135547 1721389 1853172 970731 3607470 1708761 2826310 1561722
9274 1561722 771914 716405 1949068 1974603 1382168 431117 2067181 1129409 -64944
9265 -64944 501550 1614023 2425771 2375516 4129317 1286154 1248681 1097599 1655533 2903991
9255 2903991 1796675 623199 2010975 2763508 1535186 3986917 983495 1429570 2419400
9246 2419400 2051973 2140565 1316105 1656462 2801806 2556223 2704901 2283640 2274848 799468
9236G99468J556001q2680r97993J427943l26031o75956j276694J707849k87722
9227A844185N6426J063293j728523J224738n88957j142312j48024J023381R75550
9218B579757K8143P34094j573110R61105o1694m18190N56548o65025p8577M04762
9208B467813n75395p21085P22124k61528R78677J069869j864800Q83398q1636
9199B617437l26419q54769L29127J367053J03546n95941k1197j070896J391793
9190B939734O41065j121354j248254J257191J03704K80026N14142j663808Q34311
9181B536757K870803k227458j373073Q75196o10499J319682o17623N04022j007203
9172B270604J237303O02597o53442K69250j130707r04452J650077j032174R99664
$$ plain form
9236 799468 2355469 2272789 1274796 2702739 2376708 1700752 424058 2131907 1844185
9227 1844185 1900611 2963904 1235381 2460119 1871162 728850 580826 1604207 2579757
9218 2579757 2607900 3341994 1768884 2729989 2668295 2250105 2806653 2141628 2063051 2467813
9208 2467813 1892418 1171333 1893457 1631929 2610606 3680475 1815675 2699073 2617437
9199 2617437 2291018 1436249 1765376 3132429 3235975 2640034 2618837 1547941 2939734
9190 2939734 3580799 2459445 1211191 2468382 2572086 2852112 3366254 1702446 2536757
9181 2536757 5407560 3180102 1807029 2682225 2071726 3391408 2773785 3277807 2270604
9172 2270604 3507907 4110504 3457062 3726312 2595605 1691153 3341230 2309056 3308720
9163C308720P47545R13858r48698m16526J172387j217174n19302K231030n91277
9154D680563n94723l49002k16097L22872J034831j304290l1449N15133l30412
9145C727426j73186J935270k32270J413799k335099J188981q09461J032274O00071
9136F347805j724327P11931P7349L02338K238297j645212Q31861J33709O84984
9127G958735p61534r80667L101483p44160J278412J328754l5254K189613j253664
9118A2081718J068016j634778M23148j19263J074607n74845Q83824m45187j097501
9109A1659739K760425L64550O20414L17682J414585l02657K168772J393531J773065
9100B2170106L154604L087129K690858O115222L718318J0153654N900715N175057
$$ plain form
9163 3308720 4056265 4970123 4021425 3604899 4777286 3560112 3040810 5271840 4680563
9154 4680563 4085840 3736838 3520741 3843613 4878444 3574154 3542705 4057838 3727426
9145 3727426 3554240 5489510 5257240 6671039 4335940 5524921 4715460 5747734 6347805
9136 6347805 4623478 5335409 5412758 5715096 7953393 6308181 7140042 7273751 7958735
9127 7958735 7197201 6216534 9318017 8573857 9852269 11181023 11145769 13335382 12081718
9118 12081718 13149734 11514956 11938104 11818841 12893448 12318603 13202427 12757240 11659739
9109 11659739 14420164 14784714 15405128 15722810 17137395 16834738 19003510 20397041 22170106
9100 22170106 25324710 28411839 31102697 37217919 40936237 51089891 56990606 62165663
9092F2165663R641239J3705512J6364899K4109881L4588035M2800982L0466560
9085B33842771k012944k0599304o6339261l6636500k0647808j4545712j0642792
9078F2418450q212826n084803n069434l427612j095065m930902r76100k567556
9070C1054152k219173Q61451l924147k10755j286123j364504j090900j492651
9062B0327350k92652p5612k522645Q3697N43517j087837j479525Q37555k9616
9053A6304232j486709j200905J18270o46492N92305j271784N57471j542104q47348
9044A0576936J767997r50863m16744L19373j446246m90745O60624p77987k8998
9035I213347j492081K249369r29964J46204p38553K69669k015820J676671N72572
$$ plain form
9092 62165663 71806902 85512414 101877313 125987194 160575229 203376211 233842771
9085 233842771 231829827 211230523 144891262 108254762 87606954 73061242 62418450
9078 62418450 54205624 49120821 44051387 40623775 39528710 34597808 33621708 31054152
9070 31054152 28834979 29696430 25772283 25561528 24275405 22910901 21820001 20327350
9062 20327350 20034698 19959086 17436441 17520138 18063655 16975818 15496293 16333848 16304232
9053 16304232 14817523 13616618 13734888 13088396 13680701 12408917 12966388 11424284 10576936
9044 10576936 12344933 11394070 10977326 11296699 9850453 9359708 10020332 9242345 9213347
9035 9213347 7721266 9970635 9040671 9186875 8448322 8717991 6702171 8378842 8951414
9026H951414j939683P09458k086925K280751j180025j254688K071437j41248o80934
9017F729557n3531N70251N41648k169153J80087n9716j149673P29312j1163n18036
9007D789583k89647O10304M64192M23949r1577r63401K51831j2790J498904p95995
8997E885353j163630K104579j647112M73095j314628J374731m08405l01684J162924
8988F165223j536257k66197J575525j580933R83401k39089R71498j873714J184281
8979E383738m84754q92620p16052q1489P34203j30825Q68254n74946O61197o14815
8969D151891J022507j070325j159153J591466q26917n2871m7173J65839j631822
8960B143442J419815n72777l37251K276507j533160n49271J871816j131915l77434
$$ plain form
9026 8951414 7011731 7721189 5634264 7915015 6734990 5480302 7551739 7410491 6729557
9017 6729557 6676026 7246277 7787925 5618772 5798859 5739143 4589470 5318782 5307619 4789583
9007 4789583 4499936 5110240 5574432 5998381 5906804 4943403 5195234 5182444 6681348 5885353
8997 5885353 4721723 6826302 5179190 5652285 4337657 5712388 5303983 5002299 6165223
8988 6165223 4628966 4362769 5938294 4357361 5340762 5101673 6073171 4199457 5383738
8979 5383738 4898984 4006364 3290312 3208823 3943026 3812201 4680455 4105509 4766706 4151891
8969 4151891 5174398 4104073 2944920 4536386 3709469 3656598 3609425 3775264 2143442
8960 2143442 3563257 2990480 2653229 4929736 3396576 2847305 4719121 3587206 3209772
8951C209772O52549p33011R41751j010143J684058k27115j70433q27934J186041
8942D705535j771923j91477J526268j573048m80260n07526R04357K07763Q59310
8933C678999l76850q21241K90500j200300L194737k680826l62924P35737J134032
8924C591864j720281K370449k51244k860334R95223M14593L09440O60433n92639
8915B917504j07881j046712J76651J182690k71069j426031R75916O64176J84728
8906C249972o67983M3158J617976j445050k79554o064j081265J384151o03739
8897B211602R63559l18086K35783q342q43010K50623R1453l25783q15960J298067
8887B739906j65077k088552J572006J206491k023607J000409j022044K027514
$$ plain form
8951 3209772 3862321 3129310 4071061 3060918 4744976 4517861 4347428 3519494 4705535
8942 4705535 2933612 2742135 4268403 2695355 2215095 1707569 2611926 2819689 3678999
8933 3678999 3302149 2480908 2771408 1571108 4765845 2085019 1722095 2457832 3591864
8924 3591864 1871583 4242032 3990788 1130454 2125677 2540270 2849710 3510143 2917504
8915 2917504 2809623 1762911 1939562 3122252 2851183 1425152 2401068 3065244 3249972
8906 3249972 2581989 2625147 4243123 2798073 2518519 2512455 1431190 2815341 2211602
8897 2211602 3175161 2857075 3092858 3084516 2241506 2492129 2583582 2257799 1441839 2739906
8887 2739906 2574829 486277 2058283 3264774 1241167 2241576 1219532 3247046
8879C247046j210050m38311J006592L60204q98900k32056j73205m47342R20768
8870B134746M87021j5984j66163L1163j520458J719067r81809J154836j564271
8861A278148J039506o25586q22596M91489J157218K18457j402860M08834J510148
8852C252758k077394J418340o7800p92889J485813j963746j50666J269836o37054
8843A737198K24113J61433k0740J771083j396283j792505K174787j024846L52797
8834B187037r44268n992L00455P99007j699416O83883P74691L85097p22395k42332
8824A515767Q18124J098620j935420O32036q96287M01445J21870q37949J877875
8815B796081j053952P07514j70952Q9941q67476N34567P00347j263580J406589
$$ plain form
8879 3247046 2036996 1598685 2605277 2965481 2066581 1834525 1661320 1213978 2134746
8870 2134746 2621767 2605783 2439620 2470783 950325 2669392 1687583 2842419 1278148
8861 1278148 2317654 1692068 869472 1360961 2518179 2736636 1333776 1742610 3252758
8852 3252758 1175364 2593704 2525904 1733015 3218828 1255082 1104416 2374252 1737198
8843 1737198 1961311 2122744 2102004 3873087 2476804 684299 2859086 1834240 2187037
8834 2187037 1242769 1236777 1537232 2336239 636823 1320706 2095397 2480494 1758099 1515767
8824 1515767 2333891 3432511 1497091 2129127 1232840 1634285 1756155 918206 2796081
8815 2796081 1742129 2449643 2278691 2368632 1501156 2035723 2736070 1472490 2879079
8806B879079j875339p05723J777638J630314k243015R72953L20741k558049J78178
8797C76777K39460j60209P97199R70925n06539l2564O84187K54145r43943n14657
8787A164781k50262j058068K643859L23247j689j002551l39944k04220j07805
8778A167348n27160J304872q8098N95448k444298R13788M65540O06226r71555
8769A022111Q18996M94046o40623o75485N85765R23925q89551p39062O69116J300251
8759B869489j513411J672320j789473j144329K135577n686r85218l74975J164945
8750B029239q17940o76254J711609k069964M087175l524390l1892L98910m60195
8741F46298L63713k42466J176742R5343o31857o1775K17317O4882R15118j698889
$$ plain form
8806 2879079 1003740 298017 2075655 3705969 1462954 2435907 2756648 198599 376777
8797 376777 616237 456028 1253227 2224152 1717613 1685049 2369236 2623381 1679438 1164781
8787 1164781 914519 -143549 2500310 2823557 2821868 1819317 1479373 1275153 1167348
8778 1167348 640188 1945060 1856962 2452410 8112 921900 1387440 1993666 1022111
8769 1022111 1841107 2335153 1694530 1019045 1604810 2528735 1639184 900122 1569238 2869489
8759 2869489 1356078 3028398 1238925 94596 2230173 2224487 1239269 864294 2029239
8750 2029239 1211299 535045 2246654 176690 4263865 739475 707583 1106493 646298
8741 646298 1010011 767545 1944287 2039630 1407773 1345998 1563315 1628197 2543315 844426
8731H44426J66831M39546O26174r4452q02331j59710N94497o05576J558197n34571
8721B033031O19503j555611M35436J370398j401582P03597q63312k88471J042040
8712B095029J562920o32417k168173J28718Q85654q63998M86426P37290k33274
8703A998175n19615j045871R98663j461914K313101R73155j72486j125357M59930
8694B417781N98929k954736J949962j195577j400904K307153o59465N55377l50550
8685A267970P40648K27515k262561J090152J621899o83098l91862J435250r47136
8676B098777j73868j078783J673601M47389N87233j474075j412573K624795k7048
8667C265448j912114N93581J69881j91927j150637O63979l8003L61875j344093
$$ plain form
8731 844426 1011257 1450803 2076977 1982525 1180194 1020484 1614981 1009405 2567602 2033031
8721 2033031 2652534 1096923 1532359 2902757 1501175 2204772 1341460 1052989 2095029
8712 2095029 3657949 3025532 857359 986077 1871731 1007733 1494159 2231449 1998175
8703 1998175 1478560 432689 1431352 -30562 2282539 3255694 3083208 1957851 2417781
8694 2417781 3016710 61974 2011936 816359 -584545 1722608 1063143 1618520 1267970
8685 1267970 2008618 2236133 -26428 1063724 2685623 2002525 1610663 3045913 2098777
8676 2098777 1924909 846126 2519727 2967116 3554349 2080274 667701 3292496 3265448
8667 3265448 1353334 1946915 2116796 1924869 774232 1438211 1400208 1762083 417990
8658D17990n71021J426646J36486J317498j109170r13847J300921r20428P49073
8649A834148L43951q98932J49509k65973l0117K93529J408481j743193N20597
8640A612000K2007L92739p43996O60357p70271j014900J008149J430077j586950
8631A009212k47616Q74053l80176O6932n20232J427413p53103j330891N28893
8622F74485P32724O72616L9577o50251l50704m37366P92171N72891j62267j077174
8612H06702J649274r85999q88310J482397p0679n69129O32434M76400o94775p68880
8602A069435O16573R06780l10308q07052J9668j129574J104799p35185P34979
8593A470115p87097J543639J54561j290733J219204j427680J809557n94713K7167
$$ plain form
8658 417990 -153031 1273615 1410101 2727599 1618429 704582 2005503 1085075 1834148
8649 1834148 2178099 1279167 1428676 1162703 1132586 1426115 2834596 1091403 1612000
8640 1612000 1634007 2026746 1282750 1943107 1172836 157936 1166085 2596162 1009212
8631 1009212 761596 1635649 1255473 1322405 802173 2229586 1476483 145592 674485
8622 674485 1407209 2079825 2119402 1469151 1118447 681081 1473252 2046143 1883876 806702
8612 806702 2455976 1469977 581667 2064064 1993385 1424256 2056690 2533090 1838315 1069435
8602 1069435 1686008 2592788 2282480 1475428 1495096 365522 1470321 735136 1470115
8593 1470115 683018 2226657 2381218 1090485 2309689 882009 2691566 2096853 2124020
8584B124020n35270N37404k0047j835476k50871K099883p71936j81869J29643
8575A295481m45477l3364M64076k4602J65611l56702l34257J48305P76761q50942
8565H04890j67789J019049q07492J411219o9434j455178O74306O27377j463559
8556E73389J69732K28217R64654n04722m90739k81302J53844J391123L29933k170782
8546C63347J368165J20038k33160q13212N06011l59136M68799Q29212j177460
8537A072604N31847r87898K849154j833723L730030k71661m674340Q63397n84720
8528F94690M07941j49041O82061O43407r67757m93365M32725L77196j06049J955059
8518C476867j472852q83755k951J734336j582377J165547j034838O72851k580200
$$ plain form
8584 2124020 1588750 2126154 2106107 270631 19760 2119643 1347707 1165838 1295481
8575 1295481 850004 816640 1280716 1256114 1421725 1065023 730766 879071 1655832 804890
8565 804890 637101 1656150 848658 2259877 2190443 735265 1409571 2036948 573389
8556 573389 743121 971338 1935992 1431270 940531 659229 813073 2204196 2534129 363347
8546 363347 1731512 1851550 1618390 805178 1311189 952053 1420852 2250064 1072604
8537 1072604 1604451 616553 3465707 1631984 5362014 5090353 416013 1279410 694690
8528 694690 1102631 953590 1635651 2279058 1311301 817936 1250661 1627857 1521808 3476867
8518 3476867 2004015 1120260 1117309 2851645 1269268 2434815 1399977 2072828 -507372
8509e07372J778006K23470M22337k19276L54899m12142P58027n99347j060563
8500G38039j11230K358605j692080l38246L71449P01205k99124k10451J523180
8491C041347O09445k327064J5669J621672j205576n13319Q02486l69483j040025
8482F35152Q61587j339j262160K334381J46394j252300j095526J493541L26327
8473B186057k584205J452173P04436L7496J06158n5385Q63439k674785K346392
8464B381776j421049N03133r66322K647729j909207K30263K72308k004457K657904
8455B392078j436420n92988J11429l6560K770990j283764k254412J832532O45658
8446B148543m27176r17978N63482O14775k94117J80119o15783J65706J553783
$$ plain form
8509 -507372 1270634 1494104 1916441 1697165 2052064 1639922 2397949 1798602 738039
8500 738039 626809 2985414 1293334 955088 1326537 2027742 1728618 1518167 3041347
8491 3041347 3650792 1323728 1339397 2961069 1755493 1242174 2044660 1675177 635152
8482 635152 1496739 1495400 233240 2567621 2714015 1461715 366189 1859730 2186057
8473 2186057 -398148 1054025 1758461 1795957 1902115 1846730 2710169 35384 2381776
8464 2381776 960727 1463860 497538 3145267 1236060 1466323 1738631 -265826 2392078
8455 2392078 955658 362670 474099 437539 3208529 1924765 -329647 1502885 2148543
8446 2148543 1721367 803389 1366871 1981646 1687529 1867648 1251865 1417571 2971354
8437B971354j724709P82876j377094J318156r22947J873961k308910Q66542j293223
8428A86006K984771k738017J473428m13037L49584j46836j405233J865079j263779
8419H91966K12263k32325P51540n64519J461685j192245o24183K42261O94588
8410A641031L28918J33366N86711J63592p35175j085605O84060M90942j205300
8401A002540J265384n06212j623478J134814J361050j468984O20329j365694K225321
8392B645070k86718N59041j76596j053153r04878J05909J470001j967511M97522
8383H88687J314995o17633n28497J555072j721410N65476P35725j370229J216620
8374B038806J17639K24930m02730q51600j311214J779228l56429k49402j374971
$$ plain form
8437 2971354 1246645 2029521 652427 1970583 1047636 2921597 612687 1479229 186006
8428 186006 3170777 432760 1906188 1493151 1842735 1695899 290666 2155745 891966
8419 891966 1104229 871904 1623444 1058925 2520610 1328365 704182 946443 1641031
8410 1641031 1969949 2103315 2690026 2853618 2118443 1032838 1716898 2207840 1002540
8401 1002540 2267924 1761712 138234 1273048 2634098 1165114 1785443 419749 2645070
8392 2645070 2358352 2917393 2740797 1687644 782766 888675 2358676 391165 888687
8383 888687 2203682 1586049 1057552 2612624 891214 1456690 2192415 822186 2038806
8374 2038806 2156445 2381375 1978645 1127045 -184169 1595059 1238630 989228 -385743
8365c85743K182008J080838k724332J850650M47120k951696J648182M72007m75333
8356A143701j35707O39733l3988o86196N78000r00666N17698J579545k8119O42221
8346C316222j875835N54795m22917k01654P62107l18856j565052J455487j153010
8337E51287J082945j484740N66998m06435N41560O46223L85827r00643K16623
8328A199645M3100J56296k13146j950796J728142R4775P00137K31483j26414j501366
8318C61856J857495n20310n09252M12175l40305k9881j84366j70931J73749k967
8308A047263J155142k28412L79452M97878m32844q08742o0772K11892L9518k573232
8298g72857K447573l9311j351450K117153j019078l95006J765232k231268R35281
$$ plain form
8365 -385743 1796265 2877103 152771 2003421 2450541 -501155 1147027 1619034 1143701
8356 1143701 1007994 1647727 1613739 927543 1505543 604877 1122575 2702120 2674001 3316222
8346 3316222 1440387 1995182 1572265 1370611 2132718 1813862 248810 1704297 551287
8337 551287 1634232 149492 716490 310055 851615 1497838 1883665 983022 1199645
8328 1199645 1242745 1399041 1185895 -764901 963241 1058016 1758153 1989636 1863222 361856
8318 361856 2219351 1699041 1189789 1601964 1261659 1231778 1047412 876481 1050230 1047263
8308 1047263 2202405 1973993 2353445 2851323 2418479 1609737 1548965 1760857 1800375 -772857
8298 -772857 1674716 1635405 283955 2401108 1382030 987024 2752256 520988 1456269
8289A456269j7846r3742k12540K55787l01145K62603M89950O10206p88823M32884
8279B093603j016569Q8313J76686j003457O10121P86212k39597K48664N07582
8270B251558j660898J45229p8947J466919j913042J123283J374951R61019l706294
8261c6222K506559j007205k47862k0984m6163j42810p50949M44059Q67018L30662
8251A896103l0988K40407m56728K19321M23695j664263J676775k069305J122074
8242A357091R07415m85457n53553O19274j074265n04218O74982J339819j029308
8233A251780Q41018k5913m08797j28053j23756J57904L94289o95419R47987L39996
8223B551036k300271J622183r81145J08773R89948j562496J412504o16518j2456
$$ plain form
8289 1456269 1438423 1344681 1132141 1387928 1086783 1349386 1839336 2449542 1660719 2093603
8279 2093603 1077034 1165347 1342033 338576 948697 1734909 1495312 1743976 2251558
8270 2251558 590660 735889 656942 2123861 210819 1334102 2709053 3670072 -36222
8261 -36222 2470337 1463132 1215270 1194286 1148123 1005313 254364 698423 1565441 1896103
8251 1896103 1865115 2105522 1648794 1868115 2291810 627547 2304322 235017 1357091
8242 1357091 2264506 1779049 1225496 1844770 770505 266287 941269 2281088 1251780
8233 1251780 2092798 2066885 1658088 1530035 1406279 1564183 1958472 1263053 2211040 2551036
8223 2551036 250765 1872948 891803 1000576 1990524 428028 1840532 1224014 1211558
8214A211558J220405J674733k018237j92739j116064J407245k81467R3546O02136
8205B601116N69706k306432J469990k08351J193833j259633P20812J26200M11930
8196C319171j780426J456376o17957J094297r495715L630840K980434L400P60800
8187A351220j679472l93981K049127M04363k526580J494753j190746j31003K741934
8178B119615j168174l51753l84688R00137j521414J718991P64930j714567J458438
8169A821515k053850J617225l11981J160849N7849M68214m40602j118836j70566
8160A029817M64340n34423J924017j560021j30290Q88322j045282J196293j353570
8151H79203R59948q14760J081538K53968j252761M48267M65351j03994p93467
$$ plain form
8214 1211558 2431963 4106696 2088459 1895720 779656 2186901 1905434 1998980 2601116
8205 2601116 3170822 864390 2334380 2126029 3319862 2060229 2781041 2907241 3319171
8196 3319171 1538745 2995121 2377164 3471461 -6024254 -2393414 587020 590420 1351220
8187 1351220 -328252 -722233 1326894 1731257 -795323 699430 -491316 -622319 2119615
8178 2119615 951441 599688 215000 1115137 -406277 1312714 2077644 363077 1821515
8169 1821515 -232335 1384890 1072909 2233758 2291607 2759821 2319219 1200383 1029817
8160 1029817 1494157 959734 2883751 1323730 1193440 2081762 1036480 2232773 879203
8151 879203 1839151 1024391 2105929 2359897 1107136 1555403 2020754 1916760 1123293
8142A123293n96087J32762P53801K79418m51443k65096R49495l3143m55513J50289
8132A587776j896651L800354j755041m95200J560727j235833O54179j635446L93472
8123I78337J492020j068963k37130P47143l81949q08906Q19002J123563j498969
8114A164148O10814k71429P31398r1521j63808o71282O41964r84230J435923L46624
8104B748601n97281j927196O19696k21051J536508j402987J12883M54571K6902
8095A350646n84079N25658o48514J267832r38509J860382j396877J15622q1547
8086A470614P04627r87913j04392j745085J704320r57915J409166k54847O14594
8077A853169J8391o26807J527692j709286J042429j337846L34985Q3766L52366
$$ plain form
8142 1123293 527206 659968 1413769 1693187 1241744 976648 1926143 1893000 1437487 1587776
8132 1587776 -308875 3491479 1736438 1241238 2801965 1566132 2220311 584865 978337
8123 978337 2470357 1401394 1164264 1911407 1529458 720552 1539554 2663117 1164148
8114 1164148 1774962 1503533 2234931 2143410 1979602 1308320 1950284 966054 2401977 2748601
8104 2748601 2151320 224124 843820 622769 2159277 756290 869173 1323744 1350646
8095 1350646 766567 1292225 643711 1911543 973034 2833416 1436539 1552161 1470614
8086 1470614 2175241 1187328 1082936 -662149 1042171 84256 1493422 1238575 1853169
8077 1853169 1871560 1244753 2772445 1063159 2105588 767742 1102727 1186493 1538859
8068A538859N4588O257J042789o24149n58207m23755J60996P09158j262207K445404
8058C089733k641382J299179L29176r62438N7718K63062m69809q7605L94597N60217
8048A832448k50258J93169j170872K053450j821430k83268L87025J295646r25247
8039A310663l60714Q74536j144250K011993k936034K092259j054020R11097j177428
8030E28102K62066K462117k013616J285618L03207j501070l63456K73439J719753
8021B956160j157333j001358L41483j96247q9644M75031j860906K733805j874450
8012C26541k18052K708081j546063O2071K261289k286372P25332J228284J62402
8003C423513k204932R25424l44153L22763j126585O93233r10029L58970p82291
$$ plain form
8068 1538859 1593447 1599704 2642493 2018344 1460137 1036382 1197378 1906536 644329 3089733
8058 3089733 448351 1747530 2076706 1114268 1171986 1435048 965239 877634 1272231 1832448
8048 1832448 1582190 1775359 604487 2657937 836507 553239 940264 2235910 1310663
8039 1310663 949949 1824485 680235 2692228 -243806 1848453 794433 1705530 528102
8030 528102 790168 3252285 1238669 2524287 2827494 1326424 962968 1236407 2956160
8021 2956160 1798827 797469 1138952 942705 853061 1328092 -532814 2200991 326541
8012 326541 108489 2816570 1270507 1332578 3593867 1307495 2032827 3261111 3423513
8003 3423513 1218581 2144005 1799852 2122615 996030 1689263 779234 1138204 355913
7994C55913K17460N3786j36392M47535R03681j538570J033685j38778r96669K549335
7984B750986j81552j426173N36174Q31309j77141o72819p05924l19583J142169
7975A777446k0835K97809N85965j821683J046049j83668O44345j364928K27960
7966A188460p89383m36806N54646L43118J73068j43518o2993J64664N63843n80841
7956I74258J932903q30682j897219M74172J03120N66725L82771P69193Q25567
7947C300808k57649l157671K522495j604247J593044j45111j2958L43719r46303
7938A636127j162353J292429l67919K12205J017873j415327P37881j58086p17317
7929A075513O48248m98554j265544N10709J649337p89746K96599n09299o23732
$$ plain form
7994 355913 573373 627159 490767 938302 1841983 303413 1337098 1198320 201651 2750986
7984 2750986 2569434 1143261 1679435 2510744 2333603 1660784 954860 635277 1777446
7975 1777446 1756611 2054420 2640385 818702 1864751 1681083 2325428 960500 1188460
7966 1188460 399077 -37729 516917 860035 1033103 889585 826592 991256 1555099 974258
7956 974258 2907161 2076479 179260 653432 756552 1323277 1706048 2475241 3300808
7947 3300808 3043159 -114512 2407983 803736 2396780 2251669 2238711 2582430 1636127
7938 1636127 473774 1766203 1398284 1610489 2628362 1213035 1950916 1792830 1075513
7929 1075513 1723761 1225207 -40337 470372 2119709 1329963 1626562 1117263 493531
7920D93531L63334J153048o68740k61853Q03627o94114M62634j212423J017149
7911A456193l11869M85915q2753j252573R58057J63937Q68857q66435q63924Q35305
7901A390710J179676j398117J72496K37001k222664L380873N422j835840J958785
7892B868342k342435Q95629J248325j438006J463958j823438N63550O23746p87456
7883A272215N4735M51601p3972O63346n00824j068510J28339K26030o7931K6922
7873A111951J716032j755096m99483J559006M88166j587924P79082O22819J9886
7864B454439r46433K70231l74216M82095o6745k230100K670407j627264K051969
7855B684383k132947J877683k770429j518553J0115502m971117k684666k06862
$$ plain form
7920 493531 856865 2009913 1341173 1079320 1882947 1188833 1651467 439044 1456193
7911 1456193 1144324 1630239 1547486 294913 1252970 1416907 2285764 1419329 555405 1390710
7901 1390710 2570386 1172269 1344765 1581766 -640898 2739975 2745397 909557 2868342
7892 2868342 525907 1421536 2669861 1231855 2695813 872375 1435925 2059671 1272215
7883 1272215 1326950 1778551 1704579 2367925 1867101 798591 926930 1152960 1085029 1111951
7873 1111951 2827983 1072887 573404 2132410 2620576 1032652 1811734 2434553 2454439
7864 2454439 1508006 1778237 1404021 1886116 1819371 -410729 2259678 632414 2684383
7855 2684383 551436 2429119 -341310 -1859863 8255639 3284522 599856 392994
7847C92994K609057k7057k42828j669981R31404l03343p2775n74629J335509L57103
7837B735454j477133N71521j006749P84076l14707K98054r42407O2854k55231
7828D55732K71887P15194O15074r48640J64352P78281K35271j818971J562801
7819B030981j251240Q66359l36085j16837j50661m79903J287591r90717J155007
7810B014495j368619K860337j964280j03805L66812M62108l38927p10900j36320
7801A080901O67702M95709M22423j968731j25846J685838l10660j413943J473072
7792B006465j485762J685748j484905J012067j441938J395769O63748o37637P45581
7783B459136m65798k75680q94828L76162J40115J320467j49386q94772Q57992
$$ plain form
7847 392994 3002051 2974994 2732166 1062185 1993589 1690246 1617471 1042842 2378351 2735454
7837 2735454 1258321 1829842 823093 1607169 1292462 1590516 648109 710963 455732
7828 455732 727619 1442813 2057887 1109247 1273599 2051880 2287151 468180 2030981
7819 2030981 779741 1646100 1310015 1193178 1042517 562614 1850205 859488 2014495
7810 2014495 645876 3506213 1541933 1438128 1804940 2267048 1928121 1217221 1080901
7801 1080901 1748603 2244312 2666735 698004 572158 2257996 1947336 533393 2006465
7792 2006465 520703 2206451 721546 1733613 291675 1687444 2351192 1713555 2459136
7783 2459136 1993338 1717658 822830 1198992 1339107 2659574 2510188 1615416 2473408
7774B473408q85979P9379n36301p53666N62790J222288m05099m17396m1441J402139
7764B700122r58398j451130J568633M308p50515O53317J153988j62152o73920
7755B084253N2099r90684l9438Q64651k31950j131056J173110k24658l79278J439061
7745B616110j232895o98317Q72759p92803J274478J03655l29220r37501O34340
7736A510606P01914R60143j883876J66038N51652n18792K90804j909962K675867
7727B544394j051638L47728n44373j083264J578322m10922Q57876q61463R83137
7718B359797n79665j641747R00524q600J640265p64839L35470J626018j498052
7709B369171p35147k98354M3489J35189j010101J524113q28549N05812J225192
$$ plain form
7774 2473408 1587429 1666808 1130507 376841 939631 2161919 1756820 1339424 1297983 2700122
7764 2700122 1741724 290594 1859227 1863535 1113020 1766337 2920325 2758173 2084253
7755 2084253 2136352 1145668 1106230 1970881 1738931 607875 1780985 1556327 1177049 2616110
7745 2616110 1383215 684898 1557657 764854 2039332 2142987 1813767 876266 1510606
7736 1510606 2212520 3172663 1288787 1454825 2006477 1487685 1778489 -131473 2544394
7727 2544394 1492756 1840484 1296111 212847 1791169 1380247 2238123 1376660 2359797
7718 2359797 1780132 138385 1038909 1030309 2670574 1905735 2241205 3867223 2369171
7709 2369171 1634024 1335670 1379159 1514348 504247 2028360 1199811 1705623 2930815
7700B930815j824979k14010p04322Q47689J368986j254015P89381j093874m0441
7691H05230J681160k351559J310699R490J00248J140083o27743j122376J95534
7682A140766J747209j038635J21297j398288J464785J58857j377082N41965j244362
7673A16512J682884O28777j987779O38730Q09647j37266O06868P0341n39504n11068
7663A378142j062485N53566P20639O67751j803907N75580J085876o0559j364441
7654F90162J332089q58485J819059r63243j272095J926714q67922N40862r59996
7645A387145o59215J96952l62680J188895k71698Q90322m48794l78563P39136
7636B281500j074121N57013K51657q01255K62174L67643o59689P71524q38512
$$ plain form
7700 2930815 1105836 891826 187504 1035193 2404179 1150164 1939545 845671 805230
7691 805230 2486390 134831 1445530 1455020 1555268 2695351 2067608 945232 1140766
7682 1140766 2887975 1849340 1970637 572349 2037134 2195991 818909 1360874 116512
7673 116512 1799396 2428173 440394 1079124 1888771 1751505 2358373 2428714 1889210 1378142
7663 1378142 315657 869223 1589862 2257613 453706 1029286 2115162 2054603 690162
7654 690162 2022251 1163766 2982825 2019582 747487 2674201 1806279 2347141 1387145
7645 1387145 727930 924882 562202 1751097 1479399 2369721 1920927 1542364 2281500
7636 2281500 1207379 1764392 2016049 1214794 1476968 1844611 1184922 1956446 1117934
7627A117934R49515n72681q35583Q24497J033060m78004n25767J768737j277201
7618B004507m92909k91957o33073L91569Q95024q25437P98649N81669k01355k803234
7608e76547K900069l79202m09522j01519o46101Q50796r78694p0457K465408j481066
7598A573165L166548k766412j53096J157168l34908R9041L00120l77955Q18152
7589C481823n52867j817021Q3283Q64091q04593J218243j631539L103244k219064
7580A725600J194467q8634k27703r42141Q50571p22413M21720j666053P33619
7571A279033l27063J663887j479697O0439J433805L22311O74375k25174j449817
7562A952099r13782J839655j671496O07086J328169q06784p33331J050227j194773
$$ plain form
7627 1117934 2067449 1494768 659185 1483682 2516742 2038738 1512971 3281708 2004507
7618 2004507 1511598 1219641 586568 978137 1873161 1047724 1846373 2428042 2226687 -576547
7608 -576547 2323522 1944320 1534798 1433279 787178 1637974 659280 588823 3054231 1573165
7598 1573165 4739713 1973301 1820205 2977373 2642465 2741506 3041626 2663671 3481823
7589 3481823 2928956 1111935 1195218 2059309 1254716 2472959 841420 3944664 1725600
7580 1725600 2920067 2831433 2603730 1661589 2512160 1789747 2211467 545414 1279033
7571 1279033 951970 2615857 1136160 1196599 2630404 2952715 3627090 3401916 1952099
7562 1952099 1038317 2877972 1206476 1813562 3141731 2334947 1601616 2651843 1457070
7553A457070J519468p82425p89383L99230J693790j593398J343398o0961q98178
7544B288611O76537j92841p55051M17636O91349j391240R88147j073320r0404
7535A559424N75523O91181m61862O56345j143249j690317K227577p85806P06275
7526B335091j060152N07237M93388j320851Q23657p0534L37885m46550j925546
7517c26375J031745P47430o98233J299933n87087L00152P36872N70616j878434
7508A196619J906586p21501k69108M6314l99907J332932q92952J13619O39166
7499B951768p33426m17634K59027P5379K48433m80314r30446J550502j240258
7490A283031j197416P92529J235416J485205k59993o86626O61354j737752j01327
$$ plain form
7553 1457070 2976538 2194113 1404730 1803960 3497750 1904352 3247750 3186789 2288611
7544 2288611 2965148 2772307 2017256 2434892 3126241 1735001 2723148 1649828 1559424
7535 1559424 2134947 2826128 2364266 3020611 1877362 187045 2414622 1628816 2335091
7526 2335091 1274939 1782176 2275564 954713 1778370 1707836 2045721 1599171 -326375
7517 -326375 705370 1452800 754567 2054500 1467413 1767565 2504437 3075053 1196619
7508 1196619 3103205 2381704 2112596 2158910 1759003 3091935 2198983 2312602 2951768
7499 2951768 2218342 1800708 2059735 2135114 2383547 1903233 972787 2523289 1283031
7490 1283031 85615 878144 2113560 3598765 3338772 2652146 3313500 1575748 1474421
7481A474421j071183J667911p12492R09090J42723O81677L44908k032724J41891
7472A546222p06109K058498N7341j011593Q56341o75806K674J62404j310887J408348
7462B387433j323680k85608R82878j67677N59780j296284J675428j457298k25555
7453H49417N21038Q00810N63428j567507M38136j72105K1046l92994Q16085M50256
7443B327610n92159Q67392j3723r47611K344165k740031J687798p98825M75061
7434B609677J6700K51020k03696j619881l83591K33872K673493l011860m8248
7425E17486J603386O43104m10569n62754j030653r9007k18742P65035N84394O68381
7415B460061n58447M38705P5660k040407J514647m92105J868181j948762J317061
$$ plain form
7481 1474421 403238 2071149 1358657 2267747 2410470 3092147 3437055 1404331 1546222
7472 1546222 840113 2898611 2955952 1944359 2800700 2124894 2127568 2289972 979085 2387433
7462 2387433 1063753 778145 1761023 1593346 2153126 856842 2532270 1074972 849417
7453 849417 1370455 2171265 2734693 1167186 1605322 1433217 1454263 1061269 1877354 2327610
7443 2327610 1735451 2602843 2589120 1641509 3985674 1245643 2933441 2134616 2609677
7434 2609677 2626377 2877397 2673701 1053820 670229 904101 3577594 565734 517486
7425 517486 2120872 2763976 2353407 1790653 760000 660993 442251 1207286 1791680 2460061
7415 2460061 1901614 2340319 2415979 375572 1890219 1398114 3266295 1317533 2634594
7406B634594j089353N07088N60958M99515k776549K736929k324178P8801J047588
7397A875393O54832J95880k45150q25897N97563J143971k783699j698736K907830
7388A821987m7840L71814q07736J041395J422124j657556Q02589k153595J537656
7379B330838N73188j740891P57087j81955K82385n56837J003734o38167K04184
7370B033566J33040r61615l43215J086237O60237j027441P79604j617667J682807
7361B425553l65532M90921k256877J119156Q80805p85036o99990R24229M26558
7352B159787P6973N12587j634858J26836M51986N41174J26456j597393J280179
7343B043727p7376j261545P60698J981070k768081J384739r58385Q92095r27267
$$ plain form
7406 2634594 1545241 2052329 2613287 3112802 336253 3073182 749004 827805 1875393
7397 1875393 2530225 2726105 2480955 1655058 2252621 3396592 612893 -1085843 1821987
7388 1821987 1774147 2145961 1338225 2379620 3801744 2144188 2946777 793182 2330838
7379 2330838 2904026 1163135 1920222 1738267 2020652 1463815 2467549 1829382 2033566
7370 2033566 2166606 1204991 861776 1948013 2608250 1580809 2360413 742746 2425553
7361 2425553 2060021 2550942 294065 1413221 2294026 1508990 809000 1733229 2159787
7352 2159787 2236760 2749347 1114489 1241325 1693311 2234485 2360941 763548 2043727
7343 2043727 1966351 704806 1465504 3446574 678493 2063232 1104847 1996942 1069675
7334A069675R84045K9932J059363r81274L2367j84822N55139o67110P78359j470532
7324A205142p05050J589140j197519n1080K749209o62389m46058P21920j288823
7315A914492n0621O46841k714017K273773L75904r07912J72419N35145j878980
7306C67044J210878j100538j127403J698804k21614L95369j64688k8860L57847
7297A386839K80954m91268J554517J19207j778750P85251J61051p75099Q59443
7288B102145n05501n1158r78801O29999J857946j829352O49808L49171n34974
7279A689283N48354j295374R11374M57358p8436Q1591j510081J237939n26324
7270A515684J110091j575101O92378n99513q84498J166757M04784m88755j376378
$$ plain form
7334 1069675 2053720 2083652 3143015 2161741 2194108 2009286 2564425 1897315 2675674 1205142
7324 1205142 500092 2089232 891713 840633 3589842 2927453 2481395 3203315 1914492
7315 1914492 1863871 2510712 -203305 2070468 2446372 1538460 1710879 2246024 367044
7306 367044 1577922 477384 -650019 1048785 827171 1222540 1057852 1028992 1386839
7297 1386839 1667793 1176525 2731042 2850249 1071499 1856750 2017801 1242702 2102145
7288 2102145 1596644 1545486 566685 1196684 3054630 1225278 1875086 2224257 1689283
7279 1689283 2237637 942263 1853637 2310995 2232559 2314150 804069 2042008 1515684
7270 1515684 2625775 1050674 1743052 1143539 259041 1425798 1830582 1341827 -34551
7261c4551P16023M54990J257660q99595J053506j439155P06487q70859m31123
7252E13383P71142J250288j193826O3533J274465j555587J788271q19525j185365
7243I06779M34651o4062J455601j032798N18026p06247o86179J910897m10932
7234B325736J22628r72077j06585M07639l75397K25660k37557j48429J395807
7225B637425j521232P16854j7600o65596r14117J503229j462885R82317j23301
7216A135094k45261R38971j56071j333142R40108J461809j579458q1898Q44346
7207A924498l64959O11611l34557j039274P05559k614785L354434j27640l20911
7198A793976n46542R94824k120392J065295M14895n22581l7869M01478k55705
$$ plain form
7261 -34551 681472 1136462 2394122 1494527 2548033 1108878 1815365 944506 513383
7252 513383 1284525 2534813 1340987 1404520 2678985 1123398 2911669 2092144 906779
7243 906779 1341430 1277368 2732969 1700171 2218197 1511950 825771 2736668 2325736
7234 2325736 2448364 1476287 1369702 1777341 1401944 1627604 1390047 1241618 2637425
7225 2637425 1116193 1833047 1815447 1149851 235734 1738963 276078 1258395 1135094
7216 1135094 889833 1828804 1672733 339591 1279699 2741508 1162050 1080152 1924498
7207 1924498 1559539 2171150 1836593 797319 1502878 -1111907 2242527 2114887 1793976
7198 1793976 1247434 2242258 121866 1187161 1602056 1079475 1041606 1443084 1187379
7189A187379j022380J470070M74316r94249j257695K843849r83698j023755K065783
7180B759620k341166J531001M62656q84339J946130j408347m90471P31728j041048
7171A265764P06990o32191K339753q10107k7645j612433J319048R29457n50490
7162B928146k08674q09604n63643L42312r85336K372530j17108k103191J053253
7153A908685q99135J428194p04018N02403p40747l49306J354605r44030m44001
7144A112650N95977o52817K90513P26153n45926j594785R60202J367724o86356
7135A573335N61084J15384j126707J160393K17209j084932O04676r84592M20159
7126A456009n29993o89337J131606P83J117672r42394o54657J213347m6153j925218
$$ plain form
7189 1187379 164999 1635069 2109385 1115136 -142559 2701290 1717592 693837 2759620
7180 2759620 418454 1949455 2412111 1527772 3473902 2065555 1575084 2306812 1265764
7171 1265764 1972754 1340563 3680316 2870209 2842564 1230131 2549179 3478636 2928146
7162 2928146 2719472 1909868 1346225 1688537 703201 3075731 2958623 855432 1908685
7153 1908685 1009550 2437744 1733726 2236129 1495382 1146076 2500681 1556651 1112650
7144 1112650 1708627 1055810 1346323 2072476 1526550 -68235 891967 2259691 1573335
7135 1573335 2134419 2249803 1123096 2283489 2500698 1415766 2020442 1035850 1456009
7126 1456009 926016 236679 1368285 1369068 2486740 1544346 889689 2103036 2056883 131665
7116A31665L40631J162721l91139O464p56220K027285j599175J060492L60459
7107B343183J041633j761528j043876J5005J833877q26360J279068k278071K817891
7098C420822k117067m68106K90227Q80492k88613J43326n40507M76692j285895
7089E11371J373551J460876k213893j744K57651r78385K745145J05007r28974
7080B330605j107471j76846R75255p01748k22296J262927o91773J994949k812616
7071H50986l82887J187308O25521J10040j666156Q86229J368079j302123L44631
7062B021628N67315r04948l161P51999j722803J263754r52798P88782O76614J77129
7052B663511j103114l22652P98566j164205O43998K59058J75370m48935M59835
$$ plain form
7116 131665 472296 1635017 1243878 1250342 494122 2521407 922232 1982724 2343183
7107 2343183 3384816 1623288 579412 594417 2428294 1601934 2881002 602931 3420822
7098 3420822 1303755 835649 1125876 2006368 1717755 1861081 1320574 1797266 511371
7089 511371 1884922 3345798 1131905 1130161 1387812 409427 3154572 3259579 2330605
7080 2330605 1223134 1046288 2021543 1319795 1097499 2360426 1668653 3663602 850986
7071 850986 468099 1655407 2280928 2390968 724812 1611041 2979120 1676997 2021628
7062 2021628 2588943 1683995 1680834 2432833 710030 1973784 1020986 1809768 2486382 2663511
7052 2663511 1560397 1237745 2036311 872106 1516104 1775162 1950532 1501597 1961432
7043A961432J209917k232223J377827p05611o14189p5483N35549M2561o46724
7034H53056j631J502120r47697Q58838m12265L25098O90265j326076m61276o50644
7024D29788K195952j266718K224972j697279o8973k08861q362N9259K55022l33486
7014A581314N26847k09623J78231l72987K5385j527633R90164m23845J499761
7005B267614o45723o6621k61633n1934J098055l73458O83888J41514j264010k30209
6995A297483p44245N34325l78176Q94447n1833Q23260j072309J029172j852450
6986D79674K08106J995985q30258r47071R60622j446618J209255L70955j232489
6977G68161P63736L17568J361911n87605j650125K281596j44518r36231m56693
$$ plain form
7043 1961432 3171349 939126 2316953 1611342 997153 921670 1457219 1499780 853056
7034 853056 851425 2353545 1405848 2264686 1852421 2177519 2867784 1541708 1080432 429788
7024 429788 2625740 1359022 3583994 1886715 1817742 1608881 1600519 1659778 1914800 1581314
7014 1581314 2108161 1898538 2076769 1703782 1729167 201534 1191698 767853 2267614
7005 2267614 1621891 1555270 1293637 1241703 2339758 1966300 2650188 2791702 1527692 1297483
6995 1297483 553238 1087563 709387 1603834 1552001 2375261 1302952 2332124 479674
6986 479674 687780 2683765 1853507 906436 1867058 420440 1629695 2000650 768161
6977 768161 1531897 1849465 3211376 2623771 973646 3255242 3110724 2174493 1717800
6968A717800j167159J866379l2199k060197R43175n07384J119124r75752j06549
6959G97238J029352j894935J373513n08436R86473N218m28572J14326n8253J349707
6949B765631q63969P66671j268035n7116n74220M85758m19119M99166N7104m24833
6939I67038L84615J123170j846289Q19217J294744r1220j604276J67802P14261
6930A929062Q45247m12534j306516Q85608K04562L79634N49642j168837O17490
6921B523358j009977l2007j14311J326907r74439p02746r1748K615957j213928
6912B327066L81525j782680J33231O10714O49387K38795j18967m17069j617168
6903D04834J161556o0223J9226L70756o08678J340765j245756J556669n87662
$$ plain form
6968 1717800 550641 2417020 2384821 324624 1267799 760415 1879539 903787 797238
6959 797238 1826590 -68345 1305168 796732 1783205 1788423 1359851 1474177 1415924 2765631
6949 2765631 1901662 2668333 1400298 1343182 768962 1254720 835601 1334767 1391871 967038
6939 967038 1351653 2474823 628534 1447751 2742495 2651275 1046999 1214801 1929062
6930 1929062 2774309 2361775 1055259 1940867 2145429 2525063 3074705 1905868 2523358
6921 2523358 1513381 1481374 1367063 2693970 1719531 1016785 925037 3540994 2327066
6912 2327066 2708591 925911 1059142 1669856 2319243 2558038 2439071 2022002 404834
6903 404834 1566390 1506167 1525393 1896149 1287471 2628236 1382480 2939149 2351487
6894B351487O01737p28721o89443J156406n18286j29050L00287j745386K35751
6885H34782R68930L16423k102236Q11186R56323k22156L34029N22078J682376
6876D101735l140933J401035o774n09161j277958J613857j233557K548495l528632
6867c1893J769103O52890o10585l31694k52073J30284J024289j112942J14908
6858A352287P35240o56341P86996j342234J232325j028062n75047J491629j510874
6849D85919k31137O67118J185468l94002K2968m16846N76536o73786N07327Q38281
6839B567846p93552J248752r0277n90793j07329j09300m31918N38209j17284m45110
6829A669244P90047j546366o6085Q12837p20744J376727O41527M04056j125406
$$ plain form
6894 2351487 2953224 2224503 1535060 2691466 2173180 2044130 2344417 599031 834782
6885 834782 1803712 2120135 17899 829085 1785408 1563252 1897281 2419359 4101735
6876 4101735 960802 2361837 2355063 1845902 567944 2181801 948244 3496739 -31893
6867 -31893 1737210 2390100 1779515 1447821 1195748 1326032 2350321 1237379 1352287
6858 1352287 2087527 1431186 2218182 875948 2108273 1080211 505164 1996793 485919
6849 485919 254782 921900 2107368 1713366 1736334 1319488 1896024 1222238 1729565 2567846
6839 2567846 1774294 3023046 2932769 2341976 2234647 2125347 1693429 2231638 2114354 1669244
6829 1669244 2459291 912925 846840 1659677 938933 2315660 2957187 3361243 2235837
6820B235837o27521q66450K530186j841499O82577J644565l368870J354141j81284
6811A561682q46118J541907j68614O05232k684348K986721j418183K321138j935097
6802A964320j72229O45967m8740m60736k75930R77791k14693L26459j507722K30867
6792A465354J358369n10655N25539n58305K89339j374613J339309j801605J013669
6783A746401Q49057j157745J259754j149057o3626k12304J24853o93371J815827
6774B519789j589766K44184J681448j497273R27217J19225j69754n66258O57609
6765B326421l7424q14925P31143k268286K148963k75416r19370P70791R52561
6756B614458o20744N70312j327763O40956J190597j776969R45267N91141j796276
$$ plain form
6820 2235837 1608316 741866 3272052 1430553 2113130 3757695 388825 1742966 1561682
6811 1561682 715564 2257471 2088857 2694089 9741 2996462 1578279 3899417 1964320
6802 1964320 1792091 2438058 2389318 1928582 1652652 2630443 2415750 2742209 1234487 1465354
6792 1465354 2823723 2313068 2838607 2280302 2569641 1195028 2534337 732732 1746401
6783 1746401 2595458 1437713 2697467 1548410 1484784 1272480 1397333 703962 2519789
6774 2519789 930023 1174207 2855655 1358382 2285599 2404824 2235070 1668812 2326421
6765 2326421 2288997 1474072 2205215 -63071 2085892 1810476 891106 1661897 2614458
6756 2614458 1993714 2564026 1236263 1877219 3067816 1290847 2236114 2827255 1030979
6747A030979j27316K497259q27221r82991Q69809J42712j078773J699705J97080
6738C421243j262819m66223O54500j37725k51253L76359M7234j87806r7924L36003
6728B431589j156689k31150P43302O32522j35801N64070m10007j372954J266001
6719B330883l85718o41730J623568J70894m81902p2714l16691M94584m93643J100694
6709C328225J071826j219335p17052j444611J435165j796589P37843J152228m99397
6700B048303N60446N42288j632999J905498j185929j106770J423169J928832k302196
6691B180642n62314J140912r5349j826817J122035o43487J094159j267990J339986
6682B481777k761980J952352J344357j364477M46539L42083j274968J637117q46322
$$ plain form
6747 1030979 903663 3400922 2573701 1590710 2460519 2603231 1524458 3224163 3421243
6738 3421243 2158424 1692201 2346701 2208976 1957723 2334082 2381316 2193510 2095586 2431589
6728 2431589 1274900 1043750 1787052 2419574 2283773 2847843 2437836 1064882 2330883
6719 2330883 1945165 1303435 2927003 3097897 2615995 2543281 2226590 2721174 2227531 3328225
6709 3328225 4400051 3180716 2463664 1019053 2454218 657629 1395472 2547700 2048303
6700 2048303 2608749 3151037 1518038 3423536 2237607 1130837 2554006 4482838 2180642
6691 2180642 1618328 2759240 2663891 837074 1959109 1315622 2409781 1141791 2481777
6682 2481777 -280203 1672149 3016506 1652029 2098568 2440651 1165683 2802800 1956478
6673A956478l08130J234016k447816K486054j206776J236206j498147J90559N22450
6664B164894J514209k358378L53101J458393j443663P97443O06534k04171k148027
6655G40335J922123j330708p14783J155711J457612q35898P95025m59894m34815
6646B294708R82851o61815J403745j777428Q52314j094156J097764l97416k91994
6637B408573k14165J05448J68250K46404k40260p42444Q69618R1146q74818Q4307
6627A902059K40558k55401R50529m50351K86258K26456j105865N27347q79182
6618A442408J128137l59609J026573j162614o82325K002500j061442K51072j358983
6609A225717L72256P01432O15527K09633j58374L92674L10087k581581J150015
$$ plain form
6673 1956478 1648348 2882364 434548 2920602 1713826 2950032 1451885 1642444 2164894
6664 2164894 3679103 1320725 1673826 3132219 1688556 2485999 3092533 2888362 740335
6655 740335 2662458 1331750 616967 1772678 3230290 2394392 3189417 2729523 2294708
6646 2294708 3277559 2615744 4019489 2242061 3094375 2000219 3097983 2700567 2408573
6637 2408573 2194408 2299856 2468106 2714510 2474250 1731806 2601424 2692570 1817752 1902059
6627 1902059 2142617 1887216 2837745 2387394 2673652 2900108 1794243 2321590 1442408
6618 1442408 2570545 2210936 3237509 2074895 1392570 3395070 2333628 2584700 1225717
6609 1225717 1597973 2299405 2914932 3124565 2966191 3358865 3668952 1087371 2237386
6600B237386m33370J440805o38065R49287o57606j250480J902296r48012j78571
6591B423670K22516j067387R66089N6728l83374J19504k41461J805580k543006
6582A358859J767198O8799m49467N78761j947467L16664j222374K194957J96263
6573B862193O20136q95793J586927q56222k581286J727286M84849L3594L9935
6564C021619N67831p26187k962598J826174o38809J287351N01978J19287p59975
6555B236671M96901m26746P65210m09465j488202K019934l53116n7710m1984m53619
6545B287874o18193J098628k21426M54258j090802P81977j169437m0743j21553
6536A360583K419013j074835q45014m30552L83521R91648j93507j268785P96823
$$ plain form
6600 2237386 1804016 3244821 2606756 3556043 2898437 1647957 3550253 2602241 2423670
6591 2423670 2646186 1578799 2544888 2601616 2218242 2337746 2096285 3901865 1358859
6582 1358859 3126057 3194856 2745389 3324150 1376683 1693347 470973 2665930 2862193
6573 2862193 3482329 2586536 4173463 3317241 735955 2463241 2948090 2981684 3021619
6564 3021619 3589450 2863263 -99335 1726839 1088030 2375381 2877359 2996646 2236671
6555 2236671 2733572 2306826 3072036 2662571 1174369 3194303 2841187 2783477 2741493 2287874
6545 2287874 1669681 2768309 2546883 3001141 1910339 2692316 1522879 1482136 1360583
6536 1360583 3779596 2704761 1859747 1429195 1812716 2804364 2610857 1342072 2138895
6527B138895J336768M17534k539754J59514J349717j719098Q73357O49039l93012
6518B272960J220420j365193j233459K050286k006835K363790j058425J213661
6510C457205r80494N18055j398173L12018m55564L14946P29622l14232m70816
6501A712567k57205L18797J62002J638564k108210J541198j608372J280214q16802
6492A862753Q83981q99157P66905p78155O4634K94861k04980l38009k31716J257895
6482B679012n80671O99594m22287N00349p53694J067320m09195N91858j893668
6473A478618K4313J30616J111977K29621q26556q17084K440641k673498J987776
6464C086424L69640j401973J085535n54246j63378n03527J4538k61562Q36132
$$ plain form
6527 2138895 3475663 3893197 1353443 1512957 2862674 1143576 2016933 2665972 2272960
6518 2272960 3493380 2128187 894728 2945014 938179 3301969 2243544 3457205
6510 3457205 2476711 2994766 1596593 1908611 1453047 1767993 2497615 2183383 1712567
6501 1712567 1455362 1774159 1936161 3574725 1466515 3007713 1399341 2679555 1862753
6492 1862753 2746734 1847577 2614482 1836327 1900961 2195822 1990842 1652833 1421117 2679012
6482 2679012 2098341 2797935 2375648 2875997 2122303 3189623 2780428 3372286 1478618
6473 1478618 1502931 1633547 2745524 2975145 2148589 1331505 3772146 1098648 3086424
6464 3086424 3456064 2054091 3139626 2585380 2422002 1918475 1933013 1671451 2507583
6455B507583k98695j92669M77309k59374J590933j442967J344071k094594K064033
6446C695630j556231O17280o38834M67655j454103J272100k38512k1734O69979
6437B813230M87675o84164R23658j150592J362210j361644m23155Q7972K02807
6428B257997J110065n493N105j406247r8371J305742l67379P31584q00905n92879
6418B139219m21447R03671k68522K8083n78487J245029j290273J07089Q70421
6409B734783n35479j28469J235250n71876J9547j40862N21161l64111j805488
6400I64456Q70634Q71589m86545R13319l56881J442310q32606o78369j477797
6391A230110R35077J052423J122018j345215k01934p91928k27867n9020J449384
$$ plain form
6455 2507583 2208888 2016219 2493528 2234154 3825087 2382120 3726191 1631597 3695630
6446 3695630 2139399 2756679 2117845 2585500 1131397 2403497 2164985 2143251 2813230
6437 2813230 3300905 2616741 3540399 2389807 3752017 2390373 1967218 2055190 2257997
6428 2257997 3368062 3362569 3367674 1961427 1863056 3168798 2801419 3533003 2732098 2139219
6418 2139219 1717772 2621443 2352921 2381004 1802517 3047546 1757273 1864362 2734783
6409 2734783 2199304 2070835 3306085 2734209 2753756 2612894 3134055 2769944 964456
6400 964456 1835090 2706679 2220134 3133453 2776572 4218882 3386276 2707907 1230110
6391 1230110 2165187 3217610 4339628 2994413 2792479 2000551 1772684 1713664 3163048
6382C163048j544506J168989j66305O85289k833891K638715k8105j604881J571382
6373C049735j648446j179276L927777j296445M97711q63608m08084m83178q380
6364A587806O78863r2756M48082K200769k785005j96634K05640q30679J921209
6355C137295p37408J708432k305674Q26731q46617R38989p57671K97830O42636
6346B904543J41137m39211r1921J919735k919766M06619Q71183N69412j442950
6337A918781j99277P01625n76559K65735k26345K73271P66419j897133J642238
6328B668755K75412p62206K9189M01447Q13932n07647j690274K637213r01793
6319B964028k83921J301106k104905J573903j705067J345810j280533P12730J706970
$$ plain form
6382 3163048 1618542 2787531 2621226 3306515 472624 3111339 3083234 1478353 3049735
6373 3049735 1401289 222013 4149790 2853345 3351056 2487448 2079364 1596186 1587806
6364 1587806 2266669 2173913 2621995 4822764 2037759 1841125 2046765 1216086 3137295
6355 3137295 2399887 4108319 1802645 2629376 1782759 2721748 1964077 2261907 2904543
6346 2904543 3045680 2606469 2514548 4434283 1514517 1921136 2792319 3361731 1918781
6337 1918781 1719504 2421129 1844570 2110305 1883960 2157231 2923650 1026517 2668755
6328 2668755 2944167 2181961 2211150 2612597 3426529 2918882 1228608 3865821 2964028
6319 2964028 2680107 3981213 1876308 3450211 1745144 3090954 1810421 2523151 4230121
6310D230121k806694J777761m97732J476100j111970j520500J897380M87158j142108
6301B789516O20588m48239k38539l24436J863117j217424l72263J82244K56191
6292C110755n94957J459837q55411j007231K186357j265139j107998J118938Q5481
6283C130632j357508J337940m99578O17099k6675k84062J551044l52136o35938
$$ plain form
6310 4230121 1423427 3201188 2703456 4179556 3067586 1547086 3444466 3931624 2789516
6301 2789516 3410104 2961865 2723326 2398890 4262007 3044583 2672320 2854564 3110755
6292 3110755 2515798 3975635 3120224 2112993 4299350 3034211 1926213 3045151 3130632
6283 3130632 1773124 3111064 2611486 3228585 3201910 2917848 4468892 4116756 3480818
$$ [...]
##END NTUPLES=NMR SPECTRUM
##END=
