##TITLE=abcd
##JCAMPDX= 6.0         $$ Bruker NMR JCAMP-DX V2.0
##DATA TYPE= NMR FID
##DATA CLASS= NTUPLES
##ORIGIN= UXNMR, Bruker Analytische Messtechnik GmbH
##OWNER= root
$$ XWIN-NMR		Version 3.5
$$ Wed Jul 23 12:39:50 2025 Russian Standard Time (UT+4h)  servis@DPX200
##.OBSERVE FREQUENCY= 200.131235884673
##.OBSERVE NUCLEUS= ^1H
##.DELAY= (6, 6)
##.ACQUISITION MODE= SIMULTANEOUS
##.ACQUISITION SCHEME= undefined
##.AVERAGES= 32
##.DIGITISER RES= 18
##SPECTROMETER/DATA SYSTEM= spect
##.PULSE SEQUENCE= zg
##.SOLVENT NAME= CDCl3
##.SHIFT REFERENCE= (INTERNAL, CDCl3, 0, 16.5164)
##AUDIT TRAIL= $$ (NUMBER, WHEN, WHO, WHERE, WHAT)
$$ ##TITLE= Audit trail, XWIN-NMR		Version 3.5
$$ ##JCAMPDX= 5.01
$$ ##ORIGIN= Bruker BioSpin GmbH
$$ ##OWNER= servis
$$ F:\spectra/data/av/nmr/H1/1/audita.txt
$$ ##AUDIT TRAIL=  $$ (NUMBER, WHEN, WHO, WHERE, WHAT)
(   1,<2025-07-23 12:39:05.65 +0400>,<servis>,<DPX200>,
      <created by zg, POWCHK disabled, PULCHK disabled
       configuration hash MD5:
       00 E9 B6 7A A2 85 ED C7 34 08 36 98 17 FE 4E 26
       data hash MD5: 32K
       74 EA 55 C3 38 91 C7 F6 92 59 BD E6 DC E4 41 E2>)
$$ ##END=
$$ 
$$ hash MD5
$$ 94 04 5E E0 AD 59 B0 31 DC BE 69 93 8F 1E 6F A0
##$RELAX= 
##$RELAX= 
##$RELAX= 
##$RELAX= 
##$RELAX= 
##$RELAX= 
##$RELAX= 
##$RELAX= 
$$ Bruker specific parameters
$$ --------------------------
##$DU= <F:\spectra>
##$EXPNO= 1
##$NAME= <H1>
##$PROCNO= 1
##$TYPE= <nmr>
##$USER= <av>
##$AMP= (0..31)
100 100 100 100 100 100 100 100 100 100 100 100 100 100 100 100 100 100 
100 100 100 100 100 100 100 100 100 100 100 100 100 100 
##$AQSEQ= 0
##$AQ_mod= 1
##$AUNM= <au_zg>
##$AUTOPOS= <>
##$BF1= 200.13
##$BF2= 200.13
##$BF3= 200.13
##$BF4= 200.13
##$BF5= 500.13
##$BF6= 500.13
##$BF7= 500.13
##$BF8= 500.13
##$BYTORDA= 1
##$CFDGTYP= 0
##$CFRGTYP= 5
##$CHEMSTR= <none>
##$CNST= (0..31)
1 1 145 1 1 1 1 1 1 1 1 1 1 1 1 1 1 1 1 1 1 1 1 1 1 1 1 1 1 1 1 1 
##$CPDPRG= <>
##$CPDPRG1= <>
##$CPDPRG2= <>
##$CPDPRG3= <>
##$CPDPRG4= <mlev>
##$CPDPRG5= <mlev>
##$CPDPRG6= <mlev>
##$CPDPRG7= <mlev>
##$CPDPRG8= <mlev>
##$CPDPRGB= <>
##$CPDPRGT= <>
##$D= (0..31)
0 2 0 0 0 0 0 0 0 0.06 0 0 0 0 0 0 0.0002 0 0 0 0 0 0 0 0 0 0 0 0 0 0 
0 
##$DATE= 1753259945
##$DBL= (0..7)
120 120 120 120 120 120 120 120 
##$DBP= (0..7)
150 150 150 150 150 150 150 150 
##$DBP07= 0
##$DBPNAM0= <>
##$DBPNAM1= <>
##$DBPNAM2= <>
##$DBPNAM3= <>
##$DBPNAM4= <>
##$DBPNAM5= <>
##$DBPNAM6= <>
##$DBPNAM7= <>
##$DBPOAL= (0..7)
0.5 0.5 0.5 0.5 0.5 0.5 0.5 0.5 
##$DBPOFFS= (0..7)
0 0 0 0 0 0 0 0 
##$DE= 6
##$DECBNUC= <off>
##$DECIM= 32
##$DECNUC= <off>
##$DECSTAT= 4
##$DIGMOD= 1
##$DIGTYP= 9
##$DL= (0..7)
0 120 120 120 120 120 120 120 
##$DP= (0..7)
150 150 150 150 150 150 150 150 
##$DP07= 0
##$DPNAME0= <>
##$DPNAME1= <>
##$DPNAME2= <>
##$DPNAME3= <>
##$DPNAME4= <>
##$DPNAME5= <>
##$DPNAME6= <>
##$DPNAME7= <>
##$DPOAL= (0..7)
0.5 0.5 0.5 0.5 0.5 0.5 0.5 0.5 
##$DPOFFS= (0..7)
0 0 0 0 0 0 0 0 
##$DQDMODE= 0
##$DR= 18
##$DS= 0
##$DSLIST= <SSSSSSSSSSSSSSS>
##$DSPFIRM= 0
$$ [...]
##$SUBNAM0= <"">
##$SUBNAM1= <"">
##$SUBNAM2= <"">
##$SUBNAM3= <"">
##$SUBNAM4= <"">
##$SUBNAM5= <"">
##$SUBNAM6= <"">
##$SUBNAM7= <"">
##$SUBNAM8= <"">
##$SUBNAM9= <"">
##$SW= 20.6817932712277
##$SWIBOX= (0..15)
0 0 3 0 0 0 0 0 0 0 0 0 0 0 0 0 
##$SW_h= 4139.07284768212
##$TD= 32768
##$TD0= 1
##$TE= 0
##$TE2= 300
##$TE3= 300
##$TEG= 300
##$TL= (0..7)
0 120 120 120 120 120 120 120 
##$TP= (0..7)
150 150 150 150 150 150 150 150 
##$TP07= 0
##$TPNAME0= <>
##$TPNAME1= <>
##$TPNAME2= <>
##$TPNAME3= <>
##$TPNAME4= <>
##$TPNAME5= <>
##$TPNAME6= <>
##$TPNAME7= <>
##$TPOAL= (0..7)
0.5 0.5 0.5 0.5 0.5 0.5 0.5 0.5 
##$TPOFFS= (0..7)
0 0 0 0 0 0 0 0 
##$TUNHIN= 0
##$TUNHOUT= 0
##$TUNXOUT= 0
##$USERA1= <user>
##$USERA2= <user>
##$USERA3= <user>
##$USERA4= <user>
##$USERA5= <user>
##$V9= 5
##$VALIST= <valist>
##$VCLIST= <CCCCCCCCCCCCCCC>
##$VD= 0
##$VDLIST= <DDDDDDDDDDDDDDD>
##$VPLIST= <PPPPPPPPPPPPPPP>
##$VTLIST= <TTTTTTTTTTTTTTT>
##$WBST= 1024
##$WBSW= 30
##$XGAIN= (0..3)
0 0 0 0 
##$XL= 0
##$YL= 0
##$YMAX_a= 52910
##$YMIN_a= -44361
##$ZGOPTNS= <>
##$ZL1= 120
##$ZL2= 120
##$ZL3= 120
##$ZL4= 120
##$ABSF1= 10
##$ABSF2= 0
##$ABSG= 5
##$ABSL= 3
##$ALPHA= 0
##$AQORDER= 0
##$ASSFAC= 0
##$ASSFACI= 0
##$ASSFACX= 0
##$ASSWID= 0
##$AUNMP= <proc_1d>
##$AZFE= 0.1
##$AZFW= 0.1
##$BCFW= 1
##$BC_mod= 2
##$BYTORDP= 0
##$COROFFS= 0
##$CY= 19
##$DATMOD= 1
##$DC= 2
##$DFILT= <>
##$DTYPP= 0
##$F1P= 11.0000007629395
##$F2P= -0.999999237060547
##$FCOR= 0.5
##$FTSIZE= 0
##$FT_mod= 4
##$GAMMA= 1
##$GB= 1
##$INTBC= 1
##$INTSCL= 1
##$ISEN= 128
##$LB= 0.05
##$LEV0= 0
##$LPBIN= 0
##$MAXI= 10000
##$MC2= 0
##$MEAN= 0
##$ME_mod= 0
##$MI= 0
##$NCOEF= 0
##$NC_proc= 0
##$NLEV= 6
##$NOISF1= 0
##$NOISF2= 0
##$NSP= 1
##$NTH_PI= 0
##$NZP= 0
##$OFFSET= 16.51637
##$PC= 1
##$PHC0= -275.1915
##$PHC1= 4.101552
##$PH_mod= 0
##$PKNL= yes
##$PPARMOD= 0
##$PSCAL= 4
##$PSIGN= 0
##$REVERSE= no
##$SF= 200.13
##$SI= 16384
##$SIGF1= 0
##$SIGF2= 0
##$SINO= 400
##$SIOLD= 16384
##$SREGLST= <1H.CDCl3>
##$SSB= 0
##$STSI= 0
##$STSR= 0
##$SW_p= 4139.07284768211
##$SYMM= 0
##$S_DEV= 0
##$TDeff= 0
##$TDoff= 0
##$TI= <>
##$TILT= no
##$TM1= 0
##$TM2= 0
##$TOPLEV= 0
##$USERP1= <user>
##$USERP2= <user>
##$USERP3= <user>
##$USERP4= <user>
##$USERP5= <user>
##$WDW= 1
##$XDIM= 8192
##$YMAX_p= 0
##$YMIN_p= 0
$$ End of Bruker specific parameters
$$ ---------------------------------
##NTUPLES= NMR FID
##VAR_NAME=  TIME,          FID/REAL,        FID/IMAG
##SYMBOL=    X,             R,               I
##VAR_TYPE=  INDEPENDENT,   DEPENDENT,       DEPENDENT
##VAR_FORM=  AFFN,          ASDF,            ASDF
##VAR_DIM=   16384,         16384,           16384
##UNITS=     SECONDS,       ARBITRARY UNITS, ARBITRARY UNITS
##FACTOR=    0.0002416,     1,               1
##FIRST=     0,             0,               0
##LAST=      3.9581328,     0,               0
##MIN=       0,             -44361,          0
##MAX=       3.9581328,     52910,           0
$$ Real data points
##PAGE= N=1
##DATA TABLE= (X++(R..R)), XYDATA
$$ [...]
5458 56 -223 -140 200 186 -91 -108 227 116 -74 -308 105 -169 -79 -222 -271 -135 -292 -192 -252 -67 129 -21
5480 -21 135 123 73 -97 10 -58 134 -62 113 129 -160 33 -229 -149 98 172 -197 -6 102 86 35 -4 151
5503 151 26 7 80 -236 -202 168 -74 3 -99 30 29 196 -2 -354 -268 139 20 135 162 -229 64 135 73
5526 73 -111 -146 -22 1 -103 190 -95 402 161 68 53 -108 37 -104 23 173 219 -203 -115 -127 -80 -254 -174
5549 -174 -5 87 76 40 244 94 163 188 -2 129 175 -67 38 -12 -106 -96 -138 121 -203 22 64 -201 47 -108
5573 -108 5 74 325 170 -98 -79 -51 -258 33 83 -151 -257 70 -172 -102 23 107 31 -56 40 -2 138 216 15
5597 15 209 119 -135 -52 -88 78 -124 22 21 106 -128 -44 106 -3 25 170 -9 42 118 -7 -174 -134 46 14
5621 14 48 -98 -96 39 -8 -83 -82 -59 143 270 -119 -44 167 12 160 18 -124 20 38 12 87 163 -3 70 135
5646 135 5 84 -145 240 -17 -83 -123 70 -203 19 173 51 -3 -125 -54 37 124 189 165 85 317 38 81 -92
5670 -92 -340 -72 -69 -66 -309 36 3 -158 -284 -81 -211 -9 148 -40 -46 -7 109 84 -60 278 -165 -309 -40
5693 -40 39 -143 -36 90 179 37 118 87 -41 -8 328 4 -149 -16 -128 1 119 -118 -282 96 -61 169
5715 169 4 135 9 -100 275 124 37 58 -265 -48 8 240 -58 2 158 -117 -249 50 51 23 -105 145
5737 145 34 212 -227 10 -117 -199 -62 -201 -224 -21 49 -151 88 23 299 38 59 95 58 112 175 -65 -64 73
5761 73 11 97 20 -134 206 -63 104 -142 -117 -197 124 66 7 307 -140 174 -23 -13 -21 -36 -43 -273 -197 -35 -194
5786 -194 -81 -147 51 172 163 91 127 71 85 -81 144 152 164 27 -132 -72 -38 151 -28 48 80 51 -35 65 -189
5811 -189 -14 -11 -129 78 -22 -6 74 29 32 -175 -162 4 -105 -100 -159 -138 -6 8 170 156 202 82 -150 118 -126
5836 -126 -59 -5 -126 45 -331 -108 -156 -78 345 -75 -212 226 117 110 -95 122 45 52 185 134 178 -119 -281 -18
5860 -18 221 97 110 183 197 -72 -111 25 130 221 -181 -32 70 -205 -93 -196 -27 -390 100 15 -18 19 -67
5883 -67 184 87 -40 -14 49 195 83 -70 1 77 3 62 -154 90 -217 -103 36 -51 231 7 -60 25 211 113
5907 113 -123 -213 95 20 -158 -40 11 7 -223 -51 126 -82 29 -152 -82 -104 271 -58 114 -113 -57 -81 -20
5930 -20 -245 -174 -247 -113 -293 38 -17 12 -13 -106 -175 -154 21 26 -24 205 -90 0 -55 -49 -158 -228 -80 243 10 -24
5956 -24 8 -24 -60 -71 67 285 32 78 -109 125 -188 -229 -95 -388 -155 -198 -12 9 -219 -47 -119 -78 73 -92
5980 -92 1 34 -72 -75 -92 9 -17 -83 -192 -27 -14 65 -7 -15 227 12 71 163 -276 14 236 -134 -7 -30 -147
6005 -147 -197 1 -90 -20 -98 73 6 118 129 67 65 -99 82 73 82 99 -86 -62 -32 -167 -25 -357 22 27 96 138 202
6032 202 -11 -149 16 44 -82 -38 -198 -119 74 23 -271 -35 136 268 -111 155 9 348 -75 54 24 -48
6054 -48 78 77 192 112 -110 -141 -33 -19 -330 -15 67 -26 38 232 35 -24 241 22 -172 -254 5 -123 -92 -72
6078 -72 -45 -104 -272 -30 -142 -8 66 32 39 117 -176 -215 143 170 -151 -258 -94 0 -131 -245 63 67 -135 9
6102 9 -12 -344 2 -82 39 -171 -46 -68 -23 -135 -95 -344 -224 -108 -44 -22 167 42 103 96 5 292 60 92 -55
6127 -55 199 48 -137 20 -36 -84 -108 87 -227 -31 -53 -56 -235 133 30 56 37 54 75 28 -60 75 -214 -76
6151 -76 101 -9 24 -292 -30 -257 -64 -63 113 8 -135 38 81 53 -190 -141 58 -48 215 -139 -51 -242 -29
6174 -29 126 -82 -123 -21 52 -161 158 -13 11 -216 -72 -25 -116 82 -67 40 98 142 48 74 231 113 130 -82
6198 -82 124 153 59 -92 52 -66 -125 -14 2 -321 256 4 -65 148 -93 -128 -182 -30 31 -65 29 69 -76 270
6222 270 191 -178 -98 11 -264 -20 -93 68 -86 88 -36 206 -37 -224 58 139 407 212 -33 222 23
6243 23 104 11 44 -95 89 -36 36 249 -29 9 -91 -163 67 -165 10 -40 23 -148 -157 298 -161 -116 -35 -23 -43
6268 -43 46 66 102 79 57 -121 140 -77 -229 -95 17 157 -127 -124 183 -74 160 -36 36 119 82 88 25 256 112
6293 112 15 -111 1 -38 -53 -234 13 149 -159 -110 -153 -125 97 105 -80 136 -95 96 -148 191 -102 108 -295
6316 -295 -45 230 311 62 155 3 112 80 -96 -1 69 77 137 99 42 0 -132 209 141 40 52 -174 -20 202
6340 202 -15 -151 111 -45 163 139 -91 150 374 -9 -76 -87 -26 95 -173 -237 73 -100 -49 239 -17 -42
6362 -42 -34 107 -3 2 -122 -67 6 -9 -160 44 167 -17 -13 -22 260 -1 224 213 101 186 65 158 39 -38 -12 -21
6388 -21 79 -107 -77 4 152 -144 -11 9 209 172 -107 47 27 -11 49 100 -40 -46 57 42 -94 -213 62 -21
6412 -21 62 -66 -191 168 -97 74 284 -16 83 204 78 24 42 32 -24 44 -253 -55 -276 -71 154 187 -232
6435 -232 -81 54 102 57 42 -199 130 -133 -143 -112 2 -52 19 -39 199 -61 -153 36 -88 -39 136 33 -186
6458 -186 7 68 73 190 -116 70 133 217 -3 -109 99 -44 19 -5 22 186 -194 136 -15 26 -105 -101 173 102
6482 102 275 -83 175 -204 -287 -113 -92 47 25 51 -228 150 124 -185 107 -80 -105 -94 -197 27 -154 -163 -253
6505 -253 81 289 -19 234 -101 -120 90 -265 -45 54 -53 187 -157 -49 37 -199 86 -301 161 -121 162
6526 162 -25 120 -146 59 -62 15 4 33 -107 -137 222 82 165 -115 -155 -39 9 42 152 216 125 112 337 57
6550 57 -100 112 88 -43 14 -5 -94 -140 150 -41 -433 -110 164 150 23 82 10 27 -128 -25 134 -223 -25
6573 -25 -169 -13 -11 -73 -122 -43 206 -34 -97 -145 326 -64 -105 105 -58 168 -206 -49 -8 5 -1 161 301 -139
6597 -139 6 -6 51 59 32 -12 -23 276 -122 -112 86 94 -148 124 84 94 -8 -36 15 24 -227 164 152 109 -22 41
6623 41 100 108 42 -128 110 108 -101 60 184 -182 12 -165 72 50 63 -175 39 89 -7 -56 -80 -111 -221 -120 -98
6648 -98 -189 -6 7 -189 0 -30 -70 -24 -108 121 -182 267 52 14 157 117 -169 -101 171 -160 -49 48 -99 229
6672 229 -213 -152 19 66 -75 -111 27 -4 74 -111 -66 93 125 -140 -2 -4 -194 -149 107 101 -144 184 -1 79
6696 79 -130 -10 65 60 120 29 -175 -9 -42 -341 -104 61 33 -2 -17 11 24 17 134 -42 -43 89 8 235 -25 297
6722 297 -176 106 57 374 33 37 86 18 8 -135 -93 113 168 -81 216 134 168 -149 144 22 32 253 -106 156
6746 156 -168 -134 23 335 -120 40 -62 -55 -12 -17 40 -235 -114 -72 68 -12 -50 -372 12 -224 -20 125 -31
6769 -31 -43 -43 -127 -30 -90 53 -327 40 -7 -65 -52 85 -315 -169 -9 54 -25 -16 -156 -53 -69 -61 -134 171 -124 150
6795 150 -77 143 87 -109 -207 -2 -24 8 -219 178 77 -232 -110 52 -239 149 72 5 -23 18 94 75 -145
6818 -145 -44 35 107 44 259 174 -56 -91 6 89 -75 -141 25 -35 8 -132 -31 -219 -183 50 112 -22 167 -109
6842 -109 -42 31 -29 143 59 -74 88 -96 -2 -161 44 -64 148 158 -38 -166 32 -187 -105 -218 58 139 116
6865 116 -34 -186 123 -243 267 -157 108 51 -75 188 -195 -100 170 43 7 -9 152 10 -137 -209 50 -42
6887 -42 28 -10 -154 -292 -295 -39 -138 -4 -65 -146 24 148 -172 125 -118 -113 -37 -145 64 -9 -27 -19 80 53 14 60
6913 60 19 -111 88 -122 4 -94 126 -195 -128 -9 232 -196 -31 212 163 -100 -172 -55 -113 76 -287 -10
6935 -10 -13 2 -17 -113 -56 -160 -230 -193 -10 102 216 -229 126 -194 118 -263 -222 205 -30 -58 14 163 -81 -95
6959 -95 -76 76 -238 291 205 -91 -142 -169 45 49 56 -222 -103 26 -158 -69 56 -37 20 -139 -58 18 -27 -94 -294
6984 -294 134 -125 -11 104 -288 -82 -46 -130 41 125 -121 -127 -277 -64 -172 92 301 -374 -12 220 57 -61
7006 -61 -152 -157 162 275 -49 -157 164 72 -159 -11 54 -19 -25 4 -7 -148 -68 -117 91 -157 -29 -187 -55 96
7030 96 8 10 -50 6 -26 318 -203 91 -38 -273 -1 5 43 -76 199 -169 -4 134 -131 119 117 -6 124 -45
7054 -45 130 -115 58 -339 -263 -131 17 217 -29 -68 350 44 -37 95 328 -1 231 327 -242 43 95 145
7076 145 83 -26 147 -14 66 157 153 70 117 109 62 64 141 -154 -114 -138 -49 120 -20 34 -108 40 -51 -44 -63 160 177
7103 177 -73 -121 27 -16 15 186 -164 83 85 -29 52 15 -44 192 -49 20 35 -11 97 -224 -101 54 53 52 60 -109
7129 -109 -62 -14 -124 -85 -75 -28 -13 50 68 45 -125 -164 -74 -25 16 -89 -126 25 -67 -169 -218 -78 108 -6 -53 -22
7155 -22 70 -30 104 123 -138 -78 -305 -96 -129 -73 -213 -164 -54 0 68 -40 168 60 -13 10 186 -103 -47 56
7179 56 31 135 -278 -85 -36 11 90 -265 163 267 -141 -71 -99 27 95 96 -149 4 46 -46 -80 43 -83 -206
7203 -206 -84 94 170 190 -144 120 -93 -39 -11 6 38 48 -106 -274 -62 -180 -33 149 -116 -167 196 -97 -36
7226 -36 -276 -187 73 50 -230 83 -176 183 -81 27 -118 137 -154 -122 -26 -153 -24 -8 173 -81 139 25
7248 25 20 -40 -277 -7 -187 -11 201 90 -49 28 -27 -14 14 -156 -127 139 3 -217 21 18 -67 179 -181 -34
7272 -34 -10 -101 -39 -435 -89 -110 -182 -198 36 -77 111 -114 -118 -66 -11 -57 -74 86 -67 -101 58 -49 22 -233 -68
7297 -68 56 262 2 -111 40 101 159 -62 -96 93 -108 -44 -4 15 20 -2 -256 -29 -208 -51 -166 -47 46 19
7321 19 8 285 -5 -80 -91 -87 187 -39 -142 42 20 62 157 73 -81 80 69 -187 -100 334 226 -261 -5 -35
7345 -35 151 -34 92 -36 -121 63 9 -11 53 157 -133 48 136 4 -193 -181 151 126 -112 -179 -93 -100 10 -99
7369 -99 -27 35 -70 -27 -40 11 -137 -100 8 175 120 242 19 114 18 101 12 -303 -31 -239 -140 -50 -26 -116 47
7394 47 33 -93 -69 250 153 -26 36 121 -126 -98 45 89 -44 39 -169 -168 69 -284 104 -206 -149 140 -130 17
7418 17 59 215 28 15 44 -123 84 143 -119 -151 25 -155 173 -68 -297 234 12 -223 -164 156 -133 -264
7440 -264 -78 122 115 -83 -5 287 -125 201 145 -136 71 -168 -79 163 -188 -102 -103 59 -194 54 -105 -38 -34 -43
7464 -43 120 35 -161 17 115 -114 -58 -23 -123 -236 -132 -118 18 -98 6 -140 86 -85 70 -69 -97 107
7486 107 104 102 161 -52 80 143 -86 -110 -38 -50 -138 213 167 196 -189 22 130 -7 79 84 33 129 167 -138 92 -54
7512 -54 -74 -287 21 31 104 -22 83 51 -72 231 -22 100 -15 -20 -92 -161 92 -57 -7 31 -86 124 98 223
7536 223 49 -166 -1 -6 46 156 166 -141 70 28 -26 82 -168 65 -51 -2 201 77 -108 177 -24 -162
7558 -162 -88 -140 -11 -140 40 -7 -31 -35 -47 -31 -263 -3 139 59 105 -168 111 188 9 129 -126 144 113 -126
7582 -126 -116 -22 -112 57 -98 -354 192 -110 103 90 132 31 222 239 218 53 48 121 247 99 -204 -152 -89 -191
7606 -191 98 -104 -194 136 -98 -52 -124 -133 -12 69 21 -143 -128 29 164 -113 148 85 62 -50 358 -18 -136
7629 -136 -11 38 2 0 -19 122 -97 -262 65 -222 -28 -67 -66 20 -7 -43 188 -26 -138 -74 148 -147 -55 -249
7653 -249 25 159 2 -385 -122 3 -90 -19 -102 -65 -126 -59 -2 -65 -54 46 199 321 -14 2 41 185 -21 157
7677 157 -64 -78 -317 82 242 169 -102 76 63 255 55 19 167 5 215 248 78 39 -11 -74 230 168 -215
7700 -215 20 58 34 -50 111 4 -7 75 -1 73 219 -78 -125 57 75 -20 -52 166 -157 -110 103 -65 -134 -29
7724 -29 127 43 55 184 137 5 35 -67 -144 -44 83 -83 -177 -116 -158 38 46 58 116 -10 -54 -38 342 -99 70
7749 70 -253 6 -55 -203 78 57 86 -314 40 -44 47 97 103 114 125 259 -80 -156 -95 7 -60 -165 -313 -112 -3
7774 -3 79 -49 11 75 215 50 37 47 80 104 274 -64 -162 170 80 1 161 -40 97 9 17 -134 -117 -163 -81 -50
7800 -50 -85 165 -69 -94 110 69 3 -151 -50 54 175 -5 -100 -157 -13 147 -56 35 107 165 -41 -45 -267 64
7824 64 29 53 -21 -154 7 34 89 -54 125 -68 170 -157 90 95 323 202 33 -17 253 110 -48 70 140
7847 140 29 0 -14 140 26 43 -281 -177 50 9 -61 -3 -139 -136 270 272 141 -172 216 31 -5 117 75 -35
7871 -35 92 139 -35 29 -106 92 -137 -195 79 5 -24 132 -119 -124 82 53 -172 -61 27 -27 -38 71 201 -44
7895 -44 2 -14 -29 -144 -24 -283 -184 -92 -163 96 -45 228 244 -43 10 116 39 118 -127 125 121 55 88 -57 58
7920 58 65 -27 93 329 52 48 145 200 175 179 184 -135 124 -43 -97 -13 173 132 33 284 -187 -153 302 102 -99 136
7946 136 -276 -63 119 43 45 -92 78 73 -74 58 -165 -224 50 -17 192 262 178 352 109 140 42 12 -112 159
7970 159 232 58 -382 -22 -41 -165 -4 69 82 120 17 67 410 -29 202 62 -125 22 10 21 -11 -113 4
7993 4 -147 -108 16 20 69 -5 -66 -88 -100 -5 -12 -249 70 -27 7 -62 -187 -194 101 -111 -29 200 -130 29 185 41
8019 41 46 -76 159 13 266 141 -49 184 -73 6 -187 16 -63 -121 -88 -93 -28 -28 276 139 -80 -107 -247 113
8043 113 -10 -23 63 -18 -111 -267 -42 183 -62 -10 18 1 185 54 -98 156 -19 -22 275 -135 35 -306 -74
8066 -74 19 -250 17 -173 -3 71 112 23 112 13 -49 -443 33 141 -148 259 201 -58 -246 -228 -58 -43 -231 -103
8090 -103 -125 22 -46 -63 35 2 -50 -153 107 34 -209 -125 58 -280 0 22 -9 -144 244 17 141 73 -165 -109
8114 -109 238 -13 -31 22 -36 180 14 -10 -145 100 29 256 -31 117 -148 17 75 89 -35 -228 104 149 -74
8137 -74 -169 -98 85 76 -28 64 -203 149 -13 147 -56 25 -72 -3 -242 62 136 -113 83 10 92 -145 142 -47
8161 -47 -191 75 -118 9 41 -334 -37 26 220 -130 0 59 -1 -10 62 2 -136 5 -149 -13 -27 90 -36
8184 -36 -61 -89 -109 114 -175 92 -179 -60 -30 -7 45 -247 14 -24 -85 -26 -13 9 164 -33 155 -159 -12 60
8208 60 -134 78 -99 -104 65 106 -201 -11 177 49 110 -25 32 -61 108 39 153 -135 79 281 -170 84 -25
8231 -25 -109 -98 231 142 -27 188 17 98 76 179 -36 15 -35 -36 -112 -70 186 108 -98 33 72 72 118 -159 -42 -76
8257 -76 -5 -30 18 164 34 -194 -172 105 137 -96 -198 163 -98 -162 36 121 412 73 263 79 -20 -36 152
8280 152 -67 1 -67 61 -15 -63 176 -49 -39 71 -94 -140 9 54 303 -45 23 -162 -86 -142 -92 -13 -29 -115 -31
8305 -31 -28 -217 -43 58 67 129 -82 -75 -80 -22 -145 -131 -36 -268 150 80 -113 -42 85 -143 99 85 -69 -44 -105 93
8331 93 -168 -114 36 24 258 -149 74 24 -178 151 29 -82 -93 251 5 41 -77 -12 -168 -28 35 -82 -177
8354 -177 -80 -51 -128 -187 285 -103 -147 27 38 225 -33 0 -95 -158 174 -41 -221 64 -41 162 50 96 30 -89
8378 -89 -85 -190 219 -8 -101 121 67 218 -17 170 33 67 9 76 123 -186 117 14 -249 -429 -28 -66 -38 108
8402 108 -101 240 -37 40 -23 -56 69 113 114 26 75 -132 225 100 80 210 -5 -55 129 115 108 9 -44 33 -34 -127
8428 -127 -28 -94 26 50 126 -113 -81 188 -14 -6 -111 -269 36 -69 -96 -1 -126 173 130 -127 -207 -107 86 -30
8452 -30 67 -118 -158 -158 -21 -127 135 237 195 257 128 -60 -48 -40 -62 -80 204 -91 -61 -40 52 -14 14 -1 95 150 -38
8479 -38 86 58 -6 -216 -135 -10 53 57 35 -111 -50 -82 -33 14 -135 -192 29 12 49 46 188 -115 -127 160 168 123 168
8506 168 -30 -51 -153 -90 76 -299 167 69 286 232 -23 83 28 -28 -87 -28 25 118 -229 -94 -44 -156 -16 203
8530 203 135 -67 -48 -83 -80 -74 -91 -93 8 -39 26 181 -19 127 118 -217 -272 138 -25 99 42 137 45 -147 1 261
8556 261 185 -107 -124 330 -136 -70 -119 -25 114 -61 -83 157 144 86 52 75 -38 112 -41 -61 135 -279 -197 -178
8580 -178 44 -91 -255 31 -180 144 -32 -117 108 226 -9 355 89 -25 7 -124 13 -150 81 72 -40
8601 -40 193 22 60 90 6 113 -179 -78 -54 -22 -123 -106 -225 -235 8 -113 -36 -226 -137 -151 16 34 -106 -79
8625 -79 110 94 -115 192 -20 177 169 58 -113 -273 93 -17 204 -33 -85 38 -120 263 185 22 -77 114
8647 114 315 -12 -14 -61 -68 -67 171 84 110 -108 82 185 79 -37 191 -233 130 127 -52 35 257 -113 -242 98
8671 98 -150 -203 -52 65 -17 87 -111 25 -70 216 201 53 83 7 67 6 74 -156 19 134 254 -69 -23 300
8695 300 141 -129 -26 180 -73 -65 -30 173 -128 124 -39 59 -4 -1 -44 -16 -195 -179 -139 64 99 -44 -7 98
8719 98 -128 -102 100 -8 -82 33 119 12 -115 -148 42 -149 -12 108 -134 233 99 -161 -129 -93 116 133 41
8742 41 111 -88 -165 -144 -116 117 135 133 -37 56 205 -176 19 -200 182 -23 -28 158 -40 -208 -117 -204 21 68 -186
8767 -186 15 29 77 -1 20 52 96 -147 -102 6 25 -120 56 26 -39 5 72 -25 243 -88 175 -67 35 -1 54
8792 54 -82 63 195 -72 -58 -13 -93 4 -67 -70 -79 -9 -161 30 132 134 83 250 -27 -104 161 177 -115 -255 3
8817 3 30 -75 192 -82 -56 -7 135 0 116 -2 114 67 23 -153 -61 -29 -22 32 13 32 -42 -65 29 -49 181 -37
8843 -37 31 22 -61 78 -34 197 -99 158 -54 -162 -56 -327 -13 174 -73 69 -51 102 143 140 -35 -26 -149
8866 -149 -11 206 -124 -128 -186 -378 84 -13 12 -116 -101 58 -189 26 49 -100 -51 38 -147 -1 13 175 -216
8889 -216 49 47 -130 133 19 -157 -157 211 49 5 -34 194 107 -72 94 70 -304 193 -130 -256 -66 128 94
8912 94 128 45 261 176 71 159 22 -170 -152 -10 72 144 -81 62 76 79 -374 -120 111 -124 -155 -82 19 93 297
8937 297 -62 95 29 138 -109 -233 -148 6 -11 -365 10 115 -89 -95 -35 -171 147 16 13 209 297 18 115
8960 115 103 -100 -342 -70 -47 -75 12 -83 103 106 -52 15 -174 -45 4 196 -127 73 27 -226 -143 108 -13 -34
8984 -34 -52 -2 10 -213 -52 -65 -75 -27 -88 -170 -268 184 -80 -32 112 -124 142 -149 -204 18 -3 -147 -109 29 -184
9009 -184 -125 -71 -52 -131 -67 -98 95 96 -95 -93 -198 343 -37 81 -81 89 186 32 72 78 120 -3 -1 23 332 74
9035 74 110 -282 -62 68 -216 -98 66 -113 -26 21 142 128 17 59 70 78 227 -44 -58 197 -166 153 -145
9058 -145 -33 -46 -18 57 20 -42 85 55 48 120 -38 -7 -117 -68 -46 -108 131 -202 -233 -25 20 129 -237 -56 -37
9083 -37 190 62 72 -169 15 -22 -81 -137 -210 193 -20 -382 83 238 -118 285 89 -95 -37 197 -30 98
9105 98 -93 142 -143 -28 30 -245 32 -168 13 264 -70 -84 111 -71 131 106 -276 -150 -49 101 -9
9126 -9 40 9 -166 -180 -121 -112 -57 -113 -78 -291 139 -15 -19 169 86 225 -12 -237 -100 118 145 -73 40 -124 204
9151 204 122 107 -114 95 220 136 -98 255 35 -10 225 228 101 0 -35 144 234 19 -77 -232 -108 5 129
9174 129 213 228 54 63 258 -211 -337 -92 91 -136 150 194 -133 -97 -2 208 -16 -120 -15 71 58 -134 -47
9197 -47 171 32 -269 -102 -328 -230 15 -32 109 83 70 -113 -82 -48 62 62 25 -3 -157 50 120 -94 -179 -63
9221 -63 81 -193 51 -65 52 -91 114 -91 63 143 -245 -62 -74 218 -114 107 111 -24 -195 -171 152 202
9243 202 88 40 89 -7 96 56 16 -42 61 160 181 410 -139 -11 -88 -20 -214 -83 -271 113 99 38 -16 125
9267 125 -33 58 100 8 144 -96 -69 -20 51 -176 -104 -130 -148 224 -28 -7 29 304 -178 -199 182 237 -36 185
9291 185 -181 -48 -266 19 119 -76 19 -101 89 -105 -107 -21 -126 129 -64 195 147 -158 220 -7 80 -77
9313 -77 -144 44 -58 -16 200 -166 214 338 -111 -35 271 125 148 -204 43 105 -9 -125 109 -191 -145 -2
9335 -2 25 -58 38 -62 -122 95 -57 -124 -37 159 95 -79 40 -116 179 -96 72 106 16 127 116 112 81 -107 -9
9360 -9 -62 90 86 27 31 6 151 -34 -60 -91 -228 120 148 95 -79 13 57 -41 123 367 -23 0 155 149 -64 -78 25
9387 25 -228 30 155 69 -160 161 -184 -14 -69 208 -166 -33 55 -138 35 104 90 62 28 109 9 313 111
9410 111 205 48 115 4 -127 -156 70 102 -83 -116 94 32 -239 51 240 40 216 -94 0 5 -112 -48 -5 -183
9434 -183 46 -6 -101 -4 -53 -145 70 9 81 134 66 99 -102 -47 38 -121 -145 4 238 24 15 -285 -112 -71 -280
9459 -280 -20 -60 42 98 -9 58 68 -17 -87 -48 41 -64 -16 148 132 139 106 104 -217 -170 -166 -46 51 44 100 211 302 20
9487 20 -5 68 188 150 146 61 -228 -142 78 -242 7 -116 246 159 -70 82 124 202 -16 6 -64 122 -235 -48
9511 -48 12 -137 -89 -268 63 22 79 174 -26 117 -82 -103 330 2 139 357 -35 263 -169 106 -80 -325
9533 -325 -257 -192 -71 75 87 -31 -120 139 67 -135 -243 -63 52 -110 40 -149 -178 -58 -52 16 145 -224 56
9556 56 2 -87 -51 -74 170 -78 -122 112 -43 -172 -139 -41 -173 241 158 92 70 29 375 204 103 45 -57 -64 298
9581 298 151 -157 -80 73 -119 210 -136 -163 -87 14 27 84 35 62 -7 13 156 -88 208 -68 -18 -111 23 21
9605 21 -31 -18 189 96 -9 132 269 -72 85 150 -82 -151 -98 -138 -20 237 141 -73 -246 436 -89 94 -47
9628 -47 177 76 -68 114 -14 -23 16 105 -194 -132 71 -201 140 17 0 46 167 100 3 8 -35 -132 129 233 38
9653 38 29 64 50 -100 -204 393 36 -159 166 -134 -39 -175 -250 7 -233 152 130 -119 -65 426 101 -218 88
9676 88 -76 -114 7 141 -99 -152 1 -88 152 -6 236 171 206 -134 206 -6 -96 237 70 -96 -124 118 241
9699 241 -101 -112 62 104 -72 54 277 88 -88 183 -158 143 161 -49 -12 -198 -16 31 -103 -155 -16 61
9721 61 168 22 50 106 -18 88 106 -66 51 102 105 -139 -34 -1 8 -52 -12 -240 173 120 -144 168 110 -59 30
9746 30 223 45 -214 -2 -20 25 -76 -62 30 -164 -194 -24 -182 77 17 38 -106 80 22 149 -145 60 -5
9769 -5 123 -116 -79 140 -17 -121 130 282 22 1 -110 -165 -12 -104 128 -165 150 135 -25 -267 -237 196 -9
9792 -9 172 97 -45 128 -233 -219 94 27 26 93 -129 149 -114 91 -91 137 173 185 -87 -78 35 -6 50 -256 -190
9817 -190 135 -42 49 176 -111 -17 21 -68 250 -77 169 243 -244 160 -256 -37 -154 130 67 34 135 -166
9839 -166 -40 157 231 -293 -68 -110 167 42 -192 48 37 118 -143 19 2 50 29 61 71 -173 -56 29 -175
9862 -175 -95 25 -63 175 39 36 -156 -8 -66 -26 -126 63 261 -163 103 174 122 -147 -25 82 -73 -310 -87
9885 -87 103 -50 96 36 -17 -83 73 168 -10 50 -128 11 -126 -124 -302 -28 25 196 40 -25 -4 -72 182 41
9909 41 84 132 35 -217 -41 -156 -29 -72 -126 57 -51 53 289 -21 -102 182 75 260 -185 -2 -4 -49 88
9932 88 -138 -33 95 20 -59 9 -192 48 134 110 35 73 270 72 284 23 37 150 -69 180 28 -64 -136 -48
9956 -48 151 -43 28 -352 -179 115 35 9 129 277 64 -57 153 166 -99 -29 -152 74 152 64 -139 -12 -148
9979 -148 156 43 115 -98 94 125 -75 -35 -16 -203 -116 -169 79 -24 25 141 -103 0 -26 -14 108 -21 -21 59
10003 59 47 -22 103 -74 28 -178 -120 -143 191 16 140 50 -152 168 -228 116 -71 -17 -142 67 29 32 -102
10026 -102 -56 -23 -146 185 -76 21 -136 -86 -43 -85 22 36 -271 -20 -240 -111 128 43 70 -110 38 -147 -138
10049 -138 121 -114 -60 -58 -2 136 133 173 32 -91 69 -48 -177 123 148 -190 14 -49 170 -291 -85 91 197
10072 197 -177 -2 255 -85 27 15 -27 -52 -159 -21 -147 65 -106 -81 194 10 -43 -2 27 -190 -44 108
10094 108 -267 114 -18 -1 19 110 -135 44 -29 -181 -46 -226 42 82 210 117 83 180 -37 157 21 -167
10116 -167 1 -7 -6 103 -16 -177 68 -42 -64 -77 65 -85 105 101 -26 16 -57 52 -46 -172 46 24 69 -15
10140 -15 164 46 -28 -114 139 -395 258 169 33 162 -40 86 89 -46 -22 -122 101 -78 -136 250 4 74 -104
10163 -104 -12 136 137 83 212 97 210 60 -201 46 10 -79 10 -89 -83 -152 12 175 -89 -349 -16 -213 78
10186 78 -39 -38 -32 -98 71 -40 -115 -169 -96 15 32 -18 -232 -24 -189 286 -10 -122 111 -233 9 39 143 -217
10210 -217 274 -59 36 -71 46 81 5 120 17 40 22 168 137 -93 -99 2 -209 -108 -62 -237 -85 -72 -292
10233 -292 -85 89 316 124 195 -114 -151 -92 -37 -131 -132 65 -4 -69 -54 32 29 -110 60 -24 -14 88 7 -64 154
10258 154 -3 2 163 103 20 120 -183 60 27 150 59 -148 -25 -372 116 95 77 70 6 -119 -226 -76 -58 36
10282 36 -144 -184 281 -216 -7 -88 180 159 -22 45 -151 148 -94 -31 38 -13 -2 -72 -106 -77 -121 55 82 67 -112
10307 -112 -103 35 164 33 -167 22 -66 -299 96 -26 39 22 -24 -16 2 -57 61 -25 51 168 -68 -59 -108 23 129
10332 129 -13 -79 -37 19 -157 -363 -308 121 114 203 188 -231 103 202 -263 35 -48 44 134 182 254 -54 -171 -50
10356 -50 -49 89 80 -11 -25 119 61 -193 -261 182 -57 52 -88 129 199 -139 -217 -295 -72 115 -157 -112 -36 205
10380 205 81 76 -174 -33 -124 -109 11 22 85 22 61 145 -249 -102 -189 138 -110 -47 -31 -72 7 -74 160 -190 -43
10405 -43 -188 -28 62 -8 87 -88 -222 -39 135 8 -139 -97 50 52 99 -144 -191 191 74 16 106 -152 65
10428 65 -210 10 -95 35 -155 6 -49 -240 -16 98 -119 -100 6 -95 8 123 60 152 -6 -8 -85 -177 -55
10451 -55 -126 55 -225 -176 -45 130 -139 -115 76 20 -307 -29 121 2 53 165 57 10 143 -230 -140 19
10473 19 -7 -69 205 56 67 -71 -161 440 113 -159 240 -52 -76 -120 -60 -34 31 150 125 107 -96 49 71 -25
10497 -25 -152 -74 -53 -99 -3 -7 95 112 -76 -5 98 -224 62 138 -58 -1 64 14 -42 56 -34 96 -228 -134 112
10522 112 -176 -80 12 -97 -22 -120 100 -10 133 -217 55 -25 157 24 -184 114 94 -27 -85 87 -68 131
10544 131 -1 -43 -120 82 4 168 5 85 128 -27 -158 -42 -4 -182 -115 -107 -35 -34 -213 99 110 -198 166 89
10568 89 -139 -114 -42 -13 70 -12 5 -34 -79 83 280 -1 126 21 -16 -53 9 147 -79 89 108 -49 21 -12 -92
10593 -92 259 198 26 -41 -70 105 112 112 -51 -241 -24 -269 -81 47 -235 -114 63 13 64 -236 -75 -67 19 -215
10617 -215 92 133 118 -46 139 -135 -2 -95 166 -112 216 -38 -88 -86 -140 -167 10 245 -196 94 -8 37 121
10640 121 -94 142 -183 -18 331 -23 91 -55 13 376 25 -18 -27 -118 -4 -92 -66 -53 -88 -110 -43 -34 71 -162
10664 -162 259 -177 -171 122 12 255 -4 126 -71 -349 -90 115 71 54 -144 72 42 19 -71 130 79 -43
10686 -43 -73 -2 250 44 103 -75 100 -124 -46 201 -85 49 -43 -3 69 -153 -17 122 -141 -159 -28 -106 -189
10709 -189 -213 -120 -285 25 -217 -90 -32 118 6 -45 178 -140 92 -81 -41 71 -70 27 2 -197 -16 77
10731 77 -35 270 -26 103 197 -75 223 110 77 13 154 -100 174 -124 -136 10 -156 -103 -189 3 91 -240
10753 -240 -21 -142 180 182 -1 125 129 -125 -60 26 131 -144 -74 -54 -110 17 -6 44 110 74 44 -150 -57 93 -88
10778 -88 -227 -228 -32 -42 127 213 62 8 90 30 55 -69 197 -44 -93 -91 135 -94 126 -61 -209 141 74 95
10802 95 -111 37 -46 -245 97 77 54 -107 166 285 91 137 -5 -16 -59 -215 -248 53 142 88 136 7 79 114
10826 114 -230 -28 40 301 28 -110 21 44 140 -219 17 -371 -249 -162 -196 169 112 -11 96 57 79 -1 19
10849 19 80 -16 -51 0 -120 96 -317 -94 3 24 36 -135 -288 -67 22 -52 -230 292 17 28 -115 -81 68 -120
10873 -120 64 -122 -322 -230 -74 4 -96 -243 124 -140 15 86 92 248 112 -126 5 13 -12 -73 -70 -46 19 -52
10897 -52 92 149 123 -4 119 -312 -60 -4 -267 274 163 155 -184 56 214 73 162 113 48 29 54 -36 256 7
10921 7 -103 -46 121 -101 48 -6 160 190 9 -9 -203 275 90 68 24 -84 153 46 -61 85 -150 -93 -126
10944 -126 -255 27 185 -237 39 -164 -46 -12 66 -157 -20 -203 -65 198 116 79 -227 -8 -54 -23 -62 10
10966 10 -100 -113 -184 -90 -136 87 -200 -175 3 208 -110 88 164 192 102 -90 142 156 46 -62 -138 -175 98 99
10990 99 -22 -50 -201 47 19 20 234 132 -154 74 -305 -101 -98 35 -144 71 11 -74 136 328 15 -78 13
11013 13 25 70 25 88 219 -263 69 -73 30 44 -164 125 76 7 111 13 95 100 -110 77 -228 63 12 226
11037 226 50 85 -70 -41 -115 99 265 17 40 -159 85 438 217 157 -100 -44 -15 -18 -347 149 -60 98 191
11060 191 3 327 -149 258 -40 122 -4 51 72 42 443 115 -293 -42 -245 -70 110 161 152 350 -115 -40
11082 -40 -72 220 130 85 108 85 -78 -113 114 103 82 -71 -67 -36 44 -36 119 -98 4 71 82 -14 -21 -50 99 -97
11108 -97 -289 -153 -40 -52 17 53 28 119 192 27 -72 -57 127 50 129 -37 160 -291 -74 -175 -107 -122 69 168
11132 168 68 -323 73 -356 -159 11 -176 -42 65 -132 -40 -45 50 99 -154 9 88 142 166 -108 85 8 -116
11155 -116 -17 133 248 229 32 -91 57 -290 -49 -227 -188 -13 60 11 -2 -119 -38 -147 5 345 -47 -271
11177 -271 -47 71 164 -42 90 -22 -341 -192 65 -111 132 -3 -212 -58 -31 136 59 115 -213 -117 -62 107
11199 107 -267 295 -2 -83 -177 97 -53 -99 -127 112 231 -255 95 -65 -189 100 65 -84 -37 -168 -9 192
11221 192 8 74 -17 18 249 293 27 127 160 -6 -98 153 -180 -4 70 -310 129 -57 -150 -28 -7 45 106
11244 106 108 1 4 -124 -27 -75 2 147 -73 -28 -32 120 182 -106 86 162 127 -22 221 -179 -254 289 24 102 -45
11269 -45 167 -103 238 -290 -81 -14 33 99 -345 -145 -108 -140 -45 93 -260 -53 -49 -91 19 -56 -189 252 -30
11292 -30 -2 -8 -126 -77 -130 -154 90 54 79 147 144 -62 -121 198 295 -85 223 112 60 -25 158 -223 47 -86 -63
11317 -63 283 -52 204 82 107 -85 3 -76 -76 32 117 -48 31 -132 -239 -231 -235 -109 83 -35 62 -168 134 88
11341 88 14 -74 243 -244 36 -170 -169 -28 234 100 110 -122 -103 -1 171 5 65 272 -214 -128 151 102 199
11364 199 5 -153 185 -99 125 9 52 -90 -65 -231 -29 -208 0 7 125 -12 -67 -160 90 214 348 -7
11386 -7 -50 28 11 145 173 34 97 -60 61 134 186 131 116 -46 -241 -164 147 -125 -87 -55 24 14 -24 29 -209 -95
11412 -95 99 161 -36 6 72 165 -72 39 38 -221 -74 -58 -80 -29 -128 -91 -209 115 -264 128 -112 179 -71 66
11436 66 -2 19 -9 286 27 192 -131 -186 -121 -155 81 51 119 -103 -67 18 -35 6 142 -5 -48 -135 86 -279 -284
11461 -284 58 -31 111 -1 -162 24 105 30 32 66 171 45 -368 -316 278 -15 -125 -7 -44 -41 -66 35 -91
11484 -91 -214 206 -118 54 -92 12 281 -210 202 88 104 86 -194 -103 21 -42 -222 -115 -20 -100 224 126
11506 126 -97 289 91 49 186 -4 200 -21 -165 -175 63 -114 62 -183 29 -58 -47 -209 -112 -144 -152 21
11528 21 210 24 92 -216 -23 -12 86 105 147 -76 -182 36 5 167 -128 -77 13 -26 88 -118 72 -235 -201
11551 -201 33 126 -79 -195 170 -7 116 109 116 -146 27 150 -99 116 -130 -90 23 229 5 -105 17 -57
11573 -57 113 75 -67 40 11 -149 31 -73 -204 -119 -96 -50 222 106 -85 175 -78 -87 154 -39 -93 31 119
11596 119 19 129 116 77 -14 7 80 -64 36 180 41 68 162 96 35 207 304 -49 38 75 89 114 21 -51 64
11621 64 104 132 125 -221 123 -8 160 -8 89 77 101 196 118 65 135 -307 65 -53 115 192 -159 -127 -19 82
11645 82 56 75 -46 -57 122 -30 40 144 215 127 -232 89 176 355 -191 -2 20 -342 -119 26 63 -18 -122
11668 -122 -61 88 57 -248 -39 -199 -281 51 87 156 34 -61 188 -25 55 69 44 -42 13 -86 -192 126 32 10
11692 10 -68 50 -164 -49 -179 -25 -89 66 100 15 -55 -15 -120 10 -44 140 140 33 -146 157 -139 -82 -49 164
11716 164 -94 64 -101 -113 -91 -21 48 -90 87 -168 -38 50 39 211 106 -243 -211 78 -259 48 151 26
11738 26 -152 20 84 178 9 50 1 -58 111 62 -38 -98 132 -22 242 215 141 -51 -58 -8 65 128 48 85 112 -61
11764 -61 -87 12 0 74 -73 -242 -14 29 -211 -100 -75 -42 -14 -13 -103 7 96 -148 90 -25 -54 -160 -201 108 -6
11789 -6 83 -141 -82 8 -294 -171 109 131 -10 -39 128 237 26 -234 -58 15 -30 23 -252 133 111 183 -10 125
11813 125 94 132 -25 31 40 -8 -166 -28 -206 59 -210 65 -125 86 -121 100 115 -83 -46 266 30 32 112
11836 112 -42 7 87 -54 -96 178 -40 -66 -38 15 106 -43 96 -118 200 58 324 6 29 -46 -35 -78 -12 47
11860 47 -66 66 -148 -15 48 -83 13 167 -62 97 -35 13 -156 -206 49 -1 -62 -8 5 31 36 113 106 -13 172
11885 172 -44 -257 -26 -71 82 -85 -13 474 -87 22 -6 219 -74 -8 55 114 -68 -129 -10 195 138 -2
11907 -2 -35 -182 44 238 -101 -99 49 -37 201 175 -126 -31 -38 149 -92 -98 133 164 -151 130 137 -24 93 -135 -37
11932 -37 125 16 -110 41 -153 -152 -36 173 -68 129 159 159 53 -4 121 -47 198 -14 -86 -277 11 132
11954 132 -59 -69 285 -271 79 235 92 56 88 84 59 158 73 -182 -63 -51 -25 -243 -79 -7 5 -129 9 247
11978 247 22 3 -18 218 157 47 13 317 -194 19 53 -216 -27 -196 -45 188 -8 59 39 183 117 -31
12000 -31 -168 -1 183 -43 120 -1 -116 72 25 -210 4 27 28 177 143 143 -313 -127 73 34 88 -20 19
12023 19 43 -285 -126 -95 182 -3 -136 -60 -133 48 -107 152 34 166 -188 241 -68 -89 -60 -54 -46 248 210 70
12047 70 41 -224 175 -33 114 -79 0 87 84 -54 -130 35 -39 -70 -41 30 118 39 17 -80 269 12 47 -129 97
12072 97 -59 -65 84 -81 220 -80 147 87 193 59 -140 70 -32 -137 -104 -20 11 43 20 -96 20 87 97
12095 97 103 -98 66 -413 53 -73 -60 -266 -38 -52 -56 193 -243 -80 -4 160 -28 149 -23 -57 -88 -67 68
12118 68 -20 72 -195 -52 -192 157 -118 74 -90 -199 36 25 95 147 -59 4 -44 -71 113 -126 -3 -306 -48
12141 -48 129 104 28 160 -64 79 -28 79 102 -128 8 54 123 131 -38 163 -18 20 32 -201 42 66 -139
12164 -139 -221 -204 258 -67 152 66 -19 -39 159 126 79 27 -144 -147 -70 -238 -37 -113 156 4 109 99 -202 -86
12188 -86 76 -99 50 45 -146 36 99 -136 -114 91 -145 150 -123 11 -49 -51 288 21 15 -74 -170 -55 -124 59
12212 59 15 -221 -65 -17 -364 206 224 86 -40 -180 -5 28 88 -65 -91 8 249 -107 117 84 -156 -36 106
12235 106 -13 47 145 -154 16 -13 -175 -59 64 -134 60 -37 22 -109 313 -68 164 187 -79 154 -298 131
12257 131 39 79 244 76 -83 58 -62 119 -18 12 -60 -261 38 18 -30 -73 30 -142 -31 6 193 111 288
12280 288 -207 -171 27 -110 18 149 28 -63 127 -111 245 -150 -47 42 -250 129 -187 18 134 -152 97
12301 97 -29 120 50 -92 -207 188 13 69 56 -29 226 91 98 -40 2 211 -17 -41 32 -251 71 -4 -93 11
12325 11 -24 0 -11 -35 -31 103 -93 -83 -96 47 -25 21 31 65 125 229 -82 -283 64 47 -29 96 132 -44 -55 128
12351 128 80 -74 177 -24 93 250 -66 55 136 198 -285 -44 39 -41 -121 -17 5 296 -3 28 81 103 10
12374 10 -75 -74 -62 79 -111 -189 33 70 -7 -196 -97 136 103 293 41 38 15 135 -156 0 -119 -121 69 177 -120
12399 -120 28 -93 -78 123 -11 126 190 -39 7 150 41 31 -13 -156 -327 -29 62 134 210 151 61 -74 86
12422 86 -42 -7 -223 145 16 49 29 -51 32 -113 64 -64 -213 35 93 53 264 -111 -58 -16 100 39 105 177
12446 177 117 -71 125 276 43 -62 175 -57 15 189 191 -114 84 48 44 196 -23 -279 -288 -146 -54 -77 -145 130
12470 130 -13 -46 -272 50 266 -12 1 63 -132 -49 112 98 228 -170 23 3 -84 232 -45 72 48 289
12492 289 28 -46 71 103 -21 30 164 -175 138 74 -4 147 -184 17 -286 -37 -57 -74 -6 -10 -192 -198 -211 71
12516 71 -43 -113 13 32 125 112 204 -158 70 135 103 -35 -64 -294 -288 66 79 -35 -16 83 55 -93 -27 -180 -201
12541 -201 -155 55 197 30 -48 5 110 37 107 -183 -4 -6 12 70 158 43 -56 -54 178 65 -266 66 9 -77 287
12566 287 49 -168 -195 -134 -159 -40 -312 81 84 -141 52 -40 -92 30 -303 16 -44 -102 19 -121 80 -128 59
12589 59 -75 9 -120 -104 21 111 196 -226 -247 18 -68 5 -246 46 -163 37 -49 -174 -176 -41 65 77 -191 -17
12613 -17 -149 -165 66 -142 -68 96 -46 261 51 -61 -303 -179 139 41 -112 7 -192 -195 76 -88 16 -255
12635 -255 -118 36 12 -116 204 118 85 -186 -15 -21 164 72 33 -133 -146 -62 101 -42 -20 71 -105 -151 113 -207
12659 -207 122 -47 60 -54 186 -28 -226 70 74 -23 75 66 25 101 -112 81 -51 85 -107 53 89 -23 -43
12682 -43 144 181 -211 -71 -122 -4 -39 114 -149 63 144 -143 140 28 -114 9 -299 -107 -86 46 -60 -257
12704 -257 -183 26 -68 -24 -16 -194 90 150 88 -109 214 -213 -73 24 130 -48 33 101 -152 19 -16 116 -60
12727 -60 95 107 29 -99 -220 170 -79 37 -55 -43 -28 -148 -128 59 39 26 -54 -63 181 -31 39 -65 32 169
12751 169 -36 4 -79 20 -88 53 -31 111 -56 -81 -98 0 -103 36 -46 1 99 24 -121 61 17 72 -113 -234
12775 -234 133 -144 4 -130 -19 15 58 -70 46 -116 -91 72 88 -13 23 -121 7 -8 -134 -284 71 -297
12797 -297 74 76 -57 -47 -26 3 -21 85 -149 85 22 85 89 -94 -137 163 148 102 -166 -104 -101 -122 -173 -124 115 143
12823 143 -6 -144 253 -4 -299 116 -44 26 80 -91 97 211 157 -78 -9 -39 53 -22 123 -18 -30 -55 -33
12846 -33 247 -158 94 -232 -6 -153 19 7 -29 7 -11 -1 -26 132 -19 34 -37 203 -141 167 32 24 -90
12869 -90 148 -54 53 134 -4 -199 51 -3 229 65 -89 -90 -11 196 -147 -61 47 -155 -126 -47 1 -44 23 23
12893 23 -46 -30 -48 63 25 -241 -100 -23 78 92 -125 65 -65 -77 43 140 161 -133 -131 80 29 139 -188 30
12917 30 -222 -125 -108 198 271 -57 240 -139 -122 36 99 -241 -3 -73 178 215 165 53 49 59 228 20 74 -41
12941 -41 8 -339 202 131 234 9 14 37 -176 -14 -57 42 -109 106 49 -42 -48 10 -71 -115 -46 -3 58 167 80 -13
12967 -13 -86 -253 -94 -104 54 36 -31 -46 -157 257 2 -35 -62 121 21 -153 65 -137 8 25 170 -134 76
12990 76 -73 -29 -92 -22 75 -69 -99 -73 -98 -177 -60 -60 119 -63 -117 -138 50 -22 26 99 -116 269 44 -175 8
13015 8 -97 149 49 -169 116 35 89 -71 -85 -145 -24 44 -117 54 56 -49 73 24 -61 310 -182 -189 -114 159
13039 159 -59 -151 -16 37 80 -82 -86 -6 25 82 25 -30 -4 -10 30 -23 34 76 -64 37 -35 -140 -40 -33 -56 -130 72
13066 72 -57 -41 -131 122 122 -79 62 90 35 81 143 -125 155 -173 -44 197 -139 15 71 -9 58 -300 -118 66
13090 66 33 -18 246 -121 -179 -84 -44 206 254 -72 54 -79 -91 92 26 112 -22 41 199 -116 9 239 -79
13113 -79 -77 113 -11 -8 140 -128 106 113 -119 -280 78 -142 -111 -237 -9 -54 -7 263 -24 96 -180 30 79
13136 79 118 223 -63 -187 82 -152 -50 41 48 -100 -49 95 -33 251 -26 -128 -96 -214 16 -98 259 54
13158 54 137 -48 104 -144 -271 286 -278 95 -311 -8 174 87 42 105 386 -40 88 69 -167 67 39 -43
13180 -43 2 -15 30 97 -201 -254 33 -130 116 -67 -159 23 93 -17 80 67 23 118 -78 102 14 -45 -35 30 35 35
13206 35 17 151 1 -15 -39 -11 154 -98 -62 131 8 -192 9 140 182 -75 -149 -42 71 -12 109 -6 99
13229 99 -53 -31 -203 -193 -111 -130 -338 10 -3 19 -128 137 31 189 1 13 70 89 -80 -61 -139 -112 98 79
13253 79 183 -128 -1 -102 27 -41 -57 90 124 112 272 -38 94 44 29 -45 -18 -23 64 -62 -79 -163 -76 -91 -58
13278 -58 39 -98 -93 -81 -143 34 -82 46 -193 145 68 131 -49 88 -104 -4 -110 -58 -81 68 -207 20 38
13301 38 -46 159 17 -107 169 45 -108 191 2 -2 105 -55 -97 -174 -126 -225 -44 32 -102 135 -43 126 -94
13324 -94 -191 -218 -42 -108 -27 -286 57 33 -15 23 -98 -121 -210 168 13 18 59 47 185 -9 -89 -63 -91 66 244
13349 244 136 59 116 42 -136 -138 77 196 -55 35 74 -34 52 129 -93 55 122 -181 25 193 14 133 -284
13372 -284 -109 166 200 17 196 -165 -225 -167 95 -72 -92 44 -89 18 141 -32 -34 243 154 34 153 -67
13394 -67 -171 -62 -189 -58 302 95 76 46 -97 89 43 27 138 -66 -46 304 -26 101 3 134 -97 158
13416 158 184 -121 149 -52 -78 -94 208 -126 -66 53 15 -43 -50 66 15 342 -193 55 -72 151 108 50 255
13439 255 -113 34 -106 34 -8 214 -54 -55 -121 48 304 90 80 28 18 291 41 -16 -215 -74 65 -11 221
13462 221 -188 178 -66 68 36 -91 -12 -13 17 -32 174 -70 2 -46 105 10 102 113 165 60 -120 43 -341 85
13486 85 170 -176 3 -44 -117 112 -165 19 59 74 136 39 14 15 94 -96 -186 171 124 -76 8 -57 81 134 -120
13511 -120 90 -173 69 -203 -133 -75 -69 -19 -48 44 -107 11 101 -18 -258 -151 -88 -80 -173 -39 -29 -347 255 -122
13535 -122 26 251 -60 -88 -196 188 119 168 74 -146 -45 112 29 60 -11 99 163 8 -128 -149 173 -91 -42
13558 -42 -178 0 136 37 -85 66 49 -37 88 -159 95 160 -85 -66 -131 -182 -108 -107 -200 131 108 194 -4 185
13582 185 -13 46 -35 -21 -43 -165 -60 263 17 -145 188 -66 -36 130 -207 221 186 92 22 24 108 78 77 159 -1
13607 -1 -39 93 -18 87 -49 -265 -85 -119 -121 -22 -175 -40 177 293 58 28 -13 -252 12 -126 -113 -63 160
13630 160 43 169 -112 -63 74 36 64 -56 -72 102 -38 -196 -89 -14 89 71 -32 28 98 85 215 215 -208
13653 -208 49 122 -46 -198 -24 183 49 -132 159 -5 1 -96 101 -156 92 119 17 -46 -88 53 -75 202
13675 202 29 -25 -128 -84 71 -23 -58 31 53 35 -163 -54 -12 12 -66 -41 -119 -13 -19 48 22 -70 -6 -83 -100 76
13701 76 -45 122 48 155 154 -117 118 -95 -174 -5 40 -92 -81 47 86 -71 284 20 -44 43 55 217 -107
13724 -107 138 -164 -85 -81 -29 158 -94 195 -259 41 84 33 -107 70 75 1 25 219 56 202 -127 -145 -42
13747 -42 139 -107 73 -16 -48 -131 -79 67 24 -109 -111 -161 48 -111 -15 215 -142 164 98 52 -229 -160 16 38
13771 38 1 -2 31 207 38 27 97 -113 -290 -58 -14 32 -166 -134 -61 236 80 26 23 251 -39 -101 82 71 6
13796 6 -40 -35 -46 225 77 166 -277 -115 61 -34 -146 152 31 79 85 -164 282 -190 53 -32 26 55 -21 134 -42
13821 -42 47 -137 81 -127 -61 -25 -31 -169 -98 -132 -87 169 -115 -44 80 -6 -57 -47 -32 -180 -99 -422 -112 -143 85
13846 85 -167 67 218 -115 103 -94 -122 229 95 -86 -75 -102 153 -250 -124 -209 9 -246 -33 -118 16 32
13868 32 164 45 -4 -8 -220 7 14 -70 66 -75 -136 -36 -107 136 179 89 -79 -126 174 21 -175 133 -131 -137
13892 -137 198 105 -95 75 -62 42 -12 -37 -127 -19 26 148 55 -16 30 59 168 -121 25 -96 -90 -169 -125 -144
13916 -144 -62 -165 39 86 -168 249 158 -22 74 -88 38 -47 4 -122 -41 -90 132 -267 -51 126 -160 121
13938 121 28 92 -86 -178 -251 -62 173 58 -8 99 -38 59 -76 -219 -55 85 74 -26 -35 -226 -155 -40 -272
13961 -272 -52 200 148 8 -44 -132 -40 -91 -12 -77 198 -32 -229 108 -37 49 -257 227 -33 107 37 -6 84
13984 84 -53 188 119 48 -195 -83 84 37 36 -162 -109 42 38 -13 -54 50 -103 -255 142 26 -189 -57 -46 -47
14008 -47 4 -157 -185 96 -37 -188 -155 62 -79 -54 76 65 107 114 -33 -25 -117 140 -17 -25 -29 14 -13 142 63 22
14034 22 136 66 -7 66 7 55 -12 64 122 -162 175 138 -73 203 30 4 14 112 19 -146 108 -8 171 116 -87
14059 -87 141 -259 7 153 -207 223 132 -24 36 71 -196 48 -7 -70 286 9 -40 105 -183 37 162 -148
14081 -148 -49 158 187 84 -33 184 -225 -4 232 -17 129 155 27 -6 -72 25 28 -1 87 178 189 33 -12 186
14105 186 35 -24 5 204 109 -192 153 -129 -26 89 191 -31 10 22 -141 208 74 159 2 105 61 236
14127 236 6 78 192 212 82 -9 -133 0 -260 16 56 237 10 15 117 132 269 -239 56 58 39 151 -29
14150 -29 24 45 301 -4 -266 -146 -82 -15 35 32 22 196 -33 -68 -112 -246 -3 -218 197 -18 -16 108 41 61 75
14175 75 -207 -91 193 -93 70 363 269 180 18 -116 -138 -144 -210 -88 121 -89 -78 -40 -66 -250 -246 51 46 -126
14199 -126 -130 22 71 -29 -55 215 131 5 -101 -276 134 -14 42 -19 15 11 -27 81 91 -114 91 30 7 55 -62
14224 -62 140 -172 223 115 176 -6 103 -63 -99 -119 28 212 7 114 87 -29 -10 -57 -122 -16 -179 -102 -144
14247 -144 -23 81 101 14 -96 5 -80 -57 91 58 19 59 -91 143 1 -157 -44 -56 52 -206 -212 -3 68
14270 68 185 -84 35 -44 10 -181 103 -144 -64 -112 142 46 75 25 -29 -138 33 76 58 -114 42 127 -154 1
14294 1 136 -96 -62 -28 19 126 -165 -79 185 88 141 -38 64 52 18 78 111 97 130 -53 -181 -93 251 -9 83
14319 83 -10 125 185 45 70 75 129 -232 -85 45 -58 -74 23 200 36 -80 44 -104 166 10 -11 -144 -172
14342 -172 -13 -14 54 -115 -9 -127 -188 51 -217 78 -105 136 360 -159 -184 84 158 -26 -246 -108 33 -34
14364 -34 -194 77 140 174 -137 15 188 170 138 -52 3 6 -75 70 195 165 92 -16 -148 129 -8 -89 -38 71
14388 71 123 305 -26 -127 73 40 1 -35 -19 58 -2 -87 79 -185 78 52 -310 -180 323 175 223 0 17 -11
14412 -11 104 105 186 -2 9 -85 -276 -88 -60 -61 107 -168 219 -13 -8 -119 -154 -83 28 164 -31 -94 -18 13 45
14437 45 -187 324 -37 165 9 77 46 110 -67 -83 29 -19 106 -56 140 135 44 -137 -136 -27 -2 -78 159 -83
14461 -83 125 -45 101 -229 -120 63 -75 21 17 138 89 -39 118 127 -13 200 12 -33 -30 68 4 62 80 57 20
14486 20 -112 -4 -13 -123 24 268 -107 89 192 13 67 129 99 -56 -297 186 25 -47 -27 -1 26 -34 -12 1
14510 1 -100 36 25 63 20 129 -72 -149 67 -97 -108 -133 289 202 -7 87 -122 43 21 -6 49 150 -35 69
14534 69 48 -47 281 -34 198 -162 83 -4 -114 308 -165 -27 259 -137 -54 17 -192 -74 -89 -83 337 75 -27
14557 -27 -6 -226 -109 -92 21 61 -155 -168 91 14 -315 -45 282 54 -128 -16 250 -96 72 110 48 22 -125
14580 -125 -177 239 -209 42 -99 99 131 45 -66 -27 -282 -20 -101 -22 -82 117 85 58 39 7 -96 75 72 46
14604 46 -101 -260 -23 -52 35 -73 178 -73 68 24 223 -63 -186 158 59 242 -350 41 79 59 108 123 29
14627 29 40 -93 135 -153 -76 84 180 -49 114 69 32 99 181 246 64 47 84 -178 -30 131 4 -8 -8 -45 139
14652 139 78 197 -159 208 -35 -40 -18 -99 250 86 -257 -37 -444 -54 -29 -16 -31 147 38 -258 49 7 7
14675 7 -117 -35 -31 48 199 67 64 -246 -2 -94 78 -125 -71 -27 58 51 -14 -15 13 -17 24 248 39 -26 -41 79 30
14702 30 -174 128 -117 -84 197 20 146 74 -103 107 75 -21 -132 -45 12 -99 110 13 61 -62 -61 132 -189
14725 -189 -158 168 189 285 -43 -9 45 28 -32 237 -122 306 10 48 7 38 214 -193 -89 23 -103 59 132
14748 132 -107 28 144 2 -267 76 140 218 -65 -59 -166 126 -20 169 114 111 -137 -171 161 129 -38 -113 234
14771 234 159 -32 -20 -172 -38 1 -38 141 103 -306 -213 -36 -13 120 31 -156 -3 -235 118 -114 -322 -195
14793 -195 -66 -88 62 -188 137 -54 -67 88 -58 -37 -84 -72 62 -242 96 37 225 68 174 -71 -180 -233
14815 -233 -70 0 -106 48 -163 -67 -177 -17 -197 196 199 79 -145 -228 100 -21 79 45 -47 -102 52 65 7
14838 7 77 -116 -300 -65 203 -255 127 29 42 -209 56 22 83 -66 25 -217 -73 -201 33 23 171 153 201
14861 201 171 -121 -105 -105 18 -82 -21 -96 -219 48 167 104 51 -96 -145 -48 146 188 -345 30 1 92 -52 12
14885 12 54 105 -21 78 52 67 126 151 -76 200 -115 165 -106 130 62 198 60 -68 21 -3 138 -154 -9
14908 -9 22 36 -25 -89 -155 -12 64 -47 180 170 132 77 -183 64 4 62 177 -146 20 127 197 40 54 -143 61
14933 61 -138 -154 137 -12 41 127 117 150 62 229 -135 -73 -152 -61 333 307 77 -77 -107 -299 182 38 218 -31
14957 -31 -87 94 157 -95 -27 -40 -23 -56 -48 8 17 39 -5 175 42 -62 332 188 -193 119 -163 -260 105 -172 36
14982 36 163 90 -138 242 63 126 100 110 -31 168 5 -5 -69 -34 -92 -55 269 197 -175 -27 260 -106 -94 -91
15006 -91 235 124 -12 17 -162 132 -29 45 67 -205 58 29 -235 200 -25 -10 -230 103 63 -52 47 48 65
15029 65 -156 43 68 166 -116 -103 -37 221 83 -59 -161 -13 85 48 -137 -55 -101 17 20 -67 -21 54 -253 -151
15053 -151 127 93 -41 31 -59 -29 44 291 79 -5 -77 -268 -91 245 -210 104 123 149 12 -56 -45 145 55 105
15077 105 -204 -2 42 327 -23 -107 -99 10 223 -353 58 -79 4 -149 -53 -119 166 6 205 34 40 45 -139
15100 -139 76 70 -47 -60 -416 -228 -71 116 -153 -108 -92 104 90 85 81 12 -7 176 146 -251 113 -94 -68 -106 -22
15125 -22 215 -197 -124 -96 -15 188 109 115 80 -108 -138 41 154 -118 -220 22 -69 254 102 16 140 1 -55 -20
15149 -20 109 254 -169 -203 126 103 -3 327 56 98 -84 -72 171 -29 -110 -85 163 -57 -124 -25 139 -10 -175
15172 -175 266 -70 118 -90 196 39 166 196 -167 55 127 31 -91 68 43 -13 -55 76 -69 -49 132 178
15194 178 63 -106 307 6 93 206 122 125 53 -91 95 236 309 -165 -5 -30 67 129 104 80 -83 83 231
15217 231 -162 84 4 -83 -149 115 89 -73 71 11 -52 -132 263 68 -188 88 76 170 0 -42 91 74 290
15240 290 -9 -87 241 -185 27 108 196 62 231 -160 124 -107 83 -5 281 -137 99 72 164 51 -152 -220
15262 -220 -82 -61 -167 123 -108 -116 18 -133 -2 -231 62 51 -90 -117 -105 21 -259 -12 22 -117 96 -41
15284 -41 70 -64 77 4 -51 -104 167 122 -20 119 -60 184 -195 102 129 -3 61 -57 163 -143 -135 -134 -160 7
15308 7 113 -20 211 229 -101 -54 -115 165 -21 20 9 -51 99 -114 136 2 -103 226 -1 -34 45 -114 170
15331 170 -49 -156 -93 52 -117 71 45 -46 203 -218 -60 118 -6 -1 10 -3 -17 -119 36 40 -158 31 59
15354 59 38 148 25 -58 -307 140 10 50 73 -20 -46 -31 -109 -46 -105 -152 -128 74 31 22 6 -173 69 144 -44 194
15380 194 144 -114 -88 140 238 -72 36 -82 340 -33 -195 240 140 -268 -115 166 -75 94 -124 -143 74
15401 74 195 75 -165 -9 -68 -73 -27 26 -3 198 -58 -107 -121 -60 -48 -1 -65 -96 205 -192 190 24 -77 16 -323
15426 -323 -117 96 -1 54 -69 -75 -28 196 40 -172 194 -19 -25 -39 8 107 -83 -231 -18 183 -136 195 -134
15449 -134 -93 154 143 -138 -41 52 -153 -72 -167 99 186 -138 177 -80 -153 -86 -69 57 -98 81 -34 -119 -63 -39
15473 -39 17 109 -271 -161 -43 -93 -102 94 106 -11 32 53 -14 -118 145 100 -85 -39 85 -111 38 -88 175 100
15497 100 64 -199 -44 -81 -24 158 292 4 -85 -100 172 218 32 23 115 39 45 69 -192 221 -4 -49 48 56 -34 124
15523 124 70 -41 140 -5 -46 17 -121 -380 -61 66 -133 18 98 60 18 0 -9 -126 29 171 -20 -59 52
15546 52 184 72 -91 2 -197 116 -55 6 -11 141 137 -113 156 140 -199 103 72 31 -38 28 -94 -147 -7 -147
15570 -147 -120 7 -22 -70 82 -196 -176 -7 43 -22 98 58 -197 -169 128 48 -99 -110 191 92 132 46 7 109
15594 109 241 76 -40 -77 -251 113 68 155 -70 63 -80 106 81 -159 -81 -39 11 -70 -16 -20 -138 124 98 119
15618 119 -149 -154 41 -83 -131 35 109 87 -82 3 15 149 -113 -67 8 -233 317 -56 175 141 -70 -101 52
15641 52 -17 174 234 146 -125 -124 7 9 51 -222 -67 -4 -36 145 129 165 -232 -101 5 98 124 91 -75 51 -17
15666 -17 349 99 109 95 209 -63 28 66 -260 104 93 274 109 -113 -179 -65 115 146 -90 -94 180 268 -90
15689 -90 -79 282 130 89 -94 169 124 -2 -17 -102 136 -51 -16 -123 -194 93 -107 -5 22 -100 221 -77 -64
15712 -64 -105 80 -22 220 116 16 33 10 30 97 10 153 -1 -46 117 202 199 -18 156 99 9 112 -203 153
15736 153 -33 -228 52 -141 66 -193 -22 -19 -58 65 -79 49 -24 -136 250 -126 -154 -110 -113 -52 102 -201 -203
15759 -203 -355 -157 -343 -109 73 -110 215 77 -2 -72 -41 101 180 242 -55 40 -27 21 -129 110 -167 -93 -53
15782 -53 -65 -115 127 53 31 194 154 10 92 -43 -213 -169 -79 45 105 -67 169 131 148 -89 147 136 -92 -51
15806 -51 253 -117 -12 169 85 31 -163 67 -46 -370 -172 -2 66 -68 -82 -110 142 152 -40 -5 -36 -11 -82
15829 -82 19 150 65 203 -64 -3 28 199 146 42 -22 213 56 210 8 6 189 -106 -138 -10 -118 -47 -139
15852 -139 -133 196 33 -245 -182 105 -69 116 127 106 -12 54 191 6 214 151 -72 42 137 144 -111 -92 50
15875 50 -131 5 216 -135 250 -158 -210 -101 316 95 30 -57 193 57 -138 300 154 -134 189 271 -125
15896 -125 107 110 119 177 78 -173 225 68 14 26 295 130 28 -13 96 57 -155 -30 165 -4 179 -47 -44 56
15920 56 -6 -81 -96 -8 165 -39 60 -90 -201 -88 16 -52 68 353 57 100 -125 -142 86 236 44 66 39
15943 39 32 -51 85 -311 -68 -145 -41 132 188 -85 147 48 -54 143 -64 -228 249 284 4 -68 101 81 -72
15966 -72 66 65 184 98 -122 -3 -214 77 -110 -72 -81 -142 116 162 -62 54 -89 138 155 -161 122 -166 75
15989 75 -8 154 158 20 -96 109 -75 -111 -76 -97 -10 -50 69 -114 -255 179 -32 -266 -190 -150 26 -244 -117
16012 -117 50 82 74 164 16 97 -178 163 -173 -29 60 -19 51 32 -50 -36 157 40 -159 73 13 -136 190 116
16036 116 103 0 -48 -95 173 -77 -135 -159 116 -295 84 6 -24 -149 42 120 38 70 -107 43 -212 -196 241
16059 241 -34 9 5 -98 98 270 48 -149 -43 80 -98 -150 -189 -4 48 -147 51 -86 -44 -73 -95 -114 52
16082 52 -110 84 200 -3 -244 -61 7 -149 -118 200 152 37 123 60 -70 -124 -32 284 -110 -83 162 -10 -168
16105 -168 -152 -25 37 -116 128 55 99 163 174 -315 -27 129 67 -83 138 130 -102 -17 -28 -96 -129 -9 -81 132
16129 132 -40 -17 -187 128 -132 -76 67 130 55 -123 -16 126 6 183 -136 48 144 245 211 154 215 108
16151 108 -3 87 -135 -110 -71 -207 90 185 -28 238 139 -77 -113 -130 38 -193 -25 -84 -80 -102 342 -21 92
16174 92 -69 103 64 -106 113 -89 19 63 -50 88 -95 -15 -31 143 -59 114 46 63 30 7 204 89 116
16197 116 7 79 -143 -135 134 338 69 2 6 115 -67 -131 53 -181 63 -79 139 -8 157 -265 -104 -3
16219 -3 69 136 -13 -48 -227 -38 76 70 -26 51 45 -40 -53 40 -9 -97 -190 47 105 243 -48 208 -29 -236 -29 61
16245 61 67 274 179 -97 79 46 -61 5 117 -119 107 -87 85 195 60 -227 256 4 46 -235 -136 97
16267 97 -289 -109 -45 194 -7 20 -131 32 -42 -100 41 -85 47 41 84 119 -24 11 116 47 43 -55 -40 -283 -69
16292 -69 -142 147 -76 -16 -122 -74 -186 -48 121 193 1 -29 -130 16 150 135 89 150 -119 119 55 39 141
16315 141 23 -50 -353 -16 101 239 119 158 23 69 -169 46 193 22 -148 15 -134 14 -130 158 -54
16336 -54 -2 89 166 -108 -9 91 11 -15 109 -152 -169 158 -131 -145 39 -235 -170 -113 -65 56 -79 328 -50 157
16360 157 -36 -148 72 36 -150 53 9 -29 -68 40 131 99 -35 8 -222 55 211 17 74 207 -49 27 31
16383C1
$$ Imaginary data points
##PAGE= N=2
##DATA TABLE= (X++(I..I)), XYDATA
0 0 0 0 0 0 0 0 0 0 0 0 0 0 0 0 0 0 0 0 0 0 0 0 -1 22 -32 32 -32 32 -32 33 -36 63 -64 65 -68 94 -97 101 -127 131
40 131 -154 163 -188 202 -227 252 -274 305 -337 372 -407 449 -497 549 -605 667 -742 825 -924
59 -924 1043 -1180 1346 -1563 1845 -2227 2790 -3675 5344 -9549 52910 32767 -43843 -12033
73 -12033 27851 25810 -18069 -33052 -12817 25063 12234 -35241 -39103 20314 37200 -8486 -30625
86 -30625 7171 35376 21220 -11619 -19958 6927 32595 4504 -37557 -22104 21859 13876 -27334
99 -27334 -29848 4918 23789 9292 -17129 -14157 21533 35734 -867 -25559 2779 29695 7683
112 7683 -24572 -21651 4256 15027 -5509 -30067 -15085 22470 20310 -16257 -19296 16736 30589
125 30589 6260 -15563 -7005 16750 18941 -10579 -29529 -4881 20065 -98 -28369 -15912
137 -15912 13349 16144 -3316 -14806 529 24681 20236 -10716 -15461 13663 21985 -6066 -23376
150 -23376 -8476 9217 5218 -14135 -21780 -1420 20190 6742 -17780 -6093 22407 19640 -4195
163 -4195 -10565 3478 15407 7604 -14234 -19594 2973 14079 -9245 -24315 -4374 15818 7124
176 7124 -8553 -7780 8539 20794 9757 -12087 -6969 17219 13795 -13557 -18221 569 8333
189 8333 -3852 -15349 -12665 5108 14886 -815 -15153 3142 23118 10293 -9422 -4032 10049
202 10049 10038 -1095 -13655 -11090 5799 7161 -14458 -18930 4595 14563 -1653 -9495 1306 11938
216 11938 13138 3788 -8294 -1026 15648 6618 -16395 -12399 6668 4093 -11234 -12777 -3489 5788
230 5788 7749 -2925 -9872 7001 20849 4802 -10814 1194 13557 3834 -8542 -9298 -3549
243 -3549 3224 332 -13704 -12876 7113 12037 -5467 -9150 7569 13981 5914 -1315 -1935 4192 9643
258 9643 2 -14025 -7945 7237 891 -14065 -10093 3137 5991 940 -3691 -1475 9477 13631
272 13631 946 -7383 4496 11439 -375 -10363 -6092 497 1019 -4733 -11274 -6033 7745 6737
286 6737 -6276 -4578 10247 11764 1653 -2485 882 5945 5450 -4325 -11638 -2767 5793 -3398 -13262
301 -13262 -5071 5696 3505 -1762 -2270 2582 9859 8976 -2005 -4150 7089 8381 -4593 -9532
315 -9532 -2316 1522 -2201 -6349 -7734 -1739 6494 3014 -6136 -74 11489 7873 -1370 -770 4005
330 4005 4290 1331 -5024 -8244 -837 3697 -5961 -11507 -930 6304 731 -3242 455 5105 7859
345 7859 5925 -2016 -1941 7097 5292 -7255 -7826 1050 435 -5782 -6704 -4058 372 4780 820 -4988
361 -4988 2657 11472 4916 -3381 1236 6193 2204 -2032 -4287 -5009 -393 1024 -7180 -8983 1875
376 1875 5849 -2041 -3171 3693 6053 4816 3349 -245 124 5792 2594 -7618 -5973 2839 -412
391 -412 -7753 -5356 -724 515 2136 927 -2255 2996 9845 3405 -3767 2617 7172 -45 -5040
406 -5040 -2652 -2076 -1507 -1227 -5968 -6905 2093 5011 -2607 -2865 5760 7015 1938 1116 2217 1644 3170
423 3170 284 -6074 -4785 2049 -1284 -8280 -4251 1548 772 -332 643 930 4075 6958 2083 -2476
439 -2476 2835 5551 -1230 -5698 -2182 -616 -2790 -2972 -4366 -3474 2085 3224 -2174 -1119 6134 6182
455 6182 782 748 2925 2406 1073 -1472 -4945 -2839 896 -2818 -7444 -2878 2579 537 -1326 1006
471 1006 2820 4406 4790 1122 -733 3495 3907 -2748 -4956 -897 -544 -3505 -3978 -3108 -1759 2089
487 2089 1731 -1760 786 6534 4502 -75 1442 3366 1451 -650 -1868 -4026 -2157 -11 -3967
502 -3967 -6306 -857 2710 -549 -1093 2141 3279 3709 3802 1431 -125 3325 2331 -4031 -4076 366 -1002
519 -1002 -4777 -3545 -1948 -1077 1623 1422 -1030 1801 6114 3157 -1070 2121 3631 -49 -1836 -1429
535 -1429 -2681 -2139 -272 -3792 -5626 205 2578 -1291 -1113 3723 3557 1530 3202 2044 364 2516
551 2516 1769 -4187 -3682 845 -1504 -5432 -2833 -129 -1079 395 1823 214 1390 5841 2947 -1323
567 -1323 2038 4170 -867 -3090 -1116 -1595 -3071 -1678 -2788 -4317 35 2671 -1204 -1218 4262 4114
583 4114 640 1820 2806 772 759 626 -3111 -3434 -18 -1476 -5359 -2695 1030 -554 -849 1564 1768
600 1768 1803 3902 2571 -334 2102 3293 -896 -3349 -944 -913 -3235 -2462 -2021 -2525 -111 1657 -539
617 -539 -183 4134 4029 863 1342 2842 1010 11 -263 -2525 -2389 -589 -2104 -4518 -1953 1332 -430
634 -430 -914 1602 2008 2074 3377 1991 453 1982 1846 -1777 -2875 -616 -1024 -3050 -2767 -1878 -1456 201
652 201 1072 -275 1111 4117 2972 599 2154 2867 340 -761 -627 -2697 -2391 -618 -2753 -4144
668 -4144 -1014 1054 -914 -193 2627 2233 1515 2929 1780 222 1919 1774 -2554 -2890 305 -1664
684 -1664 -3731 -2170 -959 -1804 43 1864 216 1017 4392 2429 -215 2123 3037 -566 -1625 -125
700 -125 -2027 -3181 -898 -1511 -3747 -654 1422 -985 -488 3283 2897 617 2308 2551 318 822 1549
717 1549 -2053 -3061 -60 -1103 -4324 -2001 334 -1455 -894 1879 1278 604 3828 2687 -99 1328
733 1328 3178 -333 -2497 -401 -1133 -3001 -1844 -1240 -2563 -874 1546 15 -406 3204 3371 606
749 606 1281 2619 568 39 531 -1422 -2530 -726 -1191 -3227 -2158 253 -536 -881 1287 1778 1225
766 1225 2383 2594 679 1243 2184 -654 -2178 -783 -991 -2751 -2015 -1230 -2162 -729 939 127 85 2766
784 2766 2638 798 1695 2317 555 -260 -158 -1426 -2190 -1156 -1768 -3102 -1452 469 -490 -722 1685
801 1685 1636 1386 2129 2052 645 1326 1650 -982 -2094 -489 -1085 -2908 -1936 -1286 -1515 -531 1067 32
819 32 725 2671 2297 458 1741 2173 87 -568 -77 -1698 -2038 -685 -1549 -3125 -804 683 -980
836 -980 -301 2361 1986 785 2490 2242 225 1205 1468 -1524 -2239 -145 -1206 -3256 -1187 -355 -1747
853 -1747 -649 1611 610 602 3130 2094 -137 1424 2584 -268 -1391 433 -1333 -3046 -1108 -1250
869 -1250 -2827 -1018 1086 -709 -768 2449 2546 594 1693 2751 357 193 1373 -1128 -2318 -563
885 -563 -950 -3106 -1826 362 -1136 -1028 1689 1093 386 2566 2771 349 1026 2395 108 -1848 -115
902 -115 -915 -2690 -1467 -740 -2081 -1269 804 -26 -176 2236 2599 578 1259 2167 594 -402 435 -960
920 -960 -2140 -773 -1104 -2898 -1504 80 -705 -722 1303 1630 740 1887 2435 815 1026 1706 -343 -1512
938 -1512 21 -1007 -2570 -1583 -738 -1869 -1060 1037 438 -61 2131 2408 416 1231 2080 395 -687
955 -687 438 -844 -2072 -769 -1037 -2634 -1652 496 -923 -521 1445 1705 661 1509 1948 748 670
972 670 1502 -481 -1732 -616 -1032 -2703 -1641 -464 -1349 -1074 517 600 349 2068 2026 591 1413 1972
990 1972 242 -500 170 -1065 -2279 -1020 -1065 -2143 -1352 337 -767 -489 1800 1536 725 2169 1923
1007 1923 171 578 1464 -706 -1840 -405 -769 -2852 -1574 -129 -1640 -857 1073 824 396 2550
1023 2550 2264 293 1007 2302 -65 -1373 408 -875 -2731 -1401 -633 -2223 -1424 974 -252 -896
1039 -896 1986 2033 -6 1339 2334 419 -159 979 -581 -2168 -612 -795 -2520 -1694 191 -871 -1079
1056 -1079 1103 1111 391 1905 2611 637 653 1952 222 -1434 -140 -544 -2484 -1731 -366 -1734 -1336
1073 -1336 666 37 -279 1456 2294 789 1256 2275 278 -242 482 -361 -1899 -870 -985 -2354 -1714
1090 -1714 -92 -717 -959 1041 1687 581 1566 2217 703 680 1412 -56 -1169 -494 -700 -2271 -1742 -637
1108 -637 -1332 -1283 528 561 -24 1408 2284 792 1053 1986 529 -569 522 -454 -1845 -1122 -803 -1880
1126 -1880 -1595 128 -403 -459 1063 1538 677 1336 2044 914 603 1110 41 -1163 -139 -833 -1985 -1500
1144 -1500 -474 -1222 -1032 237 468 278 1709 1966 545 1134 1653 196 -567 497 -845 -1829 -1073
1161 -1073 -816 -1984 -1132 211 -698 -579 1446 1353 437 1786 1879 403 238 1594 -494 -1361 -190 -792
1179 -792 -2422 -1382 -183 -1355 -840 995 572 -190 1821 2271 147 872 1702 4 -900 336 -388
1196 -388 -2041 -1178 -395 -1951 -1364 839 -53 -570 1325 1934 290 1265 2266 680 -436 1052 150
1213 150 -1946 -700 -378 -2155 -1764 182 -692 -1181 683 1380 51 1626 2214 497 500 1782 363
1230 363 -757 67 -338 -2068 -1604 -152 -1174 -1469 637 326 -590 1419 1685 627 790 2045 640
1247 640 -318 494 -86 -1674 -1216 -356 -1751 -1447 -81 -398 -887 489 1341 86 1329 2104 752 221
1265 221 1544 368 -978 -524 -504 -1733 -1810 -599 -1029 -1156 91 436 -198 1030 1985 613 737 1787
1283 1787 407 -229 513 -336 -1493 -1130 -662 -1716 -1448 -170 -284 -786 540 1324 612 1033 1735 697
1301 697 224 1223 77 -996 -411 -566 -1856 -1392 -468 -1270 -842 605 175 16 1328 1596 648 1101
1319 1101 1622 93 -685 451 -404 -1801 -1170 -731 -1750 -1393 218 -577 -666 1524 1335 123 1249
1336 1249 2316 474 100 1259 -41 -1340 -305 -264 -2331 -1452 -90 -875 -1058 685 536 -205 1102
1353 1102 2252 391 674 1715 272 -1112 211 -158 -1836 -1284 -258 -1583 -1803 141 155 -874
1369 -874 1079 1818 381 711 2212 960 -104 835 408 -1421 -842 -143 -1694 -1709 -108 -548 -1080 496
1387 496 1371 27 784 1933 855 484 1391 709 -809 -279 -70 -1512 -1542 -570 -1383 -1343 124 484 -514
1406 -514 593 1653 896 747 1788 866 -104 258 202 -871 -910 -420 -1557 -1697 -135 -315 -894 465
1424 465 1043 374 807 1489 778 410 1154 402 -626 -329 -346 -1664 -1332 -626 -820 -1291 48 61 -370 1014
1444 1014 1413 795 941 1481 487 -301 47 -16 -1107 -985 -573 -1508 -1183 -68 -398 -547 645 1014 433
1463 433 1089 1490 569 289 929 366 -877 -232 -497 -1849 -1195 -208 -720 -1049 322 353 -360 1157 1413
1482 1413 516 851 1483 349 -365 586 -223 -1309 -1187 -448 -1741 -1273 263 -23 -723 592 1289 212
1500 212 905 1799 824 28 863 477 -1117 -689 -66 -1452 -1275 -124 -754 -1083 396 739 -146 885
1518 885 2018 605 467 1495 736 -863 61 78 -1456 -1400 -375 -1244 -1585 31 273 -562 599 1377
1536 1377 286 700 1678 931 -82 833 249 -1032 -974 -186 -1247 -1529 -190 -331 -1002 265 902 285
1554 285 480 1874 731 362 949 694 -529 -381 -42 -1480 -1261 -273 -821 -1333 21 433 -337 321
1572 321 1416 626 615 1446 683 -193 330 261 -841 -885 -147 -1283 -1287 -112 -232 -951 482 766 421 736
1592 736 1623 889 179 850 436 -953 -313 -137 -1261 -1543 -595 -980 -1292 50 154 -550 522 1472 707
1611 707 743 1529 716 -371 153 63 -1071 -938 -290 -1321 -1177 -329 -307 -569 493 932 241 935 1488 701
1631 701 178 862 110 -658 -407 -193 -1375 -1366 -313 -894 -1067 59 370 -273 962 1275 722 706 1381 564
1651 564 -330 118 60 -1248 -915 -537 -1187 -1126 -126 -22 -489 488 1087 386 845 1659 881 250 912 516
1671 516 -768 -539 -100 -1391 -1404 -417 -752 -1178 107 764 112 667 1440 742 344 938 690 -501 153
1690 153 25 -1102 -1166 -378 -914 -1500 -73 348 -506 478 1222 608 690 1270 756 34 584 408 -886 -825
1710 -825 -305 -910 -1409 -431 -283 -1001 45 777 84 289 1414 869 102 933 831 -394 -480 -38 -887
1729 -887 -1209 -469 -822 -1499 -232 232 -404 235 1050 616 -32 1037 945 107 280 416 -867 -772 -310 -981
1749 -981 -1396 -496 -177 -610 175 737 285 502 1279 974 340 695 632 -425 -221 -104 -1138 -1139 -613 -731
1769 -731 -996 -4 341 -131 286 1180 922 480 1144 779 -179 3 93 -611 -1034 -497 -849 -1106 -508 -330
1789 -330 -600 30 592 529 595 1116 424 244 844 400 -589 -355 -98 -1131 -1074 -329 -610 -917 117 535
1809 535 -73 596 1086 440 621 1260 663 111 285 109 -975 -943 -290 -980 -983 -469 -266 -616 289 933 211
1830 211 398 1249 707 187 587 545 -573 -451 -9 -1162 -1306 -74 -300 -1381 178 579 -157 480 1583
1849 1583 590 217 1186 505 -313 -164 299 -987 -969 -531 -781 -1068 -243 160 -447 199 1279 546 410
1868 410 1072 816 -122 485 594 -460 -843 13 -727 -1507 -473 -379 -825 -66 730 268 293 1276 874 224
1888 224 621 857 -376 -117 103 -951 -1333 -174 -857 -1204 -324 282 -316 464 1086 641 392 910 969
1907 969 -181 -83 103 -445 -1048 -291 -634 -1222 -615 -371 -300 211 598 338 295 940 873 413 494 490 -109 -558
1929 -558 -50 -555 -817 -379 -691 -899 -262 448 49 221 957 335 292 828 747 -90 36 154 -609 -571 -166
1950 -166 -677 -985 -239 -172 -611 274 832 238 324 1204 712 361 609 565 -287 -288 -290 -983 -934 -401 -907 -867 129
1973 129 274 -195 329 941 653 395 835 720 -2 -2 193 -943 -831 -44 -613 -1258 -478 25 -584 342
1993 342 807 427 265 1347 803 154 690 555 -555 -629 187 -802 -1165 -77 -485 -1025 -371 679 -117
2012 -117 173 1168 921 56 805 869 -200 -398 459 -443 -1135 -392 -368 -1059 -331 345 -420 152 996 400
2032 400 178 856 1028 255 374 420 -329 -852 -164 -423 -1259 -500 -102 -788 -133 746 196 205 973 922 5
2053 5 683 792 -14 -175 -55 -391 -794 -383 -376 -759 -352 266 -30 -49 882 664 384 742 865 180 209 336
2075 336 -255 -827 -159 -585 -1040 -371 -162 -578 -157 471 240 107 1002 839 436 563 711 -97 -7 7 -673
2096 -673 -849 -518 -634 -583 -201 100 -60 257 940 418 264 890 861 239 142 315 -570 -690 -272 -610 -861
2117 -861 -342 -78 -503 -92 745 407 170 1285 769 70 516 510 -335 -471 -127 -761 -1135 -482 -272 -847
2137 -847 -118 413 -168 91 902 344 406 808 612 -135 -70 160 -591 -1025 -119 -529 -1019 -302 307 -333 -185
2158 -185 765 328 312 1027 716 157 613 564 -286 -832 98 -498 -1202 -328 -98 -678 -466 515 13 25 844
2179 844 725 256 569 820 -300 -227 139 -533 -698 -130 -389 -830 -165 180 -294 -241 576 556 375 831 908
2200 908 363 243 728 -301 -813 -138 -463 -919 -669 -77 -483 -262 506 351 66 865 791 221 831 712
2220 712 -67 -223 -87 -604 -810 -258 -525 -1041 -331 -67 -89 -196 701 570 238 664 659 11 171 251 -126
2241 -126 -552 -171 -261 -869 -570 -126 -320 -298 441 260 104 836 739 307 476 536 -161 -400 -217 -420 -586
2262 -586 -290 -297 -774 -271 -17 -22 -94 495 462 126 693 596 -80 94 222 -659 -664 -223 -453 -805 -275 -212 -364
2285 -364 -16 632 625 105 804 674 256 507 784 -155 -172 -196 -551 -1097 -199 -107 -582 -256 312 -4 29 670
2307 670 585 -88 713 713 -38 111 65 -358 -786 -106 -363 -707 -554 173 -228 -162 551 500 33 537 963 195
2329 195 499 725 -52 -555 -113 -432 -1016 -294 -103 -534 -331 444 -78 112 850 396 88 585 697 212
2349 212 -405 531 -264 -688 -394 -427 -941 -381 9 -165 -13 540 312 164 712 818 543 64 617 -224
2369 -224 -583 -328 -275 -1093 -458 101 -309 -485 311 199 -182 781 926 51 278 869 -9 -136 316 -231
2389 -231 -788 -166 -235 -736 -579 247 -286 -157 541 656 267 398 567 191 -129 554 -171 -607 -141 -158 -719
2410 -719 -540 214 -536 -344 293 313 419 757 645 353 361 560 -13 -301 10 -397 -735 -368 -556 -767 -67
2431 -67 168 -259 -63 540 693 218 389 670 185 215 334 -122 -239 -183 -342 -763 -420 -142 -435 -325 378
2452 378 142 356 702 601 -3 274 684 -133 -434 20 -363 -895 -254 -242 -732 -236 86 -18 -93 725 709
2473 709 157 559 595 -30 211 152 -91 -710 -20 -356 -751 -319 59 -195 -110 553 276 152 457 692 34
2494 34 124 438 23 -704 -410 -412 -625 -389 -152 -452 -554 415 254 -35 707 657 132 353 708 -112 -331 379
2516 379 -169 -774 -426 -3 -896 -345 324 -165 -290 721 433 88 693 769 210 -1 451 10 -450 -313
2536 -313 -266 -688 -462 73 -392 -536 238 179 -177 387 780 139 177 836 222 -77 82 -119 -669 -596 -289
2557 -289 -755 -630 -242 -230 -267 364 431 198 420 457 184 95 342 -66 -401 -247 -170 -303 -255 20 -256 -152
2579 -152 127 395 283 421 652 241 364 135 -13 -153 280 -251 -432 -313 -74 -160 -312 105 2 -74 510
2600 510 592 286 505 474 131 -120 138 -225 -545 -420 -126 -602 -432 -138 -410 -65 436 114 134 396 534
2621 534 64 196 504 -117 -201 -7 -175 -779 -287 -133 -473 -327 274 119 -255 570 539 29 406 690 -126
2642 -126 -138 472 -90 -687 -236 -51 -825 -224 6 -246 -247 430 349 268 631 819 21 204 451 -6 -478 -73
2664 -73 -318 -909 -399 32 -442 -396 65 87 -126 285 787 358 445 647 184 -142 118 -122 -493 -213 -27
2685 -27 -650 -506 -114 19 -269 284 566 244 115 433 159 87 550 -20 -638 -304 -175 -713 -462 -262 -398
2706 -398 -436 274 361 95 293 811 336 345 604 158 -225 260 130 -478 -518 -81 -597 -445 -43 -127 -8 324
2728 324 609 191 263 750 252 -31 114 -15 -496 -572 -428 -619 -683 62 -299 -538 -146 266 -100 483 391
2749 391 133 403 461 197 -73 114 -363 -536 -464 -499 -474 -120 -19 -260 -76 470 576 310 188 405 309 198
2771 198 305 67 -334 -152 -173 -771 -347 -141 -173 -141 391 479 -144 406 670 -43 141 542 155 -324 168
2792 168 -176 -746 -290 14 -659 -336 32 -222 165 348 570 36 232 494 152 12 274 -82 -536 -106
2812 -106 -181 -946 -501 33 -56 -493 484 279 -19 353 651 104 124 523 -135 -422 76 -144 -686 -242 -42
2833 -42 -474 -319 312 150 -349 172 785 50 310 455 301 -46 58 -26 -597 -531 -277 -537 -590 7 -124
2854 -124 -106 240 494 101 243 338 378 34 205 235 -425 -196 -72 -618 -395 75 -305 -196 60 177 -25
2875 -25 190 578 468 367 441 -44 -211 75 -4 -521 -408 -248 -438 -566 -104 -97 -229 244 582 -76 230 555
2897 555 134 165 197 2 -677 -366 -196 -554 -618 215 -204 -441 74 103 128 125 591 281 289 443 295 -165 -67
2920 -67 -134 -466 -355 13 -220 -432 -101 -305 -203 338 342 223 354 607 201 28 559 -62 -496 -146 -31
2941 -31 -645 -485 69 -488 -214 265 333 -100 540 217 168 -19 690 78 -15 -139 -222 -586 -355 23 -457 -310
2963 -310 75 -52 70 158 457 177 202 705 275 80 311 237 -420 -313 -107 -441 -422 -128 221 -382 60
2984 60 170 41 366 610 154 202 296 50 -355 43 24 -501 -482 37 -563 -592 42 156 -51 28 405 279
3006 279 205 679 261 -37 155 74 -474 -358 203 -822 -519 20 -21 -291 302 495 52 172 500 121 -27
3027 -27 266 486 -369 -183 121 -504 -464 -120 -138 -474 60 50 -209 205 546 -12 72 -36 146 -255 -28 -30
3049 -30 -333 -408 -152 -306 -474 -155 -81 -31 41 312 177 224 754 126 141 229 4 -171 -231 12 -332 -65 2
3072 2 -137 -223 167 166 73 119 263 364 138 374 179 -98 -33 -285 -311 -134 1 -279 -541 -230 -17 -151 231
3095 231 495 17 372 364 84 -158 345 -146 -171 20 -212 -437 -405 -179 -41 -405 174 233 63 268 440 275
3117 275 -79 483 225 -113 177 -18 -229 -282 -289 -273 -280 212 29 -210 63 257 164 176 488 496 -54 124 28 -368
3141 -368 -284 -167 -497 -363 -134 -155 -583 84 213 48 406 281 290 131 409 57 -315 -48 -70 -417 -581 -9
3163 -9 -43 -525 87 224 -83 266 472 125 250 528 319 -87 88 159 -352 -313 91 -535 -393 40 108 -163
3185 -163 -269 225 169 299 389 268 -177 241 97 -273 -281 128 -205 -503 -75 -49 -292 -28 130 320 380 446
3207 446 191 181 378 220 -45 217 106 -67 -274 -75 -339 -206 -99 -352 -251 -6 216 68 -57 463
3227 463 501 133 300 169 -173 -89 26 -512 -267 -133 -201 -490 284 8 -42 207 457 212 79 189 111 -242
3249 -242 -90 -78 -326 -139 -149 -201 -556 131 171 -100 167 399 56 142 447 79 28 126 33 -308 -222 85 -309
3272 -309 -234 -128 -278 -465 190 189 9 287 501 178 63 362 315 -179 -22 130 -477 -607 -198 -234 -275 -27
3294 -27 -149 -405 50 371 159 49 258 83 -163 252 -62 -198 -320 -132 -104 -505 -261 -33 -303 -22 334
3315 334 -163 -82 390 300 -139 362 118 -394 -150 160 -252 -206 36 -177 -198 -218 191 -97 -25 526 116 319
3337 319 414 79 -347 -3 123 -461 -77 173 -547 -550 122 -137 7 -253 274 308 198 339 163 76 183 125
3359 125 -140 32 -110 -373 -399 -341 -216 -403 -229 90 -66 159 442 359 12 276 103 -140 171 284 -370
3380 -370 -267 -124 -165 -370 -205 -78 -482 195 108 199 239 313 315 -86 -71 322 -203 -116 53 -289 -233 -268 -52 -212
3404 -212 -40 112 -33 296 437 180 308 174 134 -64 41 197 -319 -104 -4 -304 -232 -89 -137 -271 41
3425 41 221 397 169 450 124 203 277 -14 -151 -139 15 17 -467 154 -164 -415 58 52 53 78 525 100 159 309
3449 309 278 -63 71 243 -306 -301 102 -191 -322 -314 336 -338 -39 227 254 151 685 326 -175 54 89 82 -398
3472 -398 226 -244 -482 62 -233 -216 94 351 69 -176 140 45 24 415 465 -12 -228 3 -212 -363 -270 -379
3494 -379 -444 -234 54 -42 -69 371 107 146 461 372 106 -35 105 -256 -272 -107 -323 -294 -102 -108 -413 143 256
3517 256 235 145 397 213 -10 -164 38 -65 -64 33 -164 -359 -67 -62 -362 -120 158 -242 63 334 122 107 378
3540 378 145 74 19 149 -188 -301 -80 -397 -150 -139 -123 -163 227 210 68 261 273 342 -63 30 312 174 -111
3563 -111 -42 -249 -403 -85 -247 -478 82 -7 -15 80 413 43 203 254 149 13 120 104 -303 -371 -279 -254 -286 69
3587 69 -99 -210 3 147 131 172 313 373 203 151 92 162 56 111 -378 -302 -42 -218 -156 84 3 72 81 305 119
3612 119 54 396 268 -34 13 108 -300 -233 -75 -237 -502 -186 45 -380 -205 190 -40 -66 152 517 -17 80
3634 80 326 -250 -77 -104 -28 -433 -95 -29 -325 -100 165 88 117 342 341 -25 282 -8 -43 -189 113 -176 -300
3657 -300 -17 -229 -130 -126 72 123 -12 147 7 -118 406 456 -4 46 4 -95 -182 -107 -309 -420 -285 -153 -417
3680 -417 17 338 40 89 238 139 58 390 225 17 -268 -131 -298 -616 -244 112 -437 -52 157 -178 -41
3701 -41 368 434 141 197 323 -105 91 312 -25 -263 -57 153 -358 -112 -79 -232 -72 105 178 -19 130 -16
3723 -16 154 57 166 47 -24 -269 -106 -426 -99 26 -212 -156 -70 100 154 123 150 135 475 -66 -277 -53 -118
3746 -118 -249 -63 -149 -341 -105 -181 87 -112 138 94 235 -42 201 175 53 221 243 -72 -203 -97 -284 -329
3768 -329 -50 53 -162 -293 51 -20 -116 155 221 -29 485 268 64 19 152 -96 -354 135 -416 -340 -242 97
3790 97 -275 -209 317 208 19 310 353 -88 195 -5 -323 -321 -24 -332 -324 -249 -188 -213 -256 150 80 28 304 82
3814 82 55 65 70 8 -194 -42 -186 -352 13 0 -85 -113 -35 -44 -200 341 -17 36 186 376 85 77 238 212 -329
3839 -329 41 -64 -429 -102 -13 -68 55 352 217 -262 88 375 36 226 222 116 28 155 -222 -432 -188 45
3861 45 -230 -26 173 -84 138 163 98 154 101 328 -92 61 147 -170 -19 -127 -202 -285 -156 -30 -86 -168 96
3884 96 15 17 231 329 33 296 38 -38 102 -194 -45 -201 -78 -155 -342 -231 -56 35 149 96 188 48 263
3907 263 83 -32 -143 203 -156 -241 -51 100 -305 35 -141 -281 -336 250 51 71 413 271 -68 227 297
3928 297 -189 -29 209 130 -184 -209 -122 -421 72 177 -155 -38 218 94 -149 160 372 -91 -103 109 -48
3949 -48 -186 -109 -179 -135 -208 350 -246 -265 207 184 -85 29 166 159 327 151 30 -29 -236 -189 -258 -19 -7 -389
3973 -389 -235 -143 -173 9 94 173 115 341 375 171 -50 -26 -50 16 -134 -46 -11 -165 79 -181 -14 33 -62 -138 182
3998 182 302 180 186 116 -93 -115 -89 -180 -396 -401 63 4 -156 9 -101 -98 148 98 31 186 307 -129 -160 170 -10
4023 -10 -284 -518 -116 -54 -174 100 -72 -142 28 201 -86 199 137 -65 148 24 59 -94 58 -72 -414 -355
4045 -355 52 -49 28 134 -192 277 -33 374 3 148 370 148 186 -59 -22 -184 -165 -100 -25 -105 4 -169
4067 -169 -192 239 313 -218 209 151 99 102 4 -146 -122 -152 -240 -335 -140 34 -244 63 295 29 47 293 341 110
4091 110 164 229 -79 257 -8 -338 -210 -58 -198 -277 -195 247 -51 78 463 199 22 232 239 223 156 76 54
4114 54 -139 133 -74 -362 -360 30 -129 -401 249 153 -49 176 232 62 -22 291 58 -271 202 -297 -361 -200
4136 -200 -51 -89 -254 435 37 -92 174 105 26 212 57 -31 -15 169 -416 -86 -105 -171 -183 -72 -89 -296 -31
4159 -31 470 -78 20 43 176 149 81 87 -221 -273 -232 -16 -345 -193 35 -319 40 246 -100 144 301 130 -35
4182 -35 53 292 163 124 81 -116 -196 -178 -112 -211 -88 136 -41 64 -216 34 83 238 186 12 -69 78 107 -251
4206 -251 0 -201 -378 -464 131 -280 -157 -171 282 123 113 261 105 377 157 157 27 98 2 -304 -125 11
4228 11 -538 -110 49 -93 -153 229 300 190 69 146 15 0 84 229 -228 -42 -178 -388 -279 -2 -313 -48
4250 -48 137 -24 142 63 249 -158 148 -38 47 17 128 -144 -208 -222 -304 -127 -125 125 -68 -42 85 253 -217
4273 -217 4 36 36 -119 190 107 31 -47 -85 -173 -181 112 -235 -67 39 -67 160 286 340 -194 104 118 -105 -246
4297 -246 10 158 -274 19 146 -108 -297 -125 -30 13 201 199 -18 245 62 69 -159 71 142 -192 10 44 -266
4320 -266 -67 -45 -291 -90 93 266 -150 187 383 98 -57 285 -7 -191 73 185 -558 -192 -7 -74 -214
4341 -214 90 149 122 147 291 113 -79 104 -25 -202 140 116 -20 100 -286 8 -220 262 -240 -162 -8 76
4363 76 86 0 138 -160 9 -20 86 139 -12 -51 -193 -35 -44 -278 89 179 -45 141 32 79 119 48 256 -37
4387 -37 -33 68 -142 -301 -228 -148 -344 -169 -124 -166 10 398 170 121 187 327 165 148 312 -200 42 -57 -166 -63
4411 -63 -85 -10 -157 -101 43 -63 -31 -53 318 93 251 -40 156 198 -36 -258 -194 -76 65 -208 -110 151 -93
4434 -93 -289 226 23 -118 96 294 -28 -196 144 8 89 70 -37 41 -198 218 -254 -228 35 19 42 308
4456 308 199 116 -118 199 52 -87 -107 92 -176 -224 134 -228 -263 126 34 14 84 195 17 -54 72 315 111
4479 111 135 63 -101 -157 -32 -108 -148 129 -83 -78 -49 187 17 64 93 128 -3 -11 141 -37 -134 -58 -173 -180 50 -193
4505 -193 -116 -34 -78 102 62 13 160 -49 224 96 92 353 -86 -64 -13 22 -336 -116 83 -131 -117 -83 123 263
4529 263 15 263 138 -1 159 93 -65 170 -75 -214 -289 -154 94 -246 -43 81 160 -36 24 230 2
4550 2 149 98 70 93 50 0 166 -160 -216 -294 -149 -236 -59 -77 501 282 5 312 203 -29 82 144 -126 -20
4574 -20 251 60 -65 328 -47 -317 225 217 195 -88 225 -135 102 236 38 -29 38 -73 -228 -260 -24 -157
4596 -157 -390 -93 54 -56 -149 250 -80 203 236 -38 177 70 24 23 30 -148 -250 -213 -83 -56 -116 162 92 -37
4620 -37 180 158 291 401 421 123 -93 -229 79 -114 -47 -60 -164 74 -22 -90 107 110 129 38 168 109 160 -29
4644 -29 12 -248 -246 -196 -10 13 -86 146 -273 -161 -18 -64 -5 62 117 252 -56 295 71 117 -63 -77 5 -139 -40
4669 -40 -50 69 59 -108 208 171 -100 226 117 393 90 -58 49 136 -335 13 160 183 -285 229 -64 -268
4691 -268 121 -11 86 199 172 234 325 302 84 -190 -330 -272 -103 -44 -229 -368 17 15 70 -88 -125 162 38 262
4715 262 -102 -20 103 -8 -90 -188 52 16 -182 -131 21 -134 144 -153 58 69 -87 308 18 -42 191 111 -143
4738 -143 -82 197 -37 56 -270 -152 -163 -136 231 -111 21 248 99 47 114 -116 50 136 59 -194 -353 5 -31
4761 -31 97 268 -131 -323 160 207 285 -92 324 201 -161 88 -63 -286 -144 -113 -25 52 -177 31 -155 394
4783 394 266 34 171 60 25 184 125 85 21 26 -158 -126 -73 76 24 -214 98 26 18 44 218 -192 60 -33 113
4808 113 4 -156 78 59 143 3 -36 -170 -69 50 -5 -146 271 99 3 75 119 151 -141 28 -122 -145 -50
4831 -50 -329 -314 -142 -74 -291 -132 245 95 116 188 167 326 170 202 37 101 103 -140 -119 -241 -175 -177 -68 -204 96
4856 96 164 342 86 53 85 283 19 255 121 -121 223 0 223 -49 120 -104 -176 224 87 -211 87 -39
4878 -39 -21 69 70 -199 -27 123 1 -198 -30 90 -282 -128 -308 -308 -78 31 -27 -122 -57 3 308 -3 164 34
4902 34 -84 -11 160 -174 -143 -201 -115 7 128 73 -339 44 -14 138 -121 125 -77 -206 68 32 -190 -95 -120
4925 -120 -29 -96 142 141 -87 120 142 246 134 125 124 -37 156 154 -94 131 40 -155 -313 -14 -84 -85 -12 -23 -28 -52 90
4952 90 143 -56 88 -33 123 87 53 32 -374 -11 -373 3 -104 8 -129 -148 71 -39 277 199 64 169
4974 169 106 105 67 37 8 -72 -84 -120 81 84 -214 -30 7 -103 390 -126 -96 38 168 -106 -9 187 -77 -258 -215
4999 -215 -161 -135 -91 171 84 12 174 31 181 58 -220 214 8 -54 14 -68 -110 54 -112 -12 68 -281 -84
5022 -84 187 167 117 266 155 137 63 -89 -91 -4 95 -158 -313 67 -298 3 66 57 -305 -213 188 -168 -54 88
5046 88 122 95 234 255 -66 122 63 -58 28 -89 -14 166 97 184 -19 -189 252 149 4 245 191 2 12 178
5070 178 -192 -228 20 -100 -181 -79 32 -426 -17 137 -96 105 158 137 -193 177 13 -265 -55 87 27 -274
5092 -274 91 69 1 114 121 -133 50 137 312 107 123 282 89 294 61 -166 -105 118 -304 -62 -28 82 -107
5115 -107 107 246 17 -23 -15 121 -297 -42 9 -227 -245 -13 -116 -221 -164 -50 -148 -70 44 -180 -112 53 233
5138 233 137 -363 34 -37 -144 22 126 -109 -132 91 -307 -185 76 -198 54 271 149 121 254 -41 -243
5159 -243 -10 -85 -194 -5 71 -155 -198 -171 -83 42 5 91 -1 16 114 53 -74 9 -138 28 -57 -275 -200 -27 -10
5184 -10 56 -113 -77 -40 141 158 101 137 -170 351 264 32 67 -30 -72 152 16 -23 48 -152 50 -216 -61 362
5208 362 -79 -15 153 -9 158 -131 168 60 18 0 -104 -158 -60 33 -179 56 -30 97 243 38 177 170 146
5231 146 -60 155 -158 -141 4 -68 -196 -19 -37 -91 -117 -51 295 65 202 27 14 253 147 -127 -219 22 -52
5254 -52 48 -241 -76 -244 -32 35 63 78 -75 -29 -39 56 -136 -27 137 -8 -279 -73 192 -260 -61 -82 -212
5277 -212 -153 186 191 -51 75 9 -15 339 222 -78 25 101 -70 -62 85 -37 -206 -75 140 31 190 151 -80
5300 -80 170 286 154 94 -24 134 167 118 -69 -101 8 106 -30 -201 31 -121 -86 -69 -91 39 80 57 91 166
5324 166 -381 11 -79 -255 -13 40 -63 -67 -72 -120 -34 -173 36 -82 50 -143 206 3 -19 -423 -98 -27 -128
5347 -128 34 -109 50 -247 -159 97 -248 16 80 -140 -133 -32 18 -61 73 -139 197 86 -167 -60 -73 -227
5369 -227 -133 91 13 -113 33 165 -89 203 -52 243 190 8 -36 -85 171 40 -194 -91 -52 -68 161 27
5391 27 -117 41 62 -140 44 224 62 168 71 13 68 -25 76 -255 -137 9 -153 -47 155 151 133 199 247 122
5415 122 -66 315 -181 31 128 -220 -212 7 -203 -49 63 -121 -22 120 -6 73 142 169 56 -93 21 -254
5437 -254 -80 -75 19 81 -308 -181 73 -5 -66 189 10 7 120 92 -72 67 235 -12 -166 183 -57 75 -95
5460 -95 -60 -101 72 190 -117 -52 -42 139 -161 -170 141 233 -113 -16 -23 -133 -9 94 11 -210 78 145 -64 -171
5484 -171 -69 -11 165 -54 171 9 319 28 149 106 -101 -4 -110 55 -10 162 295 99 95 109 145 153 200 -87
5508 -87 -48 0 -16 -80 28 17 -214 -186 116 13 -71 183 -120 137 -105 35 -106 -116 97 30 278 -243 1
5531 1 9 -64 -74 -112 2 86 62 177 69 240 -13 -56 36 -117 11 -138 -90 26 -44 -28 -148 21 -33 -5 -105
5556 -105 7 -9 161 46 102 -95 -180 33 -66 102 -107 37 -330 -97 92 -45 -10 67 -118 153 145 62 -49
5579 -49 -148 -76 45 72 -202 -132 -217 -76 -139 -56 -183 -9 3 219 -65 71 -33 42 -213 39 32 -36 -60 104 3
5604 3 36 29 8 -106 -46 31 -97 48 188 4 -82 47 9 69 77 -13 -153 -101 -245 -111 -202 -66 -161 14 270 -43
5630 -43 -111 106 135 -50 120 26 14 53 237 -138 44 -63 110 -152 -291 2 45 -66 168 -111 69 204
5652 204 -4 46 -17 216 101 130 -346 8 -275 -137 -13 -273 84 127 20 154 243 20 -13 226 112 8
5674 8 8 -34 -166 55 52 -84 138 -131 51 -89 -36 112 -43 74 135 133 -193 9 167 14 -71 69 -54 43
5698 43 22 114 -134 -260 -186 190 137 305 -65 151 -4 -53 33 -39 -105 -253 -170 180 -11 31 -9 131 -51 -84
5722 -84 157 -13 109 141 34 47 -105 168 -166 -203 -32 -23 -127 -154 132 142 0 -95 156 -8 101 89 42 -79
5746 -79 266 4 -169 74 5 22 154 -144 -251 -31 57 -166 -60 124 227 19 -8 125 151 -152 -211 104
5768 104 -33 -50 -43 -173 -116 192 110 -243 141 307 92 1 79 100 -136 18 7 28 192 127 -183 18 186 -64
5792 -64 54 145 -31 -286 274 38 -15 113 -185 -77 -239 -75 53 -189 65 -21 -136 -159 -56 98 -16 -122
5814 -122 174 66 247 -2 -200 223 102 356 -132 179 176 -34 -54 -66 -1 137 11 160 -70 221 55 156
5836 156 140 263 14 -175 328 -10 -56 -121 -41 224 -69 136 62 -84 85 221 274 -40 61 -144 -41 32
5858 32 -42 -134 -3 -32 -124 -5 273 -233 -158 -59 27 -4 125 230 173 25 -37 34 -70 176 -72 -55 160 46
5882 46 108 -2 63 184 100 114 135 19 -10 130 145 81 -166 229 223 -110 -18 -82 -59 -170 -92 -87 -56 272 -114 124
5908 124 50 56 258 0 -213 -82 -336 -49 -126 -86 -316 -161 -54 126 -80 -97 -119 22 43 -106 217 51 -179
5931 -179 -34 -89 -50 -202 40 -17 -60 -116 -115 63 122 -60 -91 -250 -1 -56 -117 255 -57 51 -26 -2 -220 4
5955 4 -18 -129 -3 141 55 93 -268 -74 103 68 125 22 129 18 29 -18 -108 116 36 -44 106 -10 -47 28 -1
5980 -1 -60 109 22 237 -134 92 17 86 -75 28 -136 -38 21 -146 41 48 -160 -119 41 129 -102 61 -30 -196
6004 -196 -294 -105 -221 -99 -254 -116 51 -111 11 101 -35 -24 15 -38 24 124 40 -23 178 192 -90 -55 128
6027 128 43 5 189 -82 -65 339 25 -185 138 -14 -67 93 266 16 -103 -123 -67 94 -48 135 147 -1
6049 -1 -121 15 -222 -40 170 -134 -19 185 33 -11 30 -2 -201 103 172 -150 -29 55 -61 161 47 38 -148
6072 -148 126 78 35 -18 -175 181 31 244 112 -187 16 -110 -122 -88 186 121 -24 -53 -61 -77 -56 207 210 -163
6096 -163 125 -67 -89 168 -158 -59 -226 10 13 132 90 169 137 132 116 -84 112 75 300 125 -54 -130 -98 -8 -162
6121 -162 76 -16 140 65 -94 35 -63 -113 156 -85 33 -227 114 -19 -15 207 -64 -125 -73 106 -98 -32 -29 149
6145 149 -95 -26 -22 93 105 122 -244 -125 39 91 -64 -81 -220 -4 -193 -35 64 107 -50 176 4 39 40 -156
6169 -156 -48 86 -16 35 -20 -45 208 -22 48 183 123 314 133 -39 -150 -9 153 159 -244 219 -35 50 -70
6192 -70 -69 57 2 -166 -199 -55 156 -24 -42 -46 125 -37 165 168 -65 73 49 -89 -189 51 7 -179 -177 64 -83
6217 -83 -7 77 -116 -63 109 -48 176 86 -146 114 -213 -84 -28 -15 52 -104 -140 140 58 102 -60 47 105 -84
6241 -84 77 -7 184 27 80 -150 -38 -158 10 -94 229 109 31 -165 239 48 199 189 133 159 277 257 120
6264 120 -13 282 -28 7 105 -49 -160 -16 111 79 125 -31 -125 -239 -183 201 33 47 33 168 -199 86 -17
6287 -17 39 -77 98 259 -27 -161 -238 126 170 232 170 143 -155 17 -71 -51 229 -152 -144 -127 118 -219 -37 4
6311 4 164 100 -110 12 -101 21 140 -137 216 -197 -144 4 -163 -80 28 37 69 260 -35 30 51 53 -8 -52 41
6336 41 -138 -175 133 -172 -110 -62 -80 84 -225 -198 197 24 -190 -233 51 40 78 -92 52 353 45 -204 -55
6359 -55 -14 -32 64 -36 -80 59 186 95 123 206 201 31 28 -55 16 -34 -107 280 -184 95 82 262 112 -114 175 -209
6385 -209 -136 -74 89 25 236 212 113 -36 -37 -483 -171 -121 -138 158 -19 14 -51 109 -7 -26 63 -1 -163 36 -2
6410 -2 59 -7 -221 -15 112 -50 26 4 -117 10 67 10 -104 219 127 -17 -266 199 165 31 -96 -102 13 111
6434 111 -276 -7 45 -6 -166 -237 9 -79 225 178 194 167 82 -257 -88 -90 -138 2 36 -11 -306 57 -28 -348 -410
6459 -410 -100 -46 26 5 -11 -92 24 64 -158 102 -90 -5 83 63 78 -14 -193 33 34 -122 -136 255 -40 -5 100
6484 100 -8 -131 89 -30 121 -315 -236 4 266 -38 -67 216 -42 -78 -73 -240 135 -165 -15 37 -161 270
6506 270 -149 189 -15 54 -69 -58 -138 92 163 50 83 160 78 -261 54 47 12 -155 -255 -46 -22 56 -36 -73 -36
6531 -36 144 8 -16 -18 -74 285 161 84 -224 -84 -35 -4 -14 -273 142 182 252 -99 111 134 -108 -299 41 175
6555 175 80 57 38 -102 -138 -217 66 -105 -29 175 -165 73 199 -57 134 42 56 -162 86 15 4 40 -227 165
6579 165 -45 188 317 -37 46 168 130 -40 52 111 61 -30 -39 -105 -238 -258 62 -91 -61 -36 97 -139 113 10
6603 10 -117 -195 182 6 70 55 176 114 34 107 -24 -174 -123 21 -191 -332 29 -1 -107 -40 168 258 -22 -22
6627 -22 50 213 -5 -37 -54 49 -114 14 -153 -61 -102 211 56 48 -78 -179 -213 104 11 42 1 3 -11 7 -235
6652 -235 38 101 -199 -9 -38 120 -33 179 -174 -59 10 283 77 170 59 72 152 -74 19 -200 -15 344
6674 344 -118 -150 -104 12 -209 67 -141 -90 -50 -41 213 226 163 79 35 101 63 207 125 58 -68 4 -96 57 -157
6699 -157 -1 135 56 32 -187 272 78 72 45 18 226 -173 -298 -26 40 -46 -119 -19 1 158 35 -21 -53 155
6723 155 -124 -28 -46 -122 -58 -215 31 -76 -73 23 -60 -245 -2 -30 -34 125 -72 -32 -177 54 94 56 -108 52 117
6748 117 5 69 -97 -45 -8 -43 159 -92 43 93 -43 66 -124 96 -162 -103 -96 -158 128 -91 -180 -90 110 8
6772 8 71 72 80 59 195 325 -163 186 249 -236 -5 -96 38 -136 129 214 69 -207 -29 138 96 -171 -12 -65
6796 -65 30 78 101 -49 0 -47 78 176 -52 -60 -180 45 -51 62 -47 -28 72 102 200 -66 193 228 11 -312 -158
6821 -158 -109 149 -13 -51 -41 -123 -36 -1 104 52 -67 -156 148 67 42 21 212 4 -160 196 111 -148 -57 105
6845 105 192 124 67 175 -115 61 71 -271 -49 50 -188 -28 21 -163 -20 13 -229 139 72 106 216 -19 49
6868 49 26 -54 85 128 -107 65 41 130 -160 173 -111 -161 -253 189 26 -140 -28 94 -87 64 -114 -80 -303
6891 -303 -40 -233 -59 -57 70 20 -89 -169 43 -61 40 47 242 191 20 14 -122 121 -158 232 -69 -78 -152 -3
6915 -3 -116 -6 151 63 -21 -52 -119 135 58 -177 -130 -75 -87 15 251 -167 119 -101 183 183 53 45 -75 -166 -155
6940 -155 3 37 -46 22 100 12 188 -63 -6 -169 -100 108 14 -142 -212 -251 126 -108 -35 233 -91 269 126 140
6964 140 37 -116 39 25 -111 -26 -98 -260 -77 -18 -82 153 88 80 -134 -90 -139 -153 -175 -64 -140 118 -144 111
6988 111 -41 -5 246 -61 -131 270 39 150 56 -80 -100 130 -8 -232 -40 -36 -173 -37 -24 42 -140 -78 -164
7011 -164 71 -39 35 -184 -102 64 52 -64 -296 12 -177 43 -89 -147 87 226 -119 110 -109 35 -377
7032 -377 190 304 -74 40 121 191 79 -79 122 160 104 66 -22 198 -87 91 -64 -198 -51 102 21 281
7054 281 -243 -119 -236 51 111 -12 -82 -113 341 -40 -3 -156 -18 158 176 241 -76 183 -299 -44 -15 -238
7076 -238 63 -65 -222 5 -213 -272 -33 -245 70 172 76 27 297 -120 8 -31 -42 -107 41 446 -66 77
7098 77 160 57 151 -192 212 79 159 82 147 -180 136 -250 -87 -114 65 -80 23 -81 -98 161 -55 135 -8
7121 -8 185 -192 83 25 -49 -42 -214 -222 -97 -113 -115 -152 171 -187 88 193 133 75 -301 199 214 74 5 73 -3 -65
7147 -65 -68 -165 -138 222 -37 -124 173 -204 53 3 63 -148 -49 127 -44 221 -14 -206 67 121 -174 3 7 -54
7171 -54 -75 75 -184 117 -64 90 -26 153 239 229 222 -87 -170 32 -123 -38 43 -146 -59 256 28 104 -35 282
7195 282 97 80 71 -236 61 29 -2 -56 -14 20 -101 -165 50 -39 2 84 -75 146 95 48 133 -33 27 106 215 11
7221 11 -107 -77 -227 17 -85 -66 -93 235 2 -45 -120 81 56 45 35 -76 -143 124 -328 -163 43 -207 86
7244 86 -313 -47 -111 58 100 28 -177 41 52 -9 -95 -105 -195 46 -110 46 -32 -49 30 -158 -34 -4 96 -101
7268 -101 -98 38 -38 93 207 -41 -34 -106 -81 -32 12 63 -142 -126 254 -141 -36 -114 -144 30 305 59 -44 72
7292 72 212 -125 13 114 5 130 262 -12 -283 40 -79 -13 170 70 -11 35 156 212 -171 -77 258 -83
7314 -83 -119 -136 -30 51 -42 43 -1 133 43 309 180 131 -222 151 124 80 24 55 106 29 -59 39 -81 458 48 -77
7340 -77 14 -3 72 78 187 -22 351 -231 29 -69 101 74 -29 -51 -104 147 124 -4 24 287 269 -191 -1 -48 -303
7365 -303 178 20 20 171 -125 -43 -98 -17 23 38 21 201 -135 -57 -4 29 242 -49 -57 -72 -86 15 147 -208 44
7390 44 140 -34 142 -4 185 75 -200 36 -60 173 144 131 216 -92 -248 49 19 -21 5 51 -49 67 207
7413 207 -28 100 23 30 95 -137 25 24 249 -213 42 172 -131 -57 127 14 -41 165 108 -188 307 191 -187
7436 -187 26 152 5 -73 55 32 61 -173 -216 -184 105 -10 -77 20 -13 141 80 151 123 47 -108 -110 22 126 -184
7461 -184 -221 -60 15 -162 -27 -13 77 -45 185 106 -140 205 -131 58 -43 -46 5 -49 178 -106 139 -40 -273
7484 -273 -75 -108 207 -7 2 130 188 -71 -9 58 107 153 -22 -54 -246 -174 217 77 -74 60 -81 142 -91
7507 -91 -3 -133 -186 -96 161 228 -221 -55 17 259 -179 24 260 138 10 -152 27 66 120 41 -69 116 -14
7530 -14 77 49 228 -25 51 -67 14 -14 -151 171 35 54 182 8 -13 290 113 -280 86 215 -17 -104 24
7553 24 -196 -86 -134 -177 -99 53 51 226 -187 -78 23 -160 -163 159 142 17 -119 -76 78 -69 -76 63 47 217
7577 217 -108 -46 282 -83 98 14 117 126 139 93 -3 196 -137 -183 78 90 -86 -110 92 -88 -72 6 34 -13 186
7602 186 -19 -45 17 37 -70 -33 -142 -225 -14 16 -13 19 114 250 -93 -49 -49 -63 127 -77 44 -7 -115 98 78
7627 78 -53 -104 220 -78 -223 -69 -50 100 -84 65 101 -26 136 -84 186 23 -61 8 15 -56 -405 -56 12
7650 12 -38 -43 -133 104 129 42 44 36 40 23 -37 148 -193 -206 82 -73 16 -122 296 226 -147 112 -5 225 -18 12
7676 12 296 -193 175 -32 220 75 -127 61 147 -34 189 10 -98 126 171 -16 102 272 -3 -4 64 -64
7698 -64 -207 -268 100 -271 -245 1 -175 18 -20 -31 -191 145 150 100 -62 -153 -122 -99 97 113 105 -161 -70 125 -171
7723 -171 157 25 -63 -33 204 -104 35 71 -116 142 -208 -49 -83 20 -36 -77 -285 113 115 -242 51 162 -93
7746 -93 90 47 -22 65 -36 221 18 26 -67 106 -140 67 -112 -37 -151 -55 -198 -52 195 312 79 -298 -157
7769 -157 -10 -62 57 -140 -23 287 -185 -4 35 -192 -10 -137 217 -139 89 95 30 -135 -68 245 0 196
7791 196 -164 -281 100 -145 -16 22 139 97 101 216 -90 77 105 222 -197 -176 92 -199 131 -130 -161 -37
7813 -37 -70 -33 -153 41 -165 -51 76 -32 27 -24 229 188 137 -116 -242 244 -8 131 -14 149 -87 92
7835 92 -45 -153 101 75 159 -197 -23 27 50 -47 40 31 263 -34 -25 -63 78 -79 132 71 68 -77 30 37 90 -113
7861 -113 81 -51 25 -78 -72 76 -61 2 -140 -239 375 230 -18 159 50 -98 79 149 -170 -187 -82 -49 -28
7884 -28 18 123 95 109 -166 85 173 4 -95 23 33 29 148 -114 228 -66 47 152 -162 -152 9 91 -49 72
7908 72 68 -122 -183 132 263 11 177 -68 -19 25 -60 111 -160 -28 3 -114 -13 81 97 102 -95 192 88 -48
7932 -48 76 257 -77 134 190 -67 38 -185 110 -165 33 23 -84 -42 37 138 34 -89 -98 3 -166 -102 -52
7955 -52 41 139 -156 20 204 -71 -169 288 -2 166 108 -56 65 43 47 66 -30 -105 79 55 88 -44 -122 110 85
7980 85 -81 -75 41 -157 44 -197 -157 33 191 -58 -152 -261 -25 -71 -55 -220 -27 -19 -241 143 15 31 -154
8003 -154 -33 -170 -100 21 19 -202 2 201 -136 96 -70 -240 227 312 -69 71 173 3 -16 -120 58 -49
8025 -49 2 -79 -198 -219 -381 -39 236 191 -153 -66 57 25 186 4 -161 211 33 -73 -41 -62 5 134 56 -168
8049 -168 -116 -82 -158 406 103 122 -60 -192 -22 -43 -232 268 62 -69 -296 -69 192 -121 113 76 -73 -59
8071 -59 -5 -117 -25 -37 128 139 268 100 140 -257 99 -146 140 -14 -115 -28 -10 -99 -271 -220 32 -12 148 -1
8095 -1 94 127 -91 110 -15 81 17 2 68 162 -165 5 -34 -101 47 129 160 65 14 -210 129 -30 27 150 194 -8
8121 -8 75 122 -35 -106 -153 -19 -72 48 -264 -140 -119 -60 -125 86 -15 29 -51 30 -78 -214 -67 -93 104 69 -149
8146 -149 -21 21 -113 43 164 40 122 -74 -141 57 -223 41 -17 -78 -135 101 75 -94 -91 -110 -11 -38 -156 16
8170 16 -15 -80 37 -50 14 -143 -186 207 32 -182 28 160 78 -323 -408 113 125 96 -284 103 62 173 115 -46
8194 -46 -86 -115 87 -35 54 -171 -75 45 41 -10 -132 -24 254 -21 71 125 81 211 44 -143 305 11 49 -219
8218 -219 -146 -41 170 -78 -192 -80 46 -184 -45 64 145 -22 -74 -6 -109 -177 -104 -173 11 56 38 132 -273
8241 -273 -34 -58 78 183 56 56 56 -12 -74 -105 204 90 -134 -16 41 -246 64 161 -39 -128 -39 197 47 -108
8265 -108 -47 54 82 -98 79 -178 136 11 -222 82 -155 -365 20 173 142 75 239 118 -76 23 43 150
8287 150 -73 -188 -16 -121 39 21 -72 -33 -86 99 -90 -57 -233 63 -32 78 10 -21 -100 -23 -203 -14 -3 42
8311 42 -20 31 -107 -44 -217 -226 106 -86 316 172 -184 3 -23 -116 -69 -60 17 275 -96 60 -97 -24 73 5 -159
8336 -159 -13 27 34 89 -61 -133 59 -154 110 -70 46 199 -224 -22 59 -138 -228 120 48 64 -66 103 88
8359 88 -157 -113 -235 65 -161 27 141 -130 150 -70 11 57 135 -174 -11 75 -20 -13 51 62 -106 -102 71 -56
8383 -56 64 82 -28 -80 2 23 24 5 200 104 -50 -7 140 -54 189 -70 -99 -85 -9 15 -127 28 -128 -121 113
8408 113 34 6 -25 117 42 215 -2 -254 291 40 161 49 -62 219 -152 56 64 -206 180 -11 113 -125
8430 -125 -23 -57 18 27 139 -149 74 110 -170 38 -117 96 73 -110 -99 9 384 210 63 -145 180 3
8452 3 114 -166 -110 99 143 -48 -11 122 -103 -140 56 -121 167 -56 150 -139 -155 -110 -75 -112 56 13 -49 -60
8476 -60 -256 16 -108 -65 -105 -33 -189 313 102 -77 -346 -72 -88 -361 -42 -79 149 -66 -18 160 62 126 101
8499 101 39 50 340 121 137 -196 -60 44 -274 163 17 -13 40 42 68 22 -146 -145 41 87 -123 -16 -123 125
8523 125 79 -25 -131 -194 77 206 -83 -44 112 98 175 -56 57 127 -30 -121 96 17 52 -119 -109 57 199
8546 199 70 148 131 197 -186 195 -39 105 -22 199 21 -180 13 182 -126 198 106 -131 -101 104 -42 -46
8568 -46 44 58 -37 -88 79 70 255 69 142 -8 182 152 -191 -63 -64 194 -129 73 -120 -97 100 -14 3 20 -135
8593 -135 151 311 -146 29 62 133 32 32 -237 25 -139 -332 -169 60 23 1 210 -124 6 -12 28 167 166
8616 166 -165 34 107 182 87 -366 138 60 -50 112 -234 53 -146 10 52 162 -182 38 -9 -109 -123 -216 69
8639 69 -60 227 -131 32 -135 -97 -5 57 186 49 37 20 -336 198 -125 22 18 -14 63 -201 81 -127 4
8662 4 -12 104 8 214 -246 139 39 45 148 7 103 13 49 -89 -137 -154 103 -51 112 -36 133 -67 -192 160
8686 160 202 252 19 -27 -35 -145 -25 -131 -35 -6 -73 92 118 -21 189 33 -49 68 78 126 122 86 29 9 -9 -206
8712 -206 -90 -78 -33 114 -150 43 32 -67 297 -47 -153 -202 132 229 -227 142 11 -140 -159 26 20 92 62 -113
8736 -113 24 6 14 -167 379 390 168 141 26 219 -6 -11 -67 25 -5 100 7 -136 116 -138 -106 376 1 -12
8760 -12 -191 23 -43 131 -14 -312 -59 -156 97 96 66 -15 124 20 52 -22 198 226 117 25 -130 130 -55 -170
8784 -170 98 221 -232 -284 -109 125 -100 -41 -38 -148 6 -27 -158 65 378 137 -110 -281 -208 -41 162 -386
8806 -386 241 196 10 -154 140 111 -113 92 -32 145 -136 55 -117 -128 -2 266 63 -79 -40 -154 -131 -60
8828 -60 68 11 51 83 93 25 61 14 -56 19 123 -115 103 6 -276 -160 80 -17 285 168 -17 61 82 140 47
8853 47 -127 19 54 -6 93 -12 29 139 -68 65 34 -76 337 -95 -7 54 -58 241 58 110 -48 -33 40 -80
8877 -80 -64 -45 -167 63 -114 217 76 12 326 218 -148 110 -64 -237 151 -76 -115 -47 120 92 -64 -189
8899 -189 -54 73 13 -81 170 -53 70 87 -156 17 -122 -142 -19 -133 0 7 95 -6 231 -55 16 -9 -143
8922 -143 187 113 -85 -55 132 -32 25 197 117 -49 -143 133 -41 36 -54 114 47 -123 83 197 189 72 268
8945 268 141 206 32 -103 270 9 -140 -120 -150 -130 -81 146 45 5 59 374 -118 -83 -139 100 -56 72 -84
8968 -84 -100 190 -210 -22 -106 -23 -17 -6 -118 -84 230 88 199 215 -35 118 -72 116 131 -54 209 -153 -26
8991 -26 158 -57 -50 209 -138 39 19 27 33 135 35 -22 35 137 -268 173 184 -11 -191 -107 -46 -66 19 47 -63
9016 -63 39 25 82 125 -35 93 -13 -45 158 90 220 186 30 90 -72 -14 138 -31 54 40 160 380 108 -12
9040 -12 23 -9 3 130 44 -156 246 116 -81 263 143 -185 26 -38 -122 -277 -57 49 -103 46 5 -73 31
9063 31 -117 -89 -159 -262 -62 -5 298 -244 27 -120 128 10 21 140 -157 210 106 -37 42 -166 39 66
9085 66 67 122 158 -17 -12 51 1 136 -86 32 -374 -125 -104 3 -116 -7 -108 -126 -4 32 -162 65 -97 -6
9109 -6 51 -57 145 25 -179 28 -103 -199 -60 47 -137 -129 81 -200 46 -64 15 37 119 118 -68 -95 -29 30 144
9134 144 209 -32 -15 9 91 -125 -160 -70 30 -270 -80 -88 131 -171 133 -51 -229 63 -132 -193 -9 -90 51
9157 51 -220 -146 -62 88 22 129 -69 157 -90 82 -34 -299 -260 -29 106 -8 50 -150 -46 -144 -398 57
9179 57 -75 57 -77 107 -200 69 -129 -51 163 22 -51 26 129 11 102 27 -3 12 110 45 122 -180 38 432
9203 432 -50 -263 -27 62 103 -48 141 -149 23 -122 -108 -32 8 71 -10 -8 320 -37 -117 -96 164 -4 100 82
9227 82 48 -170 -204 -54 22 162 -141 178 -12 123 320 -204 146 -35 87 -134 -84 46 33 -143 186 -174
9249 -174 23 65 -81 288 -18 19 253 127 80 -63 82 -177 -314 209 -44 21 -97 98 219 252 -142 -125
9271 -125 98 -49 191 -116 255 -23 -87 -13 -101 380 65 139 184 -181 99 -101 100 -82 57 538 48 33
9293 33 132 -12 -25 50 54 -50 -191 178 -40 -34 47 -298 46 -223 201 15 114 -85 118 -8 63 -185 42 -152
9317 -152 194 -72 -112 133 27 -130 119 126 33 -39 322 133 117 100 14 -65 39 -255 48 -147 -297 -130 -100
9340 -100 87 131 214 103 72 -44 4 217 -171 -223 16 -5 192 149 -103 -161 118 108 77 112 43 81 -43 51 168
9365 168 156 -58 33 -159 205 -13 -245 -62 44 -5 -126 33 -311 -167 15 -81 50 127 20 174 -174 52
9387 52 -10 -92 89 248 -64 -208 13 -131 9 -126 -87 -9 -80 12 -47 -28 239 -89 14 -82 -126 31 66 -9
9411 -9 -294 122 21 -8 -71 40 -150 210 -33 176 -45 -285 -155 7 111 224 -219 43 -21 12 61 -7 -49
9434 -49 326 1 -98 78 11 -30 -322 -225 46 -74 -65 70 159 -67 -67 -83 -131 -10 -41 170 -61 -229 -128 -444
9458 -444 54 116 107 46 -83 -211 59 17 -9 -46 136 -147 -119 -126 -68 103 40 -1 192 -198 182 -192 -167 -35 -70
9483 -70 87 232 148 -54 -128 -287 150 -314 284 143 -85 -67 -69 235 0 -236 -37 -79 -173 123 -39 229 -121
9506 -121 -57 171 15 80 -112 176 -6 -43 114 -42 29 -49 -187 125 -62 12 -112 -109 -150 346 144 -65 1
9529 1 -178 -1 -125 -119 69 70 10 -119 -143 -82 196 -59 -111 -173 -193 -107 173 61 -41 139 -112 269 -82 -52 -37
9554 -37 -249 139 24 -207 207 70 -31 125 33 50 -67 -24 149 165 -6 82 149 16 133 167 -316 -55 200
9577 200 -71 39 -164 277 77 94 237 159 -88 -77 139 -176 -367 -56 -207 -28 -89 -178 212 166 94 -119
9599 -119 7 209 4 311 98 -34 -75 -71 -21 -37 -48 -40 -208 -21 137 -5 47 193 167 310 -5 -34 32 31 95
9624 95 -110 76 -72 326 -17 12 95 -204 -93 168 -20 181 -33 132 87 -3 108 108 -64 -12 29 29 111 -35
9648 -35 138 -14 51 62 -79 77 -150 -135 97 42 116 129 191 178 -78 68 52 151 53 -131 132 -101 84 352
9672 352 -64 -24 3 170 -180 -106 -122 48 0 53 -347 80 -243 -17 -35 -225 -80 -61 128 106 23 -89 -50 -89
9696 -89 68 76 23 -34 -6 91 131 -109 -296 16 98 115 -77 -103 73 -95 14 32 -102 215 -33 4 160 -93
9720 -93 327 295 85 -73 -62 168 -62 290 62 -119 110 148 42 -245 129 -46 -220 24 -77 127 28 -55
9742 -55 47 178 255 18 -37 174 -35 49 -71 219 74 37 32 -68 36 13 -79 -66 119 -11 15 62 111 276
9766 276 -148 -8 -21 90 215 226 -79 -290 -282 -210 273 -114 115 -24 3 -69 183 -111 166 148 133 -144 140
9789 140 -174 56 69 -225 37 39 -76 -91 -43 229 18 19 16 -6 202 31 62 -47 9 89 178 89 10 319 -125
9814 -125 -160 -2 -73 -46 70 -26 -88 35 -193 128 -217 -103 -175 127 101 67 -154 -72 -261 -100 41 18 115 186
9838 186 67 -73 -11 -74 99 125 1 -333 -86 15 -179 129 -164 -344 -91 127 4 -194 -14 -175 3
9859 3 -92 179 1 184 -113 -116 36 -82 -267 -141 -117 -15 -121 161 59 -293 -61 123 -58 -190 -189 -124 38
9882 38 -50 12 -62 -101 -189 -84 38 -20 -109 -3 -62 32 287 21 85 -79 -86 -29 -84 -82 -36 40 33 139 -132 -50 -22 254
9910 254 -158 -273 70 -7 -24 150 -44 -155 -43 -54 -420 5 226 -106 -60 20 -43 -31 -106 39 -44 -17 -8 -16 -214
9935 -214 145 -154 -101 -182 -83 -111 -104 65 104 117 -31 -2 261 -126 206 -63 189 262 101 69 117 -40 -126 -110 21
9960 21 49 -254 -209 -117 21 -78 -210 74 149 124 -182 223 -198 -3 205 -11 49 -295 17 -96 -148 120 -76
9983 -76 36 -257 -194 177 -173 82 -134 82 221 -73 -232 147 158 -168 127 48 -28 -263 -24 31 165 -23
10005 -23 -202 -142 -23 60 -18 52 -135 -239 30 96 -82 -70 -262 -291 -164 60 -111 197 -82 -30 9 161 136
10028 136 1 -141 -74 -70 152 -154 -202 41 -162 0 43 -131 49 268 19 18 62 -78 -247 261 63 -136
10050 -136 -46 175 -1 -62 -55 76 -62 195 342 -11 -73 36 -141 -84 72 75 36 -2 -190 29 204 117 37 59
10074 59 -67 251 -29 -164 167 76 103 37 95 75 -235 -62 32 167 162 -124 91 142 107 -26 51 254 384 -136
10098 -136 70 121 53 -4 -165 -55 144 -65 82 -168 122 113 172 79 -90 -168 -190 55 233 216 -250 152 -205
10121 -205 -43 -345 -146 3 -26 144 -67 -17 155 175 54 154 -147 38 -53 218 -3 21 138 -6 -90 105
10143 105 -97 -130 19 -59 108 160 -54 298 -31 50 12 -109 92 228 194 -178 56 -83 -23 -104 -87 -66 -77
10166 -77 72 -198 2 -163 -68 34 100 -247 233 77 68 -126 52 92 -12 -59 -140 195 50 111 143 -86 172
10189 172 -58 144 -13 -65 127 21 15 166 -133 118 192 -19 -122 21 126 122 94 -187 17 94 11 -57 140
10212 140 129 -143 -87 -67 -281 119 32 -65 -12 -159 126 79 15 -41 72 -102 89 178 -110 -75 -161 -167 -7 -219
10236 -219 4 -55 -74 -19 64 3 -152 96 19 7 -25 -82 169 78 -125 -8 161 -91 161 102 -81 139 108 145
$$ [...]
16383B31
##END NTUPLES=NMR FID
##END=
