##TITLE=abcd
##JCAMPDX= 6.0         $$ Bruker NMR JCAMP-DX V2.0
##DATA TYPE= NMR FID
##DATA CLASS= NTUPLES
##ORIGIN= UXNMR, Bruker Analytische Messtechnik GmbH
##OWNER= root
$$ XWIN-NMR		Version 3.5
$$ Mon Jun 30 18:37:23 2025 Russian Standard Time (UT+4h)  servis@DPX200
##.OBSERVE FREQUENCY= 200.131235884673
##.OBSERVE NUCLEUS= ^1H
##.DELAY= (6, 6)
##.ACQUISITION MODE= SIMULTANEOUS
##.ACQUISITION SCHEME= undefined
##.AVERAGES= 32
##.DIGITISER RES= 18
##SPECTROMETER/DATA SYSTEM= spect
##.PULSE SEQUENCE= zg
##.SOLVENT NAME= CDCl3
##.SHIFT REFERENCE= (INTERNAL, CDCl3, 0, 16.5164)
##AUDIT TRAIL= $$ (NUMBER, WHEN, WHO, WHERE, WHAT)
$$ ##TITLE= Audit trail, XWIN-NMR		Version 3.5
$$ ##JCAMPDX= 5.01
$$ ##ORIGIN= Bruker BioSpin GmbH
$$ ##OWNER= servis
$$ F:\spectra/data/av/nmr/H1/1/audita.txt
$$ ##AUDIT TRAIL=  $$ (NUMBER, WHEN, WHO, WHERE, WHAT)
(   1,<2025-06-30 18:37:00.32 +0400>,<servis>,<DPX200>,
      <created by zg, POWCHK disabled, PULCHK disabled
       configuration hash MD5:
       00 E9 B6 7A A2 85 ED C7 34 08 36 98 17 FE 4E 26
       data hash MD5: 32K
       B9 BF 38 BC 6F 95 C6 EB EA F4 5C 65 50 10 AE 10>)
$$ ##END=
$$ 
$$ hash MD5
$$ 54 85 E6 7F EA EC 64 C1 52 E9 FE A7 9B B1 12 D3
##$RELAX= 
##$RELAX= 
##$RELAX= 
##$RELAX= 
##$RELAX= 
##$RELAX= 
##$RELAX= 
##$RELAX= 
$$ Bruker specific parameters
$$ --------------------------
##$DU= <F:\spectra>
##$EXPNO= 1
##$NAME= <H1>
##$PROCNO= 1
##$TYPE= <nmr>
##$USER= <av>
##$AMP= (0..31)
100 100 100 100 100 100 100 100 100 100 100 100 100 100 100 100 100 100 
100 100 100 100 100 100 100 100 100 100 100 100 100 100 
##$AQSEQ= 0
##$AQ_mod= 1
##$AUNM= <au_zg>
##$AUTOPOS= <>
##$BF1= 200.13
##$BF2= 200.13
##$BF3= 200.13
##$BF4= 200.13
##$BF5= 500.13
##$BF6= 500.13
##$BF7= 500.13
##$BF8= 500.13
##$BYTORDA= 1
##$CFDGTYP= 0
##$CFRGTYP= 5
##$CHEMSTR= <none>
##$CNST= (0..31)
1 1 145 1 1 1 1 1 1 1 1 1 1 1 1 1 1 1 1 1 1 1 1 1 1 1 1 1 1 1 1 1 
##$CPDPRG= <>
##$CPDPRG1= <>
##$CPDPRG2= <>
##$CPDPRG3= <>
##$CPDPRG4= <mlev>
##$CPDPRG5= <mlev>
##$CPDPRG6= <mlev>
##$CPDPRG7= <mlev>
##$CPDPRG8= <mlev>
##$CPDPRGB= <>
##$CPDPRGT= <>
##$D= (0..31)
0 2 0 0 0 0 0 0 0 0.06 0 0 0 0 0 0 0.0002 0 0 0 0 0 0 0 0 0 0 0 0 0 0 
0 
##$DATE= 1751294219
##$DBL= (0..7)
120 120 120 120 120 120 120 120 
##$DBP= (0..7)
150 150 150 150 150 150 150 150 
##$DBP07= 0
##$DBPNAM0= <>
##$DBPNAM1= <>
##$DBPNAM2= <>
##$DBPNAM3= <>
##$DBPNAM4= <>
##$DBPNAM5= <>
##$DBPNAM6= <>
##$DBPNAM7= <>
##$DBPOAL= (0..7)
0.5 0.5 0.5 0.5 0.5 0.5 0.5 0.5 
##$DBPOFFS= (0..7)
0 0 0 0 0 0 0 0 
##$DE= 6
##$DECBNUC= <off>
##$DECIM= 32
##$DECNUC= <off>
##$DECSTAT= 4
##$DIGMOD= 1
##$DIGTYP= 9
##$DL= (0..7)
0 120 120 120 120 120 120 120 
##$DP= (0..7)
150 150 150 150 150 150 150 150 
##$DP07= 0
##$DPNAME0= <>
##$DPNAME1= <>
##$DPNAME2= <>
##$DPNAME3= <>
##$DPNAME4= <>
##$DPNAME5= <>
##$DPNAME6= <>
##$DPNAME7= <>
##$DPOAL= (0..7)
0.5 0.5 0.5 0.5 0.5 0.5 0.5 0.5 
##$DPOFFS= (0..7)
0 0 0 0 0 0 0 0 
##$DQDMODE= 0
##$DR= 18
##$DS= 0
##$DSLIST= <SSSSSSSSSSSSSSS>
##$DSPFIRM= 0
$$ [...]
##$SUBNAM0= <"">
##$SUBNAM1= <"">
##$SUBNAM2= <"">
##$SUBNAM3= <"">
##$SUBNAM4= <"">
##$SUBNAM5= <"">
##$SUBNAM6= <"">
##$SUBNAM7= <"">
##$SUBNAM8= <"">
##$SUBNAM9= <"">
##$SW= 20.6817932712277
##$SWIBOX= (0..15)
0 0 3 0 0 0 0 0 0 0 0 0 0 0 0 0 
##$SW_h= 4139.07284768212
##$TD= 32768
##$TD0= 1
##$TE= 0
##$TE2= 300
##$TE3= 300
##$TEG= 300
##$TL= (0..7)
0 120 120 120 120 120 120 120 
##$TP= (0..7)
150 150 150 150 150 150 150 150 
##$TP07= 0
##$TPNAME0= <>
##$TPNAME1= <>
##$TPNAME2= <>
##$TPNAME3= <>
##$TPNAME4= <>
##$TPNAME5= <>
##$TPNAME6= <>
##$TPNAME7= <>
##$TPOAL= (0..7)
0.5 0.5 0.5 0.5 0.5 0.5 0.5 0.5 
##$TPOFFS= (0..7)
0 0 0 0 0 0 0 0 
##$TUNHIN= 0
##$TUNHOUT= 0
##$TUNXOUT= 0
##$USERA1= <user>
##$USERA2= <user>
##$USERA3= <user>
##$USERA4= <user>
##$USERA5= <user>
##$V9= 5
##$VALIST= <valist>
##$VCLIST= <CCCCCCCCCCCCCCC>
##$VD= 0
##$VDLIST= <DDDDDDDDDDDDDDD>
##$VPLIST= <PPPPPPPPPPPPPPP>
##$VTLIST= <TTTTTTTTTTTTTTT>
##$WBST= 1024
##$WBSW= 30
##$XGAIN= (0..3)
0 0 0 0 
##$XL= 0
##$YL= 0
##$YMAX_a= 20542
##$YMIN_a= -15356
##$ZGOPTNS= <>
##$ZL1= 120
##$ZL2= 120
##$ZL3= 120
##$ZL4= 120
##$ABSF1= 10
##$ABSF2= 0
##$ABSG= 5
##$ABSL= 3
##$ALPHA= 0
##$AQORDER= 0
##$ASSFAC= 0
##$ASSFACI= 0
##$ASSFACX= 0
##$ASSWID= 0
##$AUNMP= <proc_1d>
##$AZFE= 0.1
##$AZFW= 0.1
##$BCFW= 1
##$BC_mod= 2
##$BYTORDP= 0
##$COROFFS= 0
##$CY= 19
##$DATMOD= 1
##$DC= 2
##$DFILT= <>
##$DTYPP= 0
##$F1P= 11.0000007629395
##$F2P= -0.999999237060547
##$FCOR= 0.5
##$FTSIZE= 0
##$FT_mod= 4
##$GAMMA= 1
##$GB= 1
##$INTBC= 1
##$INTSCL= 1
##$ISEN= 128
##$LB= 0.05
##$LEV0= 0
##$LPBIN= 0
##$MAXI= 10000
##$MC2= 0
##$MEAN= 0
##$ME_mod= 0
##$MI= 0
##$NCOEF= 0
##$NC_proc= 0
##$NLEV= 6
##$NOISF1= 0
##$NOISF2= 0
##$NSP= 1
##$NTH_PI= 0
##$NZP= 0
##$OFFSET= 16.51637
##$PC= 1
##$PHC0= -271.4733
##$PHC1= 1.101538
##$PH_mod= 0
##$PKNL= yes
##$PPARMOD= 0
##$PSCAL= 4
##$PSIGN= 0
##$REVERSE= no
##$SF= 200.13
##$SI= 16384
##$SIGF1= 0
##$SIGF2= 0
##$SINO= 400
##$SIOLD= 16384
##$SREGLST= <1H.CDCl3>
##$SSB= 0
##$STSI= 0
##$STSR= 0
##$SW_p= 4139.07284768211
##$SYMM= 0
##$S_DEV= 0
##$TDeff= 0
##$TDoff= 0
##$TI= <>
##$TILT= no
##$TM1= 0
##$TM2= 0
##$TOPLEV= 0
##$USERP1= <user>
##$USERP2= <user>
##$USERP3= <user>
##$USERP4= <user>
##$USERP5= <user>
##$WDW= 1
##$XDIM= 8192
##$YMAX_p= 0
##$YMIN_p= 0
$$ End of Bruker specific parameters
$$ ---------------------------------
##NTUPLES= NMR FID
##VAR_NAME=  TIME,          FID/REAL,        FID/IMAG
##SYMBOL=    X,             R,               I
##VAR_TYPE=  INDEPENDENT,   DEPENDENT,       DEPENDENT
##VAR_FORM=  AFFN,          ASDF,            ASDF
##VAR_DIM=   16384,         16384,           16384
##UNITS=     SECONDS,       ARBITRARY UNITS, ARBITRARY UNITS
##FACTOR=    0.0002416,     1,               1
##FIRST=     0,             0,               0
##LAST=      3.9581328,     0,               0
##MIN=       0,             -15356,          0
##MAX=       3.9581328,     20542,           0
$$ Real data points
##PAGE= N=1
##DATA TABLE= (X++(R..R)), XYDATA
$$ plain form
0 0 0 0 0 0 0 0 0 0 0 0 0 0 0 0 0 0 0 0 0 0 0 0 0 0 0 0 0 0 0 0 0 0 0 0 0 0 0 0 0 0 0 0 0 0 0 0 0 0 -1 1 0 -2 2 -2 1 -2 4 -3 1 -1 1 1 -4 8
64 8 -13 30 -57 130 -382 3657 16379 1379 -15356 -6475 2919 20 -4870 -7551 -3465 9650 10040
81 10040 -5843 -5406 11964 11058 -4297 -4237 4344 2980 -1205 -4476 -8831 -3702 5587 -1705 -11843
96 -11843 -1575 9903 2353 -4418 1909 5900 5140 4910 -811 -4742 3480 6376 -6605 -10720 772
111 772 3269 -4978 -5519 -1460 640 4727 3870 -4055 -571 11549 6814 -6703 -2916 7114 2802
126 2802 -5348 -5583 -3279 343 2167 -5323 -9048 3352 9839 -1993 -6384 5427 9473 1276 -1899
141 -1899 77 1192 3459 147 -8531 -5547 4963 977 -9658 -4495 5285 2777 -1616 177 1564
156 1564 4230 6680 331 -4974 2500 6831 -3136 -7931 -544 1487 -2958 -3302 -2626 -2394 3002 4564
$$ packed form
0@%%%%%%%%%%%%%%%%%%%%%%%%%%%%%%%%%%%%%%%%%%%%%%%%jKjkMmLlOpMkK%nJ2
64Hk1M3q7J87n12M039J2722j5000j6735Q881R394k899m890k681M086J3115L90
81A0040j5883M37J7370r06j5355O0Q581j364m185l271m355N129R289p292j0138
96a1843J0268J1478p550o771O327L991p60k30n721l931Q222K896j2981m115J1492
111G72K497q247n41M059K100M087q57p925L484J2120m735j3517L787J0030m312
126B802q150k35K304L622J824p490l725J2400O487j1832m391J1811M046q197l175
141a899J976J115K267l312q678K984J0510l986j0635N163R780k508m393J793J387
156A564K666K450o349n305P474M331r967m795P387K031m445l44O76K32N396J562
$$ plain form
172 4564 -2840 -2333 7416 6557 -2275 -1703 3320 1906 -429 -2190 -5326 -2388 3510 -1769 -8678 -1291
188 -1291 6807 1021 -4124 1413 5075 3544 2117 -830 -1822 4109 4063 -5966 -6866 2600 2538 -6020
204 -6020 -5218 763 1596 1143 362 -1880 1941 7663 2457 -4696 900 6538 57 -5191 -1715 -129
220 -129 -1356 -1219 -3344 -4300 1897 4265 -2375 -2833 5041 5443 -267 -21 2077 862 1344 352 -4693
237 -4693 -3459 2772 -230 -6793 -2942 3268 953 -1641 155 1266 2822 4668 424 -3069 2531
252 2531 5487 -2463 -5869 280 1572 -2883 -3601 -2126 -1090 2116 1799 -3026 -751 6590 4049 -2977
268 -2977 -275 4686 1527 -1947 -1745 -1971 -828 963 -2969 -5746 486 4120 -1681 -3329 2776 4107
284 4107 986 1042 1203 102 2442 2026 -3722 -3481 2096 399 -5169 -2975 972 -19 -517 523 -684
$$ packed form
172D564p404N07R749q59q832N72N023j414k335j761l136K938N898n279o909P387
188a291Q098n786n145N537L662j531j427k947r92N931m6j0029r00R466o2q558
204f020Q02N981Q33m53p81k242L821N722n206p153N596N638o481n248L476J586
220a29j227J37k125r56O197K368o640m58P874M02n710K46K098j215M82r92n045
237d693J234O231l002o563L851O210k315k594J796J111J556J846m244l493N600
252B531K956p950l406O149J292m455p18J475J036L206l17m825K275P341k541p026
268b977K702M961l159l474K02k26J143J791l932k777O232L634n801j648O105J331
284D107l121N6J61j101K340m16n748K41N577j697n568K194L947r91m98J040j207
$$ plain form
301 -684 1203 5003 1722 -2657 1349 5116 -294 -3671 -561 96 -1516 -1332 -2694 -3486 1443 2849
317 2849 -2571 -2535 4345 4366 -910 -345 2487 1786 801 -237 -3043 -1456 2159 -1339 -6007 -1301 3197
334 3197 -720 -2841 891 2270 1703 2218 553 -770 2975 3552 -2620 -3541 1693 967 -3749 -2747
350 -2747 -425 -1137 62 696 -1635 -181 4662 2468 -1972 1139 4098 635 -1581 -260 -818 -1203
366 -1203 161 -2122 -4336 68 2591 -1913 -2766 2388 3302 450 763 1405 708 2388 1645 -2878 -2349
383 -2349 2345 73 -4917 -2609 1339 -287 -1727 -170 38 1301 3424 728 -1685 2478 4248
398 4248 -1015 -2954 850 922 -2135 -2092 -1460 -2030 330 923 -2526 -1166 3844 2594 -1448 762 3234
415 3234 1135 -62 284 -1224 -1165 984 -1394 -4405 -949 1849 -1539 -2328 914 1668 736 1715 1061
$$ packed form
301f84J887L800l281m379M006L767n410l377L110O57j612J84j362p92M929J406
317B849n420L6O880K1n276N65K832p01r85j038k806J587L615l498m668M706M498
334C197l917k121L732J379n67N15j665j323L745N77o172r21N234p26m716J002
350b747K322p12J199O34k331J454M843k194m440L111K959l463k216J321n58l85
366a203J364k283k214M404K523m504q53N154R14k852L13O42o97J680p43m523N29
383b349M694k272m990K308L948j626j440J557K08J263K123k696k413M163J770
398D248n263j939L804P2l057M3O32n70K360N93l449J360N010j250m042K210K472
415C234k099j197L46j508N9K149k378l011L456K798l388p89L242P54r32R79o54
$$ plain form
432 1061 -339 2455 2943 -1580 -2490 1608 748 -3273 -2423 -476 -1017 -518 -90 -1591 79 3691 1596
449 1596 -2009 1286 4207 693 -1734 240 317 -757 -507 -2170 -2992 283 1397 -2454 -2277 2550
465 2550 2494 -685 554 2359 1251 1260 1007 -1338 -1073 1681 -682 -4049 -1516 1129 -1366 -1943 264
482 264 417 344 2193 1051 -701 2159 3306 -711 -1845 1326 632 -2027 -1550 -1149 -1761 -254 353
499 353 -2171 -1200 2912 2019 -1242 705 3190 1222 -162 364 -631 -560 846 -1514 -3752 -508 1547
516 1547 -1875 -2538 873 1831 69 680 1090 631 2028 2040 -1299 -1193 1987 170 -3253 -1648 269
533 269 -1197 -1493 -164 -720 128 2250 957 -1036 1809 3328 66 -1061 1041 533 -1108 -765 -1206
550 -1206 -2400 -329 661 -2095 -1740 1917 1716 -703 720 2076 844 1105 1147 -859 -681 1483 -375
$$ packed form
432A061j400K794M88m523r10M098q60m021Q50J947n41M99M28j501J670L612k095
449A596l605L295K921l514k427J974P7j074K50j663q22L275J114l851J77M827
465B550n6l179J239J805j108Rk53k345K65K754k363l367K533K645k495n77K207
482B64J53p3J849j142j752K860J147m017j134L171o94k659M77M01o12J507O07
499C53k524R71M112q93l261J947K485j968j384N26r95P1J406k360k238L244K055
516A547l422o63L411R58j762O11M10m59J397J2l339J06L180j817l423J605J917
533B69j466k96J329n56Q48K122j293j993K845J519l262j127K102n08j641L43m41
550a206j194K071R90k756L55L657k01k419J423J356j232K61M2k006J78K164j858
$$ plain form
567 -375 -3411 -1145 941 -1360 -2087 -6 331 336 1481 555 -257 2124 2848 -791 -1306 1838 745 -2245
585 -2245 -1410 -467 -1276 -828 -314 -1712 -606 2114 1005 -1263 1123 3116 712 -277 986 424 -472
602 -472 223 -1085 -2533 -416 740 -2029 -2005 1065 944 -498 680 1468 462 1498 1732 -587 -661
619 -661 1617 164 -2494 -1263 450 -1231 -1597 -274 -723 -266 1614 588 -995 1549 2919 52
635 52 -907 1267 895 -976 -574 -854 -1594 -276 58 -2239 -1381 1813 969 -1182 604 2257 1007 421
653 421 1019 17 -191 993 -568 -2557 -607 701 -1803 -2099 391 381 -469 743 774 57 1520 1954
671 1954 -274 -474 1666 554 -1700 -777 -101 -1340 -1031 -70 -1240 -926 1369 678 -1039 898 2479
688 2479 537 -93 1079 595 -143 307 -706 -1952 -396 390 -1868 -1937 874 699 -706 459 1357
$$ packed form
567c75l036K266K086k301p27K081L37NJ145r26q12K381P24l639n15L144j093k990
585b245Q35R43q09M48N14j398J106K720j109k268K386J993k404r89J263n62q96
602d72O95j308j448K117J156k769K4L070j21j442J178P88j006J036K34k319p4
619f61K278j453k658J231J713j681l66J323m49M57J880j026j583K544J370k867
635E2r59K174l72j871M02k80p40J318L34k297Q58L194q44k151J786J653j250n86
653D21N98j002k08J184j561j989J950J308k504k96K490j0q50J212L1p17J463M34
671A954k228k00K140j112k254R23O76j239L09R61j170L14K295o91j717J937J581
688B479j942o30J172m84p38M50j013j246J556P86k258o9K811j75j405J165Q98
$$ plain form
705 1357 581 1123 1321 -164 -90 1569 23 -2169 -583 624 -1251 -1765 -140 -305 -421 776 385
722 385 -422 1334 2120 -32 -367 1651 839 -1077 -426 -165 -1360 -811 -106 -1562 -1107 981 327 -987
740 -987 637 1978 437 335 1184 270 -51 930 -231 -1892 -295 477 -1699 -1801 191 201 -703 383
758 383 629 54 1344 1715 -197 -229 1711 536 -1567 -479 139 -927 -1170 -412 -1085 -565 851 33
776 33 -995 1048 2279 106 -128 1437 982 -389 145 -293 -1109 -254 -18 -1783 -1332 735 144 -1100
794 -1100 423 1355 265 662 1333 150 245 1250 198 -1522 -138 476 -1318 -1479 -137 -528 -723
811 -723 370 297 -428 1072 1748 -34 -51 1562 815 -753 -183 -14 -945 -646 -248 -1504 -1063 792 -202
830 -202 -1293 420 1798 349 36 1226 654 202 852 -209 -1205 -22 360 -1572 -1496 319 -179 -1146
$$ packed form
705A357p76N42J98j485P4J659j546k192J586J207j875n14J625j65j16J197l91
722C85q07J756P86k152l35K018q12j916O51K61j195N49P05j456M55K088o54j314
740i87J624J341j541j02Q49r14l21R81j161j661J597P72k176j02J992J0r04J086
758C83K46n75J290L71j912l2J940j175k103J088O18j066k43P58o73N20J416q18
776C3j028K043J231k173k34J565m55j371N34m38q16Q55K36j765M51K067n91j244
794a100J523R32j090L97O71j183R5J005j052j720J384O14j794j61J342l91j95
811g23J093p3p25J500O76j782j7J613p47j568N70J69r31K99L98j256M41J855r94
830b02j091J713J378j449l13J190n72m52O50j061r96J183L82j932P6J815m98r67
$$ plain form
848 -1146 96 669 33 909 1272 -120 307 1632 334 -1184 -109 545 -1223 -1027 -264 -883 -840 419
866 419 -34 -754 880 1453 7 138 1680 644 -259 400 135 -844 -207 15 -1572 -1142 658 -144
884 -144 -1166 214 1020 162 581 1142 167 542 1391 164 -1059 176 610 -1326 -1429 -88 -464 -1011
902 -1011 55 129 -405 950 1245 -131 304 1839 623 -789 328 492 -949 -722 -126 -1167 -917
919 -917 438 -401 -1227 552 1219 -75 154 1402 713 76 828 292 -757 176 121 -1425 -1261 213
937 213 -261 -1058 -8 375 -232 675 1138 217 229 1532 449 -829 231 565 -1010 -1011 -119 -833 -856 214
957 214 -350 -910 755 1256 -149 37 1607 724 -474 526 392 -636 -267 34 -1210 -966 405 -548
975 -548 -1384 198 982 -286 229 1361 500 298 1157 411 -743 355 433 -1287 -1258 167 -557 -1098 -52
$$ packed form
848a146J242N73o36Q76L63j392M27J325j298j518J075O54j768J96P63o19M3J259
866D19m53p20J634N73j446J31J542j036r03O59k65r79O37K22j587M30J800q02
884a44j022J380Q06q58M19N61r75L75Q49j227j223J235M34j936j03J341l76n47
902a011J066P4n34J355K95j376M35J535j216j412J117J64j441K27N96j041K50
919i17J355q39q26J779O67j294K29J248o89o37P52n36j049R33n5j546J64J474
937B13m74p97J050L83o07R07M63r21J2J303j083j278J060L34j575jQ92p14k3J070
957B14n64n60J665N01j405J86J570q83j198J000j34j028L69L01j244K44J371r53
975e48q36J582P84j268N15J132q61k02Q59p46j154J098P8j720K9J425p24n41J046
$$ plain form
994 -52 -17 -560 474 1054 -107 155 1601 655 -521 339 617 -717 -619 -58 -1156 -1021 233 -400 -1252
1013 -1252 328 984 -234 -4 1262 741 132 750 364 -628 165 198 -1222 -1146 308 -440 -1307 -89
1031 -89 565 -248 239 923 125 395 1326 416 -560 537 655 -926 -966 115 -513 -992 -85 -259 -776 341
1051 341 723 -290 152 1405 715 -264 687 598 -577 -330 215 -1040 -962 208 -557 -1261 55 633 -342
1070 -342 185 958 412 147 1190 295 -492 498 469 -1049 -865 216 -520 -1161 -167 -2 -555 228 723
1089 723 -102 179 1461 594 -367 540 769 -464 -508 93 -798 -799 62 -459 -1094 349 694 -378 20 1255
1109 1255 647 -79 827 461 -226 247 201 -950 -800 169 -509 -1272 -5 352 -520 115 793 67 231
1128 231 1148 363 -367 716 637 -698 -677 216 -643 -1115 -55 -403 -723 306 729 -418 96 1428 463
$$ packed form
994e2L5n43J034N80j161K62J446r46j176Q60K78j334R8N61j098J35J254o33q52
1013a252J580O56j218K30J266n21o09O18l86r92P93L3j420P6J454p48q67J218
1031h9O54q13M87O84p98K70R31r10r76J097J18j581m0J081o28m79R07j74n17J117
1051C41L82j013M42J253o90r79R51q9j175K47N45j255P8J170p65p04J316N78r75
1070c42N27P73n46k65J043q95p87R90k9j518J84J081p36o41R94J65n53P83M95
1089G23q25K81J282q67r61R07K29j233m4O01q91jQ61n21o35J443L45j072L98J235
1109A255o08p26R06l66o87M73m6j151J50R69o78p63J267L57q72O35O78p26J64
1128B31R17p85p30J083p9j335K1Q93q59m72J060l48l20J029M23j147N14J332r65
$$ plain form
1147 463 -112 646 605 -477 -152 65 -854 -732 230 -688 -1215 150 410 -497 -109 970 378 219 820
1166 820 383 -172 428 471 -741 -594 316 -509 -1184 -143 -49 -808 57 652 -138 199 1210 493 -213 703
1186 703 707 -525 -239 256 -612 -823 -62 -392 -1024 153 448 -530 21 1086 596 72 812 757 -137 372
1206 372 384 -749 -634 299 -551 -1200 -67 130 -590 -93 571 99 251 1087 498 -148 634 680 -640 -409
1226 -409 340 -464 -938 -210 -271 -752 63 345 -391 192 1053 329 -192 870 617 -339 63 203 -625 -622 17
1247 17 -510 -1086 -72 195 -671 -86 865 182 67 932 643 -203 570 576 -681 -352 401 -522 -1082 -248
1267 -248 -45 -745 74 394 -178 142 1017 320 -231 804 689 -366 -176 302 -546 -634 74 -474 -889 64
1287 64 80 -782 13 888 255 -92 780 726 -67 349 454 -446 -442 215 -485 -869 -125 40 -723 -171 528 24
$$ packed form
1147D63n75P58m1j082L25K17r19J22R62r18n27J365K60r07L88J079n92j59O01
1166H20m37n55O00M3j212J47R10q25o75J041R4p59Q65N95p90L37J011p17p06R16
1186G03Mj232K86M95q68k11P61l30o32J177K95r78N51J065m90n24P40n5q94N09
1206C72J2j133J15R33q50o49J133J97p20M97O64m72J52Q36n89o46P82M6j320K31
1226d09P49q04m74P28o1m81Q15K82p36N83Q61p24n21J062k53r56M02J40q28LO39
1247A7n27n76J014K67q66N85R51o83j15Q65k89q46P73Oj257L29P53r23n60Q34
1267b48K03p00Q19L20n72L20Q75o97n51J035j15j055J90M78q48q8P08n48m15R53
1287F4J6q62P95Q75o33l47Q72n4p93M16J05r00MO57p00l84P44J65p63N52O99n04
$$ plain form
1309 24 36 819 351 -35 713 611 -376 -198 249 -400 -885 -119 -327 -844 25 219 -397 47 896 267 -71
1330 -71 833 789 -153 224 411 -415 -417 141 -560 -1049 -38 147 -755 -274 771 99 -31 759 571 -14 559
1351 559 591 -455 -160 373 -570 -832 -35 -138 -759 -252 316 -277 -100 856 300 15 867 689 -255 57
1371 57 576 -353 -563 15 -366 -809 -44 38 -604 -213 651 63 -172 802 607 -102 341 522 -275 -309 284
1392 284 -453 -944 -94 61 -795 -336 520 -56 -74 703 328 -39 872 641 -281 -1 566 -477 -845 -19
1412 -19 -219 -859 -88 55 -447 -88 688 174 -185 790 744 20 177 501 -318 -355 192 -396 -808 -45 -68
1433 -68 -825 -92 521 -66 -146 692 623 -20 589 537 -189 -129 447 -420 -869 -30 -190 -889 -350 187 -365 -71
1455 -71 729 178 45 671 696 -207 66 543 -222 -531 27 -280 -852 -199 -51 -599 -109 595 29 -167 789
$$ packed form
1309B4J2P83m68l86P48j02r87J78M47o49m85P66k08n17Q69J94o16M44Q49o29l38
1330g1R04m4r42L77J87q26kN58p01m89J011J85r02M81J045o72j30P90j88n85N73
1351E59L2j046K95N33r43k62P97j03o21N07N68n93J77R56n56k85Q52j78r44L12
1371E7N19r29k10N78l81m43P65Q2o42L91Q64n88k35R74j95p09M43J81p97l4N93
1392B84p37m91Q50J55q56M59Q56n76j8P77l75l67R11k31r22K80N67j043l68Q26
1412a9k00o40P71J43n02L59P76n14l59R75m6p24J57L24q19l7N47n88m12P63k3
1433f8p57P33O13n87q0Q38o9o43O09n2p26O0N76q67m49Q39j60o99N39N37n52K94
1455g1Q00n51j33O26K5r03K73M77p65l09N58l07n72O53J48n48M90P04n66j96R56
$$ plain form
1476 789 728 -14 313 572 -121 -31 258 -361 -819 4 -145 -835 -259 377 -250 -123 770 346 -37 716 716
1497 716 -155 149 463 -399 -612 -73 -326 -750 -182 56 -459 -218 570 156 -173 602 666 68 412 496 -108
1518 -108 -368 261 -364 -739 -71 -177 -965 -256 361 -156 -192 523 440 46 536 575 -252 65 427 -300 -676
1539 -676 13 -103 -778 -388 242 -399 -163 490 107 -69 751 599 -261 176 675 -140 -489 91 -251 -777
1559 -777 -233 -150 -581 -245 369 -97 -123 606 404 2 528 635 11 -105 290 -201 -782 49 -302 -788 -385
1580 -385 349 -214 -283 358 276 45 703 524 -112 128 613 -160 -488 87 -98 -668 -275 -1 -499 -190 301
1601 301 81 -240 611 528 -61 197 673 -180 -291 154 -190 -621 -133 -64 -705 -364 380 -198 -283 610 292
1622 292 86 525 426 6 77 319 -164 -468 115 -18 -778 -354 99 -429 -401 427 139 -4 561 478 -139
$$ packed form
1476G89o1p42L27K59o93R0K89o19m58Q23j49o90N76O36o27J27Q93m24l83P53%
1497G16q71L04L14q62k13N39k53m24N68K38n15K41P88m14l29P75O4n98L44Q4o04
1518a08k60O29o25l75O68j06p88P09O17n17l6P15q3l94M90L9q27L17L62p27l76
1539f76O89j16o75L90O30o41K36O53l83j76Q20j52q60M37M99q15l49N80l42n26
1559g77N44Q3m31L36O14m66k6P29k02m02N26J07o24j16L95m91n81Q31l51m86M03
1580c85P34n63o9O41q2k31O58j79o36K40M85p73l28N75j85n70L93K74m98L09M91
1601C01k20l21Q51q3n89K58M76q53j11M45l44m31M88O9o41L41P44n78q5Q93l18
1622B92k06M39r9m20P1K42m83l04N83j33p60M24M53n28K8Q28k88j43N65q3o17
$$ plain form
1643 -139 217 581 -65 -246 102 -157 -532 -97 -20 -549 -205 353 -92 -189 498 486 -126 280 613 97 -30
1664 -30 244 -81 -666 -49 -87 -600 -234 118 -288 -321 444 240 -51 526 372 -91 175 523 -108 -228 41
1685 41 -159 -745 -332 -50 -403 -331 322 -40 -174 533 563 -29 221 594 -12 -105 427 -96 -465 -31 -136
1706 -136 -632 -343 119 -280 -342 335 236 -55 384 586 192 166 442 -173 -389 157 -135 -534 -194 -46 -447
1727 -447 -339 130 -32 -166 485 449 -173 341 584 -90 -180 309 -132 -543 -213 -167 -506 -367 110 -349 -299
1748 -299 345 338 -95 295 560 -2 -38 274 -36 -435 127 -184 -758 -301 41 -447 -302 255 212 -175 363
1769 363 446 -102 312 501 -20 -259 264 -133 -490 -216 -96 -376 -325 90 -156 -36 491 402 19 382 510
1790 510 61 -38 341 -73 -388 -169 -92 -555 -307 -34 -317 -459 322 261 -118 335 475 58 231 446 -71
$$ packed form
1643a39L56L64o46j81L48k59l75M35P7n29L44N58m45r7O87j2o12M06L33n16j27
1664c0K74l25n85O17l8n13L66L52m06l3P65k04k91N77j54m63K66L48o31j20K69
1685D1k00n86M13K82l53P2O53l62j34P07L0n92K50L73o06r3N32n23l69M34j05
1706a36m96K89M62l99o2O77r9k91M39K02l94k6K76o15k16N46k92l99L40J48m01
1727d47J08M69j62j34O51l6o22N14K43o74r0M89m41m11L30M6l39J39M77m59N0
1748b99O44pm33L90K65n62l6L12l10l99N62l11n74M57L42m88J45N57m3l87N38
1769C63Q3n48M14J89n21k39N23l97l57K74J20k80N1M15k46J20N27q9l83L63J28
1790E10m49r9L79m14l15K19P7m63K48K73k83j42P81o1l79M53J40m17J73K15n17
$$ plain form
1811 -71 -317 194 -163 -515 -150 97 -338 -406 202 -151 -255 446 458 8 288 571 26 -133 393 -101 -397
1832 -397 -211 42 -402 -361 -9 -275 -263 264 177 -28 388 536 86 88 466 -50 -344 70 -135 -569 -225 92
1854 92 -449 -336 266 121 -155 316 451 49 241 555 34 -162 104 -40 -556 -186 -61 -475 -391 53 -191
1875 -191 -269 386 209 -110 286 620 -38 -50 448 97 -294 54 -115 -399 -238 86 -257 -364 208 108 -131
1896 -131 262 517 69 124 482 19 -241 168 -100 -466 -161 37 -457 -393 73 -60 -224 297 249 54 320
1917 320 520 28 12 345 134 -447 -46 11 -416 -294 13 -268 -273 254 194 -15 259 527 76 201 436 27
1939 27 -190 99 -23 -396 -306 -15 -503 -252 186 183 -175 307 343 75 312 593 177 -23 233 -17 -553 -160
1961 -160 0 -374 -357 7 -156 -313 257 242 -101 268 359 129 51 414 201 -281 147 14 -364 -345 -100 -320
$$ packed form
1811g1k46N11l57l52L65K47m35o8O08l53j04P01J2m50K80K83n45j59N26m94k96
1832c97J86K53m44M1L52k66J2N27q7k05M16J48m50KL78n16k94M14k05m34L44L17
1854I2n41J13O02j45k76M71J35m02J92L14n21j96K66j44n16L70J25m14Q4M44k44
1875a91p8O55j77l19L96L34o58j2M98l51l91L48j69k84J61L24l43j07N72j00k39
1896a31L93K55m48N5L58m63k60M09k68l66L05J98m94O4M66j33j64N21m8j95K66
1917C20K00m92j6L33k11n81M01N7m27J22L07k81nN27o0k09K74K68m51J25K35m09
1939B7k17K89j22l73R0K91m88K51M38ll58M82L6k68K37K81m16k00K56k50n36L93
1961a60J60l74J7L64j63j57N70j5l43L69R1k30p8L63k13m82M28j33l78J9K45k20
$$ plain form
1983 -320 -329 203 33 -139 256 355 5 -25 379 131 -73 298 -18 -351 -68 -14 -482 -356 -47 -130 -208 368
2005 368 368 -158 165 381 123 1 392 -31 -195 58 29 -412 -289 68 -204 -356 107 168 -161 209 392
2026 392 94 100 367 79 -168 128 125 -352 -124 -31 -341 -396 133 59 -264 228 434 35 139 416 152 60 363
2049 363 152 -345 -94 28 -384 -349 55 -245 -199 67 242 -152 207 460 6 59 258 13 -170 81 101
2070 101 -300 -269 -15 -275 -467 54 140 -252 176 275 -65 134 453 45 23 314 93 -353 -37 1 -371 -300
2092 -300 2 -109 -189 78 178 -90 137 456 -67 -75 438 85 -203 62 114 -333 -250 -37 -359 -298 112 43
2114 43 -153 124 294 45 134 478 134 -236 178 -5 -325 -68 -4 -320 -368 69 -179 -333 -43 221 -114
2135 -114 182 378 155 113 355 130 -294 -176 136 -357 -160 43 -264 -302 -52 9 -246 111 360 8 16 333
$$ packed form
1983c20rN32j70j72L95R9l50l0M04k48k04L71l16l33K83N4m68J26L09q3p8N76
2005C68%n26L23K16k58j22L91m23j64K53k9m41J23L57k72j52M63O1l29L70J83
2026C92k98OK67k88k47K96lm77K28R3l10n5N29p4l23M92K06l99J04K77k64r2L03
2049C63k11m97K51J22m12L5M04l00M6K66J75l94L59K53m54N3J99k45j83K51K0
2070A01m01L1K54k60j92N21Q6l92M28R9l40J99L19m08k2K91k21m46L16L8l72P1
2092c00L02j11q0K67J00k68K27L19n23qN13l53k88K65N2m47Q3K13l22O1M10o9
2114D3j96K77J70k49Q9L44l44l70M14j83l20K57O4l16m8M37k48j54K90K64l35
2135a14K96J96k23m2K42k25m24J18L12m93J97K03l07l8K50O1k55L57K49l52QL17
$$ plain form
2157 333 199 -32 52 64 -183 -212 -29 -318 -303 104 53 -200 181 221 -65 219 378 206 -41 290 62 -306
2179 -306 23 47 -256 -364 16 -118 -325 45 221 46 135 481 107 116 248 134 -86 228 14 -382 -252
2200 -252 -11 -289 -400 -10 11 -167 188 373 -93 -93 390 121 -63 256 94 -241 -101 108 -258 -320 -41
2221 -41 -91 -416 63 189 79 150 393 85 115 303 104 -203 -1 161 -335 -243 19 -47 -347 28 24 -305 106
2244 106 291 -43 129 417 186 -124 168 194 -129 -130 92 -287 -204 20 -78 -212 12 133 -134 110 474 1
2266 1 26 283 95 -178 15 123 -319 -267 54 -193 -373 36 43 -225 138 248 11 12 329 179 42 146 162
2289 162 -232 -162 69 -310 -263 -89 -174 -204 99 272 32 22 401 304 -69 185 123 -178 -145 -11 -168 -225 -4
2312 -4 -166 -273 86 22 -1 50 284 -28 -12 303 162 -100 90 180 -296 -153 12 -179 -425 -28 -53 -206 66
$$ packed form
2157C33j34k31Q4J2k47k9J83k89J5M07n1k53L81M0k86K84J59j72k47L31k28l68
2179c06L29K4l03j08L80j34k07L70J76j75Q9L46l74RJ32j14k20L14k14l96J30
2200b52K41k78j11L90K1j78L55J85m66%M83k69j84L19j62l35J40K09l66o2K79
2221d1n0l25M79J26j10P1K43l08L0J88j99l07K02J62m96R2K62o6l00L75ml29M11
2244A06J85l34J72K88k31l10K92K6l23jK22l79Q3K24r8j34K24J21k67K44L64m73
2266AK5K57j88k73J93J08m42N2L21k47j80M09Pk68L63J10k37JL17j50j37J04J6
2289A62l94P0K31l79M7J74q5l0L03J73k40j0L79r7l73K54o2l01L3J34j57n7K21
2312dj62j07L59o4k3N1K34l12J6L15j41k62J90R0m76J43J65j91k46L97k5j53K72
$$ plain form
2335 66 325 -12 95 411 118 -88 83 40 -207 -75 165 -209 -277 3 -179 -385 14 116 -42 93 306
2356 306 168 26 220 161 -74 82 197 -201 -192 149 -255 -185 -26 222 -139 12 221 -33 107 247 177 20
2378 20 234 41 -224 -110 -10 -122 -289 -50 -138 -315 22 168 0 33 275 122 161 245 215 -209 49 93
2400 93 -257 -174 -2 -166 -293 52 59 -100 -143 165 27 -13 368 27 -34 242 102 -116 -225 92 -282 -310 -39
2423 -39 -51 -275 73 92 -16 83 277 70 -38 259 220 -48 -192 85 -199 -290 -37 -212 -307 51 149 -85 -73
2446 -73 304 103 31 249 134 26 191 163 -203 -173 87 -120 -235 121 1 -304 116 125 15 30 375 108
2468 108 -27 118 130 -212 -125 84 -94 -234 48 -185 -250 57 152 -23 29 149 99 25 242 201 -151 14 89
2491 89 -276 -112 33 -192 -285 -19 -111 -256 -17 108 34 -15 212 129 -1 184 311 -156 -1 70 -187 -269 19
$$ packed form
2335F6K59l37J07L16k93k06J71m3k47J32K40l74o8K80j82k06L99J02j58J35K13
2356C06j38j42J94n9k35J56J15l98RL41m04P0J59K48l61J51K09k54J40J40p0j57
2378B0K14j93k65J14J00j12j67K39q8j77L37J46j68L3K42j53L9Q4l0m24K58M4
2400I3l50Q3J72j64j27L45Pj59m3L08j38m0L81l41o1K76j40k18j09L17l74k8K71
2423c9j2k24L48J9j08R9J94k07j08K97l9k68j44K77k84r1K53j75r5L58R8k34J2
2446g3L77k01p2K18j15j08J65k8l66L0K60k07j15L56j20l05M20Rj10J5L45k67
2468A08j35J45J2l42Q7K09j78j40K82k33o5L07R5j75N2J20n0p4K17m1l52J65P5
2491H9l65J64J45k25r3K66r2j45K39J25p4m9K27q3j30J85J27m67J55P1k57q2K88
$$ plain form
2514 19 14 -281 -35 144 70 -55 239 -28 22 125 270 -68 -35 124 -111 -222 -71 -160 -372 -18 93 -179
2536 -179 -72 163 39 73 183 126 10 30 88 -193 -103 13 -163 -166 -77 -32 -275 93 104 -117 73 157 171 6
2560 6 105 212 -8 -1 105 -266 -272 65 -104 -237 24 -6 -116 33 153 96 9 306 89 -73 83 203 -105
2583 -105 -9 46 -192 -176 4 34 -170 -151 186 -81 -4 227 152 18 92 138 -6 -133 12 -171 -218 -17 -3 -276
2607 -276 -35 77 -98 -1 253 139 123 267 198 -126 6 138 -111 -213 79 -255 -180 50 11 -170 -131 192
2629 192 -33 -73 317 200 -69 78 -21 -33 -132 135 -199 -344 51 -94 -212 16 80 -117 18 92 138 11
2651 11 191 205 -15 -7 105 -90 -247 85 -58 -281 -132 31 -127 -19 246 130 111 246 229 -120 91 191
2673 191 -247 -106 27 -90 -255 37 -144 -207 -1 164 -12 -55 255 137 19 156 130 -47 -9 51 -38 -180
$$ packed form
2514A9nk95K46J79p4j25K94k67N0J03J45l38L3J59k35j11J51q9k12L54J11k72
2536a79J07K35j24L4J10n7j16K0N8k81R0J16j76lQ9M5k43L68J1k21J90Q4J4j65
2560FR9J07k20PJ06l71oL37j69j33K61l0j10J49J20n7q7K97k17j62J56J20l08
2583a05R6N5k38J6J80L0k04J9L37k67P7K31p5j34P4M6j44j27J45j83m7K01J4k73
2607b76K41J12j75R7K54j14j6J44o9l24J32J32k49j02K92l34P5K30l9j81L9L23
2629A92k25m0L90j17k69J47r9j2r9K67l34j45L95j45j18K28O4j97J35P4M6j27
2651A1J80J4k20QJ12j95j57L32j43k23J49J63j58J08K65j16j9J35j7l49K11J00
2673A91m38J41J33j17j65K92j81o3K06J65j76m3L10j18j18J37k6j77L8O0q9j42
$$ plain form
2695 -180 21 -127 -278 -135 29 -80 136 162 -12 -64 238 146 55 110 111 46 -167 101 -176 -183 99 129 -191 29
2719 29 70 -2 -26 133 109 73 133 214 -14 -101 209 -89 -76 7 -85 -343 14 78 -83 -114 187 41 -91 131 117
2744 117 -105 7 41 -58 6 57 -29 -212 -38 42 -167 -45 211 -37 -49 145 195 -62 180 208 -42 -49 86 -170
2768 -170 -184 27 -108 -208 -29 81 1 50 233 194 -3 120 173 10 19 124 0 -73 78 -134 -149 16 -52
2791 -52 -140 -148 192 34 -113 132 157 -87 108 242 20 -73 -73 -84 -275 82 21 -314 -137 58 -8 82 142 235 -72
2816 -72 122 115 34 115 111 -102 -150 34 -78 -212 -26 79 -148 -86 64 -19 4 99 41 -51 105 315 -25 -105 50
2841 50 2 -188 8 6 -171 -92 113 17 -129 126 79 32 158 129 -48 91 7 -29 -147 -17 13 -238 61 67 -61
2866 -61 -59 138 74 95 71 97 4 -72 -23 -64 2 -68 82 -327 -56 -56 -117 -147 -27 -15 -103 143 182 51 138 199 -59
$$ packed form
2695a80K01j48j51J43J64j09K16K6j74n2L02r2r1N5Jo5k13K68k77pK82L0l20K20
2719B9M1p2k4J59k4l6O0Q1k28q7L10k98J3Q3r2k58L57O4j61l1L01j46j32K22j4
2744A17k22J12L4r9O4N1q6j83J74Q0k09J22K56k48j2J94N0k57K42K8k50pJ35k56
2768a70j4K11j35j00J79J10q0M9J83l9j97J23N3j63RJ05j24p3J51k12j5J65o8
2791e2q8qL40j58j47K45K5k44J95J34k22r3%j1j91L57o1l35J77J95o6R0O0R3l07
2816g2J94pq1Q1mk13m8J84j12j34J86J05k27O2J50q3K3R5n8r2J56K10l40q0J55
2841E0m8j90J96kj77P9K05r6j46K55m7m7J26k9j77J39q4l6j18J30L0k51K99Oj28
2866f1KJ97o4K1k4K6r3p6M9m1O6p0J50m09K71%o1l0J20J2q8K46L9j31Q7O1k58
$$ plain form
2893 -59 -11 49 -61 -177 37 -87 -153 10 57 -39 -167 181 181 -27 104 109 62 -1 122 -52 -150 116 39 -164 -103
2918 -103 -139 -95 -74 33 18 -88 118 239 -45 58 139 45 -27 6 38 -239 -15 -50 -266 -169 -80 -51 58 156 112
2943 112 84 139 83 45 -112 54 -83 21 37 117 -66 -105 124 -88 -84 55 25 -22 151 114 64 108 165 -92 -187
2968 -187 75 -18 -25 -101 -9 -196 -77 127 -48 -82 158 217 -39 7 26 -147 90 -28 -79 -82 -39 -21 -56 -75 50
2993 50 -95 -88 37 27 -35 114 57 68 -6 233 98 13 22 51 -174 -69 11 -177 -143 109 107 -87 90 74 95 105
3019 105 120 58 -91 141 19 -91 -17 -75 -320 -180 163 -64 -87 13 64 -121 33 105 -14 2 157 -67 -180
3042 -180 -27 -22 -156 -119 7 -176 -62 3 28 57 55 183 13 66 146 -32 -151 110 70 -126 14 -37 -37 -93 47
3067 47 -55 -121 181 210 -17 163 87 -69 -68 54 -95 -149 7 29 -139 -48 -11 -62 -65 -46 -67 45 167 175 -57 -16
$$ packed form
2893e9M8O0j10j16K14j24o6J63M7r6j28L48%k08J31Nm7o3J23j74r8K66p7k03O1
2918a03l6M4K1J07j5j06K06J21k84J03Q1r4p2L3L2k77K24l5k16R7Q9K9J09R8m4
2943A12k8N5n6l8j57J66j37J04J6Q0j83l9K29k12MJ39l0m7J73l7n0M4N7k57r5
2968a87K62r3pp6R2j87J19K04j75l4K40N9k56M6J9j73K37j18n1lM3J8l5j9J25
2993E0j45PJ25j0o2J49n7J1p4K39j35q5RK9k25J05Q0j88L4K52kj94J77j6K1J0
3019A05J5o2j49K32j22j10P4n8k45J40L43k27k3J00N1j85J54P2j19J6J55k24j13
3042a80J53Nj34L7J26j83J14O5K5K9kJ28j70N3Q0j78j19K61m0j96J40n1%n6J40
3067D7j02o6L02K9k27J80p6j56JJ22j49n4J56K2j68R1L7n1lJ9k1J12J22Qk32M1
$$ plain form
3093 -16 153 23 -1 0 62 -64 34 -104 -57 -49 -118 -78 -72 162 161 -105 58 196 191 49 52 -10 -226 -82 -126 -35 -114 13
3121 13 -154 6 94 -63 -69 59 89 -19 -6 142 -5 66 106 -49 -254 -150 -45 -145 -142 -27 56 -45 95 22
3145 22 52 264 71 32 -58 -38 24 -50 -82 -86 -66 -72 59 41 -52 27 1 36 8 110 -19 24 176 -154 -123 67 12
3172 12 -173 25 -52 -97 -14 94 62 -55 40 17 48 233 229 -30 -71 59 -26 -236 105 -36 -109 -98 34 -2 -96
3197 -96 63 4 -69 127 134 -3 78 96 -5 -116 -18 70 -112 55 -31 -151 -152 84 27 -64 -7 84 3 28 144 -54
3223 -54 12 45 -18 -109 -7 -78 -98 -159 0 -136 -35 -22 121 -59 160 79 101 -10 17 -48 -98 -23 -25 -137 -218 -25
3249 -25 -40 24 95 -53 -67 136 33 10 6 66 48 -98 104 -95 -95 18 -45 -85 -121 5 -13 -52 139 28 -89 -12
3275 -12 234 39 -12 33 -30 -167 48 94 -135 -86 -10 0 -65 0 -75 -20 124 216 -29 -92 131 98 -76 162 9
$$ packed form
3093a6J69j30k4JO2j26R8j38M7Qo9M0OK34jk66J63J38nj42Lo2k16J44m4R1p9J27
3121A3j67J60Q8j57oJ28L0j08J3J48j47P1M0j55k05J04J05j00LJ15Q3j01J40p3
3145B2L0K12j93l9r0K0O2p4l2mK0oJ31j8r3P9k6L5k8J02j29M3J52l30L1J90n5
3172A2j85J98p7m5Q3J08l2j17R5k3L1J85mk59m1J30q5k10L41j41p3J1J32l6r4
3197i6J59n9p3J96Pj37Q1J8j01j11R8Q8j82J67q6j20jK36n7r1N7R1q1K5J16j98
3223e4O6L3o3r1J02p1k0o1J59j36J01J3J43j80K19q1K2j11K7o5n0P5kj12q1J93
3249b5j5O4P1j48j4K03j03k3mO0j8j46K02j99%J13o3m0l6J26j8l9J91j11j17P7
3275a2K46j95n1M5o3j37K15M6k29M9P6J0o5O5p5N5J44R2k45o3K23l3j74K38j53
$$ plain form
3300 9 -159 -60 48 -35 -160 -75 18 -5 42 182 -7 149 -5 75 115 53 -70 -54 -9 -30 -130 -57 30 -36 -187 263
3326 263 17 -64 118 36 -51 37 210 223 -138 -4 33 -158 -155 27 -74 -114 86 90 -26 -55 83 43 78 173 -10
3351 -10 -96 70 2 -62 -96 48 -36 -177 7 -115 -111 -36 0 -89 53 70 -101 48 91 -45 -89 -21 -30 -111 -172 91
3377 91 -101 -124 6 -34 82 15 184 -79 -9 114 10 34 -67 50 -146 -19 41 -93 -29 -5 -29 -73 46 -22
3401 -22 -45 -9 -23 43 71 -5 -12 -150 1 39 -121 -83 17 -51 -77 48 123 -103 -46 45 119 -3 39 29 32 37 -110 -30
3429 -30 38 32 -122 -133 2 -27 -215 28 96 -24 39 -17 43 -12 44 109 -89 7 -67 -98 -111 -96 -14 -70 112 25 3
3456 3 71 -41 -47 6 121 -21 -101 85 41 -18 -20 -11 -59 -72 -7 85 5 69 -69 -13 -5 -17 -55 42 113 146 -23 -12 37 -56
3486 -56 -151 5 -37 -123 -77 -33 -41 60 201 35 38 116 75 -42 6 -28 -39 -39 -12 -49 -72 -20 -37 -36 23 -23 -20 41 106 28
$$ packed form
3300Ij68R9J08q3j25Q5R3k3M7J40j89J56j54Q0M0o2j23J6M5k1j00P3Q7o6j51M50
3326B63k46q1J82q2q7Q8J73J3l61J34L7j91LJ82j01m0K00Mj16k9J38m0L5R5j83
3351a0q6J66o8o4l4J44q4j41J84j22MP5L6q9J42J7j71J49M3j36m4O8rq1o1K63
3377I1j92k3J30m0J16o7J69k63P0J23j04K4j01J17j96J27O0j34O4K4k4m4J19o8
3401b2k3L6j4O6K8p6pj38J51L8j60L8J00o8k6J25P5k26N7R1P4j22M2j0LNj47Q0
3429c0O8oj54j1J35k9j88K43O8j20O3n6O0n5N6O5j98R6p4l1j3J5Q2n6J82q7k2
3456CO8j12oN3J15j42q0J86m4n9kRm8j3O5R2q0O4j38N6Qj2l8R7P1L3j69J1M9r3
3486e6r5J56m2q6M6M4qJ01J41j66LP8m1j17M8l4j1%K7l7k3N2j7JN9m6LO1O5p8
$$ plain form
3516 28 -44 79 52 -142 -84 -70 -216 -12 40 -59 -37 -57 14 -29 4 70 34 -61 40 -55 84 -30 0 -139 -91 -36
3542 -36 -17 -21 -32 141 0 -1 32 -53 -53 58 51 -40 33 -58 -89 75 -50 -182 -77 -30 -25 9 -12 138 -36 -42 95 9
3570 9 63 227 27 -98 -118 18 -53 -35 83 41 -50 112 33 -49 6 54 -13 92 76 -38 50 33 68 -14 49 -45 -168
3597 -168 -165 4 51 -103 -14 63 -34 -54 40 88 -34 -5 -29 -192 23 -1 -137 -167 76 -2 -56 83 -103 -116 3
3622 3 37 -39 -22 78 24 -87 52 48 -23 -70 4 -32 -70 6 17 -119 -1 93 105 96 106 76 34 65 141 -59 -91 -168 -108
3651 -108 -53 28 -89 -58 -13 68 22 -17 112 64 51 159 93 -181 -117 23 -145 -15 -15 -14 -20 -8 -20 -68 24 119 -43
3678 -43 25 131 125 7 17 15 -95 -97 20 -136 95 44 -7 -10 -69 76 -96 -112 94 -82 -55 -60 102 -112 -62 129
3704 129 -22 -38 -20 64 -153 80 -34 -94 -5 145 47 -136 52 -23 -101 121 45 0 -5 95 101 -151 11 47 -107
$$ packed form
3516B8p2J23k7j94N8J4j46K04N2r9K2k0P1m3L3O6l6r5J01r5J39j14L0j39M8N5
3542c6J9mj1J73j41jL3q5%J11pr1P3r1l1J64j25j32J05M7NL4k1J50j74oJ37q6
3570IN4J64k00j25k0J36p1J8J18m2r1J62p9q2N5M8o7J05j6j14Q8j7L5q2O3r4j23
3597a68LJ69M7j54Q9P7r7k0R4M8j22K9k4j63K15k4j36l0K43p8n4J39j86j3J19
3622CL4p6J7J00n4j11J39mp1m7P4l6l8P6J1j36J18R4J2rJ0l0m2L1P6k00l2p7O0
3651a08N5Q1j17L1M5Q1m6l9J29m8j3J08o6k74O4J40j68J30%JoJ2j2m8R2R5j62
3678d3O8J06oj18J0kj10kJ17j56K31n1n1ln9J45j72j6K06j76K7nJ62k14N0J91
3704A29j51j6J8Q4k17K33j14o0Q9J50r8j83J88p5p8K22p6m5nJ00Ok52J62L6j54
$$ plain form
3729 -107 -65 140 12 13 14 76 -175 28 140 -81 -101 -30 -17 22 41 -84 -225 14 -37 -87 77 75 -18 -71 23 -11
3755 -11 -84 101 -43 -72 -80 45 -58 -158 27 10 -75 -36 -72 -140 39 46 101 -136 110 11 -22 17 78 -33 15 -4
3781 -4 46 -46 -95 -11 -36 -14 -68 -75 19 96 78 -7 54 -52 -76 -186 -15 24 70 -7 9 -72 59 178 43 4 24 34
3809 34 -51 54 -52 1 -60 -72 73 -61 44 -72 -29 -80 -26 -46 2 208 -47 -97 163 57 6 -7 0 24 -169
3834 -169 1 33 -141 25 13 -80 13 84 22 102 117 -56 139 -16 26 -38 83 25 -168 -36 -49 -36 -52 9 101
3859 101 -36 -17 84 -17 48 83 -73 -157 -6 24 -71 -21 33 -21 61 -96 132 15 77 3 -19 40 41 50 27 74 -25
3886 -25 -21 -56 6 -43 -120 93 -169 -128 -2 19 -142 -60 38 8 -80 33 22 -19 -42 60 -58 -17 130 66 -85 -46
3912 -46 67 70 20 -15 -39 34 124 47 23 -41 22 -29 -74 53 96 -107 -7 -36 46 -34 -40 47 48 -9 12 -12 69 18 -99
$$ packed form
3729a07M2K05j28JJO2k51K03J12k21k0P1J3L9J9j25j41K39n1n0J64kr3n3R4l4
3755a1p3J85j44k9qJ25j03j00J85j7q5L9l6o8J79PN5k37K46r9l3L9O1j11M8j9
3781dN0r2m9Q4k5K2n4pR4P7j8q5O1j06k4j10J71L9M6p7J6q1J31J19j35l9K0J0
3809C4q5J05j06N3o1j2J45j34J05j16M3n1N4k0M8K06k55n0K60j06n1j3PK4j93
3834a69J70L2j74J66j2r3R3P1o2Q0J5j73J95j55M2o4J21n8j93J32j3J3j6O1R2
3859A01j37J9J01j01O5L5j56q4J51L0r5N0N4n4Q2j57K28j17O2p4k2N9JRk3M7r9
3886b5Ml5O2m9p7K13k62M1J26K1j61Q2R8l0q8J13j1m1k3J02j18M1J47o4j51L9
3912d6J13Ln0l5k4P3R0p7k4o4O3n1m5J27M3k03J00k9Q2q0oQ7Jn7K1k4Q1n1j17
$$ plain form
3941 -99 45 -145 -3 10 7 -39 83 -111 -54 -96 -117 180 15 59 56 57 -10 37 -40 103 -55 -24 85 23 -2 -49 -29
3968 -29 11 2 -41 12 -47 -48 -19 5 -44 -145 -32 60 -65 -4 46 -113 -94 -107 57 97 -150 0 -31 -56 34 -14 86
3995 86 39 101 -18 -112 58 97 -163 99 -61 -57 18 12 -163 135 -88 78 -17 -44 13 -38 0 47 -43 -96 40 24
4021 24 -28 55 56 -54 86 90 -5 159 85 26 -65 -4 -12 26 -178 -103 -36 -154 -121 1 -87 52 141 -6 -54 -54 69 -102
4049 -102 3 141 4 -43 -10 -45 52 104 95 -156 -120 64 -61 -126 -17 37 -70 -81 19 -80 -13 10 -53 -148 23
4074 23 -126 -19 -24 -35 -183 -67 24 61 34 -2 80 50 -31 94 15 17 -35 -9 -154 -76 -16 35 88 39 -44 -49 22 44 3
4103 3 -51 92 24 -1 163 27 -94 60 -91 37 108 58 87 22 40 55 -36 -74 -11 -11 -83 35 28 -95 30 -12 -66
4130 -66 -17 0 -42 -66 38 3 -38 46 -47 -106 -25 -29 -152 18 41 9 -54 52 8 5 36 -98 -18 55 -110 -43 52 69
$$ packed form
3941i9J44j90J42J3lm6J22j94N7m2k1K97j65M4lJo7M7p7J43j58L1J09o2k5m7K0
3968b9M0rm3N3n9jK9K4m9j01J13R2j25O1N0j59J9j3J64M0k47J50l1k5R0m8J00
3995H6m7O2j19r4J70L9k60K62j60MP5oj75K98k23J66r5k7N7n1L8M7r0n3J36j6
4021B4n2Q3Jj10J40Mr5J64p4n9r1O1qL8k04P5O7j18L3J22q8J39Q9j47m8%J23j71
4049a02J05J38j37m7L3l5R7N2rk51L6J84j25o5J09N4j07j1J00r9O7K3o3r5J71
4074B3j49J07nj1j48J16R1L7k7l6Q2l0q1J25p9Kn2K6j45P8O0N1N3m9q3nP1K2m1
4103Cn4J43o8k5J64j36j21J54j51J28P1n0K9o5J8J5r1l8O3%p2J18pj23J25m2n4
4130f6M9J7m2k4J04l5m1Q4r3n9Q1mj23J70K3l2o3J06m4lL1j34Q0P3j65O7R5J7
$$ plain form
4158 69 95 31 -7 29 -21 100 82 -33 -36 2 41 -77 -45 -12 -76 -118 93 -42 -63 -114 14 -60 -169 -33 6 44 16
4185 16 11 32 -44 30 -24 23 42 -22 -83 66 -32 46 -91 -52 -79 33 155 -8 -57 -157 -66 -7 45 -28 -51 85 134
4212 134 54 4 83 -10 84 11 -25 -11 -87 33 12 -27 4 -4 55 -47 51 66 -68 56 -14 -64 48 88 6 -9 102
4239 102 -73 -119 5 -29 -105 -14 -54 5 8 102 86 -22 16 38 72 -22 -53 51 -18 47 2 -138 55 43 -26 -16 39
4266 39 -90 -52 -23 -23 -60 -46 88 29 -32 38 -123 -168 -71 56 -85 -92 55 -41 26 17 50 -90 133 -17 -154 -171 -55
4293 -55 -18 19 40 -35 2 -17 186 10 -3 101 39 30 4 55 60 38 84 56 -136 -30 -72 -44 -62 8 -65 -11 14 -50 57
4322 57 32 7 38 -49 -22 -49 -100 46 14 -3 -45 35 4 11 23 -8 -85 -67 32 -25 29 67 73 21 45 -13 -64 -46 12 -75 -13
4353 -13 -22 68 -26 38 -82 -55 -71 -81 8 18 -23 3 91 122 -70 -126 76 38 -71 -32 -23 50 -173 93 118 -75 160
$$ packed form
4158F9K6o4l8L6n0J21j8j15lL8L9j18L2L3o4m2K11j35k1n1J28p4j09J36L9L8k8
4185A6nK1p6P4n4M7J9o4o1J49r8P8j37L9k7J12J22j63m9j00R1N9N2p3k3J36M9
4212A34q0n0P9r3R4p3l6J4p6J20k1l9L1qN9j02R8J5j34J24p0n0J12M0q2j5J11
4239A02j75m6J24l4p6R1m0N9LR4j6j08L8K2L4r4l1J04o9O5m5j40J93j2o9J0N5
4266C9j29L8K9%l7J4J34n9o1P0j61m5R7J27j41pJ47r6O7rL3j40K23j50j37j7J16
4293e5L7L7K1p5L7j9K03j76j3J04o2rk6N1Nk2M6k8j92J06m2K8j8P0p3N4K5o4J07
4322E7k5k5L1q7K7k7n1J46l2j7m2Q0l1PJ2l1p7J8R9n7N4L8On2K4n8n1J8N8q7O2
4353a3rR0r4O4j20K7j6j0Q9J0m1K6Q8L1j92n6K02l8j09L9RP3k23K66K5j93K35
$$ plain form
4380 160 -34 -3 132 -52 -25 -25 75 22 -174 29 69 16 -62 34 67 59 115 -15 108 10 44 -58 2 -108 141
4405 141 -67 84 -39 -18 -22 -38 -27 -89 -5 51 -69 -66 33 -13 80 69 175 110 -44 -8 22 -30 -1 -126 -9 -48 -50
4432 -50 -54 76 173 50 68 110 117 8 17 -18 -63 17 32 -18 17 25 -17 96 1 104 24 73 65 -71 -38 -68 123 -73 32
4461 32 -48 -89 -74 -89 -48 -25 23 -21 -17 -8 2 -21 61 -42 1 38 -8 -46 -143 30 17 -78 32 74 -7 93 -1 -10 67 82
4491 82 -14 -4 87 -59 -41 -25 90 24 36 20 -55 -10 2 24 -63 24 35 -13 121 105 58 38 43 -5 32 15 -26 31 52
4520 52 -52 1 46 -59 119 76 58 -24 -7 145 -50 -9 -22 -42 -24 -120 42 78 4 76 102 53 66 11 51 -31 61
4547 61 57 -37 67 14 31 26 -74 -32 26 32 -2 224 67 -43 -14 -31 -23 -30 -23 48 -85 19 -66 -18 -82 -7 -8 -21 -12 -45 -69
4578 -69 87 124 31 75 108 -66 20 16 13 65 17 -5 -104 68 40 87 -69 -45 81 74 55 50 -123 74 104 121 98 4 11
$$ packed form
4380A60j94L1J35j84K7%J00n3j96K03M0n3p8R6L3qN6j30J23r8L4j02O0j10K49
4405A41k08J51j23K1mj6J1o2Q4N6j20LR9m6R3j1J06o5j54L6L0n2K9j25J17l9k
4432e0mJ30R7j23J8M2Pj09Rl5m5Q0J5n0L5Qm2J13r5J03q0M9qj36L3l0J91j96J05
4461C2q0m1J5j5M1K3M8m4MRJ0k3Q2j03M3L7m6l8r7J73j3r5J10M2q1J00r4rP7J5
4491H2r6J0R1j46J8J6J15o6J2j6p5M5J2K2q7Q7J1m8J34j6m7k0Nm8L7j7m1N7K1
4520E2j04N3M5j05J78m3j8q2J7J52j95M1j3k0J8r6J62L6p4P2K6m9J3n5M0q2R2
4547F1mr4J04n3J7nj00M2N8Ol4K26j57j10K9j7QpPP1j33J04q5M8o4P5jj3Rl3k4
4578f9J56L7r3M4L3j74Q6mlN2m8k2r9J72k8M7j56K4J26pj9nj73J97L0J7k3r4P
$$ plain form
4607 11 -16 -83 50 35 -74 -67 -16 -68 18 38 151 31 19 9 -6 129 -23 -142 -84 36 -51 -29 -163 2 50 98
4633 98 -32 -1 42 204 45 26 72 13 -17 117 49 -19 -25 60 34 35 24 -86 -19 -112 -21 29 -29 13 -69 -56 -55 83 -63
4662 -63 -32 72 -35 -7 -3 -60 -19 40 -62 -63 52 38 10 54 57 17 -57 -35 -34 -9 -32 -35 -31 103 50 35 -68 98 22 -63
4692 -63 17 -10 35 -9 60 -76 88 51 -19 -15 -65 -82 38 9 -39 -23 -49 51 -33 -39 -59 -23 -70 39 -52 -15 -25 -85 -52
4721 -52 -105 14 52 -80 -65 42 98 10 35 78 47 100 -16 39 -31 -100 -87 -119 -111 90 -176 10 74 -80 -95 -72 77
4748 77 26 70 87 26 -43 44 8 -139 -29 48 25 102 -52 11 -29 -120 -2 -42 -48 106 -120 -33 -15 141 -82 95
4774 95 33 114 53 -30 -89 80 -80 37 100 28 80 22 -2 75 -52 -3 -12 -76 -50 -62 -18 -16 7 60 -4 -10 -25 -2 -10 25
4804 25 22 18 -21 -3 -78 -41 24 71 -20 88 71 -59 -118 25 176 12 -40 71 85 5 24 -25 38 5 -102 -130 -70 93
$$ packed form
4607A1k7o7J33j5j09PN1n2Q6K0J13j20j2j0j5J35j52j19N8J20q7K2j34J65M8M8
4633I8j30L1M3J62j59j9M6n9l0J34o8o8oQ5k6Jj1j10O7r3R1N0n8M2q2J3JJ38j46
4662f3L1J04j07K8Mn7M1N9j02jJ15j4k8M4Lm0p4K2JK5k3lMJ34n3j5j03J66p6q5
4692f3Q0k7M5m4O9j36J64l7p0Mn0j7J20k9m8J6k6J00q4ok0L6m7J09r1L7j0o0L3
4721e2n3J19L8j32J5J07N6q8K5M3l1N3j16N5p0o9J3l2QK01k66J86O4j54j5K3J49
4748G7n1M4J7o1o9Q7l6j47J10P7k3P7j54O3m0r1J18m0oJ54k26Q7J8J56k23J77
4774I5o2Q1o1q3n9J69j60J17O3p2N2n8k4P7j27M9ro4K6j2M4KK3N3o4oj5K3qL5
4804B5lml9J8p5L7O5M7r1J08j7j30n9J43J51j64n2J11J4q0J9m9O3l3j07k8O0J63
$$ plain form
4832 93 -63 -48 -25 141 -131 80 70 -6 60 17 -28 -109 164 -38 -46 -31 -47 -10 -35 6 -32 38 2 16 54 45 232 -5
4860 -5 -113 62 50 7 -47 -67 -34 -100 -13 49 34 83 59 -15 55 -40 61 -36 84 84 75 17 -52 -72 87 31 40 -44 9 -43
4890 -43 2 63 12 101 -24 -54 -21 43 -60 -21 -35 9 90 -147 -191 -97 -57 -50 26 77 14 -27 104 111 147 112 20 40 -57
4919 -57 10 43 11 42 53 -38 11 37 -138 93 54 106 24 42 89 -146 4 -32 -47 -19 -48 -104 -59 -17 -74 -49 7 -8
4947 -8 -92 80 90 -21 69 -15 -90 -12 34 -94 -19 -63 -44 -42 -113 -107 38 44 39 93 -7 -58 18 143 -27 78 -105 -50
4975 -50 -48 91 8 -38 97 115 -12 11 142 18 52 63 16 -141 88 0 -98 -81 4 -32 -85 -44 -84 -61 74 37 0
5002 0 -52 76 -51 49 -103 -7 33 30 69 -48 -24 64 -18 -121 27 121 75 -32 -43 -50 25 53 -3 -113 -3 -138
5028 -138 -133 -65 -127 -15 -124 -47 1 -61 15 24 -50 -97 145 -31 -80 151 48 -37 27 -32 -41 -58 -75 -19 16 34 -34 -147
$$ packed form
4832I3j56J5K3J66k72K11j0p6O6m3m5q1K73k02qJ5j6L7k5M1l8P0l6J4L8rJ87k37
4860ej08J75j2m3n4k0L3o6Q7O2j5M9k4p4P0r5J01r7J20%rn8o9k0J59n6Rq4N3n2
4890d3M5O1n1Q9j25l0L3O4j03L9j4M4Q1k37m4R4M0PP6N1o3m1J31PL6l5r2K0r7
4919e7O7L3l2L1J1r1M9K6j75K31l9N2q2J8M7k35J50l6j5K8k9n6M5M2n7K5N6j5
4947hq4J72J0j11R0q4p5P8M6j28P5m4J9Kp1OJ45OnN4j00n1P6J25j70J05j83N5
4975e0KJ39q3m6J35J8j27K3J31j24L4J1m7j57K29q8r8J7Q5l6n3M1m0K3J35l7l7
5002@n2J28j27J00j52R6M0lL9j17K4Q8q2j03J48R4m6j07j1pP5K8n6j10J10j35
5028a38NO8o2J12j09P7M8o2P6Rp4m7K42j76m9K31j03q5O4n9rj7j7N6L5J8o8j13
$$ plain form
5056 -147 141 32 82 18 128 106 -16 100 -19 7 47 -78 66 21 41 -49 6 -66 79 102 89 107 4 -19 74
5081 74 21 92 -38 -164 -45 -44 -12 -58 -31 50 -122 -26 35 -42 -28 39 -51 59 11 11 -114 7 -14 -23 -1 -88 53 -26
5109 -26 -35 -25 108 -74 111 100 -90 27 -2 7 2 111 79 -44 -37 66 -13 -27 56 81 -142 -36 -39 -85 32 -41 37
5136 37 45 43 -51 -68 -108 -95 -137 -86 -94 39 -16 -26 -24 21 6 42 14 13 -13 51 -79 -8 -19 88 -44 -75 -28 -21 50 47 23 56
5168 56 113 -57 -90 -19 -13 -6 29 -32 26 12 103 -31 24 0 110 58 8 1 -44 -80 68 15 -3 -10 -120 -90 -51 -39 -50 -48
5198 -48 53 -12 -27 -37 -41 -119 -1 30 43 -73 141 32 41 61 8 -79 -39 133 136 -22 33 -46 -59 69 -11 21 -7 58
5226 58 8 26 -42 50 42 24 -197 -105 104 45 -88 -7 74 -45 -135 -32 55 -41 -53 71 -42 43 -108 67 15 -43
5252 -43 75 -32 -74 -4 66 -38 45 76 137 46 176 85 -21 87 56 15 16 -83 66 13 -40 8 -9 -2 33 -75 54
$$ packed form
5056a47K88j09N0o4J10k2j22J16j19K6M0j25J44m5K0r0N5p2J45K3j3J8j03k3R3
5081G4n3P1j30j26J19JL2m6K7Q1j72R6O1p7J4O7r0J10m8%j25J21k1rK2q7J41p9
5109b6rJ0J33j82J85j1j90J17k9RnJ09l2j23PJ03p9j4Q3K5k23J06lm6J17p3P8
5136C7Qkr4j7m0J3m2N1qJ33n5j0KM5j5L6k8jk6O4j30P1j1J07j32l1M7PP1lk4L3
5168E6N7j70l3P1OPL5o1N8j4R1j34N5k4J10n2n0pm5l6J48n3j8pj10L0L9J2j1K
5198d8J01o5j5j0mp8J18L1J3j16K14j09RK0n3q7M0J72Lj58N5p9j3J28q0L2k8O5
5226E8n0J8o8R2qj8k21R2K09n9j33Q1Q1j19r0J03Q7r6j2J24j13Q5j51J75n2n8
5252d3J18j07m2P0P0j04Q3L1O1r1J30r1j06J08l1m1Jr9J49n3n3M8j7PL5j08J29
$$ plain form
5279 54 104 -13 -38 51 -67 67 -54 23 -87 12 91 -68 -163 45 -30 47 137 42 25 -39 154 19 -111 3 88
5304 88 -173 -91 1 46 -35 55 23 15 -1 1 6 122 174 88 -25 30 -20 4 56 -72 -86 -59 -3 -85 -45 -73 -58 -136 10
5333 10 120 9 28 59 78 110 50 8 43 -124 -115 -73 -65 -11 -63 -89 -18 -1 -54 -16 64 123 -48 143 20 -11 17 -69
5361 -69 -38 -23 -22 -33 -53 -106 0 70 30 25 23 54 31 106 26 -32 -43 -1 -56 -45 -27 -142 59 55 8 -53 -1 -62 10 -13 -34
5392 -34 -21 -33 53 -84 -19 45 -49 -72 -20 8 -119 48 148 47 -3 -73 -7 24 -57 103 -62 162 -30 -23 13 74
5418 74 -99 -76 -21 43 165 -7 1 -107 51 -18 -29 12 41 57 59 33 99 -85 28 96 34 5 -46 -65 47 82 18
5445 18 65 18 -18 98 31 56 111 -57 61 133 -18 27 41 43 22 -37 -55 58 -86 45 -16 30 38 23 51 -99 -27
5472 -27 -50 17 -24 -78 -12 29 -54 29 50 88 70 -26 8 -90 15 51 -33 -4 4 -85 -11 -54 -12 -19 -65 66 -56 9 -6 43
$$ packed form
5279E4N0j17k5Q9j18J34j21P7j10R9P9j59r5K08p5P7R0r5j7o4J93j35j30J14Q5
5304H8k61Q2R2M5q1R0l2qj6KNJ16N2q6j13N5n0K4N2j28j4K7N6q2M0k8J5p8J46
5333A0J10j11J9L1J9L2o0m2L5j67RM2QN4n2k6P1J7n3L8Q0N9j71J91j23l1K8q6
5361f9L1J5Jj1k0n3J06P0m0nkL1k3P5q0n8j1M2n5J1J8j15K01mm7o1N2o1P2k3k1
5392c4J3j2Q6j37O5O4r4k3N2K8j27J67J00j01n0p0O6L1q1J60j65K24j92PL6O1
5418G4j73K3N5O4J22j72Qj08J58o9j1M1K9J6Kk6O6j84J13O8o2k9n1j9J12L5o4
5445A8M7m7l6J16o7K5N5j68J18P2j51M5J4Kk1n9j8J13j44J31o1M6Qj5K8j50P2
5472b7k3O7m1n4O6M1q3Q3K1L8j8r6L4r8J05L6q4K9Qq9P4m3M2pm6J31j22O5j5M9
$$ plain form
5502 43 136 -72 -57 51 28 5 -65 100 -116 -24 13 -41 26 77 -6 84 76 -54 3 -42 41 -120 -73 83 -38 27 -36
5529 -36 4 -31 108 -50 20 45 110 123 0 -23 13 44 26 -60 13 32 19 12 -67 -56 9 56 -26 118 42 2 9 22 32
5558 32 65 116 -18 8 36 -93 -152 60 -70 -52 -20 16 -61 -87 1 71 -35 -109 -204 60 -65 -40 -32 -43 4 85 -31
5585 -31 -70 -40 -36 -50 87 48 -48 4 -102 107 62 37 -23 21 -31 11 -8 35 63 99 85 -96 12 -7 2 22 -58 79
5613 79 21 -27 46 88 -64 -130 33 -5 9 -64 89 -17 7 21 -65 57 28 241 -142 22 -73 -48 5 71 -15 3
5639 3 33 81 -172 -92 -78 112 32 6 55 -80 -25 -8 -49 -42 -3 135 26 95 78 -70 -11 -116 -26 -45 -61 -16 60 -20
5667 -20 -25 -23 -5 -73 17 -100 -8 -115 0 69 -148 -62 -51 69 -2 -43 3 -78 -60 12 66 132 -32 -36 34 -91 -63 -6
5695 -6 -52 -20 31 -38 -39 38 -78 -45 -18 -5 -58 8 -37 -6 83 -24 -38 11 -40 56 -29 -20 49 90 -133 -85 76 7 -120
$$ packed form
5502D3R3k08J5J08k3k3p0J65k16R2L7n4O7N1q3R0qj30N7m5Q3j61M7J56j21O5o3
5529c6M0l5J39j58P0K5O5J3j23k3L6L1j8q6P3J9j3pp9J1O5M7q2J44p6m0PJ3J0
5558C2L3N1j34K6K8j29n9K12j30J8L2L6p7k6Q8P0j06p4r5K64j25K5Qj1M7Q1j16
5585c1l9L0Mj4J37l9r6N2j06K09m5k5o0M4n2M2j9M3K8L6j4j81J08j9RK0q0J37
5613G9n8m8P3M2j52o6J63l8J4p3J53j06K4J4q6J22k9K13l83J64r5K5N3O6q6J8
5639CL0M8k53Q0J4J90q0k6M9j35N5J7m1PL9J38j09O9j7j48N9j05R0j9j6M5P6q0
5667b0nKJ8o8R0j17R2j07J15O9k17Q6J1J20p1m1M6q1J8P2N4O6j64mP0j25K8N7
5695fm6L2N1o9jP7j16L3K7J3n3O6m5L1Q9j07j4M9n1R6q5RO9M1k23M8J61o9j27
$$ plain form
5724 -120 17 -99 -88 -61 -3 -26 26 13 84 -82 95 75 -76 5 -2 93 -48 13 -4 10 -12 -49 -48 0 -156 46 56
5751 56 14 -46 -210 7 18 -41 67 -9 2 -16 81 -31 88 -33 28 13 23 89 81 -33 -20 60 -34 29 -33 -75 132
5778 132 33 63 25 109 0 22 195 136 -101 -120 116 108 12 -35 -125 -34 9 81 -36 -8 11 -27 27 -14 -92 -41 -16 48
5806 48 -30 -3 45 -12 18 -28 -83 11 -134 -22 -114 -109 -61 41 -44 -43 -66 -31 36 6 -25 0 73 -30 -41 -25 -30 6 -104
5835 -104 -58 -86 114 107 -30 -154 -42 102 -22 -12 18 37 -28 -12 -2 -72 -48 17 -41 -13 -5 -13 -34 -29 -66 -19 108 22
5863 22 -11 -98 75 63 60 57 -6 -20 -19 -15 -1 2 -106 138 108 -105 -9 -40 -4 -3 36 -15 -20 159 -141 -14 37 180 -41
5892 -41 5 -65 -67 24 80 -114 -7 -52 -65 -67 -35 85 -104 -22 33 -88 51 152 10 -43 18 -27 -49 -49 -24 -91 -3 85
5920 85 -66 -34 11 1 109 -59 79 -69 -125 16 3 149 -22 -36 -40 24 19 20 123 -9 -30 -163 -40 -11 113
$$ packed form
5724a20J37j16J1K7N8k3N2j3P1j66J77k0j51Q1pR5j41O1j7J4k2l7JM8j56K02J0
5751E6m2o0j64K17J1n9J08p6J1j8R7j12J19j21O1j5J0O6qj14J3Q0r4O3o2m2K07
5778A32r9L0l8Q4j09K2J73n9k37j9K36qr6m7r0R1M3P2j17K8J9l8N4m1p8N1K5O4
5806D8p8K7M8n7L0m6n5R4j45J12r2NM8J02q5Jk3L5O7l0l1K5P3j03j1J6nL6j10
5835a04M6k8K00pj37j24J12J44j24J0L0J9o5J6J0p0K4O5n8K8Qqk1Nl7M7J27q6
5863B2l3q7J73j2llo3j4JMJ4Lj08K44l0k13R6l1L6JL9n1nJ79l00J27N1J43k21
5892d1M6p0kR1N6j94J07m5j3kL2J20j89Q2N5j21J39J01j42n3O1m5k2%K5o7Q8Q8
5920H5j51L2M5j0J08j68J38j48n6J41j3J46j71j4mO4nJJ03j32k1j33J23K9J24
$$ plain form
5945 113 41 12 44 -64 75 40 2 -52 -92 13 -51 103 -121 66 75 6 3 9 77 -49 -118 17 45 -187 24 -13
5971 -13 -1 -17 71 -48 23 32 -16 80 52 228 -39 46 1 -51 -50 -74 -66 33 53 -32 20 68 18 23 -93 46 2 -83 41
6000 41 4 103 -66 -63 43 -70 -92 46 142 -122 106 -68 -1 71 -82 -6 13 -152 -49 -81 106 88 -14 63 -52
6025 -52 12 5 6 -56 10 -2 -72 68 3 38 102 -15 -7 73 22 53 -107 -67 82 -15 -93 -18 -28 12 -11 -118 -44 14 -103
6054 -103 -55 79 -76 -47 51 -62 38 73 -10 62 9 87 -106 -48 86 7 -4 56 66 -143 -48 2 -97 49 140 -51
6080 -51 -58 68 -67 28 9 82 -19 48 -68 21 -75 20 79 -63 -70 35 -162 -112 7 44 -115 -4 86 -50 40 21
6106 21 -46 28 14 -68 48 32 -62 -59 46 -21 -28 66 -11 135 8 -32 -12 -23 -49 34 -88 -22 -7 6 -37 21 44 -42 2
6135 2 -44 1 -25 185 5 -4 68 -167 20 26 -20 -69 -14 -67 -102 -46 32 77 27 -113 -17 -169 15 117 35 17 -37 -29
$$ packed form
5945A13p2k9L2j08J39l5l8n4m0J05o4J54k24J87Ro9lOO8j26o9J35K8k32K11l7
5971a3J2j6Q8j19P1Rm8R6k8J76k67Q5m5n2Jk4QR9K0q5N2M8n0Nj16J39m4q5J24
6000D1l7R9j69LJ06j13k2J38R6k64K28j74O7P2j53P6J9j65J03l2J87j8j02P7j15
6025e2O4pJo2O6j2p0J40o5L5O4j17QQ0n1L1j60M0J49r7p8P5j0M0k3j07P4N8j17
6054a03M8J34j55K9R8j13J00L5q3P2n3P8j93N8J34p9j1O0J0k09R5N0r9J46R1j91
6080e1pJ26j35R5j9P3j01O7j16Q9r6R5N9j42pJ05j97N0J19L7j59J11R0j36R0j9
6106B1o7P4j4q2J16j6r4LJ05o7pR4p7J46j27m0K0j1k6Q3j22O6J5J3m3N8K3q6M4
6135Bm6M5k6K10j80rP2k35J87Om6m9N5n3l5N6P8M5n0j40R6j52J84J02q2j8n4Q
$$ plain form
6163 -29 68 37 50 38 32 69 -98 -102 -22 27 -21 -85 33 9 -62 45 139 2 -141 20 26 61 80 -86 94 -93 -120
6190 -120 33 -82 -143 -186 37 7 34 -79 48 87 -81 -79 -38 -83 -56 41 -28 24 -70 4 -43 31 -64 18 -67 -33 104
6217 104 -27 -31 127 -9 -63 35 93 38 112 -1 -64 1 52 19 -52 7 32 41 -37 118 17 105 19 -9 -101 1 -97
6244 -97 -53 -98 -61 -70 -75 38 -19 -64 -50 127 79 47 106 9 53 11 -77 -52 -3 67 -73 9 121 -94 53 -94 -58 8
6272 8 -18 -33 -60 -52 -38 91 -57 26 -58 -25 -112 17 -46 9 -34 19 -34 70 -28 -5 51 -45 134 -190 -88 -98 -146 -115
6300 -115 76 -81 -103 12 12 -58 6 -79 -56 -40 -99 -41 -92 36 26 93 -57 55 -78 4 -41 -36 -36 132 45 85 9
6327 9 44 76 46 65 11 -110 -66 41 53 29 -75 -61 -4 -27 30 49 -63 -44 -69 -35 97 -19 -32 -81 -75 -109 5 -40
6355 -40 -26 -52 18 43 69 -12 -14 89 -38 -24 19 -70 9 68 -37 -9 -91 -49 74 -27 6 -190 72 51 -46 19 -19
$$ packed form
6163b9R7l1J3j2oL7j67mQ0M9m8o4J18k4p1J07R4j37j43J61OL5J9j66J80j87k7
6190a20J53j15o1m3K23l0K7j13J27L9j68KM1m5K7R7o9N2r4P4m7P4r5Q2q5L4J37
6217A04j31mJ58j36n4R8N8n5P4j13o3O5N1l3p1N9K5Rp8J55j01Q8q6k8r2J02r8
6244i7M4m5L7rnJ13n7m5J4J77m8l2N9r7M4m2q8K5M9P0j40Q2J12k15J47j47L6O6
6272Hk6j5k7QJ4J29j48Q3q4L3q7J29o3N5m3N3n3J04r8K3N6r6J79l24J02j0m8L1
6300a15J91j57k2J15%p0O4q5K3J6n9N8n1J28j0O7j50J12j33Q2m5N%J68q7M0p6
6327IL5L2l0J9n4j21M4J07J2k4j04J4N7k3N7J9j12J9k5L4J32j16j3m9Ol4J14m5
6355d0J4k6P0K5K6q1kJ03j27J4M3q9P9N9j05K8q2M2J23j01L3j96K62k1r7O5l8
$$ plain form
6382 -19 106 124 -57 -19 -14 3 -37 32 -5 23 -76 -126 52 169 -20 -10 52 -95 -107 -66 85 -34 -39 -33 -61 36 -48 30
6410 30 -114 65 71 -35 43 -8 -1 12 51 28 12 4 14 32 80 95 -44 -59 57 -37 -17 45 -19 -132 -71 18 -48 75
6438 75 -55 -38 12 52 -64 81 -23 -11 -88 -13 126 -44 98 60 -17 -54 59 78 37 -52 57 40 -102 11 -29
6463 -29 -5 -51 -31 -24 -128 -104 -41 -32 29 51 -28 54 -79 6 14 -52 49 -51 -98 -47 -39 20 42 -47 -61 -67 50 44 17 -79 53
6494 53 6 42 5 150 -25 16 -38 -67 86 -46 57 92 52 54 71 -4 131 28 61 72 -53 58 130 -75 105
6519 105 -117 86 -12 26 -26 52 -8 -18 47 11 20 -18 56 52 -17 9 8 29 -104 -15 -43 -60 5 -120 -6 4 -67 81
6547 81 6 -17 58 70 9 -17 0 -39 -38 -20 -122 -12 -29 9 -41 -11 40 -22 -15 162 -56 2 -105 -25 -15 -10 83 -35 -112
6576 -112 -40 -33 -41 -72 34 142 110 -12 16 -77 80 24 76 -65 -51 54 -77 -129 -92 -6 53 -53 6 -1 -48 89 41
$$ packed form
6382a9J25J8j81L8NJ7m0O9l7K8r9n0J78J17j89J0O2j47j2M1J51j19nOk8R7q4P8
6410C0j44J79Oj06P8n1PJ3L9k3j6qJ0J8M8J5j39j5J16r4K0O2o4j13O1Q9o6J23
6438G5j30J7N0M0j16J45j04J2p7P5J39j70J42l8p7l7J13J9m1q9J09j7j42J13m0
6463b9K4m6K0Pj04K4O3RO1K2p9Q2j33Q5Qo6J01j00m7N1QN9K2q9j4oJ17ok7r6J32
6494E3m7L6l7J45j75M1n4k9J53j32J03L5m0KJ7p5J35j03L3J1j25J11P2k05J80
6519A05k22K03r8L8n2P8o0j0O5l6Rl8P4mo9K6jK1j33Q9k8j7O5j25J14J0p1J48
6547H1p5k3P5J2o1k6J7l9JJ8j02J10j7L8n0L0N1o2PJ77k18N8j07Q0J0NR3j18p7
6576a12P2Pql1J06J08l2j22K8r3J57n6N2j41J4J05j31n2L7Q6N9j06N9pm7J37m8
$$ plain form
6603 41 192 13 -157 -59 22 -64 -70 24 -39 34 -70 -16 13 -101 65 37 38 145 -28 39 -80 75 -81 -36 -6 -10
6629 -10 -72 -104 -134 20 56 -66 -114 35 68 73 -21 30 -7 -120 -109 -108 -156 -36 47 16 -4 31 -44 14 -1 27 85 37 33
6658 33 -63 104 51 44 -9 -28 -116 -57 21 -6 -85 -8 -41 15 -76 -85 32 -58 43 -24 42 -65 -137 -87 -18 -128 73 85
6686 85 3 -81 28 14 67 48 49 91 -60 -4 -142 -126 -51 -85 -48 -38 50 41 109 -61 56 -102 33 63 -13 -8 -2 -9 75
6715 75 28 -9 -26 92 -37 -9 70 78 -62 -31 59 -91 -62 -4 -25 9 -62 46 49 -137 -112 -42 1 -28 -75 -19 -115 -17
6743 -17 -31 -132 69 -15 -66 93 104 108 -27 66 75 -71 116 13 37 -3 74 -107 61 -52 -16 -130 -29 -28 -88 -65
6769 -65 29 -69 51 -36 -70 -25 -43 -158 -142 -38 41 45 -58 -73 -127 38 81 149 -80 109 27 88 24 17 -73 3 53 -34
6797 -34 -81 -109 20 -60 -69 -10 -15 -21 -28 26 10 85 28 8 -5 110 90 -62 47 -73 -39 14 -16 -118 -102 148 12 82
$$ packed form
6603D1J51j79j70R8Q1q6oR4o3P3j04N4K9j14J66k8JJ07j73O7j19J55j56M5L0m
6629a0o2l2l0J54L6j22m8J49L3Nr4N1l7j13J1Jm8J20Q3l1k0L5p5N8j5K8N8m8m
6658C3r6J67n3pn3j9q8N9P8k7p9P7l3N6r1rJ17r0J01o7O6j07p2N0O9j10K01J2
6686H5q2q4J09j4N3j9JM2j51N6j38J6P5l4L7J0Q8rO8j70J17j58J35L0p6NOpQ4
6715G5m7l7j7J18j29K8P9Qj40L1R0j50K9N8k1L4p1J08Lj86K5P0M3k9m7N6r6R8
6743a7j4j01K01q4n1J59J1Mj35R3Rj46J87j03K4m0P7j81J68j13L6j14J01Jo0K3
6769f5R4r8J20q7l4M5j8j15J6J04P9Mj03j5n4J65M3O8k29J89q2O1o4pr0P6N0q7
6797c4m7k8J29q0rN9nopN4j6P5n7k0j3J15k0j52J09j20L4N3l0j02J6K50j36P0
$$ plain form
6825 82 88 -12 29 -42 83 90 84 -54 32 -18 92 -12 -19 -19 -16 -39 37 45 7 -64 38 107 89 -78 -101 -74 125 -72 -10
6854 -10 -9 69 -28 48 37 63 81 -63 46 33 -9 63 34 -59 -65 -81 41 -32 -71 41 -62 -40 -24 2 -50 19 -10 -117
6882 -117 -14 55 -21 -72 -14 -83 8 -6 47 109 104 -22 -81 94 -29 143 65 -3 41 -52 81 -8 -3 -117 -8 33 45
6909 45 76 -39 -43 29 98 70 40 59 -114 8 -69 -4 -58 -79 47 -56 -14 6 -62 78 -106 113 37 43 -77 -20 -28
6936 -28 -60 -97 -44 -28 -48 -3 23 -68 118 -62 -2 191 16 38 37 10 27 -26 3 0 -10 7 -149 -28 -34 -170 -84 87
6964 87 104 -105 -61 -112 -69 -11 29 20 50 -77 24 -2 56 46 -94 -117 -31 -82 0 19 -21 -56 92 105 87 35 -5 -21
6992 -21 98 5 127 -46 15 128 30 37 61 -59 -7 -29 34 -78 136 81 93 -160 -56 69 -4 -45 -66 -42 50 -14
7018 -14 60 -31 -17 50 -5 12 29 93 77 -79 -106 -46 -31 7 135 -171 71 43 -51 19 -40 49 -65 98 -36 104
$$ packed form
6825H2Oj00M1p1J25Poj38Q6n0J10j04p%Lk3P6Ql8p1J02O9j8j67k3K7J99j97O2
6854a0JP8r7P6j1K6J8j44J09j3m2P2k9r3oj6J22p3l9J12j03K2J6K6n2O9k9j07
6882a17J03O9p6n1N8o9R1j4N3O2nj26n9J75j23J72p8o8M4r3J33q9Nj14J09M1J2
6909D5L1j15mP2O9k8l0J9j73J22p7O5n4k1J26j03M2K0o8J40j84K19p6Oj20N7q
6936b8l2l7N3J6k0M5K6r1J86j80O0J93j75K2jk7J7n3K9lj0J7j56J21oj36Q6J71
6964H7J7k09M4n1M3N8M0rL0j27J01k6N8j0j40k3Q6n1Q2J9m0l5J48J3j8n2m0j6
6992b1J19r3J22j73O1J13r8PK4j20N2k2O3j12K14n5J2k53J04J25p3m1k1K4R2o4
7018a4P4r1J4O7n5J7J7O4j6j56k7O0J5L8J28l06K42k8r4P0n9Q9j14J63j34J40
$$ plain form
7044 104 59 29 1 56 139 4 -11 -73 26 -80 -4 -17 -71 -26 -8 -12 -14 -44 -4 9 -21 29 74 52 -21 -98 51 40 4
7073 4 -51 -23 5 33 61 -75 -83 -75 31 -24 120 128 -24 88 -54 5 5 45 -28 133 85 -43 -9 -17 -171 92 50 21
7101 21 50 -38 -33 83 2 28 -102 -65 -99 -31 23 9 -12 -22 47 -23 36 -47 15 14 -23 110 -86 -114 22 59 33 0 122
7130 122 31 -66 200 94 143 22 139 101 42 53 21 -10 20 162 26 -18 -61 -54 -11 80 19 -32 60 -47 70 -29
7156 -29 33 -74 -2 -39 -14 -44 -73 -93 -58 23 74 -47 -113 80 -3 -77 35 37 -121 100 -3 35 -36 104 37 -118
7182 -118 -44 -44 -41 -1 -44 -48 53 -20 -97 -19 53 40 36 -62 21 -90 -46 -10 -23 -69 37 -6 -115 78 31 33 -78 -15 28
7211 28 -55 -45 78 12 -21 49 -42 -30 31 -35 -14 36 52 50 -1 3 59 40 -27 -46 -86 7 19 -37 -17 19 -70 114 91 -80
7241 -80 49 11 8 19 73 82 -5 -105 -6 58 -24 76 -15 -82 -15 26 108 72 -57 -10 49 1 -11 77 -2 -126 -111 -99 19
$$ packed form
7044A04m5l0k8N5Q3j35j5o2R9j06P6j3n4M5J8mkl0M0J3l0N0M5k2p3p7J49j1l6
7073Dn5K8K8K8K8j36qQJ06n5J44Qj52J12j42N9%M0p3J61m8j28L4qj54K63m2k9
7101B1K9q8NJ16q1K6j30L7l4O8N4j4k1j0O9p0N9q3O2jl7J33j96k8J36L7k6l3J22
7130A22r1r7K66j06M9j21J17l8n9J1l2l1L0J42j36m4m3PM3R1o1n1R2j07J17r9
7156b9O2j07P2l7K5l0k9k0L5Q1N1j21o6J93q3p4J12Kj58K21j03L8p1J40o7j55
7182a18P4%LM0m3mJ01p3p7P8P2j3mr8Q3j11M4L6j3m6J06m3j09J93m7Kj11O3M3
7211B8q3J0J23o6l3P0r1J2O1o6K1N0J6kn1MN6j9o7j9m0R3J2n6K0L6q9J84k3j71
7241h0J29l8lJ1N4Rq7j00R9O4q2J00r1o7O7M1Q2l6j29M7N9m8j2Q8p9j24J5J2J18
$$ plain form
7270 19 33 103 40 12 8 108 1 -14 -9 -4 107 -213 48 -8 105 126 -110 29 -55 -66 -36 -123 -146 -126 76 -130 -73
7297 -73 11 58 -11 2 33 -114 31 -108 3 -65 3 53 -41 -63 33 -34 51 -33 86 65 -17 71 -38 -31 -49 -44 -26 -22 -30
7326 -30 -99 -31 -89 -5 -11 -159 17 -82 96 -27 1 91 -8 153 68 77 -2 -89 9 -41 20 47 -5 -36 123 21 3 -46
7354 -46 5 51 -7 15 48 -19 -53 25 40 28 -3 7 71 -53 -34 -39 -25 -56 37 -43 -120 111 108 -2 -8 85 210 -28 -132
7383 -132 -53 5 -18 20 -77 29 91 129 -154 -54 84 -69 1 84 36 2 18 -1 -56 -110 52 20 -5 7 -5 -24 -101
7410 -101 -11 -34 -135 0 -61 54 -55 3 -2 25 -139 -66 -4 11 -50 59 -106 36 96 -60 -49 -9 13 83 -12 -26
7436 -26 -29 18 39 9 23 65 21 -16 15 -45 -24 22 15 -60 -47 14 -37 -54 -101 4 24 -74 -81 12 55 -122 -4 63 -32 57
7466 57 -12 180 -8 40 -57 -13 -46 -4 -74 -117 9 -13 -62 160 94 100 109 52 -38 -89 105 -67 -48 7 102 19 -15 25
$$ packed form
7270A9J4P0o3k8mJ00j07j5NNJ11l20K61n6J13K1k36J39q4j1L0q7k3K0K02k06N7
7297g3Q4M7o9J3L1j47J45j39J11o8O8N0r4k2R6o7Q5q4J19k1q2Q8j09Pj8NJ8Mq
7326c0o9O8n8Q4oj48J76r9J78j23K8R0r9J61q5Rp9q7R8n0O1K7n2l1J59j02j8m9
7354d6N1M6n8K2L3o7l4P8J5j2l1J0O4j24J9nJ4l1R3q0p7K31lj10oR3J25k38j04
7383a32P9N8k3L8r7J06O2L8k83J00J38j53P0Q3m8l4J6j9n5n4J62l2k5J2j2j9p7
7410a01R0k3j01J35o1J15j09N8nK7j64P3O2J5o1J09j65J42O0j56J1M0K2P0r5j4
7436b6lM7K1l0J4M2m4l7L1o0K1M6pp5J3O1n1j7m7J05K0r8pR3M3j77J18O7r5Q9
7466E7o9J92j88M8r7M4l3M2p0m3J26k2m9K22o6ORn7r0n1J94j72J9N5R5q3l4M0
$$ plain form
7494 25 -105 -82 -33 -36 76 21 -39 -40 -95 7 100 -73 2 -19 -92 55 55 -48 -63 30 -39 48 -16 79 56 25 62 56 -54
7523 -54 -46 32 -52 -7 74 -73 4 49 97 -29 10 7 -14 154 -68 -31 35 -54 -24 -187 66 26 -74 63 55 -73 -66 41
7551 41 25 -60 -39 87 9 107 147 23 75 -46 0 42 38 12 -49 -87 42 106 -119 95 25 85 -34 17 -13 24 -38
7578 -38 -84 31 -143 -77 -119 -54 90 -116 -3 -116 -8 -62 -21 42 -81 -31 -51 -28 25 94 66 -20 -47 -21 -40 -127
7604 -127 -38 4 -86 68 -8 5 -116 56 54 -82 -32 -12 -50 12 -57 -10 -30 34 118 -156 60 -63 16 21 72 20 59
7631 59 80 -18 75 -19 -6 82 98 3 1 27 -63 -79 -40 -42 23 11 69 -91 -50 47 82 -42 -33 -26 -35 3 -53 40 -31 35 38 55
7663 55 49 -30 -23 -3 -5 -29 88 105 34 -55 -21 -51 69 -30 -40 -41 -33 -111 23 100 -83 88 54 30 61 64 -37 -98 -15 6
7693 6 -43 -148 129 -31 50 -77 -104 -68 63 90 48 80 -21 117 -97 -1 21 134 53 58 -96 77 94 -120 -35
$$ packed form
7494B5j30K3M9lJ12n5o0jn5J02R3j73P5k1p3J47%j03j5R3o9Q7o4R5k3l1L7oj10
7523e4QP8q4M5Q1j47P7M5M8j26L9lk1J68k22L7O6q9L0j63K53m0j00J37qj28PJ07
7551D1j6q5K1J26p8R8M0j24N2j21M6M2mk6o1l8J29O4k25K14p0O0j19N1l0L7o2
7578c8m6J15j74O6m2O5J44k06J13j13J08n4M1O3j23N0k0K3N3O9k8q6k7K6j9q7
7604a27Q9M2r0J54p6J3j21J72kj36N0K0l8O2o9M7k0O4Q4k74K16j23P9NN1n2L9
7631E9K1r8R3r4J3Q8J6r5kK6r0j6L9kO5j2N8j60M1R7L5j24RPrL8n6R3p1O6LJ7
7663E5op9PK0kk4J17J7p1q9L4l0J20r9j0jQp8J34P7j83J71l4k4L1Lj01o1Q3K1
7693Fm9j05K77j60Q1j27k7L6J31K7m2L2j01J38k14R6K2J13q1Nj54J73J7k14Q5
$$ plain form
7718 -35 -30 -19 34 -30 86 -72 97 195 -32 -45 -84 -78 -13 54 -6 83 33 19 -18 14 6 -19 -36 22 12 -22 64 37 9 -60
7748 -60 -25 85 -58 -106 -51 -16 -72 41 -15 56 62 58 48 81 38 147 -45 -34 17 -114 -106 -141 9 54 102 73 67 13 98
7777 98 25 72 152 12 -25 178 -17 -51 -65 -13 -51 -52 -2 43 -12 19 39 -58 23 -34 39 -65 20 7 40 75 -13 -112 21
7806 21 -55 -37 -54 9 86 24 16 29 -61 0 24 -35 -92 49 21 17 -121 50 -56 4 145 -20 76 9 -35 -122 -10 77
7834 77 66 67 -25 102 -40 46 6 -92 -16 -44 29 -53 14 158 -126 26 38 102 -61 -63 -11 0 36 79 122 -81 7 -23
7862 -23 -61 -49 6 -14 3 27 65 -36 27 113 -42 13 57 -52 14 31 -65 14 -4 -76 -104 166 61 12 -33 34 133 67
7890 67 -74 -11 -49 -98 -121 63 -128 24 136 -45 -56 -91 -103 75 -25 54 97 8 155 61 49 47 -73 37 -66
7915 -66 -42 -39 2 14 -1 7 -13 107 -45 19 -9 45 -33 59 22 23 -131 18 -3 -60 3 88 -41 -82 94 -65 -1 87
$$ packed form
7718c5NJ1N3o4J16j58J69R8k27j3l9OO5O7o0Q9n0j4l7L2qk5j7N8j0l4Q6k7k8o9
7748f0L5J10j43m8N5L5n6J13n6P1Omj0L3m3J09j92J1N1j31Ql5J50M5M8k9on4Q5
7777I8p3M7Q0j40l7K03j95l4j4N2l8jN0M5n5L1K0r7Q1n7P3j04Q5j3L3L5q8r9J33
7806B1p6J8j7O3P7o2qJ3r0O1K4n9n7J41k8mj38J71j06O0J41j65R6o7m4q7J12Q7
7834G7j1Jr2J27j42Q6m0r8P6k8P3q2O7J44k84J52J2O4j63kN2J1L6M3M3k03Q8l0
7862b3l8J2N5k0J7K4L8j01O3Q6j55N5M4j09O6J7r6P9j8p2k8K70j05m9m5O7R9o6
7890F7j41O3l8m9k3J84j91J52J12j81j1l5j2J78j00P9M3q9J47r4j2kj20J10j03
7915f6K4LM1J2j5Qk0J20j52O4k8N4p8R2l7Jj54J49k1n7O3Q5j29m1J76j59O4Q8
$$ plain form
7943 87 -6 -17 22 -36 -15 -126 -10 13 45 0 35 -120 -60 93 57 -15 25 52 110 44 71 -71 -8 -27 -62 42 3
7970 3 13 -84 -20 -31 -10 24 79 -1 -44 -71 51 8 3 -8 -23 47 79 60 -77 29 11 -110 -59 -32 60 73 39 -10 -25
7999 -25 -46 -35 53 -42 82 -85 29 -100 -134 -2 -112 -110 -61 27 -20 16 -74 72 51 -9 -38 -11 20 -16 -56 -80 139
8026 139 -61 20 -42 -40 43 -63 71 74 -135 13 -104 -91 -36 -2 6 15 -70 -74 20 46 67 9 -34 116 34 -127 69 55
8054 55 -76 37 58 -160 -31 -55 -49 2 6 -124 -18 -131 -4 -59 9 29 29 -6 39 -68 -122 -8 79 11 -112 -39
8080 -39 -25 -168 -31 71 -30 14 12 7 -47 44 -39 -12 55 33 26 58 94 39 -76 50 97 -47 -47 -88 12 112 -30
8107 -30 -70 -30 129 42 76 -125 37 -9 -32 -20 19 39 -28 2 22 -44 -92 -1 12 97 -13 -10 1 52 -79 -74 55 -87
8135 -87 -15 59 -28 41 38 42 -46 10 -235 -84 -32 -34 -18 25 -86 -18 -111 41 -68 -4 11 -57 8 -63 12 -31 -63 37 -150
$$ packed form
7943H7r3j1L9n8K1j11J16K3L2m5L5j55O0J53l6p2M0K7N8o6K7j42O3j9l5J04l9
7970CJ0r7O4j1K1L4N5q0m3k7J22m3nj1j5P0L2j9j37J06j8j21N1K7R2J3l4m9j5
7999b5k1J1Q8r5J24j67J14j29l4J32j10KM9Q8m7L6r0J46k1o0k9K7L1l6m0k4K19
8026A39k00Q1o2KQ3j06J34Lk09J48j17J3N5L4QRq5mR4K6K1n8m3J50q2j61J96j4
8054E5j31J13K1k18J29k4ON1Mj30J06j13J27n5O8K0%l5M5j07n4J14Q7o8j23P3
8080c9J4j43J37J02j01M4knn4R1q3K7O7k2pL2L6n5j15J26M7j44%m1J00J00j42
8107c0m0M0J59q7L4k01J62m6k3J2L9K0o7L0K0o6m8R1J3Q5j10LJ1N1j31NJ29j42
8135h7P2P4q7O9lMq8N6k45J51N2kJ6M3j11O8r3J52j09O4J5o8O5p1P5m3l2J00j87
$$ plain form
8164 -150 -45 58 -8 -131 79 64 70 25 -94 65 27 48 -33 -34 -38 -92 73 57 -159 125 55 41 61 -44 -77 -26
8190 -26 -28 -39 33 -118 50 52 76 43 -34 -71 0 -13 -91 -116 -12 29 -26 -83 48 -85 -151 52 25 207 59 -106 -84
8217 -84 -74 24 -176 -14 16 -15 23 14 59 36 -81 3 -210 -33 -49 -26 133 -11 -64 -13 83 63 7 31 66 69 -4 63
8245 63 11 54 -32 -52 -50 54 25 1 88 -55 41 -59 38 -35 -68 -40 -79 -135 -208 28 62 31 -29 28 125 20 30 103
8273 103 -33 53 55 -7 72 60 52 -2 -67 57 -71 -116 109 113 109 79 62 69 -54 25 23 -72 40 145 15 -13 4 -62 37
8302 37 -43 1 -13 57 -50 -54 69 -112 -89 -7 29 -20 -75 40 -14 -32 28 122 -63 42 22 35 -38 -12 22 84 -23
8329 -23 35 -33 36 108 7 -49 6 6 -47 -58 -16 42 -34 -2 94 14 25 59 -72 24 109 -37 -111 -33 -21 -46 -1 4 15 -125
8359 -125 173 -35 67 68 -157 -39 -9 31 25 -119 57 -5 60 89 -62 -73 -51 136 -19 -12 97 97 -6 132 26
$$ packed form
8164a50J05J03o6j23K10j5Om5j19J59l8K1q1jmn4J65j6k16K84p0j4K0j05l3N1
8190b6kj1P2j51J68KK4l3p7l7P1j3p8k5J04M1n5n7J31j33o6K03k7J82j48j65K2
8217h4J0R8k00J62L0l1L8rM5k3j17Q4k13J77j6K3J59j44n3N1R6k0n6K4L5Lp3O7
8245F3n2M3q6k0KJ04k9k4Q7j43R6j00R7p3l3K8l9n6p3K36L4l1o0N7R7j05J0P3
8273A03j36Q6Ko2P9j2qn4o5J24j28m5K25Mml0j7Pj23P9kr5J12J05j30k8J7o6R9
8302C7q0M4j4P0j07mJ23j81K3Q2L6m9n5J15n4j8O0R4j85J05k0J3p3K6L4O2j07
8329b3N8o8O9P2j01n6N5%n3j1M2N8p6L2R6q0J1L4j31R6Q5j46p4P8J2k5M5NJ1j40
8359a25K98k08J02Jk25J18L0M0oj44J76o2O5K9j51j1K2J87j55PJ09%j03J38j06
$$ plain form
8384 26 3 111 5 -5 6 -54 -59 -61 -22 28 -9 -101 78 34 5 -32 -41 -100 -4 64 94 -5 -16 -30 -113 -86 8 -34 -93 -63
8414 -63 -123 -71 -30 17 -60 -80 -31 15 94 -104 14 -37 131 59 -77 56 68 -47 -28 -14 52 -79 -60 8 79 -5 -35
8441 -35 55 -119 68 -15 -80 -56 0 -8 -13 -88 -35 -147 90 80 138 -10 19 -29 30 5 38 -27 -84 6 -55 6 60 -21 -8
8470 -8 30 15 10 11 -45 -84 15 -69 25 -58 83 122 1 48 39 -97 -33 131 -12 31 -66 3 19 96 -15 84 -1 66 -57
8499 -57 -2 62 32 -53 -14 -41 21 9 -92 65 -5 17 36 12 -4 -79 90 -61 44 45 21 -33 41 20 21 -3 26 58 68
8528 68 -122 111 -51 93 40 27 -13 27 -158 54 -67 113 -78 24 81 121 18 -72 -59 -22 -61 -57 -4 -7 -24 -70
8554 -70 11 -13 -62 14 -41 -44 29 -71 -69 -9 65 34 -33 81 96 2 98 47 65 -25 67 -38 -45 -95 34 -5 -3 -23 55 19
8584 19 171 146 27 89 34 31 32 47 65 -18 -71 -1 -89 -36 -26 78 7 -57 33 -14 -59 100 62 41 34 23 63 30 40 -44
$$ packed form
8384B6k3J08j06j0J1o0nkL9N0l7r2J79m4k9l7rn9R6O8L0r9j1j4q3K7R4m2n9L0
8414f3o0N2M1M7p7k0M9M6P9j98J18n1J68p2j36J33J2j15J9J4O6j31J9O8P1q4l0
8441c5R0j74J87q3o5K4N6qnp5N3j12K37j0N8j48K9m8N9k5L3o5n7R0o1O1N4q1J3
8470hL8j5nJn6l9R9q4R4q3J41L9j21M7rj36O4J64j43M3r7O9J6P7j11R9q5O7j23
8499e7N5O4l0q5L9k7O2j2j01J57p0K2J9k4j6p5J69j51J05Jk4n4P4k1Jk4K9L2J0
8528F8j90K33j62J44n3j3m0M0j85K12j21J80j91J02N7M0j03r0J3L7l9MN3lj7m6
8554g0Q1k4m9P6n5lP3j00KO0P4l1o7J14J5r4R6n1J8r0R2j05pn0J29l9Kk0P8l6
8584A9J52k5j19O2n5lJJ5J8q3n3P0q8N3J0J04p1o4R0m7m5J59l8k1pj1M0l3J0q4
$$ plain form
8614 -44 -3 2 -137 56 19 6 -49 25 53 -59 -34 50 68 -138 28 25 91 22 -38 -18 26 73 48 126 87 -7 45 -44 118
8643 118 -41 48 99 17 -31 -66 -32 -19 -85 28 32 9 -14 23 -40 -78 33 -69 9 43 8 -77 194 -14 -66 48 -91
8670 -91 98 7 49 -159 -154 81 -6 -92 -20 -21 38 -38 10 -18 -86 45 -22 -71 4 86 -31 5 90 41 35 62 112 -43 -43
8699 -43 65 48 7 -41 4 -113 -36 -161 128 46 54 101 -94 -73 62 21 -30 59 4 61 -23 47 12 106 106 36 -46 19
8727 19 -20 -3 121 31 42 -72 -7 -59 47 -113 86 72 -52 52 46 16 106 34 -7 43 -14 65 21 -49 61 175
8753 175 125 -42 31 30 63 18 18 -19 37 -107 -31 46 48 2 57 -35 55 46 -103 -43 106 36 -8 -106 56 94 25 77 35
8782 35 39 0 3 -55 71 25 -15 -47 -10 -106 -63 18 17 -12 9 -65 -85 -57 50 149 142 -37 59 1 15 35 5 -119 -65 -105
8812 -105 7 6 79 70 -28 43 39 10 105 64 -64 69 121 -34 -124 136 -36 -119 -156 44 -100 -22 11 -98 4 -73
$$ packed form
8614d4M1Nj39J93l7j3n5P4K8j12K5Q4J8k06J66lO6o9o0K0M4M7k5P8l9r4N2q9J62
8643A18j59Q9N1q2m8l5L4J3o6J13Mk3k3L7o3l8J11j02P8L4l5q5K71k08n2J14j39
8670i1J89r1M2k08NK35q7q6P2jN9p6M8k8o8J31o7m9P5Q2j17L6Q5m9oK7N0j55%
8699d3J08j7m1m8M5j17P7j25K89q2QM7j95K1J35m1n1Q9n5N7q4P0l5R4%p0q2O5
8727A9l9J7J24r0J1j14O5n2J06j60J99j4j24J04ol0R0p2m1N0n7P9m4p0J10J14
8753A75n0j67P3jL3m5%l7N6j44P6P7Km6N5r2R0rj49O0J49p0m4r8J62L8o9N2m2
8782C5Ml9Ln8J26m6m0l2L7r6M3Q1jk9K1p4k0K8J07R9pj79R6n8J4K0l0j24N4m0
8812a05J12jP3rr8P1mk9R5m1j28J33N2j55r0K60j72q3l7K00j44P8L3j09J02p7
$$ plain form
8838 -73 5 -25 -5 29 10 45 -83 58 -57 32 -27 -14 37 13 56 -84 49 34 33 55 -43 49 -16 128 100 -14 -47
8865 -47 -103 -12 16 76 -92 -77 12 -82 -143 7 4 7 78 -60 22 -66 -23 -24 82 -59 -257 51 -91 48 -38 13 -123
8892 -123 68 42 108 -11 -51 4 -34 -49 74 104 -78 -209 0 -75 38 31 89 -147 -15 30 -38 41 -6 55 17 5
8918 5 23 45 117 4 74 7 -96 -137 -13 -48 -50 71 -7 40 -65 -10 -2 66 6 14 196 -51 87 15 -2 -159 -62 -139
8946 -139 -115 13 36 8 9 52 22 32 37 67 -128 -11 81 -11 3 -48 6 -51 77 51 43 1 15 -8 67 11 11 -60 23 66
8976 66 85 55 33 -3 -38 3 114 -92 -33 -19 -64 92 -19 48 74 177 11 5 77 172 49 19 -26 26 -39 -27 93
9003 93 31 58 -39 20 92 -19 -62 150 115 63 -22 -15 0 21 -36 -20 65 49 40 3 -7 -96 12 18 -2 -94 72 28 -58 -73
9033 -73 38 4 62 28 52 12 80 36 -3 62 26 5 40 106 42 -56 9 79 -81 -2 102 -167 30 50 111 -44 88
$$ packed form
8838g3P8l0K0L4j9L5j28J41j15Q9n9J3N1k4M3j40J33j5jK2r8R2o5J44k8j14l3
8865d7n6R1K8O0j68J5Q9r4o1J50lLP1j38Q2q8M3jJ06j41j98L08j42J39q6N1j36
8892a23J91k6O6j19m0N5l8j5J23L0j82j31K09p5J13pN8k36J32M5o8P9m7O1l8j2
8918EJ8K2P2j13P0o7j03m1J24l5kJ21p8M7j05N5QO8o0QJ82k47J38p2j7j57R7p7
8946a39K4J28K3k8JM3l0J0NL0j95J17R2r2J4n1N4n7J28k6qm2J4k3P5n6%p1Q3M3
8976F6J9l0k2l6l5M1J11k06N9J4m5J56j11O7K6J03j66oP2R5j23l0m5N2o5J2J20
9003I3o2K7r7N9P2j11m3K12l5n2q5PJ5K1n7J6Q5j6rl7j0q9J08Ok0r2J66m4q6j5
9033g3J11l4N8l4K4m0O8m4l9O5l6k1L5O6o4r8O5P0j60P9J04k69J97K0O1j55J32
$$ plain form
9060 88 -94 -30 -3 79 101 35 75 9 65 -5 94 9 2 -61 -33 -8 -24 -29 -132 57 106 -11 -11 82 -50 -63 18 -66 -97
9089 -97 -35 37 28 -24 7 -13 -47 -4 67 5 -67 13 -9 7 39 -23 -59 43 40 -40 -27 85 16 -29 -61 47 -85 46 112
9118 112 -65 -9 71 53 86 14 -27 -76 43 118 -93 -98 -59 70 -58 -19 -67 82 -4 95 45 -9 21 -100 4 -11
9144 -11 7 -88 44 14 69 -132 1 26 76 41 -4 15 43 -82 -122 -59 -96 185 -6 87 -19 -87 -63 -91 -60 -53 65
9171 65 27 49 23 125 -94 38 26 -62 50 41 -32 62 -1 22 -66 -2 138 -13 -13 -61 40 100 -93 33 -13 7 -129
9198 -129 30 70 19 14 -72 -154 14 -18 33 22 7 4 105 65 57 -66 -69 -6 -65 2 -165 21 -53 56 -20 83 -45
9225 -45 113 27 13 28 27 -32 40 29 58 96 26 86 10 31 -75 -113 7 84 -117 -1 79 11 -12 75 35 18 84 -55
9253 -55 79 -23 8 -56 -37 -23 -21 16 -43 114 187 90 48 11 -11 72 -64 -23 23 -71 -63 -29 75 20 35 -64 54 -18
$$ packed form
9060H8j82O4K7Q2K2o6M0o6N6p0R9q5po3K8K5j6nj03J89M9j17%R3j32j3Q1q4l1
9089i7O2P2rn2L1k0l4M3P1o2p2Q0k2J6L2o2l6J02lq0J3J12o9m5l2J08j32J31O6
9118A12j77N6Q0j8L3p2m1m9J19P5k11nL9J29j28L9m8J49q6R9n0n4L0j21J04j5
9144a1J8r5J32l0N5k01J33K5N0l5m5J9K8j25m0O3l7K81j91R3j06o8K4k8L1PJ18
9171F5l8K2k6J02k19J32j2q8J12rp3R4o3K3q8O4J40j51%m8J01O0j93J26m6K0j36
9198a29J59M0n1nq6q2J68l2N1j1j5lJ01m0qj23lO3n9O7j67J86p4J09p6J03j28
9225d5J58q6j4J5jn9P2j1K9L8p0O0p6K1j06l8J20P7k01J16Q0o8k3Q7m0j7O6j39
9253e5J34j02L1o4J9J4KL7n9J57P3r7m2l7k2Q3j36M1M6r4QL4J04n5J5r9J18p2
$$ plain form
9281 -18 -52 -6 12 -3 -41 123 -97 -56 37 -147 143 166 -31 10 -14 100 -80 55 -5 18 14 13 97 55 7 35 -41
9308 -41 -6 -10 -50 4 -61 -36 31 51 85 -83 -3 26 -87 -25 3 12 26 -43 42 -139 -124 -4 -44 -74 83 47 1 75 -6
9337 -6 24 109 -13 16 -1 114 26 -7 59 -11 101 -87 31 77 -159 140 74 -17 2 113 62 47 -18 -108 12 17 1
9364 1 62 -29 -26 -45 -24 35 23 -15 -56 27 108 45 10 -199 25 2 -16 23 7 -76 -89 32 95 36 -64 -73 86 85 5 53
9394 53 -30 -25 29 35 68 92 50 -12 -46 64 51 -9 -2 -44 -120 -66 -2 -107 -56 117 15 4 -115 -108 -84 -3 109 5 -159
9423 -159 8 46 12 -6 -7 99 35 70 85 -77 -72 30 38 -40 96 3 -87 -59 70 9 -31 63 97 -37 34 -66 -118
9450 -118 -2 -49 -20 69 47 17 -124 10 40 -55 61 75 73 -18 -141 194 24 -7 -60 23 81 -67 -30 -116 44 14
9476 14 -34 48 -58 -16 71 -42 4 52 -43 -31 4 17 -71 -21 -58 36 -101 49 -40 77 -34 120 21 18 -29 80 36
$$ packed form
9281a8l4M6J8j5l8J64k20M1R3j84K90K3j97M1k4J14j80J35o0K3mjQ4m2m8K8p6
9308d1L5mm0N4o5K5O7K0L4j68Q0K9j13O2K8RJ4o9Q5j81J5J20m0l0J57l6m6P4q1
9337fL0Q5j22K9j7J15q8l3O6p0J12j88J18M6k36K99o6r1J9J11n1j5o5r0J20Nj6
9364AO1r1Lj9K1N9j2l8m1Q3Q1o3l5k09K24k3j8L9j6q3j3J21O3n9j00rJ59jq0M8
9394E3q3NN4OL3K4m2o2l4J10j3o0Pm2p6N4O4j05N1J73j02j1j19PK4Q1J12j04j64
9423a59J67L8l4j8jJ06o4L5J5j62NJ02Qp8J36r3r0K8J29o1m0R4L4j34P1j00n2
9450a18J16m7K9Q9k2l0j41J34L0r5J16J4kr1j23L35j70l1n3Q3N8j48L7q6J60l0
9476A4m8Q2j06M2Q7j13M6M8r5J2L5J3q8N0l7R4j37J50q9J17j11J54r9lm7J09m4
$$ plain form
9503 36 -34 -38 -12 -27 -38 -29 -32 89 90 -69 20 101 -20 -61 59 -48 -57 0 -55 -49 71 59 -38 -59 -39 14 25 15 -39 -20
9533 -20 -137 39 38 78 58 9 -47 -49 61 -51 19 -16 -26 10 34 -35 -71 -66 -63 -8 94 -41 23 -145 87 118 43 21
9561 21 -120 6 74 -31 -62 -72 11 17 -39 -161 -57 -60 20 -54 -41 69 -10 40 18 34 26 18 -29 84 -3 40 7 56 -60
9590 -60 -78 11 11 67 -120 -14 134 -62 -107 26 -57 -104 109 -44 51 47 -47 59 -44 46 -80 -67 0 -143 27
9615 27 97 -3 115 -41 -7 48 124 -8 -96 -28 -114 101 -17 -45 -65 -94 -63 -91 -26 79 -36 66 -22 -103 57
9640 57 -5 68 -47 -66 -24 -2 -10 -2 -21 100 -1 -3 116 -68 -11 24 -74 -5 -51 85 -94 22 -52 -65 28 43 18 -54
9668 -54 -85 77 91 102 -71 -26 -125 -101 10 69 -54 8 29 -38 -71 -55 73 -32 30 88 -27 150 -19 -13 -76 48
9694 48 -59 -104 -58 -42 14 -12 34 -140 -36 -79 68 -51 -15 90 -103 52 90 0 -17 -53 -10 -33 24 -75 -84 55
$$ packed form
9503C6p0mK6j5j1RlJ21Jj59Q9Q1j21m1J20j07rN7n5OJ20j2r7k1K0N3J1j0n4J9
9533b0j17J76jM0k0m9n6kJ10j12P0l5j0L6K4o9l6NLN5J02j35O4j68K32L1p5k2
9561B1j41J26O8j05l1j0Q3On6j22J04lQ0p4J3J10p9N0k2J6qqm7J13q7M3l3M9j16
9590f0j8Q9%N6j87J06J48j96m5J33q3m7K13j53R5mr4J06j03R0j26J3O7j43J70
9615B7P0j00J18j56L4N5P6j32q8O8q6K15j18k8k0k9L1k8O5J05j15J02q8q1J60
9640E7o2P3j15j9M2K2qQj9J21j01kJ19j84N7L5r8O9m6J36j79J16p4j3R3J5k5p2
9668e4l1J62J4J1j73M5r9K4J11N9j23O2K1o7l3J6J28j05O2N8j15J77j69Oo3J24
9694D8j07m5M6J6N6k6M6j74J04m3J47j19L6J05j93J55L8r0j7l6M3k3N7r9rJ39
$$ plain form
9720 55 -75 -52 -15 13 78 -36 91 26 54 -42 7 -17 81 11 17 -42 -34 -115 152 -85 26 63 -16 -21 -138 -73 50 37
9748 37 -33 13 42 -68 -100 23 -13 -3 -3 131 33 46 24 -27 93 134 148 -77 -38 33 30 -92 -38 58 -168 -7 5
9775 5 -14 -78 -13 -45 56 130 12 28 130 -14 70 34 -48 -82 35 -22 181 -148 -30 42 -39 -63 116 62 -116 89
9801 89 20 -118 -46 -135 20 -39 -81 54 -17 26 -20 3 -38 47 53 -114 14 29 3 -89 78 -10 -70 -110 -50 86 -57
9828 -57 22 89 -83 45 -79 -3 99 69 -104 -45 80 30 40 117 -9 -2 89 112 -39 26 70 50 17 78 13 65 107
9855 107 -15 78 -6 57 -79 -127 -92 18 -112 -71 129 -98 -29 58 44 3 127 68 34 52 37 -48 -54 159 -100 34
9881 34 -51 -43 -1 15 55 46 3 1 -16 4 63 11 57 -31 -26 -92 -66 -95 50 -75 124 -203 -12 56 85 73 12 -26 -18 44
9911 44 -2 -28 -85 28 37 -22 -89 -49 -84 -27 27 -7 -39 213 -64 -29 -43 2 83 46 -83 80 95 -163 34 43 1 -1
$$ packed form
9720E5j30K3L7K8O5j14J27o5K8r6M9k4R8p0On9Qq1K67k37J11L7p9nj17O5J23j3
9748C7p0M6K9j10l2J23l6J0%J34r8J3k2n1J20M1J4k25L9P1lj22N4R6k26J61J2
9775Ej9o4O5l2J01P4j18J6J02j44Q4l6q2l4J17n7K03l29J18P2q1k4J79n4j78K05
9801H9o9j38P2q9J55n9m2J35p1M3m6K3m1Q5Oj67J28J5k6r2J67q8o0m0O0J36j43
9828e7P9O7j72J28j24P6J02l0j73N9J25n0J0P7j26PR1K3j51O5M4k0l3O1o5N2M2
9855A07j22R3q4O3j36m8L5J10j30M1K00k27O9Q7j4m1J24n9l4J8j5q5oK13k59J34
9881C4q5QM2J6M0rm3kj7K0N9n2M6q8No6K6k9J45j25J99l27J91O8K9j2o1l8QO2
9911D4m6k6n7J13Rn9o7M0l5N7N4l4l2K52k77L5j4M5Q1l7j29J63J5k58J97Rm2k
$$ plain form
9939 -1 -32 40 6 15 21 72 -23 -146 -19 -29 -13 -97 -4 -46 -80 -53 -90 177 -13 54 2 -42 54 -47 -70 -156 -10 78 34
9968 34 9 -40 29 18 -9 75 -6 -110 64 33 -83 -69 -46 -30 -59 -9 -56 131 86 69 75 42 -88 -101 -78 -21 -14 -38 62
9997 62 -19 -71 42 54 2 -77 -26 70 -21 -45 -86 -45 -26 9 -46 17 -41 60 -18 -106 117 16 -20 25 -16 -49 -87 55
10025 55 22 -125 7 46 22 29 -59 -26 14 22 21 76 37 16 2 4 -5 -29 -54 68 33 97 71 -16 -108 -5 65 -8 -34 36
10055 36 67 126 57 -1 3 61 6 -45 15 70 45 -19 -5 1 20 -32 8 50 -18 69 95 -13 31 36 4 -20 10 -106 -119 3
10085 3 -40 6 -16 74 37 72 -236 65 184 4 49 63 -29 38 -60 -44 6 14 111 148 -132 -79 -52 -37 -67 4 -56 -24
10113 -24 -12 -90 64 -66 90 75 -6 -141 94 -72 13 -79 -20 -31 -25 61 87 78 -24 -55 -72 -165 43 -4 -121 -10
10139 -10 7 -78 -108 44 0 125 30 -1 10 117 -63 141 2 35 -30 -7 -60 8 12 139 -2 -78 -13 -67 -4 -6 -1
$$ packed form
9939al1P2l4RON1r5j23J27j0J6q4R3m2l4K7l7K67j90O7n2m4R6j01k3q6J46Q8m4
9968C4k5m9O9j1k7Q4q1j04J74l1j16J4K3J6k9N0m7J87m5j7Ol3j30j3K3N7Pk4J00
9997F2q1n2J13J2n2p9N1R6r1k4m1M1J9L5n5O3n8J01p8q8K23j01l6M5m1l3l8J42
10025E5l3j47J32L9k4Pq8L3M0QjN5l9k1j4Krk4k5J22l5O4k6q7r2J03P0p3k6P0
10055C6L1N9o9n8MN8n5n1O0N5k5o4J4OJ9n2M0M2o8Q7K6j08M4Nl2k4L0j16j3J22
10085Cm3M6k2R0l7L5l08L01J19j80M5J4r2O7r8J6N0QR7L7k80N3K7J5l0P1o0L2
10113b4J2p8J54j30J56j5q1j35K35j66Q5r2N9j1OQ6K6rj02l1j7r3K08m7j17J11
10139a0J7q5l0J52m4J25r5l1J1J07j80K04j39L3o5K3n3O8MJ27j41p6O5n4O3kN
$$ plain form
10166 -1 73 67 -36 -39 9 56 75 -15 -21 75 15 23 82 113 57 -8 20 2 66 18 -3 -17 -41 -17 29 -29 -32 12 -32 -107 -58 -56 67
10199 67 63 13 -22 -163 9 -33 48 -6 -61 50 96 -1 -7 -4 -105 -18 51 13 37 -20 -13 -29 -26 14 176 -27 -6 17 -12
10228 -12 51 14 9 46 74 42 5 4 67 -13 36 -39 87 23 -29 -13 -39 -124 -35 -148 26 -88 -14 -25 39 139 -37 89
10256 89 70 -22 -58 113 -79 -80 3 9 -37 -39 155 -89 60 -141 -92 -37 -62 -149 -121 -48 86 64 -76 47 -48 87
10282 87 77 103 -48 -23 2 -1 -6 -60 28 -69 119 18 -57 -89 61 -2 -37 179 -30 89 54 119 -146 -44 -47 1 -135
10309 -135 83 23 -38 123 -64 77 121 -116 19 129 -1 52 -43 20 77 14 57 56 -27 1 45 -50 56 -150 65
10334 65 -69 -113 -45 61 8 57 6 -5 -33 -13 -55 4 51 53 47 13 10 -62 97 -8 -23 24 131 36 -104 -112 -26 9 39
10363 39 11 -28 -51 -98 -80 93 114 -72 56 19 84 -29 -70 44 90 -17 -112 -25 119 -40 -94 -10 -45 68 -7
$$ packed form
10166aP4oj03lM8M7J9r0oR6o0QN9L1n6o5K8j8O4m8k1j4k4K4M6n8lM4m4p5M9KJ23
10199F7mn0l5j41J72m2Q1n4n5J11M6r7oLj01Q7O9l8K4n7Pj6LM0J62k03K1K3k9
10228a2O3l7nL7K8l2l7jO3q0M9p5J26o4n2J6k6q5Q9j13J74j14P4j1O4J00j76J26
10256H9j9r2l6J71j92jQ3Om6kJ94k44J49k01M9N5k5q7K8P3J34k2j40J23r5J35
10282H7j0K6j51K5K5lnn4Q8r7J88j01p5l2J50o3l5K16k09J19l5O5k65J02lM8j36
10309a35K18o0o1J61j87J41M4k37J35J10j30N3r5O3N7o3M3jq3K8M4r5J06k06K15
10334F5j34m4O8J06n3M9n1j1k8K0m2N9M7Kol4lp2J59j05j5M7J07r5j40qQ6L5L0
10363C9k8l9k3m7J8J73K1j86J28l7O5j13m1J14M6j07r5Q7J44j59n4Q4l5J13p5
$$ plain form
10388 -7 20 44 57 -16 -118 23 51 23 -25 10 3 -71 -25 15 -18 -126 -19 -48 62 -31 -54 22 153 -6 132 39 -46
10415 -46 68 51 -14 51 -45 -37 93 34 0 57 -43 84 5 66 -17 -141 114 -63 58 17 -32 -7 -48 -21 47 78
10441 78 -12 55 -1 26 -23 87 74 -88 13 35 36 -93 8 -19 -119 -11 54 17 5 105 78 14 -56 -103 -58 -187
10467 -187 -52 -30 29 15 16 -134 17 84 65 -45 -14 -41 -39 -42 63 -92 -24 16 -23 8 15 -84 -94 -25 -40 31 -17 103
10495 103 23 17 -185 123 15 -43 62 -84 -8 40 -27 21 165 -2 -118 -10 -9 18 27 -24 -8 32 -41 14 -64 123
10521 123 -43 -67 -34 -10 -112 -76 15 -47 -26 30 -79 8 -58 75 -30 3 -36 101 28 13 -86 91 -31 -33 -55 118
10547 118 -74 -72 72 32 5 47 37 -93 -58 -72 51 -10 88 95 -114 34 -18 25 0 -44 -76 -140 -33 -6 142 -125
10573 -125 -80 11 92 -83 3 -33 117 -51 26 -119 -78 -52 89 -46 -49 -57 -30 99 -51 -96 13 -6 -24 45 -79
$$ packed form
10388gK7K4J3p3j02J41K8k8m8L5pp4M6M0l3j08J07k9J10r3k3P6J31j59J38r3q5
10415d6J14j7o5O5r6QJ30n9l4N7j00J27p9O1q3j24K55j77J21m1m9K5m1K7O8L1
10441G8r0O7n6K7m9J10j3j62J01K2Jj29J01k7j00J08O5l7j2J00k7o4p0m7M5j29
10467a87J35K2N9j4Jj50J51O7j9j10L1k7KlJ05j55O8M0l9L1Pr9j0O9j5P1m8J20
10495A03q0ok02L08j08n8J05j46P6M8o7M8J44j67j16J08JK7Rn1J6M0p3N5p8J87
10521A23j66k4L3K4j02L6R1o2K1N6j09Q7o6J33j05L3l9J37p3j5r9J77j22kk2J73
10547A18j92KJ44m0k7M2j0j30L5j4J23o1R8Pk09J48n2M3k5m4l2o4J07K7J48k67
10573a25M5R1Q1j75Q6l6J50j68P7j45M1K6J41j35lqK7J29j50m5J09j9j8O9j24
$$ plain form
10598 -79 -65 -8 81 -7 13 44 58 169 54 -97 -22 35 -88 5 62 66 100 7 -66 25 30 -39 -11 2 -46 98 -42 78
10626 78 -78 -8 -105 8 57 35 -81 -43 -74 -9 0 -38 24 13 56 -20 107 58 59 -47 -11 -74 81 -4 -58 34 73 -10
10654 -10 -88 17 99 -68 13 -43 123 85 -101 34 30 5 -162 -27 -26 -31 82 -46 96 94 12 12 -80 5 106 17 -17
10681 -17 -38 7 -93 73 18 -19 -4 56 -87 -48 45 -98 1 -12 7 72 55 2 178 14 35 -28 129 -90 6 21
10707 21 -2 26 59 62 91 -53 39 31 7 -56 -4 -97 22 31 -130 -50 42 7 -106 -64 -17 147 -99 -45 34 -19 106 54
10735 54 12 -43 -69 -12 -51 22 103 -34 -55 -11 -13 -99 118 -76 -26 -15 52 34 -28 24 -79 -43 -17 91 99 -7 -87 -80
10763 -80 -55 29 -46 36 63 8 -17 63 22 -92 42 76 -94 -78 25 155 -9 35 -40 122 21 3 14 -62 -112 111
10789 111 59 -30 -32 32 29 -8 74 61 -41 -13 -39 -15 43 -18 15 2 75 60 -112 16 8 70 -93 -10 -33 40 -21 62 -33
$$ packed form
10598g9J4N7Q9q8K0L1J4J11j15j51P5N7j23R3N7ML4r3p3R1No9K8J3m8J44j40J20
10626G8j56P0r7J13M9k2j16L8l1O5Rl8O2j1M3p6J27m9Jj06L6o3J55q5n4R2L9q3
10654a0p8J05Q2j67Q1n6J66l8j86J35mk5j67J35JnJ13j28J42kq2%r2Q5J01q9l4
10681a7k1M5j00J66n5l7J5O0j43L9R3j43R9j3J9O5j7n3J76j64K1o3J57k19R6J5
10707B1k3K8L3LK9j44R2qk4o3N2r3J19Rj61Q0R2l5j13M2M7J64k46N4P9n3J25n2
10735E4m2n5k6N7l9P3Q1j37k1M4kq6K17j94N0J1O7j8o2N2j03L6K6J08Qj06q0P
10763h0K5Q4p5Q2K7n5k5Q0m1j14J34L4j70J6J03J30j64M4p5J62j01j8J1p6n0K23
10789A11n2q9kO4ll7Q2j3j02K8k6K4N8o1L3j3P3j5j72J28qO2j63Q3k3P3o1Q3r5
$$ plain form
10818 -33 -58 30 48 -38 -13 53 -14 -17 122 -24 -21 94 -148 -89 51 -19 -73 -98 -24 -60 107 87 107 9 -12 17 -5 91
10846 91 71 130 -28 19 -94 83 33 52 54 -34 -48 -64 32 40 34 24 -5 17 -22 -70 -21 11 25 -34 74 -4 67 -51 -11
10875 -11 -55 2 46 72 148 77 -63 57 -93 20 17 52 31 -55 -33 -57 -92 -23 -25 -62 51 11 44 -26 -86 3 5 -89 29
10904 29 162 65 -15 -121 -53 13 93 -51 -7 -43 -22 -24 -57 -10 -13 -39 161 -49 89 -4 -41 -1 8 -52 131 4 -36
10931 -36 -19 -6 44 9 56 63 44 44 -4 37 18 -71 -82 -46 -93 25 -38 -157 113 119 -26 31 40 -77 -61 71 69 -70 -28
10960 -28 -22 -18 28 -127 -66 -2 -52 18 -21 -32 74 -55 3 -8 11 -1 57 -39 7 -83 124 -58 -6 -5 89 -148 -11 5
10988 5 20 -62 52 82 -49 -42 13 47 -30 18 -122 3 -15 30 62 -34 -37 -13 -12 -17 94 14 58 9 -96 -18 -14 -80 -144 90
11018 90 -84 -9 -233 74 53 16 7 14 -49 67 88 14 79 91 12 43 -37 16 96 60 -15 -141 -79 31 13 64 -44
$$ packed form
10818c3k5Q8J8q6K5O6o7lJ39j46LJ15k42N9J40p0n4k5P4l6J67k0K0r8k1K9k2R6
10846I1k0N9j58M7j13J77n0J9Kq8j4j6R6Qoj0k9K2l9m8M9L2J4n9J08p8P1j18M0
10875a1m4N7M4K6P6p1j40J20j50J13lL5k1q6K2k4l5O9kl7J13m0L3p0o0Q9Kr4J18
10904B9J33r7q0j06O8O6Q0j44M4l6K1kl3M7lk6K00k10J38r3l7M0Ro0J83j27m0
10931c6J7J3N0l5M7Pj9%m8M1j9q9j1L6m7J18o3j19K70Oj45N7Rj17J6J32kj39M2
10960b8OMM6j55O1O4n0P0l9j1J06j29N8j1J9j2N8r6M6r0K07j82N2JR4k37J37J6
10988EJ5q2J14L0j31PN5L4p7M8j40J25j8M5L2r6lK4JnJ11q0M4m9j05P8Mo6o4K34
11018I0j74P5k24L07k1l7rPo3J16K1p4O5J2p9L1q0N3Q0l6p5j26O2J10j8N1j08
$$ plain form
11045 -44 -19 -65 59 13 -7 23 4 -122 -37 4 47 -73 75 17 39 83 75 8 -87 -68 16 14 29 86 11 7 -43 -52 53
11074 53 -66 -24 80 -76 71 35 -16 76 -1 -30 28 29 65 19 49 -12 -97 34 -41 46 30 45 62 14 -58 -59 -63 -134 76
11103 76 -38 -35 -87 56 -108 161 68 5 -49 7 42 -21 -1 -19 10 -4 82 -86 6 -5 -50 -73 62 -95 -33 -60 48
11130 48 57 -14 25 -121 41 44 104 -26 -24 31 93 -98 -29 -6 -57 -47 -97 36 74 86 -61 -62 -61 -55 -124 -47 4 -40 66
11159 66 55 -90 73 -115 53 68 75 30 -1 -31 45 30 -48 50 -106 -97 -34 45 -12 -10 48 28 -66 38 3 -13 39 17
11187 17 26 -15 20 -144 -14 -21 -7 73 -120 -51 22 33 -133 -35 9 116 -23 25 -61 21 -63 11 -63 49 9 -67 97
11214 97 -62 12 63 -54 61 -15 182 -39 -27 90 -46 -82 -49 -31 -2 -60 -12 43 -9 25 -32 -47 -48 -65 -44 -5 -58
11241 -58 -78 -22 13 37 26 71 5 27 61 8 -30 -84 46 -90 3 3 -80 -87 72 49 -107 19 94 -34 49 -40 -75 -10
$$ packed form
11045d4K5m6J24m6k0L0j9j26Q5M1M3j20J48n8K2M4qo7r5J9Q4kJ5N7p5mn0rJ05
11074E3j19M2J04j56J47l6n1R2p7k9N8JL6m6L0o1q5J31p5Q7j6J5J7m8p2jmp1K10
11103G6j14Ln2J43j64K69r3o3n4N6L5o3K0j8K9j4Q6j68R2j1m5k3J35j57O2k7J08
11130D8Rp1L9j46J62LO0j30KN5O2j91O9K3n1J0n0J33L8J2j47jJOo9P7N1m4J06
11159F6j1j45J63j88J68J5Pm5l1l0P6j5p8R8j56RO3P9n7KN8k0r4J04l5j6N2k2
11187A7Rm1L5j64J30pJ4Q0j93O9P3J1j66R8M4J07j39M8q6Q2q4P4p4J12m0p6J64
11214I7j59P4N1j17J15p6J97k21J2J17j36l6L3J8K9n8M8N5n2L4n7j5jj7K1L9n3
11241e8k0N6L5K4j1M5o6K2L4n3l8n4J30j36R3%q3pJ59k3j56J26P5j28Q3q9l5O5
$$ plain form
11269 -10 -32 -44 25 44 -24 -136 -122 -27 -100 -51 16 83 24 -65 4 100 -50 -43 142 68 17 -94 58 43 -53 -32 -5 -7
11297 -7 19 87 -60 50 54 -79 25 58 6 -66 55 -77 -85 41 -118 89 -1 -61 -35 70 -45 40 45 102 20 -39
11323 -39 80 38 73 83 -44 46 78 -107 40 37 30 -22 41 31 -97 96 -81 69 -6 15 -71 -28 13 -142 12 -31
11349 -31 -82 -61 -27 -4 84 17 -58 -8 -123 -52 37 -10 -21 20 121 23 -31 24 -32 -4 -124 -35 -25 -83 -26 -21 29 -12 -51
11378 -51 27 -165 -62 87 -71 -21 -22 101 -87 -50 10 -46 -54 29 47 -94 151 69 16 -93 44 -23 -2 48 -16 -102
11404 -102 2 -37 -78 70 -10 67 69 32 -24 -89 -8 69 12 -92 35 28 -43 -4 -50 -8 82 -17 -21 54 -147 101 -84
11431 -84 31 -90 -56 45 106 -1 14 12 48 -2 -99 89 -47 3 22 -46 -17 28 68 38 -53 33 -30 45 -22 32 74
11458 74 77 20 94 -62 13 58 -41 68 110 11 -69 -9 -41 103 -31 89 -22 15 -83 -17 -76 45 83 -71 123 -63
$$ packed form
11269a0k2j2O9J9o8j12J4R5p3M9O7O7n9q9O9R6j50PJ85p4n1j11J52j5r6K1K7k
11297gK6O8j47J10Mj33J04L3n2p2J21j32qJ26j59K07r0o0K6J05j15Q5NN7q2n9
11323c9J19m2L5J0j27R0L2j85J47lpn2O3j0j28J93j77J50p5K1q6M3M1j55J54m3
11349c1n1K1L4K3Q8o7p5N0j15P1Q9m7j1M1J01r8n4N5n6K8j20Q9J0n8N7NN0m1l9
11378e1P8j92J03J49j58N0jJ23j88L7O0n6qQ3J8j41K45q2n3j09J37o7K1N0o4q6
11404a02J04l9m1J48q0P7Kl7n6o5Q1P7n7j04J27pp1L9m6M2R0r9mP5k01K48j85
11431h4J15j21L4J01O1j07J5kL6n0r7J88j36N0J9o8K9M5M0l0r1Q6o3P5o7N4M2
11458G4Ln7P4j56P5M5r9J09M2r9q0O0l2J44j34J20j11L7r8O6n9J21L8j54J94j86
$$ plain form
11484 -63 -157 82 -29 -90 -89 6 -6 48 -106 -96 41 -90 -13 -12 -125 -20 31 -148 -46 32 14 -102 64 -58 -93
11509 -93 91 -97 -123 -13 99 60 11 24 9 55 3 19 -43 18 -23 2 -62 -14 -180 33 -76 -26 -24 -137 -8 -21
11535 -21 -26 -93 -40 -129 -130 -55 11 31 -12 55 -23 -37 -39 35 -79 -42 -47 -40 40 28 0 -26 -42 39 81 61 -12 -120 77 -124
11565 -124 0 35 114 -49 42 12 14 64 80 9 -34 43 116 -11 -30 43 -69 49 -61 87 -54 -90 -12 33 77 11
11591 11 -53 -94 100 -13 -80 54 8 -9 -61 52 60 -54 37 -100 42 55 -32 -111 -30 69 -35 17 -1 57 50 1 -52
11618 -52 148 105 -52 91 28 -10 -131 44 117 62 65 -21 -27 -84 -17 38 49 -17 -58 87 27 -48 -4 -89 -66 5 3 31
11646 31 -59 -32 10 -41 -60 105 -75 63 -49 -45 41 -53 -137 21 -114 104 46 -5 -19 6 23 95 78 41 -17 -8 46
11673 46 6 21 24 31 14 -127 131 118 97 -123 49 8 44 -29 -20 33 9 15 -41 96 132 -4 -65 -10 75 77 -189 -83
$$ packed form
11484f3r4K39j11o1JR5j2N4j54J0J37j31P7Jj13J05N1j79J02P8j8j16J66j22l5
11509i3J84j88k6J10J12l9m9J3j5M6n2J6o2O1m1K5o4M8j66K13j09N0Kj13J29j3
11535b1no7N3q9jP5O6K0m3O7p8j4kP4j14L7nPQ0j2k8k6j6Q1M2k0p3j08J97k01
11565a24J24L5P9j63R1l0KN0J6p1m3P7P3j27j9P3j12J18j10J48j41l6P8M5M4o6
11591A1o4m1J94j13o7J34m6j7n2J13Qj14R1j37J42J3q7p9Q1R9j04N2j8N8pm9n3
11618e2K00m3j57J43o3l8j21J75P3n5Lq6on7O7N5J1o6m1J45o0p5M4q5K3P1kK8
11646C1r0K7M2n1j9J65j80J38j12MQ6r4q4J58j35K18n8n1j4K5J7P2j7l7n8RN4
11673D6m0J5LPj7j41K58j3k1k20J72m1L6p3RN3k4On6J37L6j36o1N5Q5Kk66J06
$$ plain form
11701 -83 -24 -42 58 -96 75 -97 -39 34 14 102 16 -2 96 5 -25 -26 77 80 -86 -46 -5 -37 72 2 -91 38 91
11728 91 20 -10 -67 -63 6 37 -117 4 38 3 25 9 -29 -14 23 -23 82 36 88 57 -1 79 -4 88 -67 -177 73
11755 73 -73 47 95 21 32 -80 36 102 2 49 -2 -47 37 -8 34 19 44 -114 -130 -73 11 53 33 32 -91 -66 43
11782 43 -27 70 -49 -37 -6 -11 65 74 6 14 79 -26 17 -17 12 91 -25 73 39 23 -1 76 -21 3 -51 76 -130 68
11810 68 35 -92 -52 -84 0 -105 16 -117 10 -13 8 103 50 -108 -27 14 -12 -72 -1 44 -90 42 53 64 -140
11835 -140 100 89 -2 32 -60 38 -42 -84 47 34 83 35 110 23 -53 110 -103 -76 31 -16 -97 140 -54 61 15
11860 15 -64 -64 -11 22 -62 -22 -4 107 -57 30 16 -3 67 -47 -24 57 125 63 -28 36 -63 -73 -21 -8 36 -79 -96 39
11888 39 -25 62 -38 25 47 47 -6 -43 36 -91 -98 -16 24 -82 22 38 -45 -140 25 61 21 21 68 -21 24 81 91 -51
$$ packed form
11701h3N9j8J00j54J71j72N8P3k0Q8q6j8R8r1l0jJ03Lj66M0M1l2J09p0r3J29N3
11728I1p1l0n7MO9L1j54J21L4l5K2j6l8J5L7m6J05m6N2l1n8Q0q3R2j55j10K50
11755G3j46J20M8p4J1j12J16O6j00M7n1m5Q4m5M2j5K5j58j6N7Q4M2k0jj23K5J09
11782D3p0R7j19J2L1nP6Ro8QO5j05M3l4K9P9j16R8l4j6k4P7r7K4n4J27k06J98
11810F8l3j27M0l2Q4j05J21j33J27k3K1R5n3j58Q1M1k6o0P1M5j34J32J1J1k04
11835a40K40j1r1L4r2R8q0m2J31j3M9m8P5q7p6J63k13K7J07m7q1K37j94J15m6
11860A5p9%N3L3q4M0J8J11j64Q7j4j9P0j14K3Q1O8o2r1O4r9j0N2J3M4j15j7J35
11888C9o4Q7j00O3K2%n3l7P9j27pQ2M0j06J04J6q3r5J65L6m0%M7q9M5N7J0j42
$$ plain form
11916 -51 41 -36 -15 27 36 17 14 -16 99 -139 10 84 -40 36 -80 -26 -104 65 -58 -58 -6 -45 -29 13 11 -19 115 -24
11944 -24 61 33 60 78 62 -50 -2 -15 -64 -177 10 90 -89 -1 5 21 -70 34 131 -38 130 43 -14 16 -25 50 104
11971 104 25 136 41 -136 54 -117 29 109 70 17 73 -58 -11 77 -53 -7 -74 41 -50 -9 -19 -39 -2 29 -41
11996 -41 113 41 -40 -80 144 76 -42 62 8 9 -55 176 182 9 -80 28 40 89 116 69 -40 2 81 -23 48 21
12022 21 -24 71 81 -51 -55 28 33 -99 20 -48 6 112 129 111 21 86 -9 23 125 88 159 -62 -46 -11 -70 28 55 69
12050 69 34 52 1 7 -52 -3 122 -8 32 84 -56 -23 32 40 40 -9 2 -31 34 -103 24 38 11 43 -14 112 26 -21
12078 -21 5 -67 12 52 -64 101 -39 17 27 -37 6 -5 59 -109 -45 -100 18 59 136 -21 30 -47 26 -68 -141 9
12104 9 24 111 -10 11 -33 11 -9 -43 -33 -64 -11 -88 -23 -39 -10 129 -120 -31 36 115 -1 87 57 -43 -8 -23 25 -27
$$ packed form
11916e1R2p7K1M2Rj9ll0J15k38J49P4j24P6j16N4p8J69j23%N2l9J6M2kl0J34j39
11944b4Q5k8K7J8j6j12M8j3m9j13J87Q0j79Q8OJ6r1J04R7j69J68q7n7L0m1P5N4
11971A04p9J11r5j77J90j71J46Q0l9n3N6j31M7Q8j30M6o7J15r1M1j0k0L7L1p0
11996d1J54p2q1m0K24o8j18J04n4Jo4K31Oj73q9J08J2M9K7m7j09M2P9j04P1k7
12022B1m5R5J0j32mQ3Nj32J19o8N4J06J7j8r0O5r5L2J02l7P1k21J6L5n9R8K7J4
12050F9l5J8n1On9M9J25j30M0N2j40L3N5Q%m9J1l3O5j37J27J4k7L2n7J26q6m7
12078b1K6p2P9M0j16J65j40N6J0o4M3j1O4j68O4n5J18M1P7j57N1p7P3r4p3J50
12104IJ5Q7j21K1m4M4k0l4J0l1N3p7O5j6K9J39k49Q9O7P9j16Q8l0j00L5j5M8n2
$$ plain form
12132 -27 -75 3 -46 80 23 93 70 -39 -40 -82 48 26 102 -99 77 -22 -32 103 -13 68 94 49 -4 82 -38 48
12158 48 36 -48 -56 -26 7 -28 -68 -9 11 50 22 -84 -15 -1 32 -23 -131 -44 -30 -21 -22 0 -33 39 -23 70 38 -3 8 -59
12188 -59 35 62 49 4 -30 81 -10 36 -45 56 19 -46 -90 -18 11 39 51 61 66 54 16 -56 105 36 -22 -28 12 60 16
12217 16 26 49 174 15 -75 -46 2 10 -1 -61 54 -67 -46 -3 -16 -59 112 -16 8 -131 123 3 -32 60 -36 -35
12243 -35 -54 -4 40 43 57 72 111 -43 -72 40 -22 -32 68 3 33 70 -34 -21 70 -79 -14 87 60 -58 -19 -25 7
12270 7 -14 63 66 112 6 12 -94 110 50 -81 -79 -28 108 -11 -10 -7 -8 15 -21 -50 -65 23 35 26 83 92 16 78 -50 52
12300 52 -62 26 -55 59 35 22 -93 42 -91 -162 -59 75 -19 44 50 -72 -39 7 0 36 -127 -63 98 80 82 18
12326 18 54 66 -112 -27 -51 10 -26 -10 -65 28 99 -61 -8 23 -65 -24 22 -30 120 71 -25 -61 -112 -82 87 -88 108
$$ packed form
12132b7m8P8m9J26n7P0k3j09jm2J30k2P6k01J76r9j0J35j16Q1K6m5n3Q6j20Q6
12158D8j2q4qL0L3l5m0N9K0L9k8j06O9J4L3n5j08Q7J4RjK2l3P2o2R3l2m1J1o7
12188e9R4K7j3m5l4J11r1M6q1J01l7o5m4P2K9K8J2J0Nj2l8p2J61o9n8oM0M8m4
12217A6J0K3J25j59r0K9M8Qj1o0J15j21K1M3j3m3J71j28K4j39K54j20l5R2r6J
12243c5j9N0M4LJ4J5L9j54k9J12o2j0J00o5L0L7j04J3R1j49O5J01k7j18L9oL2
12270Gk1P7LM6j06Oj06K04o0j31KN1J36j19JLjK3l6k9j5Q8J2rN7Rp6O2j28J02
12300E2j14Q8q1J14k4j3j15J35j33p1J03J34r4O3Oj22L3M6pL6j63O4J61j8Ko4
12326A8L6J2j78Q5k4O1l6J6n5R3P1j60N3L1q8M1M6n2J50m9r6l6n1L0J69j75J96
$$ plain form
12353 108 41 -9 -182 77 179 -133 -2 60 -11 94 -10 -42 140 61 132 80 -63 -95 -30 -24 -116 -25 -39 22 108
12378 108 21 15 55 -27 50 17 -69 51 -64 -71 -101 47 -18 62 25 85 -4 -46 -75 -138 45 25 23 -34 -70 162 -75 -86
12406 -86 -52 50 185 -65 -58 -99 20 -107 -62 -20 -105 47 -28 -45 63 13 -18 -87 67 -1 85 34 -102 120 78
12431 78 41 15 52 6 -15 61 28 16 49 -63 102 36 -12 -11 27 81 -136 -74 5 25 -59 52 0 -171 91 47 62
12458 62 74 13 46 23 -63 -106 -141 -72 32 45 8 -90 7 -83 -47 16 -45 -17 -122 61 48 -51 15 56 -57 27 14 43
12486 43 -9 -24 46 109 42 7 22 9 83 14 -52 16 -54 124 -16 31 38 137 -1 -48 -73 43 52 58 133 -35 36 92 -20
12515 -20 58 -33 8 77 -46 22 -10 -45 100 -16 -17 -2 -15 -9 9 90 62 -11 10 -46 -45 -72 74 26 11 -17 -49 -102 83
12544 83 120 -62 59 -76 34 56 41 12 18 -86 -40 40 -20 -6 -24 90 -82 -45 -44 2 -48 64 -46 -30 -21 -12 -47
$$ packed form
12353A08o7n0j73K59J02l12J31O2p1J05j04l2J82p9P1n2j43l2O5Or2R1j4O1Q6
12378A08q7oM0q2P7l3q6J20j15pl0J48o5Q0l7O0q9m2k9o3J83k0kn7l6K32k37j1
12406h6L4J02J35k50Pm1J19j27M5M2q5J52p5j7J08n0l1o9J54o8Q6n1j36K22m2
12431G8l7k6L7m6k1P6l3j2L3j12J65o6m8JL8N4k17O2P9K0q4J11n2j71K62m4J5
12458F2J2o1L3k3q6m3l5O9J04J3l7r8R7r0L6O3o1K8j05J83j3r9O6M1j13Q4j3K9
12486D3n2j5P0O3o7l5J5j3P4o9o6O8p0J78j40M7PR9j38m7k5J16ROP5j68P1N6j12
12515b0P8r1M1O9j23O8l2l5J45j16jJ5j3OJ8Q1k8p3K1n6Jk7J46m8j5k8l2n3J85
12544H3L7j82J21j35J10K2j5k9Oj04M6Q0o0J4j8J14j72L7JM6n0J12j10J6RRl5
$$ plain form
12571 -47 -35 65 -112 112 -18 -26 119 -76 -5 85 -13 24 -75 14 8 61 56 -65 -1 145 25 39 -17 -47 -11 -99 56
12598 56 -53 -2 -99 -32 -41 5 -2 -31 -39 74 165 -36 -38 -38 -53 -99 90 -5 -16 -41 3 -1 -58 102 -71 5 -29 67 -20 2
12628 2 19 15 95 -18 5 87 4 98 101 -75 -29 -38 -165 -7 -23 -23 -26 -38 -27 2 -42 56 99 63 -30 -170 -58 -14 -31 1
12658 1 -3 22 14 92 47 97 60 45 -59 70 -31 -36 -16 -28 69 -19 85 69 -86 -79 -51 5 -64 -87 -62 -35 29 56 59 -74
12688 -74 38 -23 -60 99 -26 23 53 82 -51 18 46 30 79 2 -9 -11 176 -88 30 -11 46 50 40 152 -148 -17
12714 -17 -103 165 -63 91 88 -4 16 43 172 46 -3 -7 9 120 27 46 -37 49 -27 -51 61 -76 -43 7 -59 26 69
12741 69 -32 -4 -17 -43 -74 45 -46 91 -52 -17 9 -57 -58 -55 70 43 -99 -31 5 4 13 56 -50 51 52 3 -26 12
12769 12 41 -13 26 75 102 -20 -2 -8 -25 9 24 -62 -26 -43 63 34 2 -78 -104 92 13 22 -52 -119 102 12 167 18
$$ packed form
12571d7J2J00j77K24j30qJ45j95P1R0r8L7r9Q9oN3nj21O4J46j20J4n6l0L6q8J55
12598E6j09N1r7O7rM6pk9qJ13R1k01k%j5m6J89r5j1k5M4mn7J60j73P6l4R6q7K2
12628BJ7mQ0j13K3Q2q3R4Lj76M6rj27J58j6%lj2J1K9m4R8M3l6r3j40J12M4j7L2
12658AmK5qP8m5N0l7j5j04J29j01nK0j2R7q8J04j6j55PK8N6o9k3K5K7O4K7Lj33
12688g4J12o1l7J59j25M9L0K9j33O9K8j6M9p7j1kJ87k64J18m1N7Mj0J12l00J31
12714a7q6K68k28J54lr2K0K7J29j26m9mJ6J11r3J9q3Q6p6k4J12j37L3N0o6Q5M3
12741F9j01K8j3k6l1J19r1J37j43L5K6o6jLJ25k7j42O8L6jRM3j06J01Jm9k9L8
12769A2K9n4L9M9K7j22J8oj7L4J5q6L6j7J06k9l2q0k6J96p9Rp4o7K21r0J55j49
$$ plain form
12797 18 10 83 -9 11 -23 101 1 -69 -92 151 32 -48 33 -41 -35 -5 77 36 4 -9 -2 47 -105 -13 117 -20 95
12824 95 -164 -68 58 68 52 114 87 53 -22 -34 36 139 60 -113 -33 23 2 -22 -129 -2 -46 -95 -49 -60 2 -26 -16
12851 -16 -28 34 -15 -14 -38 -83 90 108 -122 -37 -67 -114 -102 73 51 -10 61 27 -50 13 -84 -45 34 54 -44 53 -22 0 28
12880 28 -16 92 -18 19 49 -97 -102 32 8 -68 -67 30 3 -55 -46 28 -8 126 -30 -92 -7 93 -23 134 41 24 81
12907 81 -37 -22 45 -51 72 69 -61 -54 37 59 -63 43 25 11 -48 -20 -36 1 33 -53 -53 -52 -44 -61 7 -101 -58 22 91
12936 91 -88 -22 -108 -4 22 5 59 -39 -8 -20 -77 41 71 49 -4 -17 55 34 61 25 25 149 -13 77 16 -55 3 -55
12964 -55 -10 93 -31 30 74 -77 -21 -64 -65 -11 18 -97 -2 -78 -90 -106 16 71 -17 90 24 28 -1 -48 -55 6 14 -143
12992 -143 -42 -50 -15 20 -40 47 -34 85 22 17 -17 -8 34 43 -6 30 -41 -114 -33 -23 117 72 -52 -35 -66 3 9 91 -31
$$ packed form
12797A8qP3r2K0l4J24j00p0k3K43j19q0Q1p4OL0Q2m1l2j3PM9j52R2J30j37J15
12824I5k59R6J26J0j6O2k7l4p5j2P0J03p9j73Q0N6k1k4j07J27m4m9M6j1O2k8J0
12851a6j2O2m9Jk4m5J73J8k30Q5l0m7J2J75k2o1P1l4p7O3r7L9P9K0r8R7p5K2K8
12880B8m4J08j10L7L0j46nJ34k4p6JR7k7n8RP4l6J34j56o2Q5J00j16J57r3j7N7
12907H1j18J5O7r6J23lj30PR1K2j22J06j8j4n9K8j6L7L2q6%JQj7O8j08M3Q0O9
12936I1j79O6q6J04K6j7N4r8L1j2n7J18L0k2n3j3P2k1K7l6%J24j62R0o1p1N8n8
12964e5M5J03j24O1M4j51N6m3jN4K9j15R5p6j2j6J22N5q8J07o6Mk9m7pO1Qj57
12992a43J01qL5L5o0Q7q1J19o3nl4RM2Rm9L6p1p3Q1J0J40m5j24J7l1O9OQ2j22
$$ plain form
13021 -31 -110 66 -6 -64 -12 45 -61 -88 -31 -112 109 -39 0 -21 62 -24 -65 14 73 88 -95 53 -59 -15 7 -61
13047 -61 101 98 9 44 32 32 -98 22 -20 84 112 -31 -26 -58 28 -30 -16 0 -18 -65 88 109 2 -5 -63 73 -2 -97
13075 -97 -29 40 -81 -43 33 -52 58 -12 -14 20 -25 33 84 -20 0 74 70 3 -30 18 58 81 19 116 -13 -31 50 81 -36
13104 -36 45 -2 -6 27 -9 -47 -74 -25 -33 13 -24 -101 -35 143 33 15 134 28 18 -116 -1 -135 -50 48 -1 -136 71
13131 71 36 42 -7 92 -31 12 103 -34 -60 25 37 -79 -46 82 29 8 87 62 22 -7 7 -60 65 74 54 92 47 0
13159 0 13 134 -106 104 -26 -48 -20 44 -22 -67 -4 -38 49 35 -42 54 -18 -2 32 2 -49 11 -67 120 28 -44 -249
13186 -249 -58 79 -76 -79 78 23 -88 -50 -48 -22 35 -5 42 89 -2 1 -55 -42 -61 30 -18 -41 54 1 17 -37 -17 5
13214 5 50 44 -7 38 89 -25 122 -11 99 33 -65 183 -96 89 -8 49 -56 -8 -88 -28 -27 98 7 -7 95 53
$$ packed form
13021c1p9J76p2n8N2N7j06k7N7q1K21j48L9k1Q3q6m1P9N9J5j83J48j12M4K2o8
13047f1J62lq9L5j2%j30J20m2J04K8j43Nl2Q6n8J4J6j8m7J53K1j07pn8J36p5r5
13075i7O8O9j21L8P6q5J10p0kL4m5N8N1j04K0P4mo7l3M8M0K3o2R7j29j8Q1L1j17
13104c6Q1m7mL3l6l8k7M9qM6l7p7O6J78j10j8J19j06j0j34J15j34Q5R8m9j35K07
13131G1l5Om9R9j23M3R1j37k6Q5J2j16L3J28n3k1P9k5m0k9J4o7J25Rk0L8m5m7
13159@J3J21k40K10j30k2K8O4o6m5O3l4Q7j4p7R6p2J6L4l0n1O0p8J87r2p2k05
13186b49J91J37j55lJ57n5j11L8KK6N7m0M7M7r1Ln6J3j9R1m8k3R5n3J6n4K0K2
13214EM5on1M5N1j14J47j33J10o6r8K48k79J85r7N7j05M8q0O0JJ25r1j4J02m2
$$ plain form
13240 53 -73 123 -100 20 -97 -34 79 76 -38 -14 62 -12 -71 -85 36 12 -2 -23 15 54 -71 -44 72 118 83
13265 83 25 -14 -8 49 11 -24 40 6 -33 -31 -43 -79 -91 61 86 58 -43 85 96 -41 45 -144 -31 60 70 -37 -108
13292 -108 37 -56 21 -20 -29 40 -59 48 -11 -23 -47 67 115 37 -39 73 23 -44 -44 -75 -19 -66 -54 11 -74 -2 61 -40
13320 -40 14 40 -22 -8 -58 82 70 23 62 -66 54 10 53 -105 -107 -33 37 17 121 -52 -44 11 -47 88 3 34 -84
13347 -84 4 94 -3 22 -79 -14 -60 -139 17 29 -55 -114 -47 11 -47 -13 -41 -43 -77 62 35 69 20 -34 122 30 -63 33
13375 33 22 -36 -2 -86 16 132 114 108 37 -31 -26 104 -52 -50 40 -59 -35 10 92 -1 -83 -51 35 -8 82 -64 -113 82
13403 82 -2 130 6 -2 -89 -57 4 11 -52 18 -1 -75 98 2 -30 -17 92 -88 71 7 -40 -102 -62 115 -33 -6 117
13430 117 -44 -36 -105 -23 -7 29 73 -138 35 -4 -51 -156 22 -118 19 7 23 -30 37 -35 64 -35 -5 -60 32 117
$$ packed form
13240E3j26J96k23J20j17O3J13lj14K4P6p4n9j4J21k4j4k1L8L9j25K7J16M6l5
13265H3n8l9ON7l8l5O4l4l9Kj2l6j2J52K5k8j01J28J1j37Q6j89J13R1J0j07p1
13292a08J45r3P7m1rO9r9J07n9j2k4J14M8p8p6J12n0o7%l1N6m7J2O5q5P2O3j01
13320d0N4K6o2J4n0J40j2m7L9j28J20m4M3j58kP4P0k0J04j73QN5n8J35q5L1j18
13347h4Q8R0r7K5j01O5m6p9J56J2q4n9O7N8n8L4k8kl4J39k7L4m9n4J56r2r3R6
13375C3j1n8L4q4J02J16j8op1o8NJ30j56KR0r9K4M5Q2r3q2L2Q6m3R0j46m9J95
13403H2q4J32j24qq7L2O1Po3P0j9p4J73r6l2J3J09j80J59o4m7o2M0J77j48K7J23
13430A17j61Qo9Q2J6L6M4k11J73l9m7j05J78j40J37j2J6n3O7p2R9r9L0n5R2Q5
$$ plain form
13456 117 19 -72 -18 169 14 -98 19 114 138 -13 5 -46 -42 30 -78 86 -45 101 -101 -6 -36 34 -65 -32 -54
13481 -54 -19 -71 62 39 42 13 -109 -39 9 10 -20 -61 -69 -30 -96 29 -44 41 73 -13 52 -7 -85 67 -89 -47 90 -18
13509 -18 -31 87 -32 64 -43 -63 32 60 12 -28 -32 3 -19 -60 -58 -136 -22 -23 -70 -5 -64 -104 25 1 75 38 -2 -70 43
13538 43 -70 -10 -24 -77 39 51 -1 41 81 114 -43 -99 35 -16 5 39 -5 -65 -78 7 52 -14 -25 -93 20 -29 -37 27
13566 27 -74 -68 1 34 73 -47 -72 -101 -43 24 46 52 -30 -15 78 25 4 59 24 -5 14 -115 -28 -149 -94 45 -36 9
13594 9 110 -70 58 -73 40 -21 40 -3 59 23 -74 -38 111 -13 -66 -89 -43 55 -82 -84 -58 -39 138 11 -17 31
13620 31 2 -16 61 4 -22 161 32 -83 15 -14 3 -99 18 -62 117 -8 99 -18 71 6 -59 -8 -56 22 -81
13645 -81 -1 -130 29 -8 67 27 5 55 -18 -5 28 -64 -41 35 25 -37 -159 -35 117 22 -18 52 35 32 84 -94 -24
$$ packed form
13456A17r8r1N4J87j55j12J17R5K4j51J8n1MP2j08J64j31J46k02R5l0P0r9L3k2
13481e4L5n2J33k3Lk9j22P0M8Jl0m1qL9o6J25p3Q5L2q6O5n9p8J52j56M2J37j08
13509a8j3J18j19R6j07k0R5K8m8m0mL5k2m1Kp8J14jm7O5n9m0J29k4P4l7m0o8J13
13538D3j13O0j4n3J16J2n2M2M0L3j57n6J34n1K1L4m4o0j3Q5M5o6j1o8J13m9qO4
13566B7j01OO9L3L9j20k5k9N8O7K2Oq2J5R3n3k1N5l5k9J9j29Q7j21N5J39q1M5
13594IJ01j80J28j31J13o1O1m3O2l6r7L6J49j24n3k3M6R8j37kK6J9J77j27k8M8
13620C1k9j8P7n7k6J83j29j15R8k9J7j02J17q0J79j25J07j17Q9o5o5N1m8P8j03
13645h1Q0j29J59l7P5m0k2N0p3J3L3r2K3P6j0o2j22J24J52r5m0P0j7lN2j78P0
$$ plain form
13672 -24 -107 28 -27 -27 -107 -1 37 40 5 -9 106 24 39 26 86 28 -33 36 0 105 -14 137 18 27 90 -8 29 46
13700 46 125 -20 2 -2 13 78 -60 107 15 7 -79 100 -24 -16 -1 19 -37 18 34 40 60 -79 137 -19 50 15 37 68
13728 68 -63 78 31 -88 -117 24 121 -49 37 151 -10 -15 72 -9 -29 -170 -76 -37 21 -34 -40 -21 45 -97 22 -14
13754 -14 3 81 93 -101 31 13 51 74 -65 21 16 8 -35 -64 89 -25 -25 22 85 18 -100 -30 -36 -8 -32 -114 23 1
13782 1 46 204 132 -63 -68 48 -20 -19 -23 129 -5 151 91 58 -71 38 -60 -44 -27 -97 53 56 -75 -5 -61 -69 -138 55
13810 55 -9 -76 57 -41 -43 77 102 27 -70 -8 -20 97 7 -15 11 38 23 -117 -6 -8 -116 68 -93 -13 46 -53 12
13837 12 33 34 15 -9 -29 30 96 -106 92 -43 66 83 -7 14 53 -127 -26 20 -19 47 45 -33 -28 53 53 -76 76 -51
13865 -51 39 172 -71 142 1 -40 -88 -38 47 -58 -57 142 -12 37 -59 -94 -103 3 95 62 -100 56 -42 -74 36
$$ packed form
13672b4q3J35n5%q0J06L8Ll5j4J15q2J5j3O0n8o1O9l6J05j19J51j19RO3r8L7J7
13700D6P9j45K2mJ5O5j38J67r2qq6J79j24QJ5K0n6N5J6OK0j39K16j56O9l5K2L1
13728F8j31J41m7j19k9J41R7j70Q6J14j61nQ7q1k0j41R4L9N8n5oJ9O6j42J19l6
13754a4J7P8J2j94J32j8L8K3j39Q6nqm3k9J53j14%M7O3o7j18P0oK8k4q2J37k2
13782AM5J58p2j95nJ16o8JmJ52j34J56o0l3j29J09r8J6J7p0J50Lj31P0n6qo9J93
13810E5o4o7J33r8kJ20K5p5r7O2j2J17r0k2K6K7j5j40J11kj08J84j61Q0N9r9O5
13837A2K1Jj9k4k0N9O6k02J98j35J09J7r0K1L9j80J01M6l9O6kp8NQ1%j29J52j27
13865e1R0J33k43K13j41m1m8N0Q5j05JJ99j54M9r6l5rJ06R2l3j62J56r8l2J10
$$ plain form
13890 36 -24 -136 16 -26 129 63 110 6 27 166 -54 -27 42 -40 19 54 -107 11 41 65 -16 -63 24 6 -71 -65
13916 -65 73 -5 71 18 105 -28 13 17 26 27 26 -59 104 -63 -1 -66 -17 111 21 -129 32 -27 20 -51 3 21 -52 -8
13944 -8 -19 71 -17 27 -108 -74 53 -21 11 -112 -78 55 -61 -47 -90 137 5 20 14 -66 -95 -70 62 -6 -69 -63 4
13971 4 0 38 -119 -100 20 -37 125 51 -50 -76 -17 72 21 -21 -22 -63 8 2 -73 -22 -44 62 -39 -66 30 -78 92 70
13999 70 79 -41 -46 102 47 74 -29 -4 -17 -10 32 -161 95 -19 -174 49 -9 -42 39 53 -33 -51 -26 -113 -75 46 -44
$$ packed form
13890C6o0j12J52m2J55o6M7j04K1J39k20K7O9q2N9L5j61J18L0K4q1m7Q7j8p7O
13916f5J38p8P6n3Q7j33M1MRJjq5J63j67O2o5M9J28r0j50J61n9M7p1N4J8p3M4
13944hj1R0q8M4j35L4J27p4L2j23L4J33j16J4m3K27j32J5oq0k9K5J32o8o3OO7
13971DmL8j57J9J20n7J62p4j01k6N9Q9n1m2jm1P1op5N1k2J06j01k7R6j08J70k2
13999G0Rj20nJ48n5K7j03K5j3PM2j93K56j14j55K23n8l3Q1J4q6j8K5q7L8J21r0
$$ [...]
16383G
##END NTUPLES=NMR FID
##END=
