##TITLE=abcd
##JCAMPDX= 6.0         $$ Bruker NMR JCAMP-DX V2.0
##DATA TYPE= NMR FID
##DATA CLASS= NTUPLES
##ORIGIN= UXNMR, Bruker Analytische Messtechnik GmbH
##OWNER= root
$$ XWIN-NMR		Version 3.5
$$ Wed May 21 18:17:01 2025 Russian Standard Time (UT+4h)  servis@DPX200
##.OBSERVE FREQUENCY= 200.131235884673
##.OBSERVE NUCLEUS= ^1H
##.DELAY= (6, 6)
##.ACQUISITION MODE= SIMULTANEOUS
##.ACQUISITION SCHEME= undefined
##.AVERAGES= 32
##.DIGITISER RES= 18
##SPECTROMETER/DATA SYSTEM= spect
##.PULSE SEQUENCE= zg
##.SOLVENT NAME= CDCl3
##.SHIFT REFERENCE= (INTERNAL, CDCl3, 0, 16.5164)
##AUDIT TRAIL= $$ (NUMBER, WHEN, WHO, WHERE, WHAT)
$$ ##TITLE= Audit trail, XWIN-NMR		Version 3.5
$$ ##JCAMPDX= 5.01
$$ ##ORIGIN= Bruker BioSpin GmbH
$$ ##OWNER= servis
$$ F:\spectra/data/av/nmr/H1/1/audita.txt
$$ ##AUDIT TRAIL=  $$ (NUMBER, WHEN, WHO, WHERE, WHAT)
(   1,<2025-05-21 18:16:18.56 +0400>,<servis>,<DPX200>,
      <created by zg, POWCHK disabled, PULCHK disabled
       configuration hash MD5:
       00 E9 B6 7A A2 85 ED C7 34 08 36 98 17 FE 4E 26
       data hash MD5: 32K
       A8 12 7C A3 6B 22 D6 BC 3D A0 D1 4D 13 0A A6 4F>)
$$ ##END=
$$ 
$$ hash MD5
$$ 5A 20 F4 76 66 EC 75 0F 55 39 8A 86 BE D9 98 A9
##$RELAX= 
##$RELAX= 
##$RELAX= 
##$RELAX= 
##$RELAX= 
##$RELAX= 
##$RELAX= 
##$RELAX= 
$$ Bruker specific parameters
$$ --------------------------
##$DU= <F:\spectra>
##$EXPNO= 1
##$NAME= <H1>
##$PROCNO= 1
##$TYPE= <nmr>
##$USER= <av>
##$AMP= (0..31)
100 100 100 100 100 100 100 100 100 100 100 100 100 100 100 100 100 100 
100 100 100 100 100 100 100 100 100 100 100 100 100 100 
##$AQSEQ= 0
##$AQ_mod= 1
##$AUNM= <au_zg>
##$AUTOPOS= <>
##$BF1= 200.13
##$BF2= 200.13
##$BF3= 200.13
##$BF4= 200.13
##$BF5= 500.13
##$BF6= 500.13
##$BF7= 500.13
##$BF8= 500.13
##$BYTORDA= 1
##$CFDGTYP= 0
##$CFRGTYP= 5
##$CHEMSTR= <none>
##$CNST= (0..31)
1 1 145 1 1 1 1 1 1 1 1 1 1 1 1 1 1 1 1 1 1 1 1 1 1 1 1 1 1 1 1 1 
##$CPDPRG= <>
##$CPDPRG1= <>
##$CPDPRG2= <>
##$CPDPRG3= <>
##$CPDPRG4= <mlev>
##$CPDPRG5= <mlev>
##$CPDPRG6= <mlev>
##$CPDPRG7= <mlev>
##$CPDPRG8= <mlev>
##$CPDPRGB= <>
##$CPDPRGT= <>
##$D= (0..31)
0 2 0 0 0 0 0 0 0 0.06 0 0 0 0 0 0 0.0002 0 0 0 0 0 0 0 0 0 0 0 0 0 0 
0 
##$DATE= 1747836978
##$DBL= (0..7)
120 120 120 120 120 120 120 120 
##$DBP= (0..7)
150 150 150 150 150 150 150 150 
##$DBP07= 0
##$DBPNAM0= <>
##$DBPNAM1= <>
##$DBPNAM2= <>
##$DBPNAM3= <>
##$DBPNAM4= <>
##$DBPNAM5= <>
##$DBPNAM6= <>
##$DBPNAM7= <>
##$DBPOAL= (0..7)
0.5 0.5 0.5 0.5 0.5 0.5 0.5 0.5 
##$DBPOFFS= (0..7)
0 0 0 0 0 0 0 0 
##$DE= 6
##$DECBNUC= <off>
##$DECIM= 32
##$DECNUC= <off>
##$DECSTAT= 4
##$DIGMOD= 1
##$DIGTYP= 9
##$DL= (0..7)
0 120 120 120 120 120 120 120 
##$DP= (0..7)
150 150 150 150 150 150 150 150 
##$DP07= 0
##$DPNAME0= <>
##$DPNAME1= <>
##$DPNAME2= <>
##$DPNAME3= <>
##$DPNAME4= <>
##$DPNAME5= <>
##$DPNAME6= <>
##$DPNAME7= <>
##$DPOAL= (0..7)
0.5 0.5 0.5 0.5 0.5 0.5 0.5 0.5 
##$DPOFFS= (0..7)
0 0 0 0 0 0 0 0 
##$DQDMODE= 0
##$DR= 18
##$DS= 0
##$DSLIST= <SSSSSSSSSSSSSSS>
##$DSPFIRM= 0
$$ [...]
##$SUBNAM0= <"">
##$SUBNAM1= <"">
##$SUBNAM2= <"">
##$SUBNAM3= <"">
##$SUBNAM4= <"">
##$SUBNAM5= <"">
##$SUBNAM6= <"">
##$SUBNAM7= <"">
##$SUBNAM8= <"">
##$SUBNAM9= <"">
##$SW= 20.6817932712277
##$SWIBOX= (0..15)
0 0 3 0 0 0 0 0 0 0 0 0 0 0 0 0 
##$SW_h= 4139.07284768212
##$TD= 32768
##$TD0= 1
##$TE= 0
##$TE2= 300
##$TE3= 300
##$TEG= 300
##$TL= (0..7)
0 120 120 120 120 120 120 120 
##$TP= (0..7)
150 150 150 150 150 150 150 150 
##$TP07= 0
##$TPNAME0= <>
##$TPNAME1= <>
##$TPNAME2= <>
##$TPNAME3= <>
##$TPNAME4= <>
##$TPNAME5= <>
##$TPNAME6= <>
##$TPNAME7= <>
##$TPOAL= (0..7)
0.5 0.5 0.5 0.5 0.5 0.5 0.5 0.5 
##$TPOFFS= (0..7)
0 0 0 0 0 0 0 0 
##$TUNHIN= 0
##$TUNHOUT= 0
##$TUNXOUT= 0
##$USERA1= <user>
##$USERA2= <user>
##$USERA3= <user>
##$USERA4= <user>
##$USERA5= <user>
##$V9= 5
##$VALIST= <valist>
##$VCLIST= <CCCCCCCCCCCCCCC>
##$VD= 0
##$VDLIST= <DDDDDDDDDDDDDDD>
##$VPLIST= <PPPPPPPPPPPPPPP>
##$VTLIST= <TTTTTTTTTTTTTTT>
##$WBST= 1024
##$WBSW= 30
##$XGAIN= (0..3)
0 0 0 0 
##$XL= 0
##$YL= 0
##$YMAX_a= 154983
##$YMIN_a= -91601
##$ZGOPTNS= <>
##$ZL1= 120
##$ZL2= 120
##$ZL3= 120
##$ZL4= 120
##$ABSF1= 10
##$ABSF2= 0
##$ABSG= 5
##$ABSL= 3
##$ALPHA= 0
##$AQORDER= 0
##$ASSFAC= 0
##$ASSFACI= 0
##$ASSFACX= 0
##$ASSWID= 0
##$AUNMP= <proc_1d>
##$AZFE= 0.1
##$AZFW= 0.1
##$BCFW= 1
##$BC_mod= 2
##$BYTORDP= 0
##$COROFFS= 0
##$CY= 19
##$DATMOD= 1
##$DC= 2
##$DFILT= <>
##$DTYPP= 0
##$F1P= 11.0000007629395
##$F2P= -0.999999237060547
##$FCOR= 0.5
##$FTSIZE= 0
##$FT_mod= 4
##$GAMMA= 1
##$GB= 1
##$INTBC= 1
##$INTSCL= 1
##$ISEN= 128
##$LB= 0.05
##$LEV0= 0
##$LPBIN= 0
##$MAXI= 10000
##$MC2= 0
##$MEAN= 0
##$ME_mod= 0
##$MI= 0
##$NCOEF= 0
##$NC_proc= 0
##$NLEV= 6
##$NOISF1= 0
##$NOISF2= 0
##$NSP= 1
##$NTH_PI= 0
##$NZP= 0
##$OFFSET= 16.51637
##$PC= 1
##$PHC0= -183.0496
##$PHC1= -4.898466
##$PH_mod= 0
##$PKNL= yes
##$PPARMOD= 0
##$PSCAL= 4
##$PSIGN= 0
##$REVERSE= no
##$SF= 200.13
##$SI= 16384
##$SIGF1= 0
##$SIGF2= 0
##$SINO= 400
##$SIOLD= 16384
##$SREGLST= <1H.CDCl3>
##$SSB= 0
##$STSI= 0
##$STSR= 0
##$SW_p= 4139.07284768211
##$SYMM= 0
##$S_DEV= 0
##$TDeff= 0
##$TDoff= 0
##$TI= <>
##$TILT= no
##$TM1= 0
##$TM2= 0
##$TOPLEV= 0
##$USERP1= <user>
##$USERP2= <user>
##$USERP3= <user>
##$USERP4= <user>
##$USERP5= <user>
##$WDW= 1
##$XDIM= 8192
##$YMAX_p= 0
##$YMIN_p= 0
$$ End of Bruker specific parameters
$$ ---------------------------------
##NTUPLES= NMR FID
##VAR_NAME=  TIME,          FID/REAL,        FID/IMAG
##SYMBOL=    X,             R,               I
##VAR_TYPE=  INDEPENDENT,   DEPENDENT,       DEPENDENT
##VAR_FORM=  AFFN,          ASDF,            ASDF
##VAR_DIM=   16384,         16384,           16384
##UNITS=     SECONDS,       ARBITRARY UNITS, ARBITRARY UNITS
##FACTOR=    0.0002416,     1,               1
##FIRST=     0,             0,               0
##LAST=      3.9581328,     0,               0
##MIN=       0,             -91601,          0
##MAX=       3.9581328,     154983,          0
$$ Real data points
##PAGE= N=1
##DATA TABLE= (X++(R..R)), XYDATA
0 0 0 0 0 0 0 0 0 0 0 0 0 0 0 0 0 0 0 0 0 0 32 -32 32 -32 32 -32 64 -64 64 -64 96 -96 113 -128 137 -160 192
37 192 -192 224 -256 288 -320 352 -384 417 -477 513 -576 632 -694 768 -841 929 -1025 1134
55 1134 -1257 1393 -1552 1737 -1951 2214 -2535 2939 -3475 4199 -5254 6948 -10104 17973 -80178
70 -80178 -79413 118001 78360 -38847 -60067 40521 44937 -33092 -47672 51874 81952 -12135
82 -12135 -91601 -30043 55287 39958 -32235 -33643 9765 11648 -21674 -5395 41783 36741 -25098
95 -25098 -46360 125 38605 13931 -20380 -13032 6684 -7392 -26087 -6512 28074 23233 -12305
108 -12305 -25989 -4231 13498 5828 -2616 9644 19953 2445 -24955 -22801 7657 23750 3405
121 3405 -21330 -11795 18203 21112 -9661 -25245 1426 26943 6775 -26628 -14579 25915 25740
134 25740 -19543 -38663 -2137 29082 7808 -22318 -7445 22428 11430 -19479 -12412 19715
146 19715 17454 -14646 -16823 13805 17386 -16358 -25472 11092 30736 -2596 -31232 -5085 27806
159 27806 7844 -26671 -8190 33962 21663 -30453 -35926 13549 33840 -5414 -31815 -359
171 -359 29791 4065 -29820 -8310 32891 20703 -25814 -28153 16114 32288 -2688 -27599 -6470
184 -6470 16695 2202 -18288 -4280 20906 13294 -14942 -17939 6700 18630 3970 -9485 -4397
197 -4397 2470 -2466 -6565 1438 9510 3402 -8768 -8929 3007 9832 3537 -4016 -1124 5625 3400
212 3400 -5323 -6227 3350 7790 -2464 -12260 -3765 11705 8603 -9015 -11315 6382 13492 -2977
226 -2977 -13846 2012 17924 4334 -18174 -11478 13723 14177 -10410 -16012 7467 17495 -4712
239 -4712 -19149 1470 21839 5814 -19088 -9868 16362 13217 -12965 -15439 9152 15611 -7400
252 -7400 -17169 4531 17836 -2020 -19107 -1752 19966 7988 -16176 -10500 13320 12168 -10959
265 -10959 -13441 9408 15637 -6918 -18306 2198 18894 2986 -17329 -7455 14246 10733 -9842
278 -9842 -11231 7246 11688 -5428 -13169 2413 14135 1837 -13177 -6103 9834 8335 -5943
291 -5943 -8458 3345 8377 -1224 -8159 -701 8059 3157 -6796 -5024 5202 6629 -2587 -6917 444
306 444 6802 1526 -6443 -3529 5509 5010 -4692 -6873 2677 7720 -704 -7922 -956 8354 3437 -7762
322 -7762 -5714 6692 7973 -4764 -9664 2131 10009 -210 -10492 -2264 10270 4818 -9205
335 -9205 -7052 7887 9617 -5026 -10705 2225 11005 250 -10914 -2913 9652 4445 -8927
348 -8927 -6604 7130 8141 -4823 -8776 2843 9332 -379 -8860 -1294 8491 2959 -7962 -4975
362 -4975 6365 5990 -5200 -7428 2902 7758 -834 -7652 -991 7334 3009 -6196 -4247 5219 5465
377 5465 -3930 -6610 1830 6635 -315 -6890 -1945 5975 3517 -4949 -4745 3865 5972 -2130 -6394
392 -6394 636 6752 1321 -6344 -3280 5027 4355 -3969 -5609 2203 5830 -1062 -6267 -425 6266
407 6266 2098 -5540 -3323 4691 4426 -3400 -5054 2117 5330 -1139 -5975 -602 5594 1737 -5296
422 -5296 -3097 4269 3871 -3191 -4268 2326 4910 -1016 -5077 -309 5003 1696 -4538 -3145 3210
437 3210 3496 -2328 -3873 1321 4012 -395 -4173 -792 4145 2542 -2957 -3399 1677 3593 -681 -3585
453 -3585 -266 3230 673 -3515 -1963 2991 3011 -2149 -3885 896 4352 578 -3853 -1254 3615 1779
469 1779 -3649 -2833 3147 3790 -2417 -4924 734 4925 441 -4708 -1206 4741 2302 -4245 -3044 3954
485 3954 4110 -3007 -4817 1846 5062 -858 -5368 -485 4943 1131 -4946 -2096 4851 3405 -3863
500 -3863 -4035 2973 4594 -1751 -4519 978 4626 -135 -4828 -1344 3953 1914 -3309 -2295 2694
515 2694 2538 -2054 -2525 1693 2734 -906 -2499 554 2480 36 -2346 -763 1645 821 -1332 -973
531 -973 1000 1086 -372 -914 -245 454 884 799 -259 -1037 -84 1052 8 -1641 -534 1867 1265 -1773
549 -1773 -2054 1131 2182 -886 -2252 1063 2968 -611 -3285 179 3601 245 -4140 -1278 4186
564 4186 2410 -3668 -3212 3139 3699 -2930 -4724 2212 5830 -366 -5422 -638 4787 965 -4569 -1148
580 -1148 5038 2129 -5200 -3847 4027 4555 -2955 -4677 2347 4890 -1925 -5408 1290 6236 368
595 368 -6034 -1869 5161 2921 -3867 -3175 2718 2554 -2902 -2680 3335 3956 -2434 -4714 686 3876
611 3876 86 -2672 773 3298 -613 -4165 -898 3566 1670 -2852 -2206 1706 1796 -1192 -1054 1421
627 1421 832 -1932 -1242 1974 2141 -614 -1146 684 434 -1859 -1297 1940 2244 -1238 -2438 557 2128
644 2128 -348 -1735 559 1644 -1035 -2165 1053 2943 -210 -3007 -648 2229 215 -2719 -621
659 -621 2857 1052 -2917 -1443 3148 2462 -2423 -2716 1795 2569 -1574 -2436 1866 3194 -1318 -3653
675 -3653 406 3249 -608 -3923 25 4699 1768 -3597 -2163 2633 1550 -3213 -2406 2923 3374 -1658
691 -1658 -3187 962 2546 -1443 -3429 527 3377 355 -2376 335 2905 -171 -3504 -913 3037
706 3037 1606 -2116 -1191 2171 1321 -2368 -2016 1700 1903 -1560 -1986 1414 2127 -1102 -1976 1242 2236
723 2236 -1086 -2709 235 2158 -185 -1892 626 2591 -197 -2978 -839 2119 447 -2166 -22
738 -22 3264 1360 -2574 -1570 2065 1154 -2749 -1986 2663 3071 -1489 -2934 811 2238 -1644 -3430
754 -3430 822 3885 487 -2975 -409 2770 229 -3361 -1136 2990 1514 -2658 -1709 2667 2267 -2372
770 -2372 -2708 1788 2683 -1607 -2826 1602 3691 -404 -3201 106 2965 -149 -3492 -792 3203 1335
786 1335 -2795 -1563 2587 1749 -2619 -2503 1771 2410 -1339 -2076 1619 2739 -1050 -3149 -199 2198
802 2198 32 -2039 151 2485 409 -2316 -749 2056 880 -1912 -1028 1860 1434 -1200 -1106 1221
818 1221 1034 -1520 -1802 715 1580 -401 -1188 626 1320 -669 -1546 282 1345 -297 -1214 535 1551
835 1551 -203 -1534 -28 1326 -181 -1786 -246 1835 690 -1434 -552 1488 547 -1816 -923 1743
851 1743 1347 -1395 -1431 1260 1516 -1204 -1836 772 1745 -835 -2088 573 2415 18 -2221 -237 2109
868 2109 393 -2121 -583 2212 1096 -1887 -1300 1663 1384 -1669 -1887 1266 2049 -886 -1985 780
884 780 2176 -393 -2188 23 2058 187 -1950 -387 1879 614 -1932 -1128 1470 1126 -1382 -1224
900 -1224 1266 1414 -1004 -1363 969 1553 -698 -1578 421 1514 -269 -1496 132 1486 -61 -1660
916 -1660 -257 1564 514 -1363 -477 1413 718 -1242 -750 1138 831 -1066 -1010 855 1011 -852 -1187
933 -1187 625 1151 -629 -1339 517 1483 -207 -1406 86 1378 76 -1320 -230 1272 293 -1374
949 -1374 -632 1186 720 -1146 -912 996 1038 -880 -1071 886 1335 -538 -1313 361 1332 -155 -1323
966 -1323 -106 1222 186 -1237 -413 1157 592 -1046 -692 942 818 -763 -754 720 843 -603 -1020
983 -1020 339 921 -264 -1051 -34 876 38 -873 -115 857 246 -749 -273 714 391 -510 -392 401 366
1002 366 -416 -431 282 362 -300 -470 201 470 -142 -383 223 461 -96 -341 144 350 -111 -374 21 256 -98
1023 -98 -355 -42 302 -1 -395 -42 421 113 -384 -81 433 140 -406 -189 354 188 -374 -344 195 240 -262
1044 -262 -329 226 397 -161 -385 211 501 -69 -407 91 477 15 -514 -200 335 173 -325 -277 260 302 -206
1065 -206 -313 188 352 -62 -264 100 295 -12 -302 -110 132 21 -224 -141 171 133 -209 -276 55 247 103
1086 103 -111 -15 132 127 -72 -191 -42 155 73 -199 -156 120 156 -141 -223 89 311 114 -141 -23 251 74
1108 74 -304 -196 335 297 -259 -387 130 276 -223 -464 71 531 144 -387 -181 319 235 -311 -263 316 305 -261
1130 -261 -352 148 185 -315 -393 156 406 -40 -337 13 387 10 -387 -43 464 276 -280 -238 123 41 -261 -113
1152 -113 259 184 -162 -144 147 138 -170 -120 245 300 -110 -234 129 221 -228 -355 68 239 -111 -193 158 142 -300
1175 -300 -367 220 509 -1 -366 55 445 -97 -602 -88 576 161 -598 -223 520 259 -575 -376 523 505 -323
1196 -323 -393 506 612 -448 -836 211 863 -16 -785 -38 704 6 -869 -280 786 435 -555 -349 611
1215 611 453 -568 -624 476 694 -359 -663 296 596 -436 -909 85 790 82 -597 31 672 0 -780
1234 -780 -209 747 353 -584 -270 617 238 -824 -505 640 514 -521 -448 633 632 -544 -761 407 862
1253 862 -218 -709 320 927 -283 -1119 -35 1000 89 -1024 -184 998 254 -1097 -471 1043 721
1270 721 -822 -789 738 857 -786 -1115 531 1165 -381 -1200 207 1143 -180 -1283 -93 1285 420
1287 420 -1031 -326 1155 539 -1194 -850 987 1035 -676 -919 665 953 -713 -1254 319 1219 -43
1304 -43 -1010 91 1145 84 -1164 -329 986 295 -1022 -436 1005 580 -917 -741 652 648 -673 -715
1322 -715 657 928 -408 -828 343 864 -285 -907 155 867 -145 -949 47 981 90 -954 -227 803
1340 803 201 -828 -270 976 576 -696 -548 660 508 -791 -779 596 812 -436 -688 547 840 -482
1358 -482 -1070 165 969 -16 -780 230 1125 -5 -1273 -439 861 262 -999 -327 1093 584 -1005
1375 -1005 -796 721 720 -773 -873 736 1164 -361 -1014 409 1065 -386 -1313 87 1295 168 -1100
1392 -1100 -150 1235 414 -1118 -566 970 669 -898 -695 925 993 -684 -1016 447 804 -693 -1155
1409 -1155 424 1241 -89 -1047 46 992 -107 -1237 -230 1140 450 -914 -363 999 492 -1080
1425 -1080 -792 744 674 -708 -656 857 1016 -567 -1050 342 968 -331 -1052 300 1247 20 -1161
1442 -1161 -137 1003 54 -1235 -387 1102 540 -898 -491 1010 704 -959 -972 669 951 -568 -942
1459 -942 622 1115 -454 -1263 78 1063 -112 -1125 -6 1259 361 -1059 -429 959 450 -1047 -718
1476 -718 888 875 -649 -843 576 830 -598 -1058 322 1002 -125 -877 195 1073 110 -961 -240 870
1494 870 255 -866 -323 842 518 -695 -596 491 432 -592 -581 503 703 -311 -639 276 612 -318 -759
1513 -759 114 668 -106 -649 73 669 -12 -673 -136 597 136 -531 -93 694 284 -559 -274 546 291 -622
1533 -622 -426 568 520 -468 -520 407 580 -376 -648 297 734 -138 -677 167 780 -45 -830 -124 721 134 -782
1554 -782 -281 732 361 -701 -492 565 535 -528 -617 482 730 -320 -737 237 747 -184 -822 32 790
1573 790 82 -733 -137 740 252 -666 -305 645 461 -515 -463 498 538 -418 -602 276 548 -264 -629 165 579
1594 579 -95 -560 18 537 51 -520 -78 528 165 -500 -203 448 203 -479 -327 372 291 -363 -356 307 363
1615 363 -251 -383 256 410 -157 -416 141 476 -89 -467 35 497 7 -504 -58 500 122 -455 -169 471
1635 471 251 -394 -298 380 350 -345 -396 262 415 -298 -529 131 451 -109 -514 3 481 64 -470 -132 455
1656 455 200 -435 -260 356 296 -345 -353 240 337 -238 -392 168 411 -50 -370 30 398 86 -326 -61 351
1677 351 161 -293 -183 230 165 -222 -219 180 210 -115 -222 79 205 -39 -210 16 190 20 -188 -70 100
1698 100 -27 -177 -35 92 27 -133 -41 80 22 -95 -6 120 73 -87 -53 70 12 -86 -57 118 82 -108 -63 73
1722 73 55 -61 -45 106 146 -13 -83 37 137 -34 -182 -11 152 19 -155 -103 69 24 -148 -104 97 174 -39
1745 -39 -131 19 112 -24 -159 -33 152 58 -153 -109 23 50 -79 -132 52 188 39 -137 -32 138 49 -123 -62
1768 -62 187 175 -74 -200 4 136 -40 -180 0 217 96 -159 -142 132 109 -139 -149 139 208 -88 -256 -34
1790 -34 151 -41 -249 -30 231 82 -261 -206 165 176 -141 -145 168 232 -98 -266 2 189 -21 -237 0 220
1812 220 64 -243 -124 200 161 -132 -79 208 175 -122 -196 67 151 -56 -147 76 171 -68 -191 -42 131 -15
1834 -15 -143 57 173 -20 -189 -48 114 -18 -167 17 154 26 -234 -111 130 49 -205 -80 244 145 -207
1855 -207 -153 187 162 -153 -182 193 276 -134 -293 72 258 -87 -334 87 424 60 -379 -68 346 131 -333
1876 -333 -160 385 258 -306 -320 227 282 -255 -394 182 403 -124 -467 8 403 -28 -443 -29 449 140 -426
1897 -426 -216 324 198 -372 -271 329 327 -283 -358 184 368 -154 -331 192 473 -28 -408 13 402 22 -368
1918 -368 -50 418 125 -380 -196 324 166 -323 -204 352 267 -267 -274 241 255 -245 -333 169 325 -178 -392 77
1940 77 352 -79 -409 60 421 -9 -452 -82 441 116 -385 -145 411 196 -422 -294 356 305 -321 -328 316
1961 316 459 -230 -446 213 520 -105 -488 98 588 33 -555 -137 484 145 -526 -235 474 327 -431 -391
1981 -391 353 406 -362 -475 287 555 -170 -526 112 498 -82 -614 -101 490 109 -482 -148 462 229 -415
2001 -415 -285 360 335 -286 -327 318 397 -199 -390 164 375 -129 -423 53 423 17 -353 10 377 31 -377
2022 -377 -106 307 83 -302 -126 288 97 -363 -256 190 143 -284 -203 303 295 -210 -264 191 259 -253 -322 208
2044 208 380 -101 -331 116 356 -113 -485 7 449 94 -372 -18 510 139 -458 -225 379 233 -359 -278
2064 -278 361 386 -304 -441 208 411 -227 -501 141 553 13 -455 -23 492 28 -543 -181 451 243 -407
2084 -407 -254 402 291 -396 -468 237 403 -206 -373 260 489 -114 -474 14 410 -15 -458 -27 489 147
2104 147 -373 -155 372 174 -395 -212 375 304 -227 -220 308 299 -266 -400 139 340 -168 -346 148 381 -99 -448
2126 -448 12 354 -51 -403 4 425 91 -388 -160 353 101 -401 -255 359 300 -275 -285 284 347 -265 -383
2147 -383 197 437 -122 -378 145 485 -22 -446 -50 442 99 -425 -146 431 251 -386 -264 311 282 -327
2167 -327 -381 249 395 -184 -378 102 346 -154 -474 -5 402 32 -408 -50 399 121 -377 -205 312 204
2187 204 -252 -190 274 289 -196 -273 111 249 -116 -274 104 317 -6 -262 48 274 20 -260 -20 271 56
2208 56 -203 -37 214 74 -233 -117 194 83 -207 -126 195 159 -189 -191 164 135 -176 -202 112 193 -131 -250 64
2231 64 194 -99 -281 32 276 7 -285 -24 308 89 -268 -85 281 133 -237 -151 258 221 -175 -226 168
2252 168 272 -119 -291 94 337 -58 -311 33 298 22 -323 -103 270 130 -259 -187 218 178 -219 -231 140
2273 140 205 -126 -216 100 221 -78 -264 14 221 35 -227 -76 198 40 -187 -100 165 135 -132 -100 153 134
2295 134 -99 -88 102 135 -44 -117 45 128 -62 -142 5 94 -17 -129 27 102 -37 -131 -41 100 10 -108 -22 99
2319 99 7 -141 -52 69 31 -103 -59 107 83 -131 -103 84 122 -55 -71 87 132 -40 -121 29 139 9 -136 10
2343 10 149 37 -123 -45 139 90 -74 -43 122 87 -94 -117 41 113 -16 -127 16 94 -21 -164 -76 82 52
2366 52 -66 -65 65 63 -69 -49 44 59 -24 -50 19 68 -13 -55 -16 55 27 1 8 45 39 -14 -27 -1 51 50 41 -10 11 12 -12 -15 -18
2399 -18 39 53 -2 -21 5 10 5 -74 23 64 9 -64 -42 -6 -24 -66 -55 16 39 -17 -60 -14 19 2 -54 28 90 23 -41 -41 13 18
2431 18 -31 -14 38 52 9 -31 -8 51 5 8 44 56 39 -9 -5 23 -15 -21 8 7 -15 9 -14 -18 -54 -6 32 11 -25 -26 13 -10 -71
2464 -71 -67 27 68 -22 -79 0 39 -60 -111 12 115 27 -62 -19 77 48 -79 -42 105 107 -30 -81 50 115 -64 -141 37
2491 37 141 19 -101 -11 110 34 -106 -65 91 92 -109 -96 43 62 -90 -166 29 76 -26 -128 9 110 -25
2514 -25 -109 -37 104 31 -94 -46 65 21 -71 -50 71 60 -49 -57 57 62 -24 -27 43 64 4 -37 25 60 -28 -75 17 71 -23
2543 -23 -54 31 69 -28 -81 -8 79 -22 -91 -12 65 -9 -133 -53 80 25 -126 -43 103 31 -114 -79 105 113 -69 -96 85
2570 85 117 -28 -134 64 149 -3 -140 31 163 13 -158 -22 144 58 -135 -59 162 110 -101 -111 105 151 -89
2593 -89 -124 61 138 -54 -181 11 154 -22 -146 -26 154 16 -161 -50 107 51 -123 -85 112 101 -113 -103
2615 -103 99 110 -113 -121 67 132 -39 -104 85 151 -8 -127 29 167 8 -132 17 180 33 -125 -54 137
2637 137 62 -147 -85 144 86 -118 -122 113 92 -134 -145 71 165 -82 -192 28 153 -53 -193 0 155 -18 -181
2660 -181 -19 201 91 -166 -102 148 107 -167 -121 151 168 -91 -149 91 160 -53 -184 62 222 17 -174 13
2682 13 192 30 -175 -63 154 66 -176 -90 135 105 -147 -183 68 109 -81 -141 76 150 -65 -154 13 121 -30
2705 -30 -166 -17 165 17 -123 -33 144 21 -152 -46 135 77 -97 -53 122 80 -109 -103 90 117 -76 -76 99
2728 99 149 -62 -127 77 148 -37 -157 31 174 17 -141 -3 134 -7 -201 -77 140 41 -139 -70 157 81
2750 81 -165 -159 105 135 -102 -137 96 152 -59 -169 38 165 -25 -185 16 214 77 -135 -29 193 89 -148
2772 -148 -65 155 143 -79 -96 135 152 -100 -137 50 149 -46 -184 30 175 -8 -176 -42 116 12 -157 -46
2794 -46 150 55 -146 -115 114 66 -138 -139 87 119 -67 -100 73 135 -59 -163 39 171 -8 -105 35 177 25
2817 25 -130 -25 170 68 -111 -29 162 103 -109 -60 105 94 -106 -143 73 122 -82 -130 44 108 -54 -175 -1
2840 -1 138 -25 -142 -34 147 30 -134 -57 121 44 -114 -93 108 92 -91 -120 81 108 -67 -101 79 159 -12
2863 -12 -105 29 167 8 -133 7 162 46 -92 -21 138 73 -125 -54 72 77 -85 -91 74 94 -75 -115 21 63
2887 63 -58 -119 19 81 -33 -105 -20 81 -12 -104 6 102 38 -98 -36 68 49 -79 -25 68 64 -63 -54 68 56 -32
2913 -32 -60 63 82 -24 -67 31 96 -12 -91 23 106 3 -109 -22 77 -3 -120 -48 97 22 -116 -61 68 49 -82
2938 -82 -103 43 74 -49 -107 17 98 -64 -97 6 104 12 -84 8 95 47 -66 3 110 80 -48 -31 72 73 -41 -64
2964 -64 71 118 -43 -60 53 77 5 -65 -1 72 11 -72 -28 54 20 -79 -39 50 5 -56 -57 41 8 -79 -58 40 51 -54 -71
2993 -71 4 47 -27 -49 25 73 -18 -63 0 78 1 -43 6 80 16 -25 -5 81 44 -15 -5 59 50 -52 -30 38 13 -47 -52 5 17
3024 17 -42 -64 -10 28 -21 -72 -13 55 7 -62 -30 14 -3 -57 -53 32 50 -12 -16 11 42 -27 -41 46 87 8 -33 3 64 -2 -30
3055 -30 17 59 31 -23 -13 48 24 -13 -15 38 22 -14 -34 11 11 -34 -25 19 28 -12 -43 -32 -12 -16 -45 -27 12 -13 -15 -26 2 -8 -30
3088 -30 -24 16 10 -9 17 -1 18 9 5 31 20 15 5 27 62 5 31 43 43 16 -4 14 9 14 -27 -8 21 -4 17 21 8 -1 -9 0 -5 23 -11
3125 -11 -6 -16 -3 -28 -19 -29 -16 -16 -6 -7 -16 -4 16 -17 -20 15 17 9 -5 13 32 29 17 4 22 21 7 13 37 30 15 7 27 48 13 -15 1
3162 1 31 9 -40 -12 25 7 -42 -21 0 13 -19 -7 2 6 -17 -18 -1 14 -29 -38 -16 30 3 -38 -22 27 6 -20 -7 51 7 12 -14
3195 -14 30 22 -18 -15 27 59 -6 5 37 48 -6 -17 17 56 -15 -18 -25 30 2 -31 -22 2 14 -42 -34 -5 14 -45 -52 8 17 -40 -34 11 31
3230 31 -37 -25 19 49 8 -50 -6 42 16 -28 4 28 28 -34 5 42 34 -31 -6 71 35 -22 -23 54 29 -27 -34 37 64 -19 -43 6
3262 6 42 -19 -53 18 58 -24 -82 -23 55 -10 -64 -20 45 -3 -52 -43 35 45 -50 -42 31 69 -13 -16 49 89 -7 -23 35 73 20 -37
3294 -37 19 74 52 -46 -10 71 32 -24 -12 75 56 -51 -48 1 62 -40 -83 41 58 -28 -94 -14 61 8 -75 1 56 0 -85
3323 -85 -30 50 31 -61 -36 68 39 -32 -49 74 71 -10 -42 30 82 -7 -57 48 81 20 -45 22 97 16 -78 -33 58 32 -66
3352 -66 -49 68 29 -77 -76 29 14 -63 -83 29 55 -43 -66 -11 73 -20 -85 -13 62 -5 -60 -21 55 3 -57 -16 73 60 -22
3381 -22 -30 72 84 -31 -50 49 73 -13 -54 28 71 -13 -54 39 80 -10 -57 -14 66 37 -52 -19 67 15 -82 -64 36 20 -46
3410 -46 -29 40 37 -52 -87 10 41 -28 -105 15 85 -11 -49 0 55 4 -43 16 51 55 -44 -1 89 49 -34 -35 61 64 -1 -10 52 76
3442 76 -35 -53 42 46 -30 -45 9 70 -5 -58 -17 50 15 -75 -51 47 35 -76 -56 44 20 -63 -62 1 56 -47 -63 0 53
3471 53 -32 -71 18 76 6 -69 1 91 46 -57 5 71 55 -37 -18 96 60 -38 -37 34 38 -38 -58 31 82 -30 -68 14 78 -27
3501 -27 -64 4 45 -3 -65 -29 51 28 -68 -33 46 26 -79 -58 36 25 -39 -48 35 61 -27 -55 22 83 21 -34 7 96 28 -38
3531 -38 -27 64 18 -28 2 62 33 -44 -36 38 41 -54 -45 8 28 -24 -41 9 14 -39 -82 -31 39 1 -69 -25 53 -11 -60 -13 33 22
3563 22 -48 -29 44 -3 -41 -44 41 29 -31 -48 27 75 -4 -49 31 40 -24 -27 7 46 8 -11 -17 26 39 -18 -15 38 23 -38 -27 8 20
3596 20 -50 -49 -2 2 -27 -59 -36 17 -32 -66 -10 16 -25 -85 -45 30 7 -23 -36 31 21 -15 -1 37 25 -6 -12 27 37 -9 -14 33
3628 33 72 8 -17 20 14 3 -45 -3 42 7 -49 -8 25 -2 -55 -30 19 14 -33 -30 -4 -5 -22 -39 2 -8 -28 -34 0 27 -17 -40 -33
3661 -33 16 -4 -22 20 20 31 -30 10 49 37 -2 14 36 32 -3 -2 27 45 23 -9 5 30 11 -25 -14 37 7 -40 -14 9 -8 -31
3693 -31 4 12 -5 -29 -30 -23 9 -37 -37 -3 -16 -3 -15 -14 5 -1 -29 -8 8 -15 -1 16 36 11 3 18 19 10 12 -1 21 31 23 23 30 20 14
3730 14 4 22 17 -6 -17 -2 -4 -29 -17 -8 -24 -14 -52 -31 -14 -5 -33 -39 -19 -21 -8 -36 -3 -9 -2 -14 -6 -14 1 -15 -7 -2 12 7 3 21 36
3767 36 3 -2 19 18 0 4 8 14 14 16 -7 30 12 -4 9 6 5 2 -11 -12 -10 -16 -29 -10 -2 -11 -13 -26 -34 -23 -26 -9 -11 -5 -25 -22 -15 8 0 -17 -1 -6
3809 -6 33 14 23 25 27 18 2 38 18 5 28 24 22 10 -18 -3 26 -3 -20 12 12 16 0 0 4 -4 5 -15 -21 -1 -15 -21 -35 7 -36 -24 -8 -3
3847 -3 12 -18 12 15 -17 -22 25 15 17 -20 9 19 3 1 1 35 19 -7 0 42 30 5 9 18 9 3 -21 5 23 -2 -37 -17 7 -21 -26 -26 -28
3884 -28 -13 -48 -46 -9 -5 -27 -15 -17 35 -9 -19 -16 25 0 -38 -20 32 -9 -10 18 -25 -6 -3 -19 20 27 -10 2 26 13 7 -1 33 44 2
3919 2 1 7 41 -8 -36 -4 20 2 -31 -16 36 -11 -60 -17 -3 9 -45 -22 6 -15 -32 -42 6 6 -40 -30 2 24 -3 -17 39 37 4
3952 4 -2 33 34 4 -9 8 30 26 -4 18 46 32 -27 -17 30 14 -24 -12 25 17 -36 -29 5 18 -19 -31 5 13 -18 -43 -17 21 -13 -58
3986 -58 9 20 4 -49 -53 -3 13 -41 -20 33 20 -20 -38 18 45 -5 -30 5 63 17 -17 11 50 40 -17 -13 55 31 -25 -24 38 28
4018 28 -24 -29 2 28 -13 -28 14 24 -15 -54 -7 3 -41 -51 -17 0 -2 -16 -32 16 -13 -54 -34 15 10 -6 -11 33 23 -6 -8 32 34
4051 34 13 -16 38 42 2 -24 20 50 9 -11 6 47 28 -24 -10 17 19 -29 -23 4 -3 -24 -35 -12 3 -34 -58 -46 21 -34 -55 -3
4083 -3 -6 18 -12 -22 1 13 -35 -24 52 16 -14 -14 33 21 1 -31 28 46 8 -14 23 34 24 -29 12 43 32 -22 -9 54 10 -31
4115 -31 -18 34 22 -3 -35 30 4 -53 -33 0 6 -18 -69 12 6 -29 -30 2 14 -9 -29 8 19 -6 -1 -3 54 40 2 21 54 28 -17
4148 -17 2 60 50 8 -6 41 30 -10 -36 28 30 3 -21 -4 24 -1 -19 -7 25 0 -17 -11 13 15 -56 -56 6 14 -11 -2 26 7 -16
4181 -16 -53 -4 5 -14 -16 13 35 6 -3 1 40 27 -22 24 31 53 4 18 39 24 -11 10 40 34 5 -21 16 41 2 -16 18 25 -4 -5
4215 -5 15 15 -15 -35 2 14 -1 -22 -42 4 5 -9 -16 10 -9 -14 -33 0 18 -3 -22 13 16 9 -20 19 25 6 -22 11 46 18 -20 -3
4249 -3 20 21 -9 -12 24 28 -6 -26 -12 11 -17 -27 3 0 -26 -39 -11 -7 -24 -32 -15 -5 -33 -38 -26 -2 -26 -30 -15 -6 -4 -12 -26 -6 13 -19
4285 -19 -8 25 17 -3 -11 6 18 -19 -4 15 11 -13 -34 -7 -3 17 -13 -14 11 5 -14 -33 3 -7 -38 -42 -6 -3 -34 -47 -39 -18 -19 -31 -31 -3
4321 -3 -4 -41 -32 -13 1 -27 -20 2 -4 0 -19 34 11 -5 2 10 16 -2 -2 -1 32 17 13 29 14 6 -4 7 20 4 -32 -27 29 -1 -18 -16 13 -14
4359 -14 -24 -9 -4 -14 -4 -19 -12 -10 -36 -13 -15 10 -7 -1 -6 10 -22 -6 -7 10 12 14 4 11 21 8 19 31 31 38 23 23 13 28 -5 7 10
4396 10 21 1 1 12 12 -5 5 1 -32 -30 -22 -16 -16 -14 -18 -19 -13 -17 -16 -1 15 -24 -22 -23 -6 21 -23 11 9 8 -5 7 -2 16 -3 32 26 24 21 26 20 25
4438 25 41 28 22 26 12 -5 15 4 2 8 2 18 15 5 11 -2 2 -21 4 9 -5 -47 -5 -18 -15 2 -7 -24 -11 2 -14 9 -12 13 -9 11
4474 11 -18 17 5 30 30 22 17 30 17 11 39 4 4 35 12 20 21 -2 11 20 30 4 10 22 -18 -21 -8 -10 -22 -14 -16 -41 -29 -47 -6 2 -8
4511 -8 -8 -10 -16 -12 -10 3 16 -4 1 8 -3 22 16 19 -1 26 22 20 28 39 12 29 29 19 18 7 10 44 17 18 14 8 9 19 -7 10 2 -13 -15 -13 -9 -19
4553 -19 -13 -19 0 -17 -26 21 16 5 -25 -16 3 -12 -9 -24 12 -8 -9 -14 29 -2 13 7 20 33 14 8 30 17 20 16 25 37 33 -18 2 27 12
4590 12 4 -7 -2 -8 -24 -3 1 2 -36 -38 4 -35 -34 -29 -9 24 -11 -17 -21 -17 -3 -10 -1 -1 6 -25 -14 4 17 -6 27 23 13 12 5 23 37 20 3
4629 3 9 29 10 1 12 6 0 -13 14 15 10 3 -13 -5 -7 -14 -19 -13 -18 -17 -41 -26 -13 -37 -47 -2 -15 -29 -6 -19 11 -20 -24 10 17 1 -5 -1 30 32
4669 32 5 1 21 7 6 1 33 20 7 15 4 44 2 2 -3 40 4 -12 -11 4 3 -12 -6 3 -22 -22 -20 -13 -10 -16 -16 5 -5 -29 -29 -2 0 -32 -12
4708 -12 -4 1 -10 -6 -2 21 10 -21 23 47 24 37 13 43 34 15 19 27 42 5 7 -1 10 -15 5 39 -2 -9 -5 -12 13 -33 -34 -14 -22 -17 -24 -19 -6
4747 -6 -9 -29 1 0 5 -32 -13 11 -5 -18 -5 7 21 0 -13 2 12 -8 9 45 46 7 26 2 41 43 13 11 29 37 -38 -3 25 32 -4
4782 -4 -8 8 7 -8 -12 -5 12 -36 -18 8 -1 -7 -37 -4 32 -15 -18 -12 -1 -25 -8 8 9 11 -19 4 23 35 -25 2 54 4 12 18 27 21 10 5
4820 5 30 27 13 -2 5 28 24 -21 7 14 -11 -20 -7 7 -2 -22 -31 1 -22 -50 -10 6 16 -27 -16 3 -2 -10 -11 2 25 11 -3 7 38 11
4856 11 -21 21 19 30 -10 26 40 51 43 13 40 43 7 -17 39 27 30 -6 32 -6 -14 -3 6 45 -9 -21 -12 11 -7 1 -5 3 -13 -31 -23 -11
4892 -11 3 -41 -10 17 -2 3 -22 -5 21 -7 25 29 19 21 24 38 36 21 13 5 60 29 22 3 13 34 38 14 29 15 -11 -11 12 20 9 -15
4928 -15 -6 -8 -21 -1 -18 -3 -14 -4 -18 -17 -5 -24 -6 -10 -6 -14 -7 6 10 -3 -17 4 9 -8 25 6 31 5 3 7 21 18 8 -5 3 25 -9
4965 -9 10 38 17 -1 -19 29 -11 -13 -1 8 15 -9 -17 4 9 -36 -17 -29 -23 -22 -29 -47 -19 -2 -17 -3 2 4 6 -9 -1 21 13 12 35 26 21 0 19
5004 19 23 -6 12 41 2 9 -8 -4 35 11 -7 -1 17 -3 0 -11 -17 12 -21 5 17 -5 -34 -28 7 15 -15 -41 -15 -8 -8 -19 7 0 -23 -41
5040 -41 -2 10 -22 6 6 23 16 19 13 31 30 -4 44 4 34 46 35 33 22 3 13 4 14 10 5 6 -24 5 -12 -29 -21 -12 1 -14 -26 -19 -23
5077 -23 -34 -19 -15 -24 -36 -13 5 -32 -22 0 7 1 11 -12 12 22 14 -3 15 24 9 8 20 26 40 13 25 36 35 16 33 3 28 23 19 16
5113 16 2 35 2 20 -14 -5 1 -28 -1 -38 3 -24 -15 -25 -8 -14 -19 -11 5 -4 -17 17 1 15 9 12 4 31 24 10 16 24 12 20 11 13 8 10 21
5152 21 35 10 10 4 20 21 18 8 -3 6 -8 -3 -6 -30 -14 -17 -15 -20 -14 -12 -19 -15 -15 -20 -17 -16 -14 -9 3 5 -39 2 27 -2 -9 -3 21 40 12 19 27 32 59
5195 59 30 11 17 4 16 34 2 19 32 -1 30 13 2 2 -11 -3 -10 -6 -4 10 -29 -19 -13 -16 -19 -42 -9 -11 -24 -25 12 -15 -22 -9 -17 -5 -2
5232 -2 -27 9 8 13 -10 12 15 25 11 5 8 17 10 28 6 7 8 2 17 32 6 6 13 9 -11 -32 10 -10 -8 -8 -14 -2 -8 -38 -22 -19 -6 -25 -15 -15
5272 -15 -12 -9 -47 -15 2 4 -11 12 -8 1 -13 -10 7 -10 24 10 13 18 12 5 39 -9 17 29 22 43 -2 4 1 12 3 -1 0 9 -9 -13 -5 5 -11
5311 -11 -26 -32 -30 -30 -29 -22 -6 -42 -42 -19 -9 -3 -17 -21 -17 -3 -6 -34 -4 12 16 10 3 36 -3 8 -8 -4 25 15 22 34 -13 1 3 6 15 -3 -4 5
5351 5 0 6 -25 -1 -4 -13 -14 -26 -24 -12 -28 -33 -8 -29 -18 -30 -21 -4 -43 -14 -6 -4 3 -20 -3 17 -8 -13 2 34 8 1 16 39 -3 9 11 42
5389 42 21 7 3 9 14 0 -18 4 12 6 4 -19 11 -12 -34 -41 -26 -16 -35 -14 10 -13 -22 -34 -9 -24 -6 -10 -22 -23 -17 -51 -11 11 -9 -15
5425 -15 29 16 11 9 7 17 13 7 13 43 24 1 41 22 -25 2 17 18 27 -3 -5 8 0 -16 -11 -9 -4 -27 -19 -5 5 -20 -33 -6 -26 -39 -32 -13
5463 -13 -31 -7 -20 -4 -3 2 -14 0 11 3 -19 -15 3 4 15 4 18 0 13 5 28 37 20 7 4 13 0 10 24 7 -5 1 -15 12 -10
5498 -10 -10 -26 -15 -9 -10 -19 -13 -10 -16 -34 -26 2 -16 -28 -14 4 6 -13 -9 12 6 -36 3 18 25 9 11 15 19 2 11 32 21 16 35 17 19 12 -3 -10
5538 -10 12 7 -6 0 7 -5 -13 -5 -7 -1 -26 1 -7 -22 -22 -18 -11 -14 -8 -45 -31 -26 -13 -20 -11 -10 4 1 -29 -14 -4 -6 8 2 19 2 0 37 20 10 17
5579 17 23 35 21 32 19 19 -4 -13 21 8 -22 -23 -8 12 -16 -18 -24 -11 -24 -16 -6 -15 -3 -31 -36 -37 -17 -28 -10 -6 -7 -10 -13 -5 -13 1 7 10 10 37
5619 37 5 20 18 23 23 18 17 24 -7 0 20 26 17 14 35 12 -15 -14 13 5 5 -2 -5 -12 -23 -22 -52 -36 -28 -29 -18 -13 -19 -47 -34 -7 -14 -6 -8 0 10 -1 4
5662 4 6 11 7 25 9 3 1 24 24 6 -19 9 19 20 10 6 38 1 7 -9 1 2 22 11 9 -5 -1 -4 -20 -4 13 -1 13 -20 -36 -17 -11 -33
5700 -33 -23 -31 -32 -4 -19 -7 -14 -18 30 -3 16 24 -3 9 34 40 9 25 2 25 12 26 -6 25 18 12 22 6 2 7 8 3 -11 -34 10 -18
5736 -18 -8 -22 -2 1 1 14 -8 -16 -8 -32 -14 -4 -16 -9 -29 -14 -11 -5 1 -1 -9 -17 4 -1 -11 1 5 14 6 27 12 24 13 18 30 37 22 37 32
5775 32 13 31 17 8 14 -6 -2 -2 -7 -30 -21 -4 -19 -6 1 -1 -20 -5 -5 -29 7 -6 -10 -1 -34 0 -17 -6 -1 -22 1 12 8 2 -21 5 1 10
5813 10 29 20 7 35 19 19 21 16 -1 12 -1 16 9 19 -14 -22 -8 -12 -9 -18 -16 -13 -26 -46 -22 -14 -28 -5 -30 -15 -21 10 -16 -22 -6 6 -4
5850 -4 -1 -7 14 5 -1 16 24 7 16 0 6 31 12 2 4 32 -5 -4 9 -17 11 15 -4 15 -5 -5 -2 -3 -9 -4 4 -29 -5 -10 -11 7 -19 -5 -7 -24
5890 -24 -12 -40 -20 -18 -32 -21 -3 -19 17 1 -7 15 21 13 18 21 11 3 25 17 21 35 32 7 22 21 6 -3 30 5 3 2 -10 -17 -3 -2 -29 1
5928 1 -8 -18 -4 -28 -16 -18 -36 -21 -27 -14 1 -7 18 -3 -8 3 0 2 -11 -3 -7 -2 2 11 40 25 10 20 31 23 6 22 31 31 8 18 16 24 -6
5967 -6 8 -1 0 -6 1 -14 -3 4 -20 0 -27 -27 -12 -26 -9 -22 -21 13 15 -15 -17 -15 -13 3 -17 11 7 11 -8 6 -1 -3 7 3 13 26 -1 -5 16
6006 16 21 21 6 15 15 31 0 28 19 -5 11 22 9 10 -21 -19 -14 0 0 -22 -32 -21 3 -18 -3 -2 -14 -14 -15 -12 -11 -17 -14 -2 -5 -3 8 4 19 -4
6046 -4 11 6 -5 -9 -2 15 8 1 15 11 -22 6 9 8 17 0 12 -6 -5 -3 3 -12 -18 3 -11 -19 -7 -18 -37 -20 -13 1 -3 -31 -28 9 -30 -31 -43 -22
6086 -22 -9 -24 -8 -18 -6 -23 2 5 3 18 15 23 11 20 17 20 26 1 -2 14 5 6 9 22 17 -8 4 4 2 -23 -20 -15 -17 -33 -44 -32 -11 -19 -29 -23
6126 -23 -21 -37 -31 -14 10 -6 -6 -10 -28 -42 -7 -18 -23 3 -23 -10 2 6 -1 -12 33 35 7 21 -2 17 12 9 5 5 13 2 17 18 -16 -25 -1 -16
6164 -16 -35 -31 -48 -28 -35 -15 -55 -5 -8 -10 -18 -11 -20 -14 -14 5 4 -19 0 -16 0 -12 11 3 -7 4 14 -2 21 13 20 -16 3 -9 16 18 0
6201 0 23 1 -11 -18 19 14 -8 -6 21 25 -20 -1 -12 -22 -14 -15 -25 -10 -4 -33 -11 -1 6 -5 -30 -19 -29 -33 -17 -16 -19 -8 -21 14 11 -1 6
6238 6 16 29 15 14 41 27 0 22 21 16 0 5 12 1 6 1 0 2 -19 -11 -12 6 -25 -8 -13 8 9 -17 5 -12 -8 -18 -18 -24 0 -20 -21 -11 12
6277 12 11 16 18 -4 2 -7 6 8 22 19 8 7 9 -1 -2 25 10 39 6 40 19 27 34 20 22 20 -11 -13 -2 -25 -6 -16 -15 -24 -33 -7 -10 10 0 -12
6317 -12 -10 -10 -24 -17 -1 -12 -5 0 -7 16 19 22 4 30 22 12 -12 25 21 22 8 23 17 -5 1 22 -5 -8 -8 -11 4 5 -4 -2 23 0 -39 -3 -7 -29
6357 -29 -25 -16 -6 -37 -26 -16 -27 -34 -10 -24 -14 2 -18 -25 13 4 -3 3 21 15 -1 1 34 -4 22 13 27 10 19 9 37 -9 7 2 17 3
6393 3 20 -2 10 11 9 15 5 -9 -30 13 -9 -33 -11 -9 -28 5 -11 -12 -31 -10 -14 -27 -36 -10 0 -19 -9 -8 -2 11 0 14 5 21 0 -4
6429 -4 34 21 10 14 8 42 34 20 19 13 18 4 4 -12 5 -16 -8 -8 -7 -12 -10 -22 -12 -20 -26 -30 -12 -9 -15 -25 -13 -33 -38 11 -26 -31 -16 -4 -16 -9 -18
6470 -18 5 -1 -4 22 -4 -3 -2 -1 -9 -5 5 18 25 -2 -3 6 24 1 19 12 23 7 0 -10 -19 6 2 -5 1 -12 -35 -24 -23 -31 -40 -36 -25 -27 -23 -11 -23
6511 -23 -9 0 -25 -25 3 4 5 -4 -10 11 5 -12 5 35 25 16 11 4 26 20 21 8 40 16 24 16 10 5 3 -6 -8 -18 -2 3 -5 -22 -43 -31 -3 -25 4
6552 4 -33 -18 -30 -11 -15 -22 -36 -18 -20 4 -8 14 7 0 5 12 8 16 12 7 21 11 5 33 17 13 23 5 26 32 9 -7 -2 23 -6 -19 6 -2 -6
6591 -6 -10 3 -16 -19 -12 -10 -30 10 -16 -19 -17 -20 -9 -2 -7 -29 -30 1 -18 -16 -31 -18 -4 -6 -11 10 -11 -2 -7 -5 12 2 12 23 19 31 -4 11 13 10
6631 10 8 -4 12 1 16 -14 -24 -29 -19 -18 -28 -18 -4 -27 -39 -22 -27 -20 -49 -22 2 -8 -18 -12 -8 -8 -17 -15 7 -3 2 7 21 6 -3 10 11
6668 11 32 -10 -3 24 27 38 -2 8 -8 -1 6 14 9 -2 7 -18 0 -15 -16 -22 -17 -17 -4 -27 -15 -20 -24 -27 -29 -27 -8 -33 -53 -35 -7 -23 -8 -23
6706 -23 5 -2 -6 -3 9 1 -6 30 8 -12 2 2 7 7 15 18 2 31 15 18 17 5 14 8 -7 -17 -12 -33 -3 -1 -24 -19 -10 -8 1 -15 -18 -10 -30 -24 -34 -5
6748 -5 -13 -15 -11 -12 -4 1 -3 -8 7 -15 -7 21 11 30 3 13 21 6 17 12 22 3 23 31 8 36 0 -23 5 12 -11 1 -17 -14 -28 -1 -10 -2 -17
6787 -17 -26 -2 -26 -16 -6 -25 -8 -19 1 -9 -23 5 -14 10 -26 14 -9 3 -8 22 21 -6 -7 -11 19 7 11 27 -6 23 22 26 6 21
6821 21 15 9 -9 -7 -12 7 -6 -5 -9 -24 2 -31 -10 -1 -30 -11 -3 -22 -1 -18 -20 -2 -4 -12 -9 -12 -6 6 -1 6 1 -2 24 9 19 0 19 4 17
6860 17 17 23 15 11 16 22 22 -4 35 10 4 14 10 36 28 3 -10 16 -9 -22 -9 -5 -15 -19 -1 -11 -16 -18 -22 -7 -11 -21 17 -11 -1 -17 -14 -7 -14 6
6900 6 2 19 10 35 28 35 27 11 7 31 25 34 14 11 39 25 4 19 9 5 -7 -11 27 -23 -12 -16 -12 -16 5 -6 -25 -20 -3 -45 -40 6 -2 -20 -18 4
6940 4 -8 -9 -10 -23 -2 -23 -16 14 -6 -15 -10 8 -5 6 12 30 27 10 25 29 9 -2 18 18 19 14 29 37 26 -5 -11 -6 -1 -16 -30 0 -5 -17 2
6979 2 -16 -5 -23 -2 7 -28 -17 -39 4 -1 -19 2 8 -23 3 13 3 -10 -5 4 26 3 10 6 -4 18 11 15 6 8 1 27 -5 -12 11 0 -4 0
7017 0 18 8 -4 -5 -25 -6 -29 -12 -3 -17 -24 -17 -24 -29 -13 -21 -13 -16 -2 -12 8 10 16 -1 -1 18 -4 4 -6 -1 7 13 -5 -2 25 7 13 14 -5 -5 9
7058 9 9 1 -13 23 13 10 5 22 -22 -5 1 -20 -18 -36 -16 -28 -18 -21 -12 -15 -30 -8 -5 -29 -29 -22 -9 -24 -6 -2 6 10 2 -7 9 19 28 6 9 25
7098 25 22 24 34 21 16 51 19 21 29 17 16 -8 -13 -16 -9 -2 -4 -4 -16 -13 -3 -5 -2 -15 -20 -7 -5 -20 -28 -22 18 -12 2 -18 17 -7 -18 3 -18 -3
7138 -3 -1 15 -14 23 16 11 24 26 32 34 26 37 17 16 30 14 3 0 -6 25 14 5 -15 5 -13 12 -3 -5 -20 -17 7 -19 -15 -1 20 15 -6 -19
7176 -19 6 1 9 10 7 3 -1 -8 23 -6 25 17 7 25 23 22 9 -3 24 14 26 39 22 15 1 6 2 30 10 5 16 5 10 20 -12 0 -5 -21
7214 -21 -22 -16 -9 -21 -14 9 -23 -19 -17 -1 2 -24 8 -8 -2 -15 -14 -11 14 7 30 -2 34 8 16 32 20 0 29 20 16 26 25 5 27 -7 -1 -6 3
7253 3 10 2 -15 5 -7 4 -12 -18 -2 -17 -30 6 -2 -21 -19 -22 -18 -29 -22 -9 3 -4 -16 -20 2 -7 -9 -12 2 -9 15 24 15 16 17 29 17 11 27 -13
7293 -13 27 12 13 6 21 15 0 2 1 23 2 -1 -6 -10 -2 -16 -1 -10 -10 -11 -26 -8 -10 7 -10 4 6 -18 -24 -9 7 6 14 -4 -6 9 23 2 13
7332 13 20 10 0 26 25 16 4 -2 30 11 12 25 15 1 -6 15 15 -6 10 11 12 -3 -6 -4 -7 -8 -22 -18 -10 -1 -3 -9 -18 -14 -7 -18 -5 -6 -8 3 22 12
7374 12 23 -3 26 22 15 21 24 11 25 26 22 23 33 10 -8 7 32 10 -5 10 45 17 3 -10 9 1 15 -5 6 -14 -5 9 -4 -2 -9 4
7410 4 0 -5 -30 -17 1 -24 -18 5 -7 7 3 -23 1 13 10 9 29 32 11 -7 17 36 -3 15 9 29 11 11 28 6 10 -2 12 -21 -6 -9
7446 -9 -5 -12 -10 2 2 3 -16 -15 2 -3 0 9 -2 -14 -2 -31 -3 -1 3 0 -12 5 -4 9 15 14 -4 17 7 28 16 30 24 50 31 20 28 50 10
7485 10 14 33 28 16 4 14 3 3 26 -2 16 -6 4 -19 -16 -4 -6 -23 -29 -17 10 -4 -7 13 -4 -3 4 -10 0 -1 -5 17 -4 20 -9 19
7521 19 -5 26 1 26 10 -12 7 24 23 4 24 26 24 28 37 28 -5 13 2 7 2 -16 8 -4 9 -10 -7 0 -23 -20 -32 -18 -17 -9 -13 -15 9 -19
7559 -19 2 7 -7 0 9 -2 -2 14 10 21 23 1 34 28 8 41 32 34 6 12 20 16 35 19 23 11 1 6 18 13 7 19 -2 -1 1 11 14 -12 -16 -20 -16
7600 -16 3 -12 -25 -21 -18 -32 -13 -4 12 -12 6 -8 -8 12 -3 7 17 25 24 0 17 37 15 24 32 8 22 39 6 19 7 -5 -10 -10 -5 20
7636 20 6 -7 -18 -6 16 -21 13 -14 -32 -11 -11 -27 -4 0 -12 5 0 -14 -32 -2 -18 -22 -31 -18 -21 -7 10 5 7 -2 -4 -11 19 15 -4 -14
7672 -14 22 22 -2 33 5 14 16 3 -9 31 5 -3 35 13 -7 -22 -12 6 -25 -33 -17 -6 -27 -22 -22 -13 -14 -16 -3 7 1 2 -7 -1 -16 5 -6
7709 -6 4 5 19 8 -1 11 6 -1 18 21 7 11 6 20 33 10 7 30 12 14 3 12 2 0 -4 3 2 -6 -7 -34 -29 -21 -34 -27 -7 -23 -32 -14 -8 -18 -11 -27
7751 -27 -15 -2 -11 11 18 17 1 18 -6 32 9 16 13 10 20 -1 29 20 14 19 4 24 24 2 5 -5 -11 -6 5 12 -17 -12 -6 -9 -13 -1 -14 -3 -15
7790 -15 -23 -30 -25 -9 -22 -27 5 -28 -31 -7 -17 -16 6 -5 -12 20 0 11 18 8 15 45 -1 -4 2 12 13 22 -4 8 15 9 13 10 -16 -7 -4 -4 -25 -5
7830 -5 -14 -33 -27 -32 -17 -15 -22 -19 -25 -10 -23 -7 -34 -26 -14 -23 -5 5 8 2 -3 13 2 -1 7 -2 -1 15 -9 12 1 -6 19 22 8 22 4 16 22 -3
7870 -3 6 12 16 -13 -20 -17 -11 -27 -8 -31 -21 -50 -38 -25 -24 -25 -35 -17 -12 -36 -47 -13 -17 -19 -23 -7 -7 -30 0 19 -16 -21 0 12 -2 7 -10 15
7908 15 9 -2 7 20 0 13 -4 -10 4 7 13 -31 -16 -22 4 -10 -16 -14 -7 -23 -18 -15 -36 -2 -21 -27 -32 -26 -39 -17 -31 -44 -45 -41 -21 -22 -20 2 4 -10
7948 -10 6 15 -4 5 28 1 -3 0 13 15 33 5 -12 5 13 2 0 -21 13 -21 2 -19 -24 -15 -21 -15 -23 -12 -7 -20 -39 -5 -35 -4 0 -14 -11 -10
7986 -10 -7 -9 -8 -19 -8 -16 0 -5 10 2 1 -19 2 16 6 -3 12 9 9 7 19 18 20 -9 -10 28 21 13 13 -9 4 8 -5 -16 -9 -12 -16 -12 -30 -25 -31 -21
8028 -21 -19 -28 -28 -26 -8 -11 -23 -10 -27 5 -9 9 -11 10 7 3 -14 20 5 29 -7 13 0 2 23 -10 -11 -2 -2 0 -15 -1 -4 22 8 -1 0 -9
8066 -9 -4 -21 12 -28 -43 -19 -5 -39 -28 -13 -34 -26 -35 -29 -25 -12 -4 -2 -4 -1 -3 -5 -9 -5 -4 14 5 18 19 12 0 13 9 6 8 7 23 21 -3 9 -5 13
8108 13 5 -17 -6 -4 2 -3 -5 -10 -14 -30 -20 -25 -37 -30 -24 -6 -28 -30 -32 -24 -8 -12 -13 -22 -8 -22 -21 -8 -21 -11 0 4 16 -9 5 9 1 12 19 -15 10
8149 10 1 11 -18 3 24 18 -14 1 -5 -5 -7 -18 1 -38 -39 -12 -17 -13 -27 -24 -23 -30 -41 -4 6 -3 -7 -19 -5 -6 0 -2 -12 -9 1 -16 5 -4 6
8188 6 2 29 16 12 2 26 25 17 21 12 35 8 20 2 2 32 21 -5 11 -16 -18 -20 -10 -9 -6 -12 -28 -9 -16 -30 -22 -37 -19 -38 -37 -18 -18 -22 -7
8227 -7 -5 1 -7 1 19 -2 -17 17 -8 6 -2 11 26 6 29 -15 18 -6 16 7 3 2 4 7 8 -17 9 35 14 8 0 -16 18 -29 -2 -2 -46 -13
8265 -13 -2 -8 -22 -7 -12 -5 -25 -20 -23 -46 -21 -10 1 -18 0 -1 6 1 13 17 10 6 20 11 18 6 2 2 18 -10 5 -12 20 0 -17 -4 -10 17
8303 17 -6 -11 -20 -2 -18 -2 -21 -10 -20 -10 -18 -10 -33 -7 -22 -26 -16 -28 8 -10 1 -14 7 -2 7 8 -11 6 7 10 0 -5 22 1 4 15
8339 15 35 11 14 2 38 3 30 17 -12 -9 7 -9 -3 -10 -14 -22 -20 -7 -23 -10 -14 -7 -16 -9 -16 -10 -18 -13 -7 -4 1 -17 0 0 -6 5 11 -1 17 19 12 -2
8381 -2 9 14 -8 14 10 16 15 15 22 16 3 20 -4 13 21 0 9 21 28 13 -4 -23 8 -11 -4 -1 -18 -37 -26 -25 9 -11 -15 -31 4 13 -18 9
8419 9 -13 14 -8 -9 15 17 6 7 23 15 40 17 5 36 15 8 24 5 -2 2 20 4 -20 12 5 16 -11 6 -9 13 -1 -2 -15 -16 -24 -34
8455 -34 -31 -1 8 1 -38 -20 1 -1 -8 -12 1 -5 -16 20 -12 -7 -5 28 18 9 38 29 24 16 48 24 34 22 21 25 29 1 28 23 8 3 15 22 16 16 1
8496 1 -8 14 -2 -17 -10 -5 14 -6 -25 6 0 14 -12 2 -1 -7 5 -16 2 -13 4 5 12 28 19 35 18 23 27 29 28 11 19 17 16 23 20 16 21 11 15
8537 15 9 4 -8 2 12 -11 -3 -10 -17 2 -2 -21 -21 -5 -27 -7 -18 -2 5 -7 -2 -2 2 0 15 -7 4 -5 3 9 31 4 12 13 21 17 27 32 14 30
8577 30 7 20 17 24 2 -9 22 21 22 4 -2 -2 1 -14 8 -20 -8 -11 -14 -23 -4 -5 -17 -25 -17 -28 -11 -10 -14 -29 1 -3 11 18 9 -3 5 -2 7 21 19
8618 19 21 12 8 18 6 9 9 13 5 7 27 19 1 -8 12 -26 0 -10 -11 -2 -4 -27 -33 -13 8 -11 -23 -29 -20 -33 -3 -21 -7 -11 -36 -7 -32 5 -10
8657 -10 -20 -5 -2 9 -12 15 3 10 9 -7 36 22 24 4 24 29 18 10 14 14 15 12 7 -9 7 14 10 -14 -14 -10 -3 -22 -16 -36 -34 -13 -19 -2 -25 -21
8697 -21 -17 -7 -18 -28 -24 -12 -2 -10 -16 6 7 9 -12 6 13 6 -12 -9 23 17 -2 -10 -6 8 -3 20 1 -10 2 -9 1 -8 -5 -17 -18 -14 -4 1 0
8736 0 -37 -51 -25 -18 -25 4 -5 -33 -16 -20 -44 -25 5 1 -5 -22 -4 14 -25 3 -13 9 -1 -5 -11 13 8 5 17 28 8 14 10 2 -1 10 6 -4
8774 -4 14 -19 -22 5 -12 -8 21 -12 -2 11 -8 -3 -24 -11 -8 -10 -26 -52 -46 -29 -30 0 -21 1 -9 2 1 -10 -20 7 -5 -14 20 5 12 7
8810 7 13 1 13 -11 1 11 12 18 -20 -12 -1 12 -16 -10 7 1 -17 -27 -10 -17 -9 -34 -12 -24 -11 -39 -24 -11 -7 -35 -16 -26 -5 -3 -18 -8
8846 -8 -9 -30 -2 -22 -11 2 -22 1 2 6 9 9 9 16 -3 7 15 13 14 29 20 -2 3 -11 -8 10 -15 -9 -25 -10 -23 8 -27 -9 -23 -34 -8 -31
8884 -31 -24 -24 -26 -4 -8 -2 19 -6 -13 -6 15 -1 22 5 -9 -12 8 15 18 10 7 12 7 16 7 -18 20 0 12 8 17 7 4 11 -32 9 10 -3 -3 -9 -13 -26
8926 -26 -17 -35 -14 -23 -45 -13 -35 -37 -19 -17 -18 -26 -14 -24 -10 7 2 -6 -19 13 10 1 -2 17 -4 5 11 3 -1 -6 -2 7 2 19 20 2 -8 22 17 -14 13
8967 13 0 -3 -7 -7 -1 -16 0 -25 -5 -24 21 -2 -13 4 -23 -26 -27 -9 -35 -22 -9 -9 -14 -5 0 -15 5 -25 5 25 -2 -4 2 8 6 6 -12 16
9005 16 7 4 17 3 15 -7 -2 13 -14 -3 -16 -11 -1 13 -30 -4 -31 0 4 -4 6 -35 -28 -12 -16 3 -11 -6 -17 -21 -4 1 7 -3 -5 1 -5 -6
9043 -6 -4 -3 18 15 6 8 2 19 16 24 15 20 37 16 24 7 -6 11 -2 45 7 -6 -17 -17 -20 -31 -11 -9 -13 -8 -8 -25 -40 -16 -18 -16 -6 -16 -35 -3
9083 -3 -33 -1 -2 23 6 -4 22 -8 6 13 -6 9 4 -4 3 16 -10 24 -3 10 3 -10 14 -11 3 6 7 1 12 -16 -9 -5 6 -29 5 -9
9119 -9 -8 -45 -33 -16 -38 -6 -16 -5 -22 -26 13 -9 -5 10 -10 -17 -1 21 13 -13 15 6 17 5 7 20 16 15 27 -11 -8 19 -8 -2 1 -2 4 4
9157 4 3 -14 -11 17 -9 -22 13 -17 -15 -7 -22 -8 -19 -5 6 -38 -25 -1 -17 -10 -14 14 14 -7 -17 -16 -4 3 18 16 -11 -12 22 34 2 6 25
9194 25 -2 31 0 -1 3 37 16 11 5 0 -24 -10 4 -31 2 -16 1 -2 -15 -4 -13 -22 -2 -30 0 -16 -15 -3 -24 -7 3 4 -13 -8 -20 3
9230 3 -11 16 -10 18 0 -4 11 7 9 4 10 -18 21 17 21 -1 0 18 13 20 8 1 -5 -3 19 -5 13 -14 -4 -2 -27 -32 -52 -23 -8 -20 -3 -19
9268 -19 -33 -35 -20 -17 -9 -7 -6 8 1 18 6 1 -8 16 7 12 14 20 -16 5 10 17 27 13 0 20 20 -8 12 0 1 11 13 -4 12 17 0 0 -11 -16
9308 -16 -22 -5 5 -2 -19 -31 -30 -7 -38 -1 -9 -24 -1 -4 -21 -15 -2 -17 1 11 0 21 3 -3 13 1 -6 18 14 8 4 10 7 2 -13 5 3 10
9346 10 7 -15 -11 13 -19 -12 -21 -22 -16 -3 -18 -37 -20 -7 -27 -10 6 -20 -15 -23 -1 -14 -5 -33 -12 -20 9 -18 -11 -21 -9 -2 3 -10 -2 17 22 -4
9384 -4 15 19 15 16 41 -3 -6 14 13 1 -4 -1 0 -3 -3 -37 -13 -14 -27 -20 -42 -21 -40 -20 -4 -25 -33 -12 -18 -22 -27 -28 -36 -19 1 8 -4 -7 13 4 -3 -1
9426 -1 -4 14 -3 19 15 24 6 -2 -5 -2 18 11 2 15 -21 0 -3 -10 -3 -4 -18 -21 -12 -35 -7 -17 -21 -17 -19 -8 -7 -14 -22 -28 -19 -17 -22 -13 -19 -8 7 -29 -2 8
9470 8 10 3 16 10 25 -1 -8 -9 -1 -2 1 0 13 7 1 3 19 2 -10 -10 -14 -13 -8 6 -6 11 10 -21 -18 -24 -38 -26 -31 -28 5 -17 -14 16 -6 -22 -26 -8
9512 -8 -20 -15 -10 11 3 -19 -6 6 8 -11 20 21 32 29 20 3 25 2 15 -11 8 14 -4 -15 -14 4 -6 -3 -11 -6 -4 -17 -15 -10 -22 -4 -4 -22 -19
9551 -19 -21 -15 -16 -24 -22 -19 6 -4 -7 -28 -23 -6 -6 -4 1 -23 -3 12 -12 9 14 22 -15 -4 15 13 6 -9 16 2 -13 9 -2 8 12 4 8 -3 -16
9590 -16 -2 -16 -12 2 -10 -39 -10 -26 -4 -18 -18 -15 -7 -11 -18 -14 -3 -4 8 5 -27 4 12 0 -6 22 9 8 9 12 0 -1 0 17 -6 -6 3 7 -4 -8
9630 -8 12 3 -19 -13 -1 5 11 -8 10 9 2 8 -11 -21 -22 -42 -15 -17 -20 -7 -39 -5 -8 -7 -9 4 3 -8 6 -7 -12 -1 15 14 12 9 33 15 4 11
9670 11 16 21 15 7 -3 3 -9 16 -23 -33 -14 13 -5 -19 -28 -19 -17 13 -16 -16 -17 -14 -15 -8 -14 -36 -17 -4 -13 -2 -5 -20 -24 5 16 -8 12 -20 -14
9709 -14 -36 22 33 -2 -8 -1 12 5 10 40 4 22 25 15 2 16 18 30 -5 4 -15 1 -12 2 4 -11 -15 -23 -4 -24 1 -5 -7 -6 -18 -18 -6
9746 -6 -15 34 -12 -11 -4 -7 -14 0 -26 14 10 -24 -6 25 -5 9 16 -3 -11 -2 11 4 20 4 -3 1 10 9 1 -5 -2 26 -13 -15 -9 -12 -25 -34 -7 -21 -14 -7
9788 -7 -5 -12 -27 -16 -27 -33 -13 -26 -23 -12 -18 -18 -10 -11 5 -1 -11 9 11 11 3 2 5 1 -5 15 15 8 25 -2 9 11 10 5 -12 2 14 -7 -2 -1 -6 -16 -14
9831 -14 -29 -12 -6 -37 -7 5 -22 4 -18 -30 -22 -30 -23 -19 -32 4 1 -3 -4 -3 -9 31 10 12 8 21 13 21 15 -6 22 17 2 5 18 9 -18 6 15 -34
9871 -34 28 -3 7 2 -22 -18 0 23 -5 -17 -30 -23 -23 -34 -29 5 -7 -16 -10 -24 -6 -19 -11 -13 -30 -18 4 -21 4 -19 17 5 -1 29 13
9906 13 0 8 1 11 0 0 6 -2 -17 9 11 -15 -8 2 -8 0 -6 -15 20 -16 -40 -10 -29 -11 -17 -16 -10 -16 -21 -8 2 -18 -7 -16 11 -12 12 3 10
9945 10 11 18 -12 5 4 -3 -13 36 -1 -18 3 3 -10 8 22 15 -15 0 -9 -2 0 28 -11 -7 -7 1 6 1 -20 4 -12 -36 -31 -8 -4 -15 -8 -6 -19
9984 -19 -25 1 -9 0 0 14 6 0 -18 -6 12 16 -6 0 25 -2 9 10 6 -2 -10 10 5 -6 9 4 -29 7 -3 -3 -1 1 2 -8 13 -14 -1 -8 -28
10023 -28 -22 -5 -23 -20 -30 -35 -26 -29 -23 -1 -26 -11 -7 -18 -7 -16 2 -1 14 12 -7 -2 17 -5 10 14 8 10 22 40 13 12 14 4 13 4 -16 -6 5
10062 5 -8 -13 -27 -20 -28 2 -15 -14 -14 -10 -1 -21 2 -8 -5 -5 9 -8 -8 -1 -6 6 -11 -23 2 -1 -5 13 -21 2 2 19 7 -1 4 -12 -6 3 6 -8
10102 -8 10 -3 5 6 -18 -10 6 -20 11 -3 -31 -33 -25 -26 -3 -1 -28 -27 -23 5 -8 -9 -17 -7 21 4 -7 -16 1 -8 -16 -3 -1 14 8 3 -10 10 7
10141 7 9 7 1 -5 -9 1 19 9 6 6 9 31 3 7 17 6 12 -7 -8 12 -20 2 -22 -22 -29 -18 -3 -28 -17 -20 -32 -27 -43 -31 -27 -24 -1 -8 -3 -9
10181 -9 -6 -6 11 1 -5 2 10 3 16 -1 -10 -17 8 -1 4 -2 -13 -23 14 5 -2 13 0 -13 3 -11 -20 -33 -2 -13 -19 -17 -18 1 -18 -14 -5 -1 -21 2
10221 2 -28 -35 -3 -20 5 -12 -10 4 5 -15 -6 -6 10 23 7 18 5 20 8 8 4 14 25 8 30 8 5 19 4 12 6 -18 -4 14 0
10256 0 -8 -6 11 8 -21 -24 -22 -18 -7 -8 -4 -16 -20 0 -2 11 -6 -8 -10 2 1 14 -18 -5 -5 0 3 24 2 21 17 0 6 10 13 -1 28 18 6 1 11
10297 11 -1 2 1 1 -13 12 4 -14 10 -17 3 -21 -24 4 -25 -26 -22 -9 -11 -17 -21 1 -19 -2 20 -7 3 10 9 14 17 -1 12 1 9 18 17 38
10335 38 28 7 19 6 -1 1 1 -7 9 -1 -14 17 11 1 -16 -28 -5 3 -17 -11 -6 -15 3 3 -6 -5 -35 -20 0 -43 -42 6 -13 -5 -4 -24 -15 -19
10373 -19 -4 0 1 -4 3 -5 17 26 0 24 7 13 19 15 4 16 8 2 -9 17 -5 20 -5 -10 9 -5 -9 -40 -1 -17 2 -4 -18 -3 -33 -6 -14
10410 -14 -34 3 -19 -7 -30 -14 -21 -17 1 -14 1 -1 -3 -9 -4 16 -23 -17 -4 2 11 -11 -2 1 10 19 12 10 10 -5 -14 -6 -22 -1 -2 -9 -19 -29 -25 -14
10450 -14 -22 -43 -51 -31 -38 -38 -18 0 -10 -2 -7 -10 0 -16 -25 -4 -10 15 5 -2 -3 4 0 3 15 -3 22 -5 7 12 -2 12 3 -3 25 -4 11 12 -6
10489 -6 -9 5 -3 -5 -16 3 -5 32 -12 -6 -29 -15 -16 -2 -20 -24 -2 -26 -4 -3 -15 -9 -25 -9 -14 0 8 -1 -3 27 11 6 -1 14 -10 26 15 9
10527 9 21 -1 36 18 -16 -19 -4 0 13 -9 2 -13 6 -7 -26 -28 1 -15 -26 -2 18 -16 -13 -11 -2 -24 -17 -18 -15 -6 -3 -24 -9 -18 -10 -9 -2 -7
10565 -7 -5 -16 -20 2 6 19 5 -12 7 11 -15 18 6 24 4 20 1 5 4 -7 -17 -26 -15 -13 3 -9 -17 -22 -28 -19 -7 -21 3 -2 -35 -23 -13
10602 -13 -12 4 -13 3 -25 -3 -17 8 13 -9 6 -3 2 -5 -9 6 -4 6 4 4 33 11 -5 -1 0 11 11 -8 4 7 2 -3 5 15 -31 -18 -15 -24
10640 -24 -23 -19 -19 -8 -37 -38 -12 -8 -3 -10 -5 6 -16 5 6 8 1 -10 33 -13 -1 -11 -13 7 -12 10 -6 -8 16 9 -15 15 37 7 2 1 14 13
10678 13 -17 5 3 -1 -28 4 -8 -12 -2 -23 -23 -3 -13 -8 -10 -16 -4 -15 -20 -33 -18 -12 -7 -23 -16 -9 -14 -8 -18 14 12 13 14 -4 -4 -8 15 -12 5
10717 5 12 1 17 38 -9 9 -6 -10 -3 -3 9 -12 -21 -12 -7 -16 -37 -27 -18 -16 -23 -40 -15 -26 -13 -26 -29 -17 -3 -18 -33 1 7 -19 -9 -6 -16
10754 -16 19 8 -9 -1 4 15 0 11 2 21 36 2 15 -14 25 -17 11 -4 -3 -33 25 -9 -20 -2 -11 -17 -22 -7 -25 -17 -24 -8 -13 -4 -3 -26
10790 -26 -27 -12 -22 1 -11 -10 17 -7 -6 -4 7 -2 1 -25 -21 -20 6 11 -4 -12 9 -12 3 5 -11 10 18 -14 8 7 -1 -4 6 -13 -2 -2 -23 -15
10828 -15 8 -19 -11 -26 -17 -39 -15 -30 -35 -9 -19 -24 -17 -16 -24 -20 -14 -17 0 7 -17 -3 8 10 5 4 4 31 7 16 11 21 1 -2 9 -8 0 -20 -16 6
10868 6 -10 -19 -9 -2 -9 -16 -17 -31 19 -8 -14 -1 5 -17 -28 -20 -13 -6 -20 -27 -12 -1 -28 -35 -8 8 -19 0 -1 0 -5 15 9 14 -14 19 12 14 36 5
10908 5 14 16 27 17 22 11 -15 -15 -5 0 -7 -10 -1 -29 -38 -23 -13 -32 -8 -6 3 -28 -25 -15 13 -9 -15 -8 0 -13 -10 2 -2 -15 -17 -4 -10 1 -1 18
10948 18 -9 1 6 7 7 4 5 4 11 22 18 24 -11 -3 9 4 -10 -4 -10 -1 -15 -2 -20 -35 -28 -8 -22 -23 -16 -35 -34 -11 6 -9 -22 -24 -15 -19 1 -7 -14
10989 -14 -20 13 7 2 -3 16 -3 1 23 -12 0 -5 -16 0 -12 -5 7 12 9 -12 -26 10 -9 0 6 -14 -6 -7 6 -4 9 -19 -13 -22 -8 -11 -32 -49
11027 -49 -16 -2 -22 -17 1 2 -19 -6 -39 -21 -9 -6 -19 -19 -15 -13 11 -5 10 22 -14 -6 9 4 15 -13 10 9 33 -26 -1 0 -7 -5 -13 -5 2
11064 2 -9 -4 -1 8 -11 -11 2 -11 -21 -31 -20 -17 -7 -22 14 -12 -4 -4 -23 -19 30 -21 -6 10 7 29 -7 -1 1 -3 7 -2 -7 12 1 -2 13 4
11102 4 16 -16 14 8 2 -18 -21 -5 20 -24 -24 -3 -24 -17 -20 -14 -15 -10 -19 11 -3 -21 0 -5 -13 -15 -10 -9 -5 4 11 -7 9 -6 -22 -9 -6 -3 29 -19
11142 -19 4 5 14 19 26 27 -2 6 10 0 21 7 -9 1 1 4 0 -4 9 1 -14 -3 -11 -19 -20 -11 -24 -32 -23 1 -1 -9 -18 -5 9 -6 -5 -2 -9 -3 8 10 0
11185 0 15 -5 -11 12 6 4 21 16 10 1 13 1 24 -7 10 -14 20 13 -11 -19 7 2 -7 6 -9 4 -9 -6 -8 -1 -26 5 -38 -18 -14 -27 2
11222 2 -23 -23 -16 7 -8 -21 4 -15 -2 2 6 -5 11 2 -24 -5 -3 -2 -8 10 1 4 -5 -9 -1 -20 -2 -3 -5 2 -13 -1 -12 -26 -25 -26 -30 -28 -6 -12 -36
11263 -36 -29 -18 -15 3 -11 -10 -23 -20 -9 -17 -10 11 -10 -16 9 -14 -27 -8 6 4 -8 -4 -6 10 -2 22 -1 -6 12 11 -3 15 8 16 -9 9 7
11300 7 -8 7 -9 5 20 -15 -10 -7 -29 4 9 -17 -7 -7 -6 -20 3 -1 8 8 14 -9 -1 -2 9 -6 4 -4 0 5 19 -1 -2 -6 16 0 -13 15
11338 15 5 11 -11 -17 -1 23 7 0 9 -9 -9 -15 -19 -6 -15 -22 -12 2 -27 -2 -8 -28 -23 -12 -7 -15 -26 -12 -5 3 -4 -12 5 9 -6 -6 -15 18 -22 17
11378 17 18 11 22 -5 18 7 3 -12 -8 -2 -13 12 11 9 10 17 -1 -20 -3 -1 4 1 -15 -12 -2 -10 -9 -10 -21 -3 4 -10 -19 -1 -21 -26 -17 6 21 -33
11418 -33 7 -6 14 1 -7 -17 8 12 16 9 4 13 12 3 -15 21 19 -5 5 0 -1 0 -14 15 -16 -12 -30 -6 -11 -12 -24 -41 -28 -4 -4 -25 -6 -11
11456 -11 8 -3 11 14 0 2 -2 -10 -11 -4 15 -22 9 13 1 8 6 4 15 17 -1 9 4 9 16 32 -10 15 -4 5 -8 16 19 -20 -13 -4 12 -12 -11
11495 -11 -19 -24 -3 -27 -6 -18 -20 -17 -4 -12 -5 -16 -5 -27 10 -6 -1 23 11 0 15 21 2 6 2 -4 -9 -1 8 14 14 -27 20 13 8 -5 7 16 6
11534 6 26 -12 -28 -10 -5 11 -3 -14 0 -9 -14 -2 -14 -13 -10 4 -9 -12 -14 -22 9 -2 -19 -25 -3 -5 5 3 3 3 -6 14 1 4 14 19 23 23 19 12
11574 12 26 14 15 31 -8 7 -3 -1 23 18 3 -8 -13 -14 6 -17 6 -3 -3 -4 -6 -9 -2 -21 -11 -19 -20 -5 -23 -22 -6 -25 -19 1 18 -14 4
11611 4 -3 1 7 7 -6 -2 6 40 -5 5 26 3 20 24 1 19 13 11 11 3 18 -13 17 -4 -20 14 -9 -8 -13 15 8 6 28 -13 14 -1 6 3 8
11650 8 5 13 -15 -24 -6 -7 17 9 -1 -4 -5 -6 5 19 16 13 3 14 16 2 9 6 10 12 13 8 30 19 18 1 25 0 0 25 13 5 10 -34 -9 -5 -3 -11
11692 -11 -10 -14 -3 16 7 -12 -6 -15 25 -11 -1 10 2 -11 14 9 0 18 -8 6 -2 -5 -24 9 7 -6 6 7 -20 4 9 2 -11 6 5 -10 16
11729 16 14 -7 8 -10 10 -3 2 -15 -25 -20 -26 -7 -15 -6 -2 -11 -17 -11 -14 -5 -9 -33 13 3 15 5 -10 31 8 25 38 23 21 25 20 7 26 14
11767 14 29 16 25 25 18 13 -32 8 -4 3 27 4 -25 -4 0 14 -23 1 -21 -16 -18 14 -10 -23 16 -11 5 -3 -3 4 11 2 -7 5 5 -17 11
11804 11 4 3 14 5 10 28 9 -1 25 18 10 -4 11 -6 0 11 2 -17 -4 2 7 3 -5 -1 -5 -17 -30 5 -29 5 -7 -1 -29 -30 6 -8 6 -5
11842 -5 1 -8 7 35 14 32 23 13 39 30 17 14 21 14 17 11 19 26 7 4 12 -6 1 24 4 11 -11 0 17 5 6 -14 5 4 -11 -17 -12 -22 0 -14
11882 -14 -21 -15 -13 -16 -22 -12 -17 15 -30 0 -17 7 12 16 13 13 17 -3 22 33 10 10 8 9 24 13 8 21 18 1 -28 -7 0 20 8 -2 -2 -3 -14
11921 -14 -8 -2 6 -10 -9 -14 -25 -13 -2 28 -10 8 -13 6 -10 -6 -7 11 2 -4 -4 18 16 -3 4 13 11 -3 17 -16 26 -7 14 -4 18 -12 14
11958 14 23 4 2 1 16 1 -2 -12 -8 -7 16 -1 -2 -14 -14 -10 -22 -21 -19 -15 -17 -19 10 -13 3 7 11 -8 3 6 5 1 -10 10 -14 12 -3 -2 -7 -3 12
11999 12 27 -14 -20 15 10 9 26 15 0 8 -15 19 13 -6 -8 -17 -22 -17 -7 -11 -3 -12 -21 -13 -7 4 -8 6 -16 -5 -22 -5 -1 -11 2 6 7 4 -8
12038 -8 15 14 8 7 12 6 15 22 0 3 11 10 -12 11 -6 8 24 8 -8 1 -6 2 -28 0 -3 10 -2 -33 -14 -5 -22 -15 -6 -14 -15 -15 -11 -24 -28 -24 -14 -29
12080 -29 27 -9 -1 1 -2 4 -6 12 27 16 13 23 17 17 2 14 18 10 0 -10 7 -14 -8 0 12 3 1 1 9 4 -32 -13 -18 -2 -15 -27 2 -30
12118 -30 -19 -29 4 -11 -10 -9 17 -10 -6 13 -15 -18 -20 0 -9 1 -4 -17 -8 -17 15 -11 -1 -3 -18 22 3 -8 5 21 5 -2 -4 17 16 12 14
12155 14 -16 -2 -18 9 -4 2 9 -24 0 -17 -5 -18 -30 -3 -26 -1 -2 -3 15 -25 -23 -10 -3 16 -15 1 13 19 0 2 32 3 12 -5
12189 -5 -4 4 -12 -13 6 6 14 -6 2 4 8 -11 20 -15 2 -7 -3 6 -28 1 -23 12 -12 11 1 1 -17 -30 -20 -7 -20 11 -1 -4 -23 5 10
12226 10 -23 -5 -19 -5 -8 3 -5 6 11 0 9 -10 13 -4 -9 21 -1 8 10 -9 6 -12 -10 7 -25 1 -5 -10 -3 6 -10 -7 -29 5 13 -18 -28
12263 -28 -20 -16 -16 -28 -9 -16 -32 -23 -16 2 -7 -5 -14 8 -3 -13 -10 11 10 -20 -3 6 -3 -4 -17 15 6 11 6 -15 10 -8 -13 -13 -3 -19 -9 -29 -20 -8
12303 -8 -9 -13 -5 -8 -31 -18 4 -21 -8 -12 -14 -17 -19 -18 -7 -13 -15 -17 -17 -8 -8 23 -14 -3 -14 -13 -1 -3 -37 12 14 5 5 12 6 -13 22 -13 -18 1 -11 2
12345 2 -16 -5 -12 -4 3 7 11 -13 -19 -19 -26 -28 -10 -27 -11 -29 -24 -27 0 -16 -17 -18 -29 -13 -32 -28 -16 -4 -5 -4 -6 -15 4 -7 -20 1 1 -6 -6 -7 10
12386 10 -4 -16 -2 -10 16 -6 -2 9 -7 5 2 -22 -17 -14 -8 -28 -10 -28 -2 11 -13 -16 -11 -3 -39 -6 -9 -10 -5 -19 -22 4 -18 -3 20 13 12
12423 12 -4 5 11 -2 -2 14 -13 4 10 11 1 19 -3 -4 -5 -21 -18 -13 -19 -2 15 -19 -4 -21 -25 -8 -7 -3 -5 2 -23 -25 -17 -9 -21 -25 -9 -22 -24 -6
12463 -6 -1 -17 -2 -16 2 12 11 -23 -5 8 12 29 14 10 -6 12 10 37 -9 31 -9 9 -2 -9 6 -9 -6 -32 -14 11 -2 -10 -19 -8 -10
12498 -10 -20 7 -16 -9 -25 -3 -1 0 -10 15 2 -7 -4 0 -20 -7 -6 3 -10 11 0 -2 -9 17 1 10 13 -16 2 6 1 -12 -28 -9 -19 -17 -21 4
12536 4 -7 2 -13 -9 -7 -3 6 -15 -17 -21 -22 -48 -14 -29 -27 -2 -18 -21 -11 -23 -2 3 -7 -24 0 -27 -9 1 23 -11 -4 -1 15 -8 -7 -6 -6 -8 -8
12575 -8 9 20 -7 -17 0 -35 -7 -3 -3 14 13 9 10 -9 -11 -9 7 -7 -17 -9 -1 -9 0 -29 -3 -11 -17 -3 -14 14 -10 0 4 -22 13 12 -16 -4
12613 -4 -11 9 4 28 15 -1 20 8 11 14 0 9 -2 8 -8 14 11 -16 15 18 -7 -16 -6 -9 -15 -27 0 -28 -11 -9 -17 2 -6 -36 -12 -14 10
12650 10 -8 -20 -5 -16 -19 0 -8 -2 2 6 5 -9 2 7 5 -8 7 3 16 7 0 8 22 -12 15 12 3 12 6 1 -23 -17 -30 -6 2 -17 -12 -21 -8 -23
12690 -23 -40 -32 11 -20 -22 -10 8 -3 2 9 -29 -11 7 15 18 -5 -4 9 -1 -25 -27 4 1 13 12 24 16 32 -6 -5 -9 7 -8 -6 -16 17 12
12727 12 -16 6 1 5 -9 0 -4 -25 -15 0 -25 3 5 -15 -9 2 -5 -13 8 8 13 9 1 -13 4 11 -2 7 4 23 -16 15 4 22 6 -5 7
12764 7 21 11 5 1 16 7 7 4 7 -6 -29 -2 -19 -15 -18 -17 -9 -14 -3 -8 -1 6 -2 -1 -10 -10 8 -22 -18 -15 -12 -13 7 -16 -6 -3 -7 -7 13 11 1 11 -10
12807 -10 -7 29 -4 -4 19 -6 7 0 31 -12 -4 14 15 -13 1 -11 11 -23 -13 -15 -30 -18 -32 -10 -18 -7 -7 15 7 -4 -2 4 1 2 3 -13 -25
12844 -25 -17 7 -16 -9 -12 -4 -9 1 -26 16 3 -9 -17 16 16 -1 4 -11 3 9 -1 -5 2 0 13 4 -17 -23 -1 -15 -21 -16 -9 -15 -20 -17 -32 2 -25 -15
12884 -15 -18 -7 -16 -4 -18 4 -10 -13 4 -16 -13 12 -16 -5 -14 7 4 -18 17 8 -6 15 -8 3 -12 5 -10 23 1 21 -15 -10 21 9
12918 9 -7 5 9 -8 -8 -14 -4 -11 7 -25 3 -9 -16 7 -27 -12 -4 -5 -23 -24 -1 -12 -10 6 -19 -14 2 16 5 -9 3 -17 -1 18 -3
12953 -3 7 -11 10 1 -13 -5 -21 -7 -32 -20 1 -15 -4 -2 1 -7 -12 -6 -20 1 3 -9 -21 -18 -11 -4 -25 -9 4 9 -28 14 3 8 18 -5 10
12990 10 -24 -18 -23 -4 6 -21 -1 -14 -7 4 29 -16 -10 -7 4 -1 11 -5 8 -12 16 -4 -17 6 -16 11 -3 -15 -17 -28 -21 -26 -14 -7 -21
13025 -21 -5 18 11 -17 -6 -6 -6 -6 -26 -15 4 -9 -24 -5 -12 5 -18 -6 -12 -6 15 -2 6 -14 0 -8 15 23 -3 8 0 -12 18 -12 6
13060 6 1 14 7 -21 6 -8 14 -4 1 0 -20 -15 -19 -6 -9 -2 -19 -18 5 12 -4 2 -12 4 -9 -8 12 15 16 25 -3 5 11 8 6 16 -3 14 10 21
13100 21 0 -6 0 -1 -6 19 -13 -8 -11 1 -1 12 10 -27 5 3 1 -23 -2 7 -10 -27 0 -29 -43 -25 -1 -10 -14 -18 -19 -9 -1 -4 -6 5 -10 10 17
13139 17 -5 15 2 1 9 -15 -8 3 12 9 -16 9 20 12 3 -16 22 -3 -8 7 -37 -11 -20 1 -25 -19 1 -20 -9 5 2 0 10 -16 12 -1
13175 -1 -1 0 16 -6 -17 0 1 -23 -14 15 5 -1 -11 12 -2 -15 -27 9 21 -10 6 25 14 24 -8 11 16 9 10 17 10 -3 -8 -11 -26 -6
13211 -6 -22 -11 -19 -2 -15 -5 -30 -16 4 -4 17 -5 -15 8 -17 6 11 -2 -4 -4 -5 -3 6 2 12 0 6 10 -17 20 -7 -6 2 -21 -17 -3 -9 -13
13249 -13 9 -1 -6 -4 16 -30 -6 -26 -20 -13 -17 -4 -36 -3 -31 -20 -3 -25 -2 -25 -17 -6 -9 -10 -15 -6 -6 -23 -6 6 -6 18 -7 -3 16 2
13285 2 -25 0 13 -12 -14 -6 20 -2 -18 -1 -27 -15 -14 -20 -11 7 -23 -4 -3 -4 -20 15 -7 -32 -31 -33 -10 -27 -15 -8 5 -12 -7 -19 -15 -14 1
13322 1 -2 -16 -21 8 -10 -18 -9 1 -14 13 11 16 12 5 5 12 -1 8 11 13 -8 -13 -7 -13 -6 -19 4 11 -10 -10 -7 -24 11 -1 -5 -21 -25 -3 15 -17 -21 -20
13364 -20 4 -10 -14 1 -9 -3 8 10 -11 -12 -9 17 6 -24 9 20 5 -5 -2 27 1 8 6 -9 6 13 11 14 6 31 7 -14 14 -3 0 -19
13400 -19 -27 -20 -3 -25 -18 -12 -28 -13 -33 -5 -21 -28 4 -22 9 -15 18 -7 4 -2 -18 17 -20 1 -23 -16 -3 9 2 11 6 -4 14 1 -27
13435 -27 -5 -6 -4 3 -3 -27 -3 -26 -16 -8 -7 7 -8 -25 -15 -3 -28 -7 -21 -20 -1 -10 -8 -25 -6 -21 -3 -34 -15 -2 2 -6 -7 28 0 10
13471 10 12 -2 10 -2 -10 21 -24 1 12 8 4 -13 -9 -6 21 -26 -7 -6 -16 -7 -12 -29 -22 -9 10 -10 -16 -19 -1 -24 -15 -7 -17 5 -13 -11 -14 -7
13509 -7 11 -3 -20 9 -13 -1 5 -7 12 0 23 -24 4 -13 -20 -8 23 3 27 19 8 -4 -5 4 0 14 -5 -8 13 -2 -6 -22 -4 -12 -8
13544 -8 -14 -13 12 -15 -7 8 10 -25 -16 1 -3 -7 8 -11 -8 8 -3 7 10 7 1 10 1 -10 1 26 -23 17 -1 -19 -11 -19 13 -6 6 14 17 -2 -10
13583 -10 -11 -14 -4 -11 4 -16 5 9 -10 -12 -17 -36 8 -18 -8 -3 -15 -19 -41 -1 -24 -12 -11 -6 -20 1 9 -5 1 24 34 21 21 -5 18 -14
13619 -14 -5 -13 -13 -17 1 -2 -18 -2 3 15 3 -12 -34 -34 -23 -24 -16 -23 -25 -7 -10 -24 -15 -26 -14 -19 -11 13 9 -26 -13 -18 -15 -10 -16 -14 -8 -42 -11 -16 -5
13660 -5 27 15 -9 5 -16 -10 0 -4 -4 0 -18 -13 -3 -11 -5 5 -8 -15 -7 -29 -12 -36 -4 -10 -19 -21 -13 -11 5 -4 -29 -29 19 11 4 -2 10 -10 -2 -5 1
13701 1 -23 -26 -2 -13 -1 10 -14 -14 -4 -20 -7 9 -6 4 9 9 18 4 1 7 -20 9 -4 7 5 -7 -27 -15 -15 2 5 -8 -3 -19 -17 -8 -18
13738 -18 -21 -24 -21 -29 -11 -18 -30 4 -3 6 4 26 27 7 15 8 23 -4 -4 -16 -4 -10 -13 -17 -20 -33 -12 -11 3 -19 12 2 -23 -2 -4 -2 -7 -16 -18 -13 -39
13779 -39 -5 -30 -9 -33 -41 -9 -1 -28 -13 -4 -8 0 -27 0 -21 -16 -5 -6 -15 -8 -13 -11 -12 1 14 -2 25 8 7 10 -3 2 19 -15 -9 -17 -2 -22
13817 -22 -7 7 5 -16 -27 -30 -32 6 -9 -15 -20 0 -5 -21 -5 -7 -11 -37 -24 -7 -5 -20 -15 -12 -17 0 -22 -1 -27 -9 -23 -19 -9 -16 0 -10 -2
13854 -2 -22 -5 0 -8 24 3 5 -20 35 -7 -18 -1 -4 -6 -23 6 -2 -20 -2 -19 -16 -17 -29 -2 -8 -9 -23 -13 -7 4 -18 -20 -13 -12 -8 -4 -20 -6
13892 -6 -9 2 -3 -8 -14 -4 -13 7 10 -11 -8 -17 0 -3 0 -1 17 -9 -19 -7 0 9 -6 -19 -22 5 -16 -35 -17 -19 -31 -11 -22 -14 -6 -12 -35 -38 -16 -21
13932 -21 -26 -2 -12 -26 -14 -7 -26 -8 11 -15 -3 12 -23 6 20 -1 5 -11 -13 -11 -22 -3 -13 -4 -12 -4 -12 -7 -9 -8 -18 -9 -11 -2 -21 -6 5
13969 5 -4 -19 -24 -6 -5 -3 -9 3 -16 -15 -7 -11 -43 -10 0 -27 -23 -30 4 -5 -7 -18 -11 -4 7 1 -10 -1 -11 2 11 8 15 -25 5 21 -25 -8 -17 -15 -15
14010 -15 -17 -17 -7 11 -2 -18 -21 -22 -14 8 -16 -19 -3 -19 28 -3 -14 7 0 -14 8 -4 1 -13 3 1 -19 -11 -12 -2 -13 7 -21 9 7 8
14046 8 -6 7 0 8 5 6 14 -22 -4 -6 -3 -8 -7 -19 -8 -22 -19 -18 -25 -15 -22 -11 -7 -25 -2 -10 -14 -30 -37 -17 1 -2 -9 -16 19 -14 -9 -19 4 -18 -21
14087 -21 3 4 -12 -26 -4 -32 -16 -7 17 -3 -10 -6 -12 -8 -4 -9 -8 -14 -23 -20 14 -7 -10 -14 9 -3 -26 -14 -16 -14 -25 -6 -9 -7 -15 -24 6 -8 16 2
14127 2 2 -9 -9 -1 -7 -3 -5 -5 15 19 14 10 16 12 9 -11 7 6 20 -11 -8 -17 7 12 -6 -1 1 -4 -16 -1 0 -5 4 -4 -2 21 -13 4 -8 -2 -2 10 16 -14
14171 -14 -12 3 -1 10 -11 -28 -20 -11 5 -11 -33 -25 -20 1 -6 -3 -15 12 11 5 27 26 22 22 14 15 16 19 7 -16 -24 -1 7 -20 -16 -9 -7 -16 2 -2 0 3 2
14214 2 -13 4 -18 0 4 5 11 8 -5 7 -9 13 11 -3 21 -8 -6 -8 -8 -3 -9 -10 -7 4 20 -1 21 6 -7 -8 24 1 -6 -11 12 -4 -4 -3 -27
14253 -27 -14 -2 -15 -1 -9 0 -28 -19 -14 -29 -20 -10 -13 -30 -20 -24 -10 -3 2 1 -7 -5 4 -5 5 5 5 11 -17 19 -1 6 -9 -20 5 3 -20 -16 -8 -4 -11
14294 -11 0 16 14 6 1 -7 -9 -5 -1 -6 -1 2 -4 2 -22 -18 2 -22 -20 6 -5 -2 -27 13 -30 -2 -10 7 -4 -21 9 -1 9 20 -7 16 -4 0
14332 0 11 -7 16 -4 -18 -17 8 16 -37 -4 -9 5 -8 -8 -17 -43 -4 -18 -5 -8 -14 -17 -15 -16 -10 -16 -41 -5 -5 6 -3 -18 8 -15 0 2 1 -8 -1
14371 -1 -1 -5 -2 -5 13 13 -13 15 10 -3 19 1 6 -10 5 15 9 5 -9 -2 -17 -12 -2 2 1 7 2 -14 2 -24 -20 -10 -17 -22 -16 -15 -20 -13 13 6 -21 -4
14413 -4 -14 -3 13 -9 -2 -15 -16 1 4 9 -1 -4 -6 -14 -7 -6 -7 -6 -6 23 -24 -12 -1 4 4 1 -3 -16 0 -18 -10 -14 -5 -4 -16 -13 7 -26 -19 4 7 -22
14455 -22 -6 2 -15 -3 -1 -3 -14 11 -14 -4 -1 11 -6 13 22 16 10 1 23 7 19 -10 3 11 -10 -2 -17 9 -26 -4 -28 -11 -24 -4 9
14490 9 -12 -4 -9 -20 -1 18 7 -10 -6 -9 -2 -11 -20 1 -2 -12 -24 -18 -4 -6 -11 -23 9 -4 -12 -4 1 -5 7 -11 9 6 -24 -8 12 0 3 26 13
14529 13 16 31 -7 2 -4 -8 -19 -17 -24 -12 14 -14 -1 -17 7 5 14 9 -18 2 -15 11 -6 10 -5 -4 -6 16 0 -3 2 -2 -7 -8 -6 13 15 -13 -17
14568 -17 -8 5 -10 7 -6 0 10 4 -5 25 -2 16 -15 1 -4 -16 2 -6 -7 -14 8 -22 -3 -20 -5 -20 -27 -22 1 5 -23 -8 7 -22 0
14603 0 -8 8 -25 -17 29 -2 5 8 -11 1 -12 -14 9 -14 -3 1 -19 0 -1 19 -6 -28 -8 4 7 -10 5 1 5 1 -15 2 -3 -8 -16 -7 0 0 -19
14642 -19 -1 7 6 -23 -20 -1 -1 -16 -12 -9 -2 13 11 14 8 -4 8 8 1 5 26 3 -13 6 -11 3 -3 -24 -8 1 8 3 -6 7 0 -9 -20 2 -12 -14
14682 -14 -23 -25 -6 -8 -7 -5 -15 -7 14 3 -11 -4 -4 -15 -14 -2 -4 -8 -11 -17 2 11 -13 -19 3 -8 0 0 7 -17 -4 3 19 -1 18 -23 -8 -2 10 -3
14722 -3 7 -26 22 -18 5 -5 -9 0 -12 -8 -8 1 -1 -3 -26 -6 -10 7 16 2 -3 -24 -24 -4 -13 -3 -13 -8 6 -1 27 -1 6 -15 -13 7 1 -1 -25
14761 -25 5 -15 -11 -7 -5 2 2 12 -11 -33 14 -3 7 -3 14 12 9 -2 -37 -28 -27 -10 -1 2 -13 -8 -30 -15 -15 -16 -12 -24 -11 -16 -18 5 2 6 7 -4
14801 -4 9 -21 9 -3 6 -2 4 -6 -30 -13 -13 7 -7 -8 13 3 1 -31 -2 -19 -9 -12 -16 -5 -13 -4 7 -8 -2 -22 -3 -2 -16 -9 -30 -15 -3
14838 -3 6 -1 -8 -28 -1 -2 4 -5 13 -9 13 7 14 -2 7 0 3 7 10 -5 -4 5 12 7 -19 -9 -5 5 0 -10 -23 -13 -32 -12 -4 5 -14 -45 -6 -4 -20
14879 -20 -1 -10 -14 -27 3 -26 1 -10 -12 4 3 -1 2 17 -7 -12 12 10 -19 3 -10 15 -4 5 -13 -2 14 -19 24 -9 1 -4 8 -34 9
14914 9 9 -9 -11 -36 -8 -9 -18 -17 -18 -22 -6 -13 -16 -12 -23 -10 -8 13 -11 6 -1 29 -15 14 1 2 -5 -11 6 2 7 -31 -15 -11 -21 2 -4 -4 -20 -9
14954 -9 7 -22 -5 -8 -2 -7 -7 -4 -3 -12 -6 -22 -21 7 -2 -10 -4 4 -3 0 14 -12 -24 -1 -10 -13 18 6 -15 -16 8 4 14 11 4 -9 9 -5 -32 5 -17
14995 -17 5 1 19 20 1 -27 17 7 -17 9 -27 -13 8 3 -6 -25 -29 11 -2 -23 -3 -11 -28 -14 7 5 5 -22 8 13 -4 4 33 2 -19
15030 -19 12 16 -23 -27 -2 -8 -6 -4 8 -3 8 9 6 -13 6 -9 2 3 -10 -3 -11 12 -9 8 -8 -3 1 0 -9 -5 -17 -9 -13 -17 14 -17 1 -3 -3 5
15070 5 7 -18 0 -8 -29 -18 -11 1 -5 -8 4 -24 -8 7 -17 -9 -2 -7 -6 -6 8 -29 -15 -5 -4 0 -4 -7 19 -10 -3 1 5 10 5 3 -12 5 3 -5 -22
15111 -22 -25 -23 -10 4 0 -8 -40 -27 -8 -4 -8 -17 -23 -8 -11 3 -2 -7 -13 -6 -12 -1 -3 9 -17 -2 2 -5 -5 22 -6 2 -10 1 -12 -2 -13 -3 -9 -11
15151 -11 2 -5 -36 -31 -1 -23 -8 -15 3 7 -19 -12 -14 -34 -18 -1 -7 -15 -20 -20 -18 -5 -19 -19 -22 -18 -26 0 0 3 -1 0 5 0 5 -4 6 -12 25 -9 -3 -13
15193 -13 -2 -16 -7 -13 -2 0 4 -13 -20 0 -20 17 -18 -15 13 -2 -23 -18 -2 12 16 -6 5 -6 -9 -10 -2 13 -20 -29 -15 -12 -20 -3 2 -28 -3
15230 -3 -10 -2 -2 -20 -6 16 13 7 -3 -10 -1 -21 16 1 -17 -5 -4 -14 -18 -1 -20 -22 -8 -25 -24 -13 -10 -24 -18 0 8 16 1 2 -17 4 6 17 2
15269 2 -14 21 19 -11 21 -9 -8 14 -10 -10 -8 -9 23 7 -24 17 -22 -1 10 2 -21 -9 -13 -7 -6 -1 0 -2 -19 10 -7 -7 14 4 -14 12 -24
15306 -24 -3 -12 6 -10 -38 -24 7 -18 -9 -6 7 9 20 -10 3 21 2 5 -8 0 -17 -8 -10 -1 -19 -18 -14 -8 -11 -18 3 -20 -9 -11 -26 -7 -17
15343 -17 -6 -18 -10 -11 -4 -9 -2 2 -6 -10 -23 -15 -8 -9 7 -12 -25 -8 3 -24 -17 -2 12 -21 -8 -3 -6 1 -1 6 4 -1 -12 -12 -2 10 -2 5 -5 5
15383 5 -2 -4 -15 8 -10 -14 -15 -31 -26 -20 -29 -14 -18 -26 -24 -9 -4 -16 -6 16 -6 -3 -14 -4 13 -31 -1 6 16 -11 4 -7 2 0 -20 -7 5 -17
15421 -17 -2 2 -19 -20 16 22 -16 -9 6 3 -3 1 -7 -3 -26 7 -2 -5 -10 10 -19 -18 -17 0 -18 -22 2 -15 13 -5 8 8 -21 11 -13 -5 1 -5 -18
15460 -18 -23 6 -13 -18 5 13 -13 18 24 7 -3 9 -4 -7 0 -15 13 -5 -29 4 11 -18 -1 13 -15 -14 2 -19 -5 -1 -13 -23 3 -6 -14
15495 -14 5 -25 -8 -6 -8 -16 -18 -5 13 11 4 1 0 6 -3 -6 -2 2 1 3 0 9 0 5 10 -11 4 -1 6 -15 1 -39 -18 -5 -30 4 -13 15 20 3 -2 1
15537 1 13 14 0 4 -8 -9 1 9 -6 9 -11 0 16 0 12 -7 21 6 23 -8 4 -14 28 14 12 -21 -2 5 -11 9 4 7 1 -25 -6
15572 -6 3 2 -2 -7 8 -10 -6 -9 -15 -5 -11 11 -8 -17 -7 -4 3 -2 -5 -2 -9 -8 5 -15 9 -1 -12 7 9 21 -1 -7 -26 -8 2 -17 -4 -5 -7 -20
15612 -20 -21 18 -12 -13 -1 -13 -15 -15 0 10 10 12 -2 23 -8 -15 -7 15 -1 -9 -2 0 -16 -13 -15 -12 -17 0 -16 -8 -1 -7 -16 1 -28 -11 2 -10 21
15651 21 -1 8 -15 -9 -8 6 1 -2 -5 21 6 -3 0 -4 -9 2 1 -13 -8 5 -14 -15 -15 -7 -3 -11 -19 -4 -1 1 7 -6 -20 4 -2 -10 -10 7 -6 -13 -15 -5 -20
15694 -20 -4 -7 -26 -8 -10 -2 -3 23 13 9 4 -14 1 14 -17 -6 9 10 27 4 -34 -2 -3 -9 26 12 -4 -23 -18 -38 -8 -27 -14 -2 -11
15729 -11 -12 -4 -11 -19 17 -4 7 -16 7 -3 -7 10 -8 1 8 -14 -1 -24 -13 -13 -6 -4 10 29 -18 -14 -13 -8 5 -16 -21 3 0 3 -5 -5 -7 -2 -5 -10 -11
15770 -11 -17 -15 -30 4 -14 -13 -6 -14 -11 -18 -5 -30 -1 -5 -5 2 -11 3 11 1 5 -5 9 13 7 25 10 12 14 7 5 -14 -5 -6 -14 0 -14 -9 6 -21 -3
15811 -3 5 -3 -11 -11 -4 -16 1 13 10 -2 -4 -9 -14 -18 -27 -11 -14 -16 -14 9 -5 5 -24 -5 -3 -4 -22 -21 -5 -3 -15 -11 4 -16 10 -1 -20 -11 13 -23
15851 -23 -14 -5 -8 -15 -32 -19 -24 -31 -13 -1 -18 -8 -4 -24 -1 -10 9 -13 4 -23 -28 -4 -13 -24 -13 -8 -33 -29 -8 -15 2 5 -13 -17 6 4 -15 3
15889 3 -3 -1 -15 -4 -4 -15 -26 9 0 -2 -8 -11 16 0 -21 -28 4 13 8 -21 2 -23 5 8 -7 -13 -9 -10 -21 -25 -7 -3 -15 0 -9 7 10 5 4 10 20
15930 20 -5 -2 8 7 -1 10 -15 27 -9 -19 -2 24 15 -11 2 5 -4 -10 -12 8 2 9 1 -9 3 -16 12 -9 -12 -3 -1 -6 -18 -15 -18 -3 -8 -5 -17
15969 -17 -12 -11 -5 -14 -15 -13 -6 -3 -15 13 -8 -14 -1 -16 -6 5 2 -2 0 -14 -13 -7 2 -10 -4 -11 -18 11 -14 -11 -9 -14 -4 1 -31 -19 1 -13 -10 -12 -3 -17
16011 -17 17 -18 -20 11 -32 -1 -20 11 -4 9 -4 -15 1 -6 19 2 -8 -10 1 24 16 13 27 13 4 10 -6 11 12 0 -1 11 16 12 15 8
16047 8 7 -6 6 -3 -8 1 -10 -5 -19 -26 2 -4 -13 -1 -12 -5 13 -10 6 5 0 -3 -9 20 -8 8 9 -4 1 3 2 -8 -8 13 16 -12 1 6 -4 -23
16087 -23 -4 2 6 -5 3 1 4 -2 18 8 -6 -18 -1 -11 -11 1 -12 -7 -16 -7 -7 3 -2 15 0 -3 5 -4 2 10 -12 3 -11 -15 -22 -5 11 30 -4
16126 -4 7 8 -27 -3 10 1 29 13 -16 -22 0 2 -15 -10 -8 1 22 -4 -1 28 15 14 10 15 -6 -11 3 9 8 14 -19 -12 -3 8 9 -2 -7 2 4 4 -4 7
16168 7 7 24 3 -16 -2 -1 31 -5 15 34 15 7 5 4 7 8 -4 3 -2 -26 0 9 1 -12 -6 -16 -5 0 10 24 -17 8 14 -12 3 -3 2 20
16206 20 -3 2 -3 -17 10 8 2 9 15 -18 22 -6 20 14 -5 -1 4 -5 -1 3 3 -11 -4 23 9 11 -13 9 4 0 18 -5 1 0 3 9 -7 -9 -5 -28 -13
16247 -13 10 -19 -12 3 -7 2 11 5 -7 -14 -17 -5 3 -14 3 3 20 13 12 12 6 28 19 15 10 3 8 0 -3 6 7 15 10 19 -4 -2 0 12 -13 -9 -20 -8 10
16290 10 0 6 -4 20 -7 6 -24 -22 -12 2 -2 -12 11 -13 -5 -17 -7 -17 -16 5 -12 2 9 27 0 -6 7 9 -4 3 29 13 -3 11
16324 11 -4 0 16 18 2 -5 -19 -20 -20 -4 -6 2 -23 7 -14 -8 12 -11 -7 -9 -11 -5 21 -4 21 8 -1 7 0 2 -13 -3 2 3 0 2 4 -3 6 4 6 28
16366 28 5 -2 11 22 0 33 0 3 -2 3 4 14 23 9 -12 2 5
16383E
$$ Imaginary data points
##PAGE= N=2
##DATA TABLE= (X++(I..I)), XYDATA
0 0 0 0 0 0 0 0 0 0 0 0 0 0 0 0 0 0 0 0 0 0 0 0 0 0 0 0 0 0 0 0 0 0 0 0 -8 16 -22 32 -32 32 -32 32 -32 32 -32 42 -48 53 -61
49 -61 64 -72 80 -82 95 -111 113 -136 147 -172 195 -226 270 -321 398 -516 702 -1048 1817 -4254
69 -4254 27501 154983 83761 -71724 -71871 38073 51285 -34662 -44671 43617 62821 -35350
81 -35350 -89781 -7659 78311 40484 -42234 -38870 18012 22320 -13764 -6434 30643 16212 -40298
94 -40298 -46485 11961 45790 10572 -28269 -15283 11092 2001 -14467 4342 30600 15689 -22432
107 -22432 -28249 1856 20365 8032 -4777 3505 10366 -6433 -25082 -13106 18189 25650 -1213
120 -1213 -23316 -8916 18655 15363 -15324 -24463 4891 25916 2428 -27028 -10498 26533 19466
133 19466 -24571 -33879 8741 35658 7150 -24490 -7582 21871 8978 -21086 -11655 20204
145 20204 15524 -17021 -17650 13106 15719 -16103 -21638 14088 28266 -7450 -32077 -2097 29418
158 29418 7134 -26107 -6926 30490 13657 -34342 -30315 22086 35932 -8779 -33125 1660
170 1660 30012 1874 -29525 -5310 32245 14662 -29924 -24735 21597 31120 -9471 -31327 -3639
183 -3639 21075 4259 -16979 -2781 19508 7896 -19303 -16555 11157 19646 -207 -14118 -4960
196 -4960 5385 1244 -3567 2950 8322 340 -10295 -7016 5783 9780 483 -7149 -2844 4369
210 4369 2015 -5424 -4449 4779 7212 -3030 -10195 -534 12131 5925 -11110 -10737 7323 12368 -4539
225 -4539 -13370 2880 16054 914 -18335 -7706 16693 13632 -11724 -15271 8538 16302 -6583
238 -6583 -18660 3039 20462 1850 -20993 -8121 17918 11956 -14440 -14256 11196 15817 -7953
251 -7953 -16184 6089 17424 -3523 -18695 138 19669 4812 -18401 -9562 14730 11633 -11745
264 -11745 -12445 10493 14707 -8168 -16928 4840 18916 319 -18550 -5599 15667 9040 -12342
277 -12342 -11452 8141 11327 -6215 -12098 4449 14132 -93 -13703 -3826 12031 7804 -7646
290 -7646 -8536 4412 8205 -2470 -8489 107 8028 1838 -7532 -4015 6323 6256 -3553 -6566 1764
305 1764 7121 705 -6571 -2498 5978 4170 -5356 -6221 3531 7226 -1794 -7852 -11 8351 2408
320 2408 -7857 -4267 7632 7173 -5619 -8789 3504 9875 -1271 -10424 -1114 10284 3354 -10004
334 -10004 -6037 8642 8509 -6306 -10035 3929 11242 -709 -10872 -1506 10379 3724 -9399
347 -9399 -5636 7951 7254 -6145 -8636 3802 9145 -1450 -8970 -256 8957 2395 -8030 -3826
361 -3826 7319 5545 -5888 -6855 3912 7464 -2101 -7974 -299 7421 2031 -6732 -3518 5938 5144
376 5144 -4334 -5838 3123 6846 -985 -6840 -925 6364 2549 -5743 -4347 4303 5303 -3083 -6217
391 -6217 1515 6782 566 -6366 -2088 5969 4058 -4442 -5025 3012 5598 -1828 -6294 100 6110
406 6110 1093 -6075 -2771 5208 4038 -3916 -4623 2938 5382 -1500 -5583 302 5788 1032 -5677
421 -5677 -2688 4571 3316 -3887 -4184 2705 4606 -1635 -4915 541 5293 1196 -4722 -2403 3949
436 3949 3387 -2816 -3833 1665 3733 -1080 -4253 -263 4221 1730 -3575 -2938 2434 3702 -978 -3469
452 -3469 247 3422 385 -3518 -1452 3120 2277 -2843 -3695 1396 4107 -187 -4088 -845 3848 1671
468 1671 -3467 -2146 3534 3330 -2890 -4538 1454 4863 -267 -5009 -1037 4562 1662 -4547 -2625
483 -2625 4256 3745 -3356 -4331 2596 5094 -1267 -5226 105 5068 707 -5106 -1777 4762 2595 -4553
499 -4553 -3854 3428 4410 -2255 -4433 1505 4672 -506 -4714 -595 4423 1633 -3755 -2346 2779 2224
515 2224 -2536 -2679 1761 2608 -1284 -2559 850 2645 -104 -2306 -314 2089 859 -1485 -952 1044
531 1044 851 -842 -1210 -64 695 635 199 -576 -900 139 1148 192 -1174 -117 1794 832 -2002 -1870
549 -1870 1279 1962 -1088 -2295 894 2536 -896 -3115 450 3565 164 -3740 -582 4322 1904
564 1904 -4003 -2981 3217 3276 -3197 -4312 2575 5272 -1368 -5755 -200 5202 1035 -4399 -836 4890
580 4890 1612 -5186 -3014 4681 4235 -3539 -4801 2456 4633 -2249 -5124 1737 5933 -433 -6121
595 -6121 -1005 5809 2633 -4437 -3143 3211 2857 -2752 -2572 2989 3034 -3270 -4670 1430 4461 -47
611 -47 -3117 379 2912 -808 -3720 16 4101 1444 -3178 -2029 2239 1987 -1460 -1546 1098 803 -1681
628 -1681 -859 2252 1977 -1152 -1654 582 768 -1161 -627 2090 1826 -1705 -2557 698 2122 -573 -2052
645 -2052 284 1570 -785 -1762 1256 2718 -602 -3022 -240 2653 502 -2411 -355 2806 777
660 777 -2972 -1294 3011 1908 -2902 -2660 2160 2787 -1467 -2270 1902 2873 -1647 -3565 748 3358
676 3358 -548 -3554 399 4366 737 -4425 -2263 2921 1850 -2707 -1613 3466 3179 -2167 -3332
691 -3332 1174 2763 -1275 -2993 1070 3510 -41 -2931 -198 2415 -493 -3279 -274 3551 1525
706 1525 -2402 -1326 2094 1161 -2381 -1764 1943 1868 -1720 -2037 1405 1999 -1330 -2077 1176 2102 -1148
723 -1148 -2400 851 2719 105 -1766 554 2204 -630 -3019 -489 2496 708 -1986 -75 2759
738 2759 593 -3100 -1625 2250 1391 -2255 -1331 2928 2639 -2190 -3297 776 2282 -1427 -2873 1369
754 1369 3816 -135 -3505 -577 2741 265 -2997 -446 3424 1557 -2660 -1521 2674 1940 -2623
769 -2623 -2645 1949 2632 -1671 -2699 1714 3350 -1020 -3485 166 3042 -165 -3221 -246 3469 1095
785 1095 -3062 -1594 2468 1458 -2800 -2273 2182 2548 -1414 -2096 1562 2407 -1387 -3029 451 2820
801 2820 345 -1945 130 2231 -32 -2612 -777 2039 738 -2050 -914 1982 1290 -1438 -1237 1194
817 1194 1060 -1403 -1404 1225 1821 -493 -1416 399 1096 -817 -1574 414 1489 -165 -1114 546 1496 -292
835 -292 -1520 88 1453 -84 -1552 -33 1770 401 -1763 -820 1255 370 -1748 -741 1871 1238
851 1238 -1504 -1323 1378 1488 -1186 -1695 962 1764 -835 -1942 686 2226 -363 -2422 -201 2135
867 2135 357 -2020 -327 2322 937 -1998 -1145 1769 1301 -1724 -1666 1408 1894 -1141 -2093 734 2004
884 2004 -659 -2250 208 2189 170 -1882 -208 1952 494 -1958 -943 1630 1097 -1494 -1249 1250
900 1250 1240 -1170 -1441 978 1490 -764 -1463 672 1641 -276 -1441 254 1487 -140 -1617 -161 1572
917 1572 362 -1520 -536 1378 606 -1288 -681 1240 858 -1015 -843 1023 1031 -842 -1123 676 1104 -713
935 -713 -1320 504 1371 -388 -1491 138 1413 42 -1298 -103 1360 310 -1271 -450 1236 642
951 642 -1231 -883 1000 888 -1011 -1088 863 1223 -681 -1294 538 1426 -155 -1221 66 1332 174
968 174 -1239 -350 1160 427 -1188 -677 953 724 -875 -776 772 854 -619 -856 546 1033 -294 -1017
986 -1017 54 891 -33 -941 -175 780 117 -852 -267 761 402 -572 -336 552 441 -351 -334 374 386 -328
1006 -328 -464 215 436 -226 -472 178 417 -139 -348 192 433 -42 -271 111 355 -23 -311 -3 284 -53
1026 -53 -426 -74 363 -20 -453 -107 413 142 -357 -129 409 230 -327 -245 282 281 -249 -337 153 305 -240 -403
1048 -403 155 427 -114 -401 162 517 29 -435 -42 451 225 -330 -266 273 217 -316 -358 159 347 -128 -303
1069 -303 105 341 1 -221 29 262 82 -161 -95 155 58 -263 -295 58 195 -30 -202 -88 120 83 -42
1090 -42 -76 88 250 102 -172 -123 138 147 -175 -229 81 248 14 -245 -70 222 93 -223 -74 399 339 -222
1112 -222 -312 196 312 -203 -409 95 443 -17 -506 -228 333 212 -303 -199 376 323 -236 -309 211 278 -256
1133 -256 -317 198 332 -174 -433 -27 286 -51 -366 -8 511 231 -344 -243 246 205 -160 -42 267 121 -273
1154 -273 -230 116 100 -198 -126 252 259 -133 -233 159 251 -174 -252 176 321 -100 -274 44 31 -333 -298 270 435
1177 435 -96 -434 18 375 -57 -467 86 642 165 -572 -202 508 160 -610 -337 516 427 -426 -469 402 485
1198 485 -432 -670 420 978 -20 -784 -18 743 -7 -844 -160 804 342 -681 -440 548 409 -594 -498
1217 -498 617 724 -387 -649 316 597 -421 -791 245 835 -48 -801 -101 552 -91 -741 -74 848 345
1236 345 -587 -263 630 258 -693 -340 741 519 -553 -516 529 468 -654 -715 498 886 -237 -723 328
1255 328 831 -302 -988 137 1103 66 -1022 -178 954 144 -1079 -378 1059 603 -961 -776 797
1272 797 849 -726 -937 718 1196 -454 -1195 247 1117 -252 -1283 12 1296 265 -1188 -393 1072
1289 1072 428 -1130 -634 1175 1036 -739 -943 652 877 -735 -1163 475 1246 -193 -1130 73 1049
1306 1049 -37 -1165 -209 1133 400 -922 -300 1059 504 -1015 -751 729 628 -711 -703 643 795
1323 795 -570 -939 318 860 -292 -881 268 948 -161 -912 81 947 -53 -1029 -248 811 192 -789
1341 -789 -189 933 485 -771 -534 699 551 -673 -569 782 862 -491 -754 444 679 -603 -1064 284
1359 284 1026 -50 -843 138 912 -184 -1270 -251 1090 383 -882 -280 1022 392 -1126 -796 768
1376 768 718 -746 -749 831 1089 -496 -1071 390 1053 -356 -1147 287 1364 92 -1210 -192 1102
1393 1102 209 -1248 -534 1032 612 -887 -631 978 898 -800 -1041 528 871 -594 -956 581 1198
1410 1198 -287 -1212 -32 907 -169 -1151 -31 1260 438 -949 -387 926 364 -1092 -685 908 751
1427 751 -677 -645 760 785 -778 -1136 391 1008 -293 -947 408 1242 -88 -1161 -89 1059 75
1444 75 -1147 -212 1168 472 -1012 -551 895 527 -1029 -852 844 1033 -554 -865 617 1030 -574
1461 -574 -1299 160 1106 -133 -1131 31 1150 130 -1221 -446 964 439 -1000 -534 1038 870 -739
1478 -739 -838 608 798 -605 -970 444 1026 -205 -925 140 983 -41 -1019 -163 969 323 -790 -255
1496 -255 875 435 -799 -624 529 446 -595 -553 529 630 -418 -692 254 590 -295 -684 254 763 -73
1515 -73 -643 71 618 -114 -750 -95 619 101 -562 -93 614 188 -614 -267 608 326 -538 -351 619 492
1535 492 -519 -573 409 525 -464 -654 323 685 -207 -704 148 727 -98 -808 -46 791 142 -754 -221 726
1555 726 255 -819 -502 570 480 -599 -597 515 665 -394 -731 311 773 -205 -766 112 812 11 -767
1574 -767 -110 710 185 -718 -289 627 395 -543 -389 546 533 -430 -541 377 590 -279 -568 214 596 -150
1594 -150 -625 -23 523 -8 -536 -68 535 128 -486 -182 479 222 -500 -285 400 263 -395 -363 301 300 -307
1615 -307 -414 241 405 -192 -437 185 473 -95 -437 88 507 -4 -504 -32 488 98 -475 -175 438 232
1635 232 -410 -260 420 350 -347 -382 323 428 -275 -486 170 433 -176 -517 22 463 -48 -516 -122 422 152
1656 152 -427 -196 408 276 -347 -327 283 337 -274 -387 173 383 -135 -421 20 379 58 -365 -22 390 168
1677 168 -293 -172 276 187 -196 -159 177 176 -173 -229 69 192 -72 -228 24 209 20 -202 -24 125 20 -137
1699 -137 -32 87 -12 -167 -103 33 -28 -100 -33 71 35 -93 -61 86 58 -48 -25 124 50 -107 -74 34 25 -105
1723 -105 -78 101 121 -59 -109 47 131 -20 -122 59 188 21 -152 -91 100 6 -147 -90 102 94 -125 -174 -11
1746 -11 84 -28 -134 0 156 49 -156 -113 70 67 -100 -105 69 117 -64 -179 -64 127 50 -84 -37 187 128 -111
1770 -111 -171 75 168 -4 -112 21 184 28 -216 -142 144 126 -136 -117 142 165 -118 -232 40 211 -9 -194
1792 -194 -26 209 12 -313 -179 146 165 -154 -168 144 199 -125 -258 54 232 6 -175 20 217 17 -249
1813 -249 -89 207 139 -146 -88 191 159 -167 -167 129 199 -37 -115 89 181 -69 -210 -13 128 -11 -126 16 124
1836 124 -78 -229 -37 151 17 -131 26 184 3 -231 -117 142 49 -202 -81 185 61 -240 -184 181 134
1857 134 -186 -152 226 247 -192 -266 129 298 -72 -289 78 358 -29 -394 -105 338 100 -341 -124 382 229
1878 229 -335 -284 256 278 -227 -336 197 367 -203 -504 37 393 -38 -431 -8 448 66 -478 -193 375 222
1899 222 -332 -221 328 302 -329 -384 213 342 -172 -347 191 410 -102 -435 31 427 37 -347 4 419 95
1920 95 -410 -161 349 179 -335 -211 324 254 -305 -279 251 278 -219 -303 229 333 -193 -388 90 346 -125 -430
1942 -430 20 375 -50 -474 -48 417 97 -425 -121 398 190 -402 -248 400 362 -325 -328 328 382 -271 -464
1963 -464 215 490 -141 -468 125 573 -14 -567 -103 522 121 -491 -191 530 264 -489 -403 336 335 -414 -436
1984 -436 317 512 -230 -547 110 508 -104 -568 -20 554 96 -497 -171 473 172 -472 -306 420 329 -321
2004 -321 -275 333 407 -235 -377 191 403 -112 -381 123 419 -13 -399 -30 338 -14 -377 -66 355 99 -284
2025 -284 -97 316 93 -331 -201 245 171 -273 -209 264 208 -285 -293 173 233 -224 -269 259 382 -113 -376 86
2047 86 330 -133 -409 58 456 20 -408 -61 433 90 -470 -179 457 282 -348 -195 417 379 -336 -429 250
2068 250 413 -227 -467 203 567 -56 -523 -10 450 3 -533 -130 503 212 -453 -265 378 242 -469 -450
2088 -450 315 437 -220 -403 247 438 -155 -501 71 456 3 -402 64 479 98 -420 -141 375 160 -403
2108 -403 -175 411 266 -306 -263 288 240 -296 -349 216 363 -127 -317 162 343 -182 -423 -11 325 -39 -399
2129 -399 9 435 51 -438 -139 326 104 -382 -169 393 282 -317 -295 268 272 -313 -367 244 435 -121 -360
2150 -360 167 440 -55 -463 -15 462 70 -396 -82 426 195 -437 -291 320 267 -357 -313 291 387 -199 -389
2171 -389 165 369 -127 -436 43 412 -13 -403 -92 359 42 -411 -190 301 212 -283 -204 286 255 -217 -283
2192 -283 157 273 -143 -242 139 307 -44 -288 17 265 -39 -256 8 284 74 -213 -10 214 52 -226
2212 -226 -113 203 93 -209 -138 180 113 -230 -197 139 135 -186 -174 151 195 -133 -224 90 232 -98 -267 57 263
2235 263 -26 -287 -32 273 51 -279 -80 282 132 -241 -117 259 203 -197 -228 166 229 -162 -273 124 289
2256 289 -87 -323 36 324 19 -307 -76 307 87 -293 -171 218 138 -255 -232 154 172 -175 -239 69 193
2277 193 -107 -256 28 231 6 -223 -12 218 33 -194 -96 165 125 -138 -106 154 120 -113 -102 130 130 -48
2299 -48 -81 68 123 -52 -124 54 133 -2 -128 -14 81 -48 -140 -17 69 -13 -116 -13 101 22 -145 -40 107
2322 107 40 -112 -59 79 28 -146 -98 74 101 -86 -107 84 114 -35 -131 48 143 12 -121 3 157 26 -133
2345 -133 -67 129 59 -98 -74 89 79 -103 -101 66 130 -35 -117 7 86 -42 -151 -59 70 17 -123 -82 56 18
2369 18 -106 -88 45 54 -11 -79 -5 34 -29 -68 -24 57 24 -30 -38 4 -7 -28 -29 32 25 27 2 -24 3 11 -5 -23 -8 32 4 -40
2401 -40 -35 -36 -2 -13 -34 11 48 -1 -76 -49 1 1 -40 -46 17 1 -38 -77 -23 21 -29 -59 -2 71 19 -66 -64 40 23 -4 -10 21 38
2434 38 -31 -55 -21 16 -11 -2 44 21 -1 -16 -25 7 -12 -16 29 -3 -22 -34 -17 -13 -45 -12 31 -15 -51 -42 2 -11 -98 -60 45 61
2466 61 -32 -86 1 49 -61 -108 -10 81 16 -112 -28 65 32 -78 -32 126 84 -44 -71 68 104 -59 -118 47 134 -3
2492 -3 -142 -13 108 6 -146 -71 92 44 -102 -95 73 70 -94 -124 36 110 -60 -144 -7 75 -32 -131 -38 103 19
2517 19 -115 -42 66 17 -83 -49 78 65 -60 -78 40 41 -45 -70 36 76 -13 -59 20 44 -23 -37 43 69 -19 -69 19
2544 19 34 -42 -97 -6 55 -37 -116 -15 59 -20 -129 -39 101 17 -124 -60 74 37 -126 -130 89 82 -119 -122 63 119 -76
2571 -76 -122 68 186 -13 -123 15 132 -5 -151 -9 175 30 -151 -65 124 102 -140 -101 115 142 -105 -130
2593 -130 64 131 -76 -156 13 132 -47 -177 -35 116 -32 -189 -71 99 19 -148 -73 102 82 -132 -99 99
2615 99 103 -90 -90 67 108 -88 -139 45 141 -41 -140 38 159 3 -135 6 156 10 -160 -32 155 42 -127
2638 -127 -82 131 65 -141 -120 104 100 -111 -142 88 143 -76 -197 55 130 -58 -203 -14 155 -23 -204 -50 169
2661 169 41 -197 -101 159 95 -149 -109 173 152 -97 -143 116 177 -80 -172 83 201 1 -181 2 184 18
2683 18 -191 -48 182 80 -142 -112 129 82 -143 -163 100 101 -117 -150 63 129 -81 -193 4 122 -28 -145 38
2706 38 142 14 -175 -53 112 -12 -150 -56 143 78 -115 -64 109 91 -114 -77 110 142 -60 -73 104 113 -82
2729 -82 -132 41 103 -59 -151 44 157 -5 -150 -20 123 3 -178 -50 168 48 -153 -109 118 52 -170 -167 101
2752 101 127 -142 -130 83 152 -64 -190 53 185 -17 -145 31 189 47 -182 -68 145 49 -172 -86 174 121
2774 121 -105 -108 112 94 -131 -164 84 189 -75 -163 51 160 -43 -194 -19 155 -1 -190 -67 141 67 -181
2796 -181 -101 101 60 -136 -108 106 112 -119 -151 64 108 -73 -155 56 141 -6 -119 40 180 -14 -167 -4 151
2819 151 37 -121 -30 156 88 -147 -85 108 71 -95 -100 104 119 -88 -154 66 125 -88 -192 27 126 -21 -159
2842 -159 -41 129 7 -174 -80 108 54 -116 -73 118 73 -141 -111 88 105 -83 -121 61 135 -26 -135 25 141
2865 141 -10 -113 22 146 56 -107 -2 123 59 -109 -73 102 73 -89 -96 67 83 -81 -122 27 68 -55 -102
2888 -102 14 77 -65 -122 10 74 -2 -102 12 89 3 -122 -60 81 31 -90 -25 118 67 -69 -44 76 53 -55
2912 -55 -87 72 75 -56 -86 47 98 -39 -90 47 104 -23 -99 -8 78 16 -114 -32 104 14 -119 -86 47 29 -122
2937 -122 -79 30 71 -93 -121 41 74 -65 -103 18 91 -21 -112 -13 89 27 -105 -36 80 48 -79 -64 90 70
2961 70 -39 -52 57 91 -39 -77 31 79 -4 -90 36 76 -10 -93 -21 96 0 -63 -23 57 -4 -82 -56 22 26 -75 -53
2988 -53 41 28 -56 -95 3 44 -35 -43 31 72 -23 -56 -5 61 -6 -33 3 70 13 -68 -8 66 38 -57 0 61 20 -76 -22 11 35
3019 35 -32 -43 15 44 -35 -77 -31 24 -42 -99 -10 60 -17 -80 -34 48 4 -55 -32 37 31 -59 -75 -3 32 -52 -47 25 25 -3 -69 5
3051 5 54 -3 -51 0 45 20 -28 10 31 21 -21 -31 29 32 -28 -20 -5 25 -18 -50 11 15 -18 -46 -27 10 -21 -22 -14 10 -15 -36 -20
3084 -20 9 -7 -4 2 24 12 -4 3 -11 13 -20 -15 13 18 1 1 -1 11 23 8 3 26 14 -19 1 -4 -14 -18 7 25 12 11 -12 -32 -2 -7
3120 -7 -14 2 -4 -11 -47 -18 -28 -9 -29 -36 -24 -15 -18 -31 -39 -23 -8 -2 -11 -2 5 -22 -22 -3 16 -8 -13 2 19 9 -16 -10 5 30 -23 -34 25 21
3158 21 -7 -31 3 24 5 -18 12 33 2 -34 -44 15 4 -31 -49 0 7 -44 -64 2 6 -36 -49 7 21 -9 -45 -20 16 -25 -44
3189 -44 -7 40 21 -24 -10 30 33 0 -34 16 55 -7 -16 31 44 -20 -40 11 40 -8 -46 -15 21 -9 -61 9 16 1 -62 -34 21 11
3221 11 -44 -51 9 15 -52 -48 6 17 -20 -46 13 33 -21 -27 5 46 2 -53 27 47 3 -45 -3 50 20 -24 -8 45 32 -42 -34 52 35
3254 35 -47 -35 16 29 -36 -78 26 50 -39 -72 -26 32 -18 -82 -29 36 -36 -57 -44 16 12 -79 -68 31 44 -44 -34 34 38 -31 -61
3285 -61 36 55 -8 -50 24 73 23 -67 -2 73 28 -65 10 73 17 -52 -36 57 48 -37 -43 47 49 -38 -61 14 40 -47 -73 -19 25 -24
3317 -24 -83 -20 46 7 -81 -55 48 -3 -58 -46 47 45 -74 -49 53 63 -71 -62 24 86 -32 -68 33 76 -10 -39 8 88
3345 88 13 -62 -12 50 24 -62 -20 53 32 -59 -66 42 31 -59 -61 27 53 -25 -65 14 51 -24 -93 -19 50 -8 -107 -40 78 -2
3375 -2 -82 -29 54 40 -54 -47 43 56 -43 -47 30 43 -3 -40 19 77 10 -65 5 53 -11 -45 31 96 16 -52 -17 48 11 -74 -48 43
3407 43 22 -83 -74 21 19 -59 -98 2 35 -67 -81 23 50 -28 -79 -4 56 -5 -84 -29 68 18 -78 -31 51 24 -48 -55 63
3436 63 43 -23 -54 48 51 -39 -41 35 52 -11 -77 11 66 -16 -76 -19 50 2 -60 -24 45 3 -92 -56 26 6 -73 -54 19 42 -44
3467 -44 -66 17 19 -29 -74 18 50 -2 -56 -8 104 16 -63 5 59 46 -74 -24 75 19 -50 -32 38 63 -40 -43 53 66 -11 -79
3497 -79 14 61 -6 -72 3 76 10 -84 -2 54 -6 -94 -49 39 6 -51 -56 27 24 -43 -69 14 36 -30 -57 21 51 0 -50 20 65
3528 65 1 -41 6 60 25 -36 -1 61 18 -42 -44 46 29 -53 -32 27 45 -44 -50 12 16 -35 -103 -20 37 -27 -88 -51 33 -21 -95 -24
3560 -24 31 9 -60 -38 14 34 -41 -53 7 25 -40 -53 9 33 -26 -42 35 60 -6 -30 18 39 36 -17 12 69 25 -27 -22 34 11
3591 11 -50 -45 18 13 -60 -41 -17 -24 -54 -61 -22 -5 -47 -83 -39 -7 -37 -64 -20 15 -17 -63 -25 30 1 -52 -19 28 28 -22 -11 33 23
3624 23 -18 -24 4 41 6 -13 -16 29 -12 -27 28 25 9 -24 -4 33 24 -55 -9 14 6 -46 -27 1 -5 -32 -65 -12 10 -17 -17 -22 14 -28
3658 -28 -55 -3 21 16 -35 9 8 -9 -7 -25 29 30 9 1 48 52 -1 -21 0 32 10 3 14 22 2 -19 -6 50 8 -6 6 15 2 -38 -24
3693 -24 -1 -1 -17 -22 12 -10 -33 -7 10 10 3 -6 -6 6 -12 -28 2 14 5 -15 11 27 11 13 -10 9 13 32 12 35 25 5 21 29 15
3728 15 7 -1 40 17 -6 1 5 -2 -5 -7 -2 -3 -5 -30 -22 -17 -19 -19 -34 9 -15 -25 4 0 -7 -7 -11 4 19 -11 -11 5 16 2 8 10 18 21 16 21 29 24 4 16
3772 16 11 10 13 7 0 11 5 17 19 24 17 -23 -6 -8 -5 -10 -22 10 -4 -8 -14 -20 -15 -16 -33 -15 -29 -10 -27 -25 4 21 -2 -6 2 22 -5 8 -3 24
3812 24 -3 -12 -19 4 19 24 -5 1 -1 14 11 -13 22 11 6 17 16 5 -13 -12 4 14 -19 -21 24 0 -27 -22 -9 -12 -42 -29 -19 -8 -32 -42
3848 -42 -19 -7 -9 -32 -13 -6 -4 -31 -10 16 34 -9 -4 10 18 -5 -2 36 30 1 22 4 17 10 0 10 10 15 -31 9 21 9 -6 -27 14
3883 14 -3 -9 -17 11 17 -28 -23 -9 13 -11 -29 4 18 -8 -15 0 -2 4 -25 -14 29 1 11 2 41 19 -9 1 41 35 -7 9 38 59 8
3918 8 3 10 47 -1 -11 26 12 33 -25 -23 9 1 -28 -17 21 -33 0 -42 3 3 -20 -21 -9 11 -22 -19 19 32 -29 -35 6 21 4 -22 -10
3953 -10 27 5 -21 18 18 2 -21 -3 23 28 -6 4 21 25 0 8 27 28 -28 -13 4 28 16 -41 -5 12 -33 -47 -7 22 -26 -29 -52
3986 -52 16 -17 -39 -29 10 1 -29 -39 5 38 -32 -31 21 40 15 -19 9 34 1 -18 1 32 21 -3 -2 31 28 -31 -2 31 22 -18 -20
4019 -20 24 37 -8 -45 16 48 -16 -55 -8 24 -8 -32 2 15 -20 -53 -42 24 -9 -60 -29 10 7 -13 -21 23 22 -31 -25 18 35 17
4051 17 -14 29 29 3 -1 16 39 9 0 21 51 40 -5 8 38 10 -16 -19 16 13 -19 -42 10 9 -23 -38 -6 9 -33 -43 -6 36 -8
4084 -8 -52 6 15 -9 -49 -30 44 15 -25 -24 28 19 -16 -13 18 42 16 -7 46 45 8 -13 27 35 27 14 14 56 23 -12 8 14 27 -28 -28 18
4120 18 5 -37 -41 -22 1 -39 -61 8 11 -33 -49 0 15 -4 -18 -16 39 -7 -17 29 9 0 -28 -6 54 22 -40 -12 22 41 -7 -22
4152 -22 27 25 -5 -26 24 24 -12 -20 1 32 -8 -30 -7 30 -9 -24 -20 34 9 -31 -33 22 -11 -30 -31 -6 12 -38 -31 12 9 -31 -46 29
4186 29 28 2 -29 0 49 16 -21 7 35 38 -2 -11 31 39 -17 2 25 26 -25 -35 -25 41 1 -19 16 39 -4 -32 2 42 3 -28 -29
4219 -29 8 5 -43 -32 3 9 -27 -24 1 4 -43 -41 0 12 -5 -25 31 24 -14 -19 -1 17 -5 5 18 25 18 -6 14 45 27 19 3 28 7
4254 7 4 -13 21 14 -8 -13 7 10 -18 -14 -10 12 -3 -29 -15 8 -27 -36 -36 -17 -8 -17 -19 16 15 -3 -11 22 12 -16 4 22 15 -1 -6 20 24 -1 -9
4293 -9 -2 28 20 -11 16 42 29 13 17 22 -15 -9 3 20 10 -22 -12 35 14 -7 -14 8 -12 -26 -17 -3 -6 -41 -10 -4 6 17 -28 -7 1 -10
4329 -10 -14 6 19 11 -4 12 34 21 -2 0 2 9 10 22 7 32 -5 7 18 13 6 15 2 -3 -1 -18 -10 18 5 -12 -8 14 -4 -1 -22 -5 -2 -21
4367 -21 -10 -24 9 -13 -28 4 -7 11 -18 4 27 24 -7 -5 14 0 0 16 22 5 18 25 -1 19 8 -2 27 15 7 -18 -18 13 24 -4
4401 -4 -4 12 10 -9 -1 -4 2 -7 -20 -17 -14 0 -20 -3 -6 7 -28 10 -1 -5 7 -3 -14 1 -4 9 25 20 0 24 -8 9 15 -2 10 -12 -5 9
4439 9 27 17 21 30 31 33 13 2 9 -8 3 7 8 12 -11 -13 -20 3 2 -6 6 -20 8 -25 -9 -34 -7 0 -13 15 4 -23 10 2 2 25 13 15 20
4478 20 17 28 24 -6 13 26 7 -4 4 14 46 8 18 16 5 20 2 0 -2 5 -12 2 4 -11 0 -5 3 0 -19 -25 -7 4 -33 -10 -17 -12 -15 -37
4516 -37 -19 -10 15 4 4 -8 -14 7 5 12 5 23 15 15 5 -19 12 -4 5 -8 8 27 32 -11 0 -4 9 12 4 4 8 -15 12 -2 2 16 -35 9
4554 9 -4 -7 -42 -16 -4 -20 -25 -30 -16 -22 -24 5 -5 10 -5 -7 17 18 22 -12 14 26 -5 -15 23 28 4 -5 4 15 15 -11 16 43 11 10 16 11
4592 11 -17 -3 -11 -2 6 -13 -35 -4 -6 -53 -14 -28 -1 -9 -30 -2 -14 -9 -38 -2 12 4 -10 2 9 -3 -15 -19 11 12 -5 -8 8 4 6 -4 30
4629 30 15 23 9 11 18 5 0 25 7 2 2 -1 -7 -27 -16 -23 -11 -30 -28 -20 2 -20 -21 -12 -20 8 -2 -38 3 -4 5 -32 -18 -1 -12 -37 -25 12
4667 12 -15 -14 11 18 6 -17 -21 3 18 -9 15 31 15 -3 -5 27 10 -22 3 -5 -4 -22 -12 -4 31 18 -18 -14 11 -18 -38 -45 -9 -10 -39
4702 -39 -35 -17 -10 -31 -16 6 -3 -22 -43 21 21 -13 -9 -3 32 2 -30 10 30 11 4 6 20 27 -14 8 44 11 -6 -2 18 9 -11 -17 29 -15
4738 -15 -12 -29 17 18 -16 -24 6 2 -12 -29 -31 -7 -42 -24 -22 11 -21 -25 -30 18 -14 -17 -25 13 17 -16 -5 17 20 14 -15 1 30 0 -13 -11 36
4775 36 13 -9 10 45 -4 -30 1 8 -14 -26 -4 -4 -14 -5 -17 -12 -13 -21 -26 5 -22 -26 -33 0 30 2 -20 -27 10 10 -6 3 10 15 -23 -3 25
4812 25 27 11 7 19 24 -11 -2 -9 36 8 -30 18 12 17 -8 0 37 19 -14 6 24 7 -22 -13 1 -21 -52 -27 -9 -19 -39 -32 -20 16 -23
4847 -23 -46 -6 2 -26 -44 2 4 5 -22 14 12 0 -14 -17 8 8 -8 -4 7 42 -26 7 23 16 -6 0 29 7 -15 -20 -9 -5 3 -27 -2 6 -21
4884 -21 -13 -20 1 7 -38 -23 -14 5 -18 -7 9 -9 -37 -20 -14 -20 -21 -35 15 6 0 2 15 23 10 2 10 22 -7 -14 -2 22 22 6 -11 31 19 3
4922 3 18 7 -6 -18 -16 -12 -5 -22 -23 -12 0 3 -22 -36 -10 -25 -33 -14 -1 -2 -26 -24 -4 -14 -22 -34 2 -2 -18 -15 -10 18 -17 -2 6 35 -5
4959 -5 4 1 13 25 -6 15 25 3 -7 2 -6 -5 -12 -31 10 -3 -4 -33 -2 -25 -48 -26 -8 -19 -15 -20 -18 -12 -7 1 -10 -13 -14 -13 -12 7 -9 -15 -4 19
4999 19 3 2 -5 8 12 7 -28 12 26 -1 -16 4 25 2 -5 8 3 -4 13 -6 5 -8 -9 -10 9 7 -22 -12 -21 -39 2 -23 -8 -9 -44 -31
5035 -31 -6 -6 -13 -1 -25 -1 -2 -32 -12 -19 7 2 -25 22 0 1 -2 29 -7 -7 9 5 22 -13 0 3 -2 12 -3 4 7 -9 14 -3 2 3 -30 1
5073 1 2 5 4 -12 -11 -5 9 -2 -17 -26 -15 -20 -47 -11 -15 -13 4 10 7 -18 5 7 -7 6 10 10 -1 -6 11 21 10 31 8 32 11 12 8 25 42
5112 42 14 13 -22 9 23 20 12 5 1 -20 9 -6 -27 -11 -22 -3 7 10 0 -14 0 -23 -31 -15 -17 8 -2 -7 3 -3 4 -11 10 -1 3 -11
5148 -11 18 2 -10 8 0 20 9 30 7 13 27 -11 -14 -2 16 -13 -7 4 -8 2 -3 -4 -11 -23 -9 -33 -20 -27 -17 -26 -35 -5 -4 -31 -9 -23
5184 -23 -33 5 -16 -3 -12 1 -12 19 23 7 -1 8 3 13 24 13 -3 14 23 -7 21 36 20 22 19 17 8 13 18 13 -10 1 -14 -5 -9 -21 -25 -1
5222 -1 -23 -18 -27 -8 -21 -36 -26 -23 1 -12 -3 5 13 -4 -24 22 14 -6 18 2 19 2 22 -6 -7 3 -1 22 11 12 9 7 18 2 8 -11 13
5259 13 -18 1 -8 -10 -33 -30 -16 -20 -14 -32 -9 -16 -18 -25 -25 -18 17 -12 -32 -9 -3 -2 -17 -19 -13 -5 -17 -23 14 17 -9 -8 -12 27 19 8 -5 26 4 3 27
5300 27 12 4 -7 35 -11 -13 -10 4 1 -17 -26 -27 -6 -26 -10 -9 -1 -16 -19 -22 -21 4 -22 -13 -5 -2 -15 -41 0 -6 -4 -18 -7 29 -5 0 0 18 40
5339 40 17 13 24 27 -19 -6 12 41 16 17 20 8 -4 -14 9 39 -10 -3 8 23 -12 -15 -1 7 -20 -17 -21 -5 -25 -25 -21 2 5 -49 -39 2
5375 2 14 -16 6 11 17 -1 6 -7 13 34 -9 6 22 3 -10 -1 25 18 -6 8 7 -12 -16 -1 16 -7 -33 -30 17 9 11 -5 -30 -6 -9 -6 -1
5412 -1 -33 -3 -13 -22 1 -6 -10 -10 1 -3 -26 -27 -3 -4 3 -22 -8 8 -1 2 22 15 5 13 15 48 30 28 24 34 3 -15 -8 10 29 -4 -22 8 2
5451 2 -4 -17 8 -4 9 -30 -9 9 -5 -20 -9 -15 5 0 2 -23 -13 -28 -23 0 -12 -7 -5 2 4 -20 -25 9 24 -3 -2 14 21 3 14 19 26 9
5489 9 15 40 15 28 1 4 34 11 -30 -8 11 -36 -9 -20 -15 4 -24 -26 0 -17 -17 -24 2 -5 -25 -31 -7 10 -35 -31 -8 13 7 -15 -11 10
5525 10 22 9 4 10 9 1 31 48 25 1 14 27 35 41 7 19 17 34 12 2 19 3 -4 -10 5 22 -18 -21 -1 -12 -35 -24 -18 -8 -12 -22
5561 -22 1 -14 -25 -36 4 -18 -19 -23 0 -1 7 -17 -9 12 -9 14 14 24 27 23 6 11 0 8 8 8 28 -27 -3 14 24 -8 -22 -29 13 -26 -19
5598 -19 3 -17 -5 -19 -7 -9 -9 -25 -22 -3 6 -5 -23 -2 -10 -15 -4 -9 -15 7 2 -3 -4 0 16 10 18 20 11 17 20 28 0 -1 21 10 10 0 16 -4 5
5639 5 -16 13 -17 -23 0 -8 -10 0 -16 -20 -10 -16 -14 -16 5 8 -17 -4 -2 13 -2 -15 -12 13 -2 -14 11 13 -10 -7 4 10 -6 3 11 29 15 7 16
5678 16 2 16 7 14 -3 9 19 2 11 0 2 -2 -15 5 -34 -7 10 -1 -5 -11 -24 -3 3 -21 -6 -21 2 -16 -11 -6 0 1 -18 5 12 20 -10
5715 -10 13 7 17 9 -2 5 5 23 6 12 -15 -3 4 13 8 0 -12 -7 -17 -2 11 -1 17 -7 -13 -20 -9 6 -3 -6 -1 0 -17 -22 -24 -38 -22 -16 -17 -16 -21
5756 -21 -45 -12 -4 -8 -24 7 9 0 -9 -14 17 4 4 32 14 24 -3 11 5 1 35 13 -1 -8 5 -15 -13 -2 5 -2 11 -16 -33 -23 -1 5 -19
5793 -19 2 -23 3 -29 -45 -19 -25 -14 -5 -5 -26 -12 -9 -11 5 1 -1 9 22 12 26 45 21 0 8 32 15 23 18 6 15 9 17 16 4 13 6 -15
5831 -15 -16 -11 -2 -27 -6 -25 3 -19 -6 -4 -6 -7 -18 -29 -28 -17 -8 -14 1 -28 -23 -2 2 7 7 6 -3 15 21 5 20 9 19 12 11 20 -1 29 12 14
5871 14 25 5 4 22 9 -11 -9 10 4 1 6 -20 -15 -27 -10 -14 -21 -8 -3 -18 -24 -13 -21 -14 -14 -9 -18 -16 -43 3 20 -16 1 -1 29 7 11 14 12 17 27
5912 27 2 19 21 9 17 20 1 -8 5 -17 16 -13 -9 -12 -9 11 4 -22 9 2 -14 -1 26 -18 -30 -6 8 -9 0 -19 -16 -18 -21 -7 3 16 -32
5949 -32 -5 21 15 3 21 15 20 -19 -6 11 32 17 2 31 34 22 24 28 12 3 -2 13 4 -1 10 1 -5 -6 1 -8 -13 -17 -22 -23 -14 0 -24 -18 -17 2 7 7
5991 7 7 -14 7 -9 -10 -19 -3 -26 16 23 6 -1 -2 9 1 8 -10 23 15 18 27 29 19 18 10 25 22 20 5 -1 1 0 -2 -21 7 -13 -8 -21 -31 -4 -32
6032 -32 -11 -12 -9 2 -30 -9 -7 -1 -25 -4 8 7 -27 -25 -12 12 -23 23 7 19 5 12 23 27 7 -7 10 10 22 -11 25 29 4 -9 5
6067 5 6 6 -1 -10 4 0 -16 7 17 -13 -14 -24 -18 -15 -37 -28 -26 -32 -21 -26 -8 -1 -14 -20 -20 12 5 -17 -20 3 -9 0 0 20 26 13 14 23 6 19 7 2
6109 2 8 4 0 8 3 -3 6 -16 18 -3 -2 21 0 -6 10 5 -21 -7 -18 -8 -3 -28 -12 -7 34 8 -16 -2 -9 4 -16 -2 0 0 12 -15 3 15
6147 15 7 18 -2 27 16 4 21 13 13 -15 16 7 10 -15 7 27 -5 1 10 -3 -23 4 -6 -19 2 -1 -29 3 -21 -8 -16 -35 -34 -3 -7 4
6183 4 10 -35 -5 -9 15 18 -19 2 -2 7 13 -13 9 9 -7 14 24 17 21 -7 9 41 -13 8 18 5 8 8 3 -2 -16 -10 -17 -5 2 -25 -19 -9 -12 5
6223 5 -16 -21 -37 -6 -35 -27 -20 -4 -2 -6 1 3 -17 -2 18 6 2 -8 8 30 7 -5 9 7 13 12 8 23 -14 -2 4 9 29 2 16 -8 0 8 -6
6262 -6 -19 -17 -13 -9 11 -18 -19 -25 -1 9 4 -13 -28 -18 -26 0 4 1 0 -13 -22 9 0 -2 -12 2 5 19 26 15 11 14 4 1 9 25 28 4 34 29 -2
6303 -2 6 31 14 4 -11 3 -1 -5 1 -10 -24 0 0 3 12 6 -10 7 20 -10 5 -31 -26 -14 -11 -26 -2 3 -2 4 2 10 -8 11 -5 14 3 1 33
6342 33 26 8 20 22 19 27 18 36 8 13 -15 4 15 -6 -11 -19 -14 -18 -15 7 -10 2 -19 -14 5 -13 -29 -35 -6 -14 -19 -4 -5 -10 -11 -7 -9 18 -10 15
6382 15 17 14 -6 5 10 18 27 4 -3 18 3 -21 15 11 17 15 6 3 0 0 19 -19 -2 -11 -14 1 -17 -19 -2 -2 -23 -12 -12 4 -19 -4 -13 19 -26 -7
6422 -7 -7 11 2 -25 14 -9 19 16 17 7 40 22 10 5 15 22 7 24 2 5 2 30 -13 18 19 17 20 0 12 12 17 1 -11 -19 -17 -5 2 7 -21
6461 -21 -8 15 -4 -8 -17 -2 -21 -1 1 -1 -14 -3 7 -28 -8 -4 6 6 8 10 25 18 27 31 19 12 23 17 2 18 31 26 -3 -1 4 -2 -16 -15 9
6500 9 17 -15 -32 -2 9 1 6 -26 6 -12 -21 -10 -10 -5 5 -2 -17 3 3 20 -21 -3 21 -1 5 6 14 16 18 13 22 7 6 28 17 24 20 15 26 -7
6540 -7 14 -3 0 2 10 10 13 3 17 -6 -14 6 -13 -22 -12 -11 -2 -20 -29 -13 3 -21 -1 10 -13 -2 4 7 8 10 4 15 23 17 13 5 -4 8 22 14 14 21
6582 21 15 11 10 13 18 17 0 -2 2 -1 19 10 6 14 11 16 0 1 -4 -3 7 3 1 -10 -17 -12 -5 -3 -10 -21 -6 -14 9 5 -19 2 1 3 -17 6 24 1 4 8 31
6627 31 20 23 13 13 17 16 -1 15 -5 -3 10 -10 6 -6 -21 -1 10 8 -12 -11 -18 -10 -15 -14 -15 -26 -14 -5 1 16 -9 -20 -5 -16 6 -18 11
6664 11 5 -8 22 8 5 6 34 -5 11 -3 17 7 27 7 27 32 21 -5 19 11 7 5 -1 6 11 -5 -16 5 5 -12 -11 5 -2 -8 4 7 -17 -14
6702 -14 13 24 2 4 -18 -8 2 12 0 -11 16 -7 26 11 18 5 13 -6 -1 39 31 6 13 33 32 22 11 13 18 37 24 26 11 1 15
6737 15 -5 9 0 -2 1 -27 -18 -32 -8 2 -20 -18 -14 8 -9 -6 -27 0 -2 -13 6 8 4 17 10 -17 8 9 11 7 18 32 17 0 8 12 12 33 15
6776 15 12 29 24 -11 26 2 10 15 7 17 -17 11 -6 -6 4 5 1 -8 -10 -5 7 2 -36 7 10 -9 3 -5 -5 1 15 8 23 6 15 20 19 44 23 19 19
6817 19 25 46 22 36 22 36 7 8 32 23 -1 4 -14 8 13 3 9 0 -8 -6 -5 -6 -11 -30 -6 2 13 -20 9 -7 -23 -28 -5 15 8 -5 13 -6
6855 -6 -11 -22 22 7 12 11 6 22 3 4 13 32 22 26 41 19 39 27 13 30 24 29 21 -6 23 -1 -17 4 9 13 1 -19 -10 -14 -2 1 3 -7 9
6894 9 -4 9 -14 -3 -5 -3 14 -31 -10 22 7 32 7 1 23 19 15 5 28 24 15 16 22 14 9 28 42 18 10 32 5 19 6 8 7 -2 -1 12 -23
6933 -23 -3 -3 4 -7 -17 0 -38 -12 5 -7 -13 8 -14 -15 14 5 15 31 6 -1 12 29 10 15 16 19 -2 5 13 10 25 19 13 5 14 17 -13 14 -5
6972 -5 -8 0 -6 0 1 4 -1 3 -7 -7 7 -7 -17 -1 -13 -14 4 6 7 -1 5 -17 11 -6 -4 5 14 2 10 15 29 0 4 31 37 18 36 22 7 10 17 20 -2
7015 -2 8 18 27 -21 -2 19 -5 22 19 -7 -19 1 1 -8 -5 1 -20 -2 -11 15 -7 -30 -4 -20 1 4 -2 1 -8 6 6 6 -10 7 -2 25 31 21
7053 21 6 5 21 12 15 27 14 27 10 1 34 15 23 34 1 27 5 5 18 1 13 -11 15 -17 -15 -17 -22 -25 -24 -26 2 -8 -14 4 10 -5 -2 -1
7091 -1 8 4 6 22 -2 19 17 -6 27 16 15 19 -6 5 22 0 1 11 15 10 4 10 7 9 4 4 11 -5 17 1 6 -3 -11 -6 -12 -12 -4 2 -22 -17 -15 -17 -7 -5 0
7136 0 -23 -11 12 0 6 8 -13 -3 34 -3 11 8 6 31 19 16 18 16 29 13 20 22 4 14 6 -10 -19 14 3 2 -2 7 2 2 -4 11 29 9 -13
7175 -13 7 13 -4 3 15 -1 -18 -10 -1 4 10 18 29 23 20 -8 13 33 3 -2 20 9 21 21 24 22 8 14 32 16 25 -8 21 -1 3 3 -1 3 -12 -4
7215 -4 -6 -15 19 4 -22 -5 -10 10 -7 -8 -11 5 -6 6 -9 2 8 -12 -10 9 -15 3 -18 29 7 7 -7 23 3 20 -3 4 19 -1 25
7250 25 22 25 8 -10 12 25 14 -5 -10 15 -1 18 -8 -12 -20 7 -12 -24 -38 -15 -35 -24 -4 -25 -12 -6 -13 5 -10 2 -15 -3 -4 -8 12
7285 12 6 6 24 24 9 23 6 31 8 14 6 31 18 3 24 15 -5 6 7 5 27 5 10 -6 0 -21 5 5 -10 3 -11 -17 -25 -15 7 -23 -26
7322 -26 -27 10 -25 -15 -21 2 -12 -2 0 7 14 2 -17 -2 -3 2 1 1 16 8 24 16 34 8 3 22 21 7 17 20 -4 9 -4 -35 4 -26 -19 7
7360 7 -7 -5 -12 -7 11 6 -20 -15 -8 5 7 -4 0 -3 -27 -15 19 -10 -7 20 -7 7 13 -5 -16 14 18 18 24 5 10 17 16 18 2 19 39 15 -11 7
7400 7 14 5 2 21 13 -7 21 -22 9 -13 -19 -33 -9 -13 13 -6 -9 -18 -21 -18 6 24 13 10 11 5 -9 16 23 -4 20 12 7 1 5 17 10 12 10 27 5
7441 5 28 19 -6 8 17 -12 0 -7 -6 -2 10 -11 -26 15 -20 11 -17 -19 -18 -9 -23 -27 -20 0 -7 -13 -7 -7 -2 7 -16 8 -2 24 24 21 2 -5 -6 18 31
7482 31 12 19 13 28 -1 35 4 18 -8 -3 0 2 -14 1 -5 -2 -7 -10 -5 5 -34 1 1 -7 -15 -7 -18 1 -14 -10 -7 -5 -9 -19 -12 11 -9 2 17 -6
7522 -6 -8 4 -15 5 -8 7 11 6 19 21 22 2 13 19 10 17 17 22 22 -1 18 23 24 11 -1 9 21 3 -15 18 -7 6 -5 -37 -15 -23 -4 -13
7560 -13 10 -14 -18 -10 -5 -12 4 3 0 5 -6 4 12 -8 -13 30 29 -14 10 -1 49 14 24 6 22 37 25 9 7 31 12 35 2 1 -16 -8 3
7597 3 -1 4 -14 -20 -13 -23 -24 -3 10 6 -1 -28 8 10 -12 5 9 -13 -8 -7 -2 10 -17 -6 19 11 -12 9 10 36 15 25 20 1 16 4 9 11 1
7636 1 12 16 23 3 -4 -13 10 2 -12 -19 -31 22 -14 -9 4 -16 -10 -9 -14 -6 -17 -11 -22 -2 -29 -8 -15 -1 -18 -14 -9 26 27 32 -9 4 -2 12 23 -7
7676 -7 14 29 14 -1 24 10 1 0 4 -11 5 13 8 -1 4 -14 4 2 -5 10 -14 2 -8 -18 -1 -6 2 -19 6 -24 5 -18 -23 -2 -7 5 -1 12
7714 12 -17 9 5 6 33 19 16 18 17 42 16 21 30 24 20 -1 -7 -17 2 -19 -10 -27 1 -3 -10 -14 -5 -4 -18 -34 -9 -5 -15 -7 -17 -6 -33 -24 -19 5
7754 5 -21 3 8 1 -2 -14 -11 12 5 -14 6 20 10 -4 28 5 2 5 17 21 22 26 9 3 6 20 -15 -1 0 -1 -16 3 20 0 -14 -17 -2 -6 -7
7793 -7 -29 -23 -4 -15 -19 -23 -6 -27 -28 -17 -1 -18 -1 -24 -16 0 -13 -8 6 7 -3 -9 13 12 12 9 15 11 6 15 2 12 10 19 17 14 5 6 9 -2 23 12
7835 12 -12 -4 1 4 -3 -5 -29 -16 -21 -30 -27 -15 -11 0 -27 -1 -16 -19 -8 17 1 -3 15 -1 15 17 7 13 38 25 15 33 7 20 30 42 20
7872 20 16 39 3 -7 6 11 16 -8 2 -11 -3 -17 -20 6 -34 -9 -30 -7 -25 -6 1 1 -9 -44 -4 15 -3 -4 9 -1 -3 -25 -17 -8 13 -9
7908 -9 -27 5 20 25 0 18 10 38 0 10 11 8 16 12 35 19 26 10 -12 -6 0 -7 -24 14 -6 -19 -31 -37 24 -14 7 -20 -12 3 -13 10 3
7945 3 1 4 -9 -3 13 -1 -2 -7 3 -9 23 6 16 20 1 -4 5 3 4 25 -10 -3 6 15 18 21 -4 -2 16 -1 -13 16 16 -4 5 2 19 -12 -4 -15 -23
7986 -23 -13 -16 -31 -16 -4 -25 -6 5 -19 8 -10 -4 11 -1 -1 -6 8 4 4 1 14 15 20 15 6 25 6 9 33 44 22 9 -3 18 38 0
8022 0 8 -1 10 2 26 -5 10 -1 -8 0 -1 -5 -8 4 -3 -23 -2 1 5 0 -11 2 -16 2 -22 2 -9 -3 15 15 34 31 11 15 41 32 38 9 40 10
8062 10 11 20 14 7 27 -6 18 20 17 -8 -2 5 6 -12 -5 -16 -4 -6 -9 -7 -1 -18 -21 3 -10 4 16 -8 6 -13 -3 21 20 -21 7 -17 9 15 12
8101 12 18 10 18 18 3 0 10 3 23 22 10 4 22 22 17 9 11 5 9 -3 -8 -5 14 -3 -49 1 -16 -12 -10 -12 -7 -27 0 -6 9 -10 -6 -13 -5 -8 3 4 28
8144 28 29 19 29 9 35 0 10 23 6 6 -3 4 5 -6 0 18 14 12 -2 9 4 -11 -10 15 14 14 6 8 21 -11 -19 -12 -19 3 -10 -32 4 -20 -6
8183 -6 -19 8 -7 3 -16 -21 21 6 1 22 17 7 12 15 40 24 35 26 8 21 25 -1 -6 6 9 9 5 29 -9 27 6 -15 -2 -22 6 8 -6
8220 -6 -5 6 7 -20 -15 8 -12 -30 1 -11 -22 21 -4 -4 7 -13 -1 0 -14 -1 5 2 -3 12 4 13 21 -8 11 29 -22 43 -3 7 2 12 27
8257 27 -11 0 -10 14 -13 -4 -5 -11 -2 -8 -4 11 -5 -11 1 -28 -13 -13 -14 5 -30 -3 -8 -21 -13 -2 17 8 12 -6 8 0 29 14 -6 19 12 12
8295 12 26 0 38 -2 12 15 43 9 9 23 14 7 6 22 30 6 8 12 -17 -10 -25 -13 12 -15 6 -19 -10 4 -9 -12 -18 1 -4 8 -10 6 14
8332 14 10 5 1 29 13 13 4 11 14 20 2 30 32 31 36 1 20 -2 6 32 26 39 -9 9 28 -3 42 16 22 29 26 -2 -9 -26 3 -19 -21 9 -7
8371 -7 -1 -7 -28 -25 2 17 -9 -4 -2 1 4 16 14 -2 5 10 15 24 4 10 24 23 26 40 31 16 16 24 4 3 25 29 -2 3 1 2 -6 -1 -1 0 -4 -4 -19 6 -10
8416 -10 1 -23 -3 -28 -13 -9 -3 -7 -5 -13 6 8 6 3 9 12 15 18 25 22 27 32 7 37 20 29 19 12 -1 11 19 20 18 23 -2 -3 3 1 20 13 -9 4 -19
8459 -19 -7 -3 -13 -23 -2 5 -13 4 -12 -23 -1 6 -11 4 -4 26 -2 21 37 -3 -8 24 3 13 15 36 18 36 0 24 23 26 26 8 6
8494 6 24 20 2 9 7 12 14 8 10 2 -19 -11 1 0 -21 -1 -13 -11 -21 -18 -17 -1 -20 10 -7 2 2 -27 10 2 20 3 7 0 7 18 28 23 27 27 8 20
8536 20 33 26 12 10 12 30 -4 17 12 18 11 -11 -27 24 15 -25 6 5 -15 8 -13 -12 -12 4 2 -8 5 -25 -18 -4 -11 0 -9 -1 7 6 -18 -13 17
8575 17 -2 11 22 17 32 38 24 17 21 6 -7 22 33 14 18 12 16 20 0 19 -22 9 -9 6 -11 -14 6 2 -12 -5 -5 -5 -7 -6 -12 1 2 -21 -18
8614 -18 -20 -27 -25 -7 -10 -5 -9 -16 2 6 10 9 3 16 10 19 -7 11 8 16 12 15 27 26 4 22 20 18 -19 14 5 -3 -7 -37 1 -4 -7 -21 0 -18 -25 -2 -2 -14
8658 -14 -14 2 -36 -7 -14 -19 2 -10 -7 8 -8 9 14 5 3 22 -11 6 7 6 -2 4 20 5 25 -1 14 26 12 -6 -4 10 -1 -2 -6 9 -16
8695 -16 4 -12 -1 5 -20 -5 -10 -3 10 3 -24 -5 13 -3 -8 8 3 11 -1 6 19 10 27 9 7 12 2 18 6 27 5 48 22 6 28 9
8731 9 -20 17 7 4 -2 -3 3 -4 11 13 -14 -25 9 0 -22 -5 28 -13 -10 -7 -6 -18 2 -5 0 -2 5 13 11 -3 18 -2 5 18 17 16 12 12 2 30 -14
$$ [...]
16383d
##END NTUPLES=NMR FID
##END=
