##TITLE=abcd
##JCAMPDX= 6.0         $$ Bruker NMR JCAMP-DX V2.0
##DATA TYPE= NMR SPECTRUM
##DATA CLASS= NTUPLES
##ORIGIN= UXNMR, Bruker Analytische Messtechnik GmbH
##OWNER= root
$$ XWIN-NMR		Version 3.5
$$ Sun Jul  6 15:43:48 2025 Russian Standard Time (UT+4h)  servis@DPX200
##.OBSERVE FREQUENCY= 200.131235884673
##.OBSERVE NUCLEUS= ^1H
##.ACQUISITION MODE= SIMULTANEOUS
##.ACQUISITION SCHEME= undefined
##.AVERAGES= 32
##.DIGITISER RES= 18
##SPECTROMETER/DATA SYSTEM= spect
##.PULSE SEQUENCE= zg
##.SOLVENT NAME= CDCl3
##.SHIFT REFERENCE= (INTERNAL, CDCl3, 0, 16.4885)
##AUDIT TRAIL= $$ (NUMBER, WHEN, WHO, WHERE, WHAT)
$$ ##TITLE= Audit trail, XWIN-NMR		Version 3.5
$$ ##JCAMPDX= 5.01
$$ ##ORIGIN= Bruker BioSpin GmbH
$$ ##OWNER= servis
$$ F:\spectra/data/av/nmr/H1/1/pdata/1/auditp.txt
$$ ##AUDIT TRAIL=  $$ (NUMBER, WHEN, WHO, WHERE, WHAT)
(   1,<2025-07-06 15:43:19.46 +0400>,<servis>,<DPX200>,
      <created by zg, POWCHK disabled, PULCHK disabled
       configuration hash MD5:
       00 E9 B6 7A A2 85 ED C7 34 08 36 98 17 FE 4E 26
       data hash MD5: 32K
       91 F3 23 C7 D3 A9 FB A7 CD 7F 8A 46 C9 5E D7 07>)
(   2,<2025-07-06 15:43:21.81 +0400>,<servis>,<DPX200>,
      <Start of raw data processing
       efp BC_mod = 2 LB = 0.05 FT_mod = 6 PKNL = 1 PHC0 = -271.4733 PHC1 = 1.101538 SI = 16K 
       data hash MD5: 16K
       1B D0 69 6D 10 18 24 21 7B D0 98 26 93 97 1B 82>)
$$ ##END=
$$ 
$$ hash MD5
$$ E6 A4 7B 2C EC EE B3 28 2A B6 7E 05 9E FF FA 9A
##$RELAX= 
##$RELAX= 
##$RELAX= 
##$RELAX= 
##$RELAX= 
##$RELAX= 
##$RELAX= 
##$RELAX= 
$$ Bruker specific parameters
$$ --------------------------
##$DU= <F:\spectra>
##$EXPNO= 1
##$NAME= <H1>
##$PROCNO= 1
##$TYPE= <nmr>
##$USER= <av>
##$AMP= (0..31)
100 100 100 100 100 100 100 100 100 100 100 100 100 100 100 100 100 100 
100 100 100 100 100 100 100 100 100 100 100 100 100 100 
##$AQSEQ= 0
##$AQ_mod= 1
##$AUNM= <au_zg>
##$AUTOPOS= <>
##$BF1= 200.13
##$BF2= 200.13
##$BF3= 200.13
##$BF4= 200.13
##$BF5= 500.13
##$BF6= 500.13
##$BF7= 500.13
##$BF8= 500.13
##$BYTORDA= 1
##$CFDGTYP= 0
##$CFRGTYP= 5
##$CHEMSTR= <none>
##$CNST= (0..31)
1 1 145 1 1 1 1 1 1 1 1 1 1 1 1 1 1 1 1 1 1 1 1 1 1 1 1 1 1 1 1 1 
##$CPDPRG= <>
##$CPDPRG1= <>
##$CPDPRG2= <>
##$CPDPRG3= <>
##$CPDPRG4= <mlev>
##$CPDPRG5= <mlev>
##$CPDPRG6= <mlev>
##$CPDPRG7= <mlev>
##$CPDPRG8= <mlev>
##$CPDPRGB= <>
##$CPDPRGT= <>
##$D= (0..31)
0 2 0 0 0 0 0 0 0 0.06 0 0 0 0 0 0 0.0002 0 0 0 0 0 0 0 0 0 0 0 0 0 0 
0 
##$DATE= 1751802199
##$DBL= (0..7)
120 120 120 120 120 120 120 120 
##$DBP= (0..7)
150 150 150 150 150 150 150 150 
##$DBP07= 0
##$DBPNAM0= <>
##$DBPNAM1= <>
##$DBPNAM2= <>
##$DBPNAM3= <>
##$DBPNAM4= <>
##$DBPNAM5= <>
##$DBPNAM6= <>
##$DBPNAM7= <>
##$DBPOAL= (0..7)
0.5 0.5 0.5 0.5 0.5 0.5 0.5 0.5 
##$DBPOFFS= (0..7)
0 0 0 0 0 0 0 0 
##$DE= 6
##$DECBNUC= <off>
##$DECIM= 32
##$DECNUC= <off>
##$DECSTAT= 4
##$DIGMOD= 1
##$DIGTYP= 9
##$DL= (0..7)
0 120 120 120 120 120 120 120 
##$DP= (0..7)
150 150 150 150 150 150 150 150 
##$DP07= 0
##$DPNAME0= <>
$$ [...]
##$SUBNAM4= <"">
##$SUBNAM5= <"">
##$SUBNAM6= <"">
##$SUBNAM7= <"">
##$SUBNAM8= <"">
##$SUBNAM9= <"">
##$SW= 20.6817932712277
##$SWIBOX= (0..15)
0 0 3 0 0 0 0 0 0 0 0 0 0 0 0 0 
##$SW_h= 4139.07284768212
##$TD= 32768
##$TD0= 1
##$TE= 0
##$TE2= 300
##$TE3= 300
##$TEG= 300
##$TL= (0..7)
0 120 120 120 120 120 120 120 
##$TP= (0..7)
150 150 150 150 150 150 150 150 
##$TP07= 0
##$TPNAME0= <>
##$TPNAME1= <>
##$TPNAME2= <>
##$TPNAME3= <>
##$TPNAME4= <>
##$TPNAME5= <>
##$TPNAME6= <>
##$TPNAME7= <>
##$TPOAL= (0..7)
0.5 0.5 0.5 0.5 0.5 0.5 0.5 0.5 
##$TPOFFS= (0..7)
0 0 0 0 0 0 0 0 
##$TUNHIN= 0
##$TUNHOUT= 0
##$TUNXOUT= 0
##$USERA1= <user>
##$USERA2= <user>
##$USERA3= <user>
##$USERA4= <user>
##$USERA5= <user>
##$V9= 5
##$VALIST= <valist>
##$VCLIST= <CCCCCCCCCCCCCCC>
##$VD= 0
##$VDLIST= <DDDDDDDDDDDDDDD>
##$VPLIST= <PPPPPPPPPPPPPPP>
##$VTLIST= <TTTTTTTTTTTTTTT>
##$WBST= 1024
##$WBSW= 30
##$XGAIN= (0..3)
0 0 0 0 
##$XL= 0
##$YL= 0
##$YMAX_a= 532711
##$YMIN_a= -251306
##$ZGOPTNS= <>
##$ZL1= 120
##$ZL2= 120
##$ZL3= 120
##$ZL4= 120
##$ABSF1= 0
##$ABSF2= 0
##$ABSG= 0
##$ABSL= 0
##$ALPHA= 0
##$AQORDER= 0
##$ASSFAC= 0
##$ASSFACI= 0
##$ASSFACX= 0
##$ASSWID= 0
##$AUNMP= <proc_1d>
##$AZFE= 0.1
##$AZFW= 0.1
##$BCFW= 0
##$BC_mod= 2
##$BYTORDP= 0
##$COROFFS= 0
##$CY= 18.4799938201904
##$DATMOD= 1
##$DC= 0
##$DFILT= <>
##$DTYPP= 0
##$F1P= 9.9274215381318
##$F2P= -0.165520771350173
##$FCOR= 1
##$FTSIZE= 16384
##$FT_mod= 6
##$GAMMA= 0
##$GB= 0
##$INTBC= 1
##$INTSCL= 4.127829e-11
##$ISEN= 128
##$LB= 0.05
##$LEV0= 0
##$LPBIN= 0
##$MAXI= 10000
##$MC2= 0
##$MEAN= 0
##$ME_mod= 0
##$MI= 50
##$NCOEF= 0
##$NC_proc= -5
##$NLEV= 6
##$NOISF1= 3.799351
##$NOISF2= 2.8
##$NSP= 0
##$NTH_PI= 0
##$NZP= 0
##$OFFSET= 16.48848
##$PC= 4
##$PHC0= -271.4733
##$PHC1= 1.101538
##$PH_mod= 1
##$PKNL= yes
##$PPARMOD= 0
##$PSCAL= 4
##$PSIGN= 0
##$REVERSE= no
##$SF= 200.130005582386
##$SI= 16384
##$SIGF1= 3
##$SIGF2= 2
##$SINO= 400
##$SIOLD= 16384
##$SREGLST= <1H.CDCl3>
##$SSB= 0
##$STSI= 16384
##$STSR= 0
##$SW_p= 4139.07284768211
##$SYMM= 0
##$S_DEV= 0
##$TDeff= 32768
##$TDoff= 0
##$TI= <>
##$TILT= no
##$TM1= 0
##$TM2= 0
##$TOPLEV= 0
##$USERP1= <user>
##$USERP2= <user>
##$USERP3= <user>
##$USERP4= <user>
##$USERP5= <user>
##$WDW= 1
##$XDIM= 16384
##$YMAX_p= 381842704
##$YMIN_p= -408404
$$ End of Bruker specific parameters
$$ ---------------------------------
##NTUPLES= NMR SPECTRUM
##VAR_NAME=  FREQUENCY,     SPECTRUM/REAL,   SPECTRUM/IMAG
##SYMBOL=    X,             R,               I
##VAR_TYPE=  INDEPENDENT,   DEPENDENT,       DEPENDENT
##VAR_FORM=  AFFN,          ASDF,            ASDF
##VAR_DIM=   16384,         16384,           16384
##UNITS=     HZ,            ARBITRARY UNITS, ARBITRARY UNITS
##FACTOR=    0.252644378177508, 1,           1
##FIRST=     3299.83951724647, 0,            0
##LAST=      -839.233330435636, 0,           0
##MIN=       -839.233330435636, -408404,     0
##MAX=       3299.83951724647, 381842704,    0
$$ Real data points
##PAGE= N=1
##DATA TABLE= (X++(R..R)), XYDATA
$$ [...]
10867e7233l8231J358N4083q3243K6940R0368o9239K2100m3680L0180M437L806
10855e8354k177J6787M9047J0138o6817j09601O6199L0616N3856q9844J1665P5331
10843a3154K8943o8981N8807q9399K8739O3343j12501M9264p8880k4880N8590
10832a00109l255P5498o176q3435M2690N3682r3381L5066L7695q939j9037o2088
10820a31789L1426K5180M1043K7192n650j18668L6880L9116p2848O4340k6330
10809i0108p5549Q2877j248K1083J615l728M3482k4981n1975R2975r4038L8452
10797f1143k0058J10178j23116O1413M83R3916q4640J3876n7615P5801j41966
10786a32871P6830j8580k838J5445M8595o4352O1675n0698Q00j2763J4639K7874
$$ plain form
10867 -57233 -95464 -94106 -40023 -123266 -96326 -5958 -75197 -53097 -96777 -66597 -62160 -58354
10855 -58354 -60531 -43744 5303 15441 -51376 -160977 -94778 -64162 -10306 -100150 -88485 -13154
10843 -13154 15789 -53192 5615 -83784 -55045 8298 -104203 -54939 -133819 -158699 -100109
10832 -100109 -103364 -27866 -34042 -117477 -74787 -21105 -114486 -79420 -41725 -50664 -69701 -131789
10820 -131789 -100363 -75183 -34140 -6948 -12598 -131266 -94386 -55270 -128118 -63778 -90108
10809 -90108 -165657 -82780 -84028 -62945 -61330 -65058 -21576 -46557 -98532 -5557 -99595 -61143
10797 -61143 -81201 28977 -94139 -32726 -32243 61673 -22967 -9091 -66706 9095 -132871
10786 -132871 -56041 -74621 -77459 -62014 -13419 -77771 -16096 -66794 -65994 -78757 -64118 -36244
10774c6244n1383n2093O6814k2173L1157j2450p0369k2896J11555l5835L3647
10763f0270N410j0214j1168m6473J01900R8504n1524j60038O7818J9336K3833
10752b2886o3406r037K1705K8974J3666r019K1507n5084Q9073j7990j100m6224
10740d9821j7887k8362K7606M0404J3462j44061O4021Q3065n9760L2909o374q8113
10728a32911J49565J1974j37223O074N0850j8530L3947M8956L2047q1281j8192
10717e4724n4519J46847k14707k3980K04227r5764j3584M9965R9534r8224L1640
10706b3289l3081P9652j30230M5255k0256k3400J5414P0718p5924M5617l3504
10695h3028M7006M1894r9306L0360P0164k0400j00632M5055L623j6347R690k28
$$ plain form
10774 -36244 -87627 -139720 -72906 -95079 -63922 -76372 -146741 -169637 -58082 -93917 -60270
10763 -60270 -54860 -65074 -76242 -122715 -20815 77689 26165 -133873 -66055 -46719 -22886
10752 -22886 -86292 -95329 -73624 -44650 -30984 -40003 -18496 -73580 15493 -2497 -3597 -49821
10740 -49821 -67708 -96070 -68464 -28060 -14598 -158659 -94638 -11573 -71333 -38424 -44798 -132911
10728 -132911 16654 28628 -108595 -102521 -51671 -70201 -36254 12702 44749 -36532 -54724
10717 -54724 -109243 37604 -177103 -201083 3144 -92620 -106204 -56239 43295 -54929 -23289
10706 -23289 -56370 23282 -106948 -61693 -81949 -105349 -89935 -19217 -95141 -49524 -83028
10695 -83028 -36022 5872 -93434 -63074 7090 -13310 -113942 -68887 -65264 -81611 -71921 -72149
10683g2149m5775N3548L6559o6354j3026P7973p9822N7303K4267l506l3664k6809
10671i1455P1999k4800k2942k2928J7268O2430l7588k4247l7806Q0886k1064o1718
10659a11965m6245M4884O337K1423k572P4024j104r4692K7819l5977N2022K3089
10647d2957k2832O4656q6762N306O8418o9468l4887J81804j46591O7904n9701
10636g5110J9524K0605l6944l2394J19213r4845J78940j37562K3541R405m8422
10625e4049K6001m6773J07160j18835K6963L2501j7020N4089p7029n8157M4781
10614h0368L502J0609l1524O1371l3073k5335K4969Q2803k6092M059L4310o1429
10602c6198L3732m8130l5894K5245K7289O013j46662J89065j05968P0133j7011
$$ plain form
10683 -72149 -117924 -64376 -27817 -94171 -107197 -29224 -109046 -51743 -27476 -30982 -64646 -91455
10671 -91455 -19456 -44256 -67198 -90126 -72858 -10428 -48016 -72263 -110069 -29183 -50247 -111965
10659 -111965 -158210 -113326 -106989 -85566 -88138 -14114 -15218 -109910 -82091 -118068 -66046 -42957
10647 -42957 -65789 -1133 -87895 -82589 -14171 -83639 -118526 63278 -83313 -15409 -75110
10636 -75110 -55586 -34981 -71925 -104319 14894 -79951 98989 -38573 -15032 -5627 -54049
10625 -54049 -28048 -74821 32339 -86496 -59533 -27032 -44052 10037 -66992 -125149 -80368
10614 -80368 -76866 -66257 -97781 -36410 -69483 -94818 -69849 12954 -13138 -9079 25231 -36198
10602 -36198 -2466 -50596 -86490 -61245 -33956 -27943 -174605 14460 -91508 -21375 -38386
10591c8386R202M4126o8223P2593O723l1842l3027L2262O934j27136J30020m043
10579g97j12414Q970l0742O3024N9342n7034j8967q515l2538Q5336j4774J7835
10567d1274K5831m6265L5967J14106r5714P346j04778O1364p0959Q9282o4827
10556h9921M7220K1281P4119j33855o5669M6451J13713m0017j15705L1962Q228
10545a02193O9272k7388n0127R9093q9845J57845p6498l3105O8033l0387o0111
10534g5411O4060o0276M6705J6551j06898J07805j33897Q4244R024K2507J8946
10523f640n523o3641J5988L3120j11361J6523J61442m7671j12575M0567p2220
10512a51991Q4845l48k9205M4485k8203J23543l177j05683K3257M9062n1405j019
$$ plain form
10591 -38386 -29184 14942 -53281 19312 26035 -5807 -38834 -6572 362 -126774 3246 -797
10579 -797 -113211 -104241 -134983 -71959 -12617 -69651 -88618 -97133 -129671 -44335 -59109 -41274
10567 -41274 -15443 -61708 -25741 88365 -7349 -3 -104781 -43417 -114376 -25094 -89921
10556 -89921 -42701 -21420 52699 -81156 -146825 -100374 13339 -26678 -142383 -110421 -102193
10545 -102193 -32921 -60309 -110436 -11343 -101188 56657 -19841 -52946 15087 -15300 -75411
10534 -75411 -11351 -71627 -24922 -8371 -115269 -7464 -141361 -57117 -48093 -25586 -6640
10523 -6640 -12163 -75804 -59816 -26696 -138057 -121534 39908 -7763 -120338 -79771 -151991
10512 -151991 -67146 -67494 -96699 -52214 -80417 43126 39949 -65734 -42477 6585 -44820 -45839
10500d5839j5585N3606j9082p6065L7081R3667K021l9895n1531J7688J8321j6320
10488d1933r0966J01932n2858J58815j16065j7801K4932p9192n3516J36093q5400
10477a15959J7229Q9709j0444l5157J04867o9455o6511N3953L7026q6791l659
10466h5192R3211p3422M1381j31906J05376o0445J6574J42097j53941L6912R4504
10455B5149l8351N2540q5721n4737J7231M6418k4432J84949k24202P049J22403
10444B8296o5883k9672n2725J22497p3511Q2581l9877q419k2702J7564o2707R6028
10432h530j22288O0859Q1173n7521o4737P1320M5950j7943n4016O3015q8558K5815
10420f5461J7572K4761K0910K1027l0140q5060P9366m978l2319J9109o8847J0543
$$ plain form
10500 -45839 -61424 -7818 -26900 -102965 -65884 27783 29804 -10091 -61622 -43934 -25613 -41933
10488 -41933 -132899 -30967 -83825 74990 -41075 -58876 -33944 -113136 -166652 -30559 -115959
10477 -115959 -98730 -9021 -19465 -54622 50245 -19210 -85721 -31768 5258 -81533 -85192
10466 -85192 8019 -65403 -24022 -155928 -50552 -110997 -94423 47674 -106267 -69355 25149
10455 25149 -13202 39338 -46383 -101120 -83889 -37471 -61903 123046 -101156 -94107 28296
10444 28296 -37587 -67259 -119984 2513 -70998 11583 -28294 -36713 -59415 -41851 -104558 -8530
10432 -8530 -130818 -69959 11214 -46307 -111044 -39724 6226 -11717 -65733 -2718 -91276 -65461
10420 -65461 -47889 -23128 -2218 18809 -11331 -96391 -17025 -22003 -54322 -35213 -104060 -93517
10408i3517P1181l6861j3489P5494j9354K6369q4751m7473P5752L135j2666N5036
10396a144k873j29026J31968q694n8765q3749Q8373m722K5463r636K7158m9862
10384g5509M6133j8569N0085n8958l1548K8949r5454J76378j13372J4751o1137
10373a38251O9531P9986K7621j70405J10251P2572p3485o4182R8383j32205N3352
10362f6832M5184o923K7983P04k9745m7787N562J5569M6291l6593K6213j6825
10350c7199N7429q3491K0337M2903R2917j16780n6481O5636l2526K2980m5278
10339f9553P4300K8745j04026J6733o2980J32413l7026k4429l9233J5123L6826
10328c3107K7048L03O48j02627K6763k7021k4579K5960P5322M1672n4425j27199
$$ plain form
10408 -93517 -22336 -59197 -72686 2808 -16546 9823 -74928 -122401 -46649 -43514 -56180 -1144
10396 -1144 -4017 -133043 -1075 -9769 -68534 -152283 -63910 -68632 -43169 -52805 -25647 -75509
10384 -75509 -29376 -47945 2140 -56818 -88366 -59417 -154871 21507 -91865 -77114 -138251
10373 -138251 -68720 11266 38887 -131518 -21267 51305 -22180 -86362 12021 -120184 -66832
10362 -66832 -21648 -28571 -588 116 -29629 -77416 -71854 -56285 -9994 -46587 -20374 -37199
10350 -37199 20230 -63261 -42924 -21 92896 -23884 -80365 -14729 -47255 -24275 -69553
10339 -69553 4747 33492 -70534 -53801 -116781 15632 -21394 -45823 -85056 -69933 -33107
10328 -33107 -6059 -5756 -5108 -107735 -80972 -107993 -132572 -106612 -31290 10382 -44043 -171242
10316a71242K6942J27432j2230q3967R0514k899m1620J9486Q6366j04544M155
10305f1607P7218j04788J7094J7240Q7992R625k8641m197j7055m1911k6647l5694
10293a11371J22578l1960m3172j65P3390K9243k1399o8939l630j2705J5695m13
10281e2848k7063M930M9253k0787r3269J33680k0382r736k870Q7378r6054o6207
10269a13975L5375n30J1142K5090K8519K902p1085N0681R181k1389K3169j2768
10257c3688o4756R0590q9750O9404n6929M0701R6171n9242j2535K1468n6857R4210
10245C8787j84003K06882p2541q5108J14105j41330J04023j5255L0267O3060j07673
10234d8786P6811r1921j413O4252j72599N5871O5557q6677P0869p238k1788R3103
$$ plain form
10316 -171242 -144300 -16868 -29098 -113065 -22551 -25450 -67070 -47584 38782 -65762 -61607
10305 -61607 15611 -89177 -72083 -54843 33149 42774 14133 9936 -7119 -49030 -75677 -111371
10293 -111371 11207 -20753 -63925 -64090 9300 38543 17144 -51795 -55425 -68130 -52435 -52848
10281 -52848 -79911 -74981 -25728 -46515 -139784 -6104 -26486 -36222 -39092 48286 -47768 -113975
10269 -113975 -78600 -79130 -67988 -42898 -14379 -11477 -82562 -31881 -22700 -44089 -20920 -33688
10257 -33688 -98444 -7854 -97604 -28200 -85129 -44428 51743 -7499 -20034 1434 -55423 38787
10245 38787 -145216 61666 -10875 -95983 18122 -123208 -19185 -34440 -4173 58887 -48786
10234 -48786 28025 -63896 -65309 -1057 -173656 -117785 -52228 -138905 -68036 -75274 -97062 -3959
10222c959n6396M4453K400r4000J73760j16176L2399M0383j45912J67917n4879
10211a0010l5918n644N592l9319J18271r3445j0667Q2664q9921M7527M9814n4124
10199c5180n4416L9605M3361l7866P660R3169m5058l7854L162q6721Q0483j1168
10187d0823O06J508j6994m9037L6861m5269P5492L1359N8823p9131r1525R3089
10175b5041J3998n0118M5441n3431J22P5790O186n8757O201P3249m8650N085j6718
10162b6643j9604L0831j08682J60064n8270R2018p3689l1745R108r6350R4361
10151b8601P056L8830k7819P0680j17717O3350m8061O3246p7190Q802Q0383j06386
10139g3427N0282L0278M1541j37559N7847o6734J10542l1654L4341j07414J01996
$$ plain form
10222 -3959 -60355 -15902 -13502 -107502 66258 -49918 -17519 22864 -123048 44869 -10010
10211 -10010 -45928 -51572 -45980 -85299 32972 -60473 -71140 11524 -78397 -30870 18944 -35180
10199 -35180 -89596 -49991 -6630 -44496 -36836 56333 11275 -26579 -23417 -110138 -29655 -40823
10187 -40823 -40217 -38709 -55703 -104740 -67879 -113148 -37656 -6297 52526 -26605 -118130 -25041
10175 -25041 -11043 -61161 -15720 -69151 -69029 6761 12947 -45810 -39609 33640 -15010 -9925 -26643
10162 -26643 -46247 -15416 -124098 35966 -22304 69714 -3975 -35720 -26612 -122962 -28601
10151 -28601 -21545 17285 -10534 60146 -57571 5779 -42282 20964 -56226 -47424 32959 -73427
10139 -73427 -23145 7133 48674 -88885 -31038 -97772 12770 -18884 15457 -91957 10039
10128A0039l8628M1431M2590j06971O2355m3233J9945j12001M5596O3667j6051
10117c1261J36o2115K9867L5138N8961J1657r0565l0198O6681j0486L5743p5014
10105f1456J0829R079L8524M2203k0904m4211j9100P6620K2391j6716j3977j4287
10093H995l7270o8241Q4882o7488j8584L9116J21605p3169K8480m8982O0653m9973
10081a9976J3475k7982j6889N1741l7997M4548m438j20268Q1840j1704K6557K2758
10069A665p3292J61949l8415l1186M829K1531r0410R3264o1720k5261J91423j94629
10057d0252K2875n7509J48053j36382J7848P2079j3537k9400Q2815l660j34066
10046g1136Q3987P2732j5916p0610K2971o0090J39361j32996m5313O7733P4942
$$ plain form
10128 10039 -28589 12842 55432 -51539 10816 -32417 -12472 -124473 -78877 -15210 -31261
10117 -31261 -31125 -93240 -63373 -28235 30726 42383 -48182 -78380 -11699 -22185 13558 -61456
10105 -61456 -50627 -41548 -3024 39179 18275 -25936 -45036 31584 53975 37259 23282 8995
10093 8995 -28275 -96516 -11634 -79122 -97706 -58590 63015 -10154 18326 -30656 29997 -19976
10081 -19976 -6501 -34483 -51372 369 -37628 6920 2482 -117786 -35946 -47650 -21093 1665
10069 1665 -71627 90322 51907 20721 25550 47081 -43329 49935 -11785 -37046 154377 -40252
10057 -40252 -17377 -74886 73167 -63215 -45367 26712 13175 -16225 66590 62930 -71136
10046 -71136 12851 85583 69667 -943 22028 -38062 101299 -31697 -77010 -9277 65665
10035F5665m0621l6443R344K9369l8692l7151N6354l3358m9266K4915O8558j10520
10023i1846N0396L2171j5448P4489q9912J52464k13776N1920k6420N4541m0057
10012f1478L1586J8059k8223N9575l4977L5290L1182m7335J6710l4553Q9372l6770
10000C8438L2938m0484k2318k6047L5295o6946N7346K2242l8812j2290N0445q1508
9988e1701K2710P0676O2398m4519j5022m8312j4936Q9145j13548k0979L7364m0055
9976f6779K09927j13139K0160K2606j23909J05766j15726P4887l5472J07434l2240
9965E3515m5685R791j30487J14453J6206k5716K0449j5071r0920M5592N0945O6647
9953F9719q3646O9536k5060q3418J21831j03772O442L0588J2535L8137r1495n1694
$$ plain form
10035 65665 25044 -11399 -2055 27314 -11378 -48529 7825 -25533 -74799 -49884 18674 -91846
10023 -91846 -41450 -9279 -24727 49762 -40150 112314 -101462 -49542 -75962 -21421 -61478
10012 -61478 -29892 -11833 -40056 19519 -15458 19832 51014 3679 20389 -14164 75208 38438
10000 38438 71376 30892 8574 -17473 17822 -49124 8222 30464 -8348 -20638 29807 -51701
9988 -51701 -28991 41685 104083 59564 44542 -3770 -18706 70439 -43109 -64088 -26724 -66779
9976 -66779 143148 30009 50169 72775 -51134 54632 -61094 13793 -21679 85755 53515
9965 53515 7830 17621 -112866 1587 17793 -7923 12526 -2545 -93465 -47873 3072 69719
9953 69719 -13927 55609 30549 -52869 68962 -34810 -28368 2220 14755 52892 -38603 -90297
9941i0297K05442j55325R2161m8461l3159k4433k4108N0380M4250j849M3013n2107
9929E507P7800J4590j859j07972O3697j0611l2056N1089l3864j49577J82795J4927
9917G4466j44642P305P8948k7878L5505J8958j11828J61830j05374P56K4213p0429
9905e8170J41960j46761P4027k0707p8130J29351q1317J03287O601l5890p263
9894B6988q5397J3517M8938J5761M1949o4660P3431k3158j8199R360o7217N38
9882b8149J7228O4388j10777N4410j4144L5887p66L1008j1291r6360N2969M8434
9870D2837j18000N6241P7197m6398N0082l6386K0954M4098o1899j2728J5351k8685
9858B664K2019j6005j9091O9474q9186Q6046l3158m0166J5393J32732n9538j04623
$$ plain form
9941 -90297 115145 -40180 51981 3520 -29639 -54072 -78180 -27800 16450 14601 57614 5507
9929 5507 83307 97897 96038 -11934 51763 41152 9096 60185 26321 -123256 59539 74466
9917 74466 -70176 -62871 16077 -11801 23704 42662 -69166 92664 -12710 -11954 12259 -58170
9905 -58170 83790 -62971 11056 -9651 -87781 41570 -39747 63540 70141 34251 26988
9894 26988 -58409 -44892 4046 19807 61756 -2904 70527 47369 29170 38530 -28687 -28149
9882 -28149 -10921 53467 -57310 -2900 -17044 18843 18077 49085 37794 -58566 -5597 42837
9870 42837 -75163 -18922 58275 11877 61959 25573 46527 90625 28726 15998 31349 2664
9858 2664 24683 8678 -10413 59061 -30125 55921 22763 -17403 -2010 130722 71184 -33439
9846c3439J51593p5417N1156o7115m1424k0021k2601J07167k9492j35128J86098
9835G1377l5593K4600j4030j1668n500r9352J03154R9494l7473j09555L7735q6300
9823f3111Q4909P309K9062p2835O7328l0868Q1986k2017l1063j686l1941P1083
9811H8156q8202l1942L8865m97M6335l1752L6967k1596J02380l1348j91194J12541
9799B8713L596k3648p0440J10520O0063q2744n30l3340J18416p4732l395m8308
9787a5829O6465R4622q1071o4291P5526o1795j2566N231P2467P1478j62526O699
9775e590q569J7770J2352J3995n8672Q0086k3369j1598n8166P5237M9315j05568
9763b2777j5999J01202k6367J0622J9078J3390j11922Q4434j7776r60j44004J70888
$$ plain form
9846 -33439 118154 42737 93893 26778 -14646 -34667 -57268 49899 20407 -114721 71377
9835 71377 35784 60384 46354 34686 29186 -70166 32988 132482 95009 -14546 23189 -63111
9823 -63111 21798 29107 58169 -14666 52662 21794 103780 81763 50700 49014 17073 88156
9811 88156 -46 -31988 6877 6380 52715 20963 57930 36334 138714 107366 -83828 28713
9799 28713 32309 8661 -61779 48741 108804 26060 25530 -7810 110606 35874 32479 -15829
9787 -15829 50636 145258 64187 -104 75422 13627 1061 6292 78759 150237 -12289 -5590
9775 -5590 -14159 3611 15963 29958 -28714 51372 28003 16405 -41761 33476 82791 -22777
9763 -22777 -38776 62426 36059 46681 65759 79149 -32773 51661 33885 32925 -111079 59809
9751E9809m0311K3421M7850q2644R7310j00633M2289j9813l7101J24936l5598
9740G9515j34205R7478m9894Q3361n8669m330L1519N0897n7565O73K227P203j8732
9727B9478l5258J27642p8413j4810N943J4432p8963O2486O3912p7605J30762j8763
9715A30843j71768N1552P4577k5638l6273k8165R8731j3113O3215n9446o0297
9704B4218J7976o2597o3713K02747O2417q5241j2774o0037J28829l4245n4864
9693F2716O2528r8349m8289O0472R760p9171J04884j13270L0510P0914q4806j4511
9681c6612J51414j00808r7272J14969j09564R6431m4118Q349n0356M5723r1542
9670a13386Q0681j6662O7270k5613R2228r1424K9158M1638K3984K4318Q9800m7982
$$ plain form
9751 59809 19498 42919 90769 8125 105435 4802 47091 27278 -9823 115113 79515
9740 79515 -54690 42788 -7106 76255 17586 13256 44775 95672 38107 38780 41007 48210 29478
9727 29478 -5780 121862 43449 28639 34582 49014 -29949 32537 96449 18844 149606 130843
9715 130843 -40925 10627 85204 59566 23293 -4872 93859 80746 143961 84515 24218
9704 24218 42194 -20403 -84116 118631 181048 95807 83033 22996 151825 117580 62716
9693 62716 125244 26895 -21394 39078 48838 -30333 74551 -38719 -8209 62705 -22101 -36612
9681 -36612 114802 13994 -83278 31691 -77873 18558 -25560 -17211 -67567 -21844 -113386
9670 -113386 -32705 -49367 17903 -7710 84518 -6906 22252 63890 87874 112192 201992 154010
9658A54010q4859N707J25433p1718L7700L915n0863L2459j811k8933N3996p2526
9646A02510j7889m2539k5528o2585P9510J307L8695J767K1311L711N5908q7192
9634F8986L6042n890j0081N6379J47714j21387N2851P6845J6045k5806P4439j07260
9622B58877J5154P7897j08250r2891M761j13236r184M9215j13701J48111l0543
9611H6210J4108j21749M2980L7120q6066P1823q663O151n8073J01262q79n4557
9599B9667O3378k0375K9680L398N143l6138J24063r3073J2204J00674j11330n3088
9587E4203P4273M2778P519o5813K0867K416l889o177l6377M5565j07056J27562
9575A55871j34899n635m5840J26529r404L241L6405n5483q0956J56917K8040p9510
$$ plain form
9658 154010 69151 74858 200291 128573 166273 170188 119325 151784 149973 121040 175036 102510
9646 102510 84621 42082 16554 -46031 33479 34786 73481 75248 96559 100270 156178 68986
9634 68986 105028 99138 89057 145436 293150 171763 224614 301459 317504 291698 366137 258877
9622 258877 274031 351928 243678 150787 155548 42312 33128 82343 -31358 116753 86210
9611 86210 100318 -21431 21549 58669 -27397 44426 35763 41914 -16159 85103 84224 29667
9599 29667 93045 72670 102350 105748 110891 74753 198816 105743 117947 218621 107291 54203
9587 54203 128476 171254 178773 112960 133827 136243 132354 126177 89800 135365 28309 155871
9575 155871 20972 15337 -30503 96026 86622 89863 126268 70785 -10171 146746 174786 95276
9563I5276k002L1090p636Q8326j13412K3539N7077o1234m5148k890O9841J5368
9551A48195l6435l6412Q2531l1178p4036J3586J31551q6907L9956r7000J7127
9540G0978L4307j2445k1072J24179m813k34793K60925o1293j02748J77488m1075
9529A89638j11083k2470O5892Q8134j07605j4077M031N7850q1109j9684O1039
9518A10556p7333J10902n4572n1793J08086n0037M3142J0079m8977O3315j15487
9507D7881P8904l3733j6080o0707J00510O863j1495Q9088j10105K8497M4201j70559
9495f735J42895L8036J8985o8790K0103J0715k0393p4382P1220p0015J29155j07418
9483H3376K0079K4607m9149K2192n700M0841n2854l5347J08150o1194J41430j43983
$$ plain form
9563 95276 93274 124364 116728 205054 91642 115181 172258 111024 65876 62986 132827 148195
9551 148195 111760 75348 157879 126701 52665 66251 197802 110895 150851 53851 70978
9540 70978 105285 92840 71768 195947 191134 -43659 217266 155973 53225 230713 189638
9529 189638 78555 56085 121977 210111 102506 88429 92460 150310 69201 49517 110556
9518 110556 33223 144125 89553 37760 145846 95809 138951 149030 100053 163368 47881
9507 47881 126785 93052 76972 16265 116775 123638 112143 201231 91126 119623 163824 -6735
9495 -6735 136160 174196 193181 124391 144494 155209 134816 60434 131654 61639 190794 83376
9483 83376 103455 128062 78913 101105 95405 136246 83392 48045 156195 95001 236431 92448
9471I2448M0598j6569K6717L6993p7524q39J16359j03106K0102M4286q152J286
9459A72599l1141k1754J7724P9811o6529j3168j6350J4777m1432M500K1969m7963
9447G3043J3930J20097o6057L1745L2019l4137l2573K5688J1926l2554l7547k7227
9435G8353j0753J22068L2358k6896K8091K1805j40313L6454l1488L295Q645q9220
9423C2399P8300M7813L4103N753q3071m5786Q3566K7030m3722l58J7823o6738
9411H7112l5704J44183M2491j8655n7304l4374k8021J04289r3338Q5184K7274
9400B23137r0319N283j09434J25283K4926k5689J6369m564M6597j11481K6430
9389A26538J8822M79K9796k1814l5833j138k0617J08312k1220o9568L6432j7688
$$ plain form
9471 92448 133046 116477 143194 180187 102663 101824 218183 115077 135179 179465 171313 172599
9459 172599 141458 119704 137428 217239 150710 137542 121192 135969 94537 99037 121006 73043
9447 73043 86973 207070 141013 172758 204777 170640 138067 163755 175681 143127 105580 78353
9435 78353 67600 189668 222026 195130 223221 245026 104713 141167 109679 112974 121619 32399
9423 32399 110699 158512 192615 198368 115297 69511 153077 180107 136385 136027 153850 87112
9411 87112 51408 195591 238082 219427 162123 127749 99728 204017 110679 195863 223137
9400 223137 132818 138101 28667 153950 178876 153187 169556 164992 211589 100108 126538
9389 126538 145360 145839 175635 153821 117988 116850 96233 204545 183325 113757 150189 132501
9377A32501J07347m7277M932r8487J35150j78610P7842J22998l4186o6748K6464
9366A81926L9362j20131L7593Q9064j11854K5834m9845P1265J19619j19005l7739
9355A26089k9630N6104J6935M9638n4876K7772M3798K7673q0406J794q800n4872
9343A21219k8345J42339m9001j6878p4542J23832m075m2674R7619j42210L399
9332A30683L4089O4533j10430L1466J7593L5051r2194J56145n3042o0960P1661
9321B24595q5375M5993L847k7892O381L8502n1284K2220q1279J33003k3398j7401
9309A87912l8758K3042J2217K7510o8802J0622J07481J7697j24340P9522l2386
9298B01717M2482Q7941q4054j17580N7057m940R7173k5119N620r5602P0270l5556
$$ plain form
9377 132501 239848 192571 197503 99016 234166 55556 133398 256396 222210 155462 181926
9366 181926 221288 101157 138750 227814 115960 141794 91949 163214 282833 163828 126089
9355 126089 96459 152563 169498 219136 164260 192032 235830 263503 183097 184891 176091 121219
9343 121219 92874 235213 186212 169334 94792 218624 214549 171875 269494 127284 130683
9332 130683 164772 229305 118875 150341 167934 202985 110791 266936 213894 152934 224595
9321 224595 139220 185213 189060 161168 167549 206051 154767 176987 95708 228711 205313 187912
9309 187912 149154 172196 184413 211923 143121 153743 261224 278921 154581 234103 201717
9298 201717 244199 332140 248086 130506 187563 182623 279796 254677 260297 164695 234965 199409
9286A99409j0516M1064o7998L4015n674L1904J7211n467m6700m0292p3621Q2828
9274A56163J11909j51253J08334k7650P5551p0530P8312l8433n3843K8098M6445
9263B63103p5290j4776P0498o0956m857J9446O8533j7447l3308P845k2953L5784
9251B35622J1177P1344k9690p742j24416K246J68084j10467j5285l6797J02237
9240B66313N2912r7514Q14q7092M5551j0196K6601N9869n6293K9014J2561J2683
9228B55223q9337L6151L8826R2949j04546N5943J6492r4322O1916j04827J6719
9217A81187O827P6194k9627M0669l2142k8477Q4610n3725Q5834n7243j45234J27157
9205B56030K7596r2990O6085r7755O7523l6130m9028R7930N890M3009r5846M8605
$$ plain form
9286 199409 188893 229957 161959 195974 190300 222204 239415 233948 187248 146956 73335 156163
9274 156163 268072 116819 225153 197503 273054 202524 280836 242403 188560 216658 263103
9263 263103 187813 173037 243535 182579 177722 197168 265701 248254 214946 222791 199838 235622
9251 235622 246799 318143 288453 280711 156295 158541 326625 216158 200873 164076 266313
9240 266313 319225 221711 222525 135433 180984 170788 197389 257258 200965 229979 242540 255223
9228 255223 165886 202037 240863 333812 229266 285209 301701 207379 269295 164468 181187
9217 181187 188014 264208 234581 275250 243108 214631 299241 245516 331350 274107 128873 256030
9205 256030 283626 190636 256721 158966 226489 190359 141331 239261 245151 288160 192314 240919
9193B40919l1379R0553M1585j91313J09991j14560J61645q7525O1369p4793L3037
9182B39529j9273J33116r3067r8136J0932M1753J50386K1287l8687j06048o4011
9171A77781P3656Q862n768Q3558K6238q5917l1818P6787j48481J19179p0914K6046
9159B49209O6564q1730P1262l3241q7833L3081N5564k2554J38607m9796j54607
9148A84526J82912n614q2367N1853j06160O6316l151K4489m0376j1130K6410k506
9136B85202J7291p233l9634M3461J3530k0603k9752P4442p4459K7321Q0338k3045
9124C46859k9388j23603R8671K7766j23827R4725p3252K29078j55379J06945q9587
9113C09008l2645n1808P3041P8670j01962M577Q0296m0271P5339p8476K2718n5503
$$ plain form
9193 240919 209540 300093 341678 150365 260356 145796 307441 219916 281285 206492 239529
9182 239529 220256 353372 260305 162169 173101 214854 365240 386527 347840 241792 177781
9171 177781 251437 260299 254531 338089 364327 278410 246592 323379 174898 294077 223163 249209
9159 249209 315773 234043 305305 272064 184231 217312 272876 250322 388929 339133 184526
9148 184526 367438 361824 279457 331310 225150 291466 288315 312804 272428 261298 287708 285202
9136 285202 302493 295260 255626 299087 312617 292014 262262 336704 262245 289566 369904 346859
9124 346859 317471 193868 292539 320305 196478 291203 217951 447029 291650 398595 309008
9113 309008 276363 224555 297596 376266 274304 278881 359177 318906 394245 315769 338487 282984
9101B82984J9867J03771r8855m8860K4097J13288p6301K1725n928q5465L3448
9090B83771m7127Q6123K572k5132P023Q0088q0180Q7914r4403P3893o4411n3489
9078B56642l1045J53806o6492q142K2493m5418O3455k3815o645M3453o6799P5483
9066C66976l3838o1747J28151j21468P2131M7281m7429l0450j22962J93068l4300
9055C55413p678j1616J9220o5589K257J18309q9108J265J8609k5322m8616J47665
9043D14809o7404n5761M7954L7694q7189J05042N007m3140j20787J34554p0607
9032C00172P178j3079J19076p6933N6349l8746Q9652j73209J03697M4550k8738
9021C89969L8365j45292J05353j9216K8182l7393M1861p4238O1557m8206J4801
$$ plain form
9101 282984 302851 406622 307767 258907 283004 396292 319991 341716 335788 250323 283771
9090 283771 236644 322767 325339 300207 307230 387318 307138 395052 300649 374542 310131 256642
9078 256642 225597 379403 312911 304769 327262 281844 345299 321484 314839 358292 291493 366976
9066 366976 333138 271391 399542 278074 350205 397486 350057 319607 196645 389713 355413
9055 355413 347735 336119 355339 289750 292007 410316 321208 322473 341082 315760 267144 414809
9043 414809 347405 291644 339598 377292 290103 395145 400152 357012 236225 370779 300172
9032 300172 307350 294271 413347 336414 392763 354017 443669 270460 374157 418707 389969
9021 389969 428334 283042 388395 369179 397361 359968 401829 327591 389148 340942 355743
9010C55743Q0101k5240l1072K6021p2806N2007l6983O2859j1678l5390l2619N8034
8998C88977m23M4475J2519j8216o6001Q9738M9268q6358K1678r2216O1972j4096
8986C91317n4221M6860j4988M3783J4010m1952J7583o1441P3703o9952L1840n4646
8974C21896Q9425M4152o8972L7202N1241j39546M3932K3972N5142p522p192k6734
8962D16996l6087J33827r6616L0829j24119J69722p940j5734p3291N0440J8840
8951D66867j19158J47892p0915M3940L5882j08850N9673j2764o4821M9567Q6338
8940E13651j15373K6075L4008j5754m4272j1983N3552O9933l4791k8172o2524
8929C84350P4204p4858J8547R0194L3329J6864o9263O697m1482l4756J26802j52308
$$ plain form
9010 355743 435844 410604 379532 405553 332747 384754 347771 410630 398952 363562 330943 388977
8998 388977 388554 433029 445548 427332 361331 451069 500337 413979 435657 343441 405413 391317
8986 391317 337096 383956 368968 412751 426761 384809 402392 340951 414654 344702 376542 321896
8974 321896 411321 455473 386501 423703 474944 335398 379330 403302 458444 450922 443730 416996
8962 416996 380909 514736 418120 448949 324830 494552 486612 470878 397587 448027 466867
8951 466867 347709 495601 424686 468626 504508 395658 455331 442567 377746 427313 513651
8940 513651 398278 424353 458361 442607 398335 386352 439904 509837 475046 446874 384350
8929 384350 458554 383696 402243 492437 525766 542630 473367 480064 438582 403826 530628 378320
8917C78320J16918J9373j31793O2395R8725N3442o1559q5167n3494Q8619k726
8906D83053l9765J75413j76437L9197j01627Q9536K2438J03551j67666J00691
8896E28384o4304J24827n5935l005Q9177o4798o5741K9425N9665j2350J6036l4706
8884E46675Q247m976L474r764O8922l8640l8464P8389K398j11954N6816q6083
8872D75040M2892P1989q5782J12752j73188J42015n817K883M2817K8041j05937
8861E47705Q4787j15404Q3502L9263m9075K1696j12345J34949m2648K4079k970
8850F13539M347K4205n3584l1361r604J97999j76257Q9543m7464O0393L0795k8002
8838F74549n1424N4082j01679J55486j32055P9240p3741J3281K0760N0640k901
$$ plain form
8917 378320 495238 514611 382818 445213 543938 597380 535821 450654 397160 485779 483053
8906 483053 443288 618701 442264 481461 379834 469370 491808 595359 427693 528384
8896 528384 464080 588907 532972 529967 619144 554346 488605 518030 577695 565345 581381 546675
8884 546675 554922 549946 553420 543656 612578 573938 535474 613863 616261 504307 561123 475040
8872 475040 517932 589921 504139 616891 443703 585718 579901 582784 625601 653642 547705
8861 547705 632492 517088 600590 639853 590778 612474 500129 635078 592430 616509 613539
8850 613539 617886 642091 588507 557146 547542 745541 569284 658827 611363 671756 702551 674549
8838 674549 623125 677207 575528 731014 598959 678199 604458 617739 638499 689139 686238
8827F86238j03853M8199R5963j52677P4144N2990M0376L6131j57702J05644m5978
8816F79475J8901Q0922l6354N642j07337Q4066M6020o7077K4429P1133m9245j3133
8804G37442J0410Q830q161M2014k2871K8794j0046L2482J16914j62566J11049
8793H84291j06942M9891K0811j7201K0882O9161k05564O0255J03002o2712L4508
8782H50382j44K4160n0815N9505P103o665j3437n7129k5138J17551K7967P1002
8770A004342j38818K5208o4111J83289j08421O6686k2645o0903J9960J02523k1075
8759I86035q968j9545n6665O0733r0802K9709n0417P9872J21915j10574L4525
8748I75818o8870K6264r767M9799l0132J596J7359k0627L0966m2858L7206l115
$$ plain form
8827 686238 582385 630584 726547 573870 648014 701004 741380 777511 619809 725453 679475
8816 679475 698376 779298 742944 748586 641249 725315 771335 704258 728687 799820 750575 737442
8804 737442 747852 756682 748521 790535 767664 796458 786412 818894 935808 773242 884291
8793 884291 777349 827240 848051 830850 851732 920893 715329 775584 878586 815874 850382
8782 850382 850238 874398 823583 883088 890191 883526 870089 812960 787822 905373 933340 1004342
8770 1004342 865524 890732 826621 1009910 901489 968175 945530 884627 904587 1007110 986035
8759 986035 977067 957522 900857 961590 870788 900497 850080 929952 1051867 941293 975818
8748 975818 906948 933212 923445 973244 943112 944708 962067 941440 972406 929548 966754 963639
8736I63639M3591j01003Q2118j1059K9035o4646L2677m7605M3117J01956J0635
8725A082455j02576N7059m4504L8693m9476P6435j03789R3315P893p5603J27271
8714A107173n8660Q900j07724J25897L4602k2577q1664P3636k524o7355O1239
8703A070943k2615R4707R0234j18659j9234j638p898N6600n1611j1757P4256j15433
8691A037895K15829j08644j1388M4865K0683o2350L3296L9394j5211O178j6835
8680A183712j18296K38473r5884K2370J4994P2300o6962P5822r5415M5381K6160
8669A302655j7964K1127l262Q4615j00785m7599K078N3142L4787k3647J80154
8658A485301j60710J2640K7265l5599M9564K0573o1525O8387N321n6336M4353
$$ plain form
8736 963639 1007230 906227 988345 977286 1006321 941675 974352 926747 969864 1071820 1082455
8725 1082455 979879 1036938 992434 1031127 981651 1058086 954297 1047612 1055505 979902 1107173
8714 1107173 1048513 1057413 949689 1075586 1110188 1087611 1005947 1079583 1077059 1009704 1070943
8703 1070943 1048328 1143035 1233269 1114610 1095376 1093738 1085840 1142440 1090829 1079072 1153328 1037895
8691 1037895 1253724 1145080 1133692 1178557 1199240 1136890 1170186 1209580 1194369 1200547 1183712
8680 1183712 1065416 1303889 1208005 1230375 1245369 1317669 1250707 1326529 1231114 1276495 1302655
8669 1302655 1284691 1305818 1302556 1387171 1286386 1238787 1240865 1294007 1328794 1305147 1485301
8658 1485301 1324591 1337231 1364496 1328897 1378461 1399034 1337509 1405896 1411217 1354881 1399234
8647A399234N2123L7562j62324J62877j5806J5971N9498n3725n4971J12003p7319
8636A475123L0517M0299n8305P1684K5125k8974p4957J83976N585n5232N921L7351
8624A658113J3406m2632J20675o2797J42614n1411o6422j8049J68825j20059R3320
8613A835583n4370l5751J06942q5420L0207J27424j4142J8870n4544J40042p9891
8602A934950k6038J16769J2883j19670J23071N309m8344J03726N2470o1861M2420
8591B135685K199P159n61L9330p582Q246J4242J65763j23303J32583K1131j9951
8579B374941Q6978Q6781r876N616P8718j02085J40938n3772K2830J69290j26580
8568B673779J00997Q1823j8304K20654j10970n6724J01873O7590J11833J01131
$$ plain form
8647 1399234 1451357 1488919 1326595 1489472 1473666 1489637 1549135 1495410 1440439 1552442 1475123
8636 1475123 1505640 1545939 1487634 1559318 1584443 1555469 1480512 1664488 1670073 1614841 1620762 1658113
8624 1658113 1671519 1628887 1749562 1686765 1829379 1777968 1711546 1693497 1862322 1742263 1835583
8613 1835583 1781213 1745462 1852404 1766984 1797191 1924615 1910473 1929343 1874799 2014841 1934950
8602 1934950 1908912 2025681 2038564 1918894 2041965 2047274 1998930 2102656 2155126 2093265 2135685
8591 2135685 2137884 2145043 2144482 2183812 2176230 2184476 2198718 2364481 2241178 2373761 2394892 2374941
8579 2374941 2461919 2548700 2538824 2544440 2623158 2521073 2662011 2608239 2631069 2800359 2673779
8568 2673779 2774776 2856599 2838295 3058949 2947979 2891255 2993128 3060718 3172551 3273682
8558C273682K4760R25K16992m0844J67500P3981M6304Q320J05082J20978P1295
8547D068975J51884R4334M0833J71426Q7862J28919J26863N7843J11398J21311
8537E161648J70420J07850P7740J02818P3393J14618J21151M41663N8826K77639
8527F707766O9037K70416J29280K32990K69751K36054J54674K86834L02135K75392
8517H934329M09469M60613L48770K80447L09908K07550K24288M48319K76454L63246
8507A2263393N58519M63793K48270M53289O07602O47959N47686M93405M80334
8498A6764250M10881L38005K91278J03152K44308L81482M04620L74959M17595
8489A9730530N52547O09294Q02611P02539O17890P09763O07190O75120Q79150
$$ plain form
8558 3273682 3298442 3299367 3516359 3475515 3643015 3716996 3763300 3771620 3876702 3997680 4068975
8547 4068975 4220859 4315193 4356026 4527452 4615314 4744233 4871096 4928939 5040337 5161648
8537 5161648 5332068 5439918 5517658 5620476 5693869 5808487 5929638 6371301 6430127 6707766
8527 6707766 6776803 7047219 7176499 7409489 7679240 7915294 8069968 8356802 8658937 8934329
8517 8934329 9343798 9804411 10153181 10433628 10743536 10951086 11175374 11623693 11900147 12263393
8507 12263393 12821912 13285705 13533975 13987264 14594866 15242825 15790511 16283916 16764250
8498 16764250 17175131 17513136 17804414 17907566 18151874 18533356 18937976 19312935 19730530
8489 19730530 20283077 20892371 21694982 22397521 23015411 23725174 24332364 25007484 25886634
8480B5886634J021247J138770J128047J338796J385257M46398N04587M15072J99276
8471C3464084m11723m82422j87671m70361m81697l93089o0018l4532l2566M29721
8461C1339726L42643L16689l2885M75169N91432j30470k64550m35580o64024m53158
8451C1084992o66553o82659q41194p45601o09429l96009m16391k53514l43228
8442B6130414k11097N9744k37558j75872k73406j12110n6461q1236j49383p6410
8432B4816625m92196m08224l46905l70800n23388j07050k62593k74388l69167
8423B1661914m49372n03319m85848l69382l69281k84393l47463j17019k24404
8414A8511433j92450k94400j63875l68036J3350k68854j60571j42070k28745j31113
$$ plain form
8480 25886634 26907881 28046651 29174698 30513494 31898751 32345149 32849736 33264808 33464084
8471 33464084 33052361 32569939 32382268 31911907 31430210 31037121 30977103 30942571 30910005 31339726
8461 31339726 31682369 31999058 31966173 32441342 33032774 32902304 32637754 32202174 31538150 31084992
8451 31084992 30418439 29735780 28894586 28148985 27539556 27143547 26727156 26473642 26130414
8442 26130414 25919317 25979061 25741503 25565631 25292225 25180115 25123654 25042418 24893035 24816625
8432 24816625 24324429 23916205 23569300 23198500 22675112 22568062 22305469 22031081 21661914
8423 21661914 21212542 20709223 20223375 19853993 19484712 19200319 18852856 18735837 18511433
8414 18511433 18318983 18024583 17860708 17492672 17506022 17237168 17076597 16934527 16705782 16574669
8404A6574669o3481r2407j52501j43214k05252n5908j37960N301j30637q2409
8394A5516201q3602o1967j15635p0728k29528l8488P9213r5425j08191m0139r457
8383A4742254j89509m475p7285J8613k6249q2156j66257k7148q9327q849j23679
8372A3965933J02626r5076m3010K0721p6625j21092k4749K9219j07362m387j536
8361A3644662n2776K1825n2462j84662L8444l7412j3752n7501j6079m849m7962
8350A3237476K8619q5596J7133m9830q8181p1217L9718R5594j41698l7250Q2235
8339A3027003j16128K1451j55581N4923j8296M9987l9037j48780L8064Q2456p4678
8328A2721384j5094r665m5372o0198J19331o239p6579m9418K12j602j63016J08933
$$ plain form
8404 16574669 16511188 16418781 16266280 16123066 15917814 15861906 15723946 15729247 15598610 15516201
8394 15516201 15432599 15370632 15254997 15184269 14954741 14916253 14995466 14900041 14791850 14751711 14742254
8383 14742254 14552745 14548270 14470985 14489598 14463349 14381193 14214936 14187788 14098461 14089612 13965933
8372 13965933 14068559 13973483 13930473 13951194 13874569 13753477 13728728 13757947 13650585 13646198 13644662
8361 13644662 13591886 13613711 13561249 13376587 13415031 13377619 13363867 13306366 13290287 13285438 13237476
8350 13237476 13266095 13180499 13197632 13147802 13059621 12988404 13028122 13123716 12982018 12944768 13027003
8339 13027003 12910875 12932326 12776745 12831668 12813372 12863359 12824322 12675542 12713606 12796062 12721384
8328 12721384 12706290 12696625 12651253 12591055 12710386 12704147 12627568 12578150 12578362 12576760 12413744 12522677
8316A2522677r1927n958Q0738k1768m343q228n9141k1737k5450M8402o2059Q7044
8304A2438250j00774N9261j1618l9624J7291p409k541n1704J9048j0219J19072
8293A2429033r1220m2033m5516L0880J7533o7238L0148N345j9597m4329Q6435
8282A2289441p6853O907M9888k7165l0034k7980J3429k824k6529L1281Q4767j84738
8270A2099590J18057q6057k4421J29791r8554q6058J32333j16509J13748n9899
8260A2122021N2648j17218R7008j5670P7558M3547l1806j74816M7782M6518m8430
8249A2099142P0245Q9358q9709J3529j3078N9335o8243P0304j07600Q6340q3620
8238A2126003J16038r5430Q0556m1084o635p8165J50695p4602Q0536j33318R2602
$$ plain form
8316 12522677 12430750 12424792 12505530 12483762 12479419 12471191 12412050 12390313 12364863 12413265 12351206 12438250
8304 12438250 12337476 12396737 12385119 12345495 12362786 12355377 12352836 12301132 12320180 12309961 12429033
8293 12429033 12337813 12295780 12250264 12281144 12298677 12231439 12261587 12266932 12247335 12203006 12289441
8282 12289441 12212588 12219495 12269383 12242218 12212184 12184204 12197633 12194809 12168280 12199561 12284328 12099590
8270 12099590 12217647 12131590 12107169 12236960 12138406 12052348 12184681 12068172 12181920 12122021
8260 12122021 12174669 12057451 12154459 12138789 12216347 12259894 12228088 12053272 12101054 12147572 12099142
8249 12099142 12169387 12258745 12169036 12182565 12169487 12228822 12160579 12230883 12123283 12209623 12126003
8238 12126003 12242041 12146611 12227167 12186083 12179448 12101283 12251978 12177376 12257912 12124594 12217196
8227A2217196k6113m8855J45405k6595m4412L2603O7305l669r2245J20190l0578
8216A2310232k4977L3677M3905q7782O2545J13484J4722j18485J34772o2257P2146
8205A2491982p4550J31307m9303J07062p8375L590K7193k8110R0436P4171Q1182
8194A2776585j24010L4359K80366m61198L45793j23450o4235O6091L6585j2375
8184A2754511J25386q5861J07680m4344J50805r4988R0390m6273j892R0367P3201
8173A3118982n8027j2842Q1730k0344Q9793n1225J37320p8671K8838J28234q5765
8162A3278023L158O9269M0851M8127p569L9381J32037j21520K07717l3723m493
8151A3651258K7215j852j6452J3683k3034J26192l0230L5811P3853r1580k672
$$ plain form
8227 12217196 12191083 12142228 12287633 12261038 12216626 12249229 12316534 12312865 12220620 12340810 12310232
8216 12310232 12285255 12318932 12362837 12275055 12337600 12451084 12465806 12347321 12482093 12419836 12491982
8205 12491982 12417432 12548739 12499436 12606498 12528123 12531713 12558906 12530796 12621232 12695403 12776585
8194 12776585 12652575 12686934 12967300 12506102 12851895 12728445 12664210 12730301 12766886 12754511
8184 12754511 12879897 12794036 12901716 12857372 13008177 12913189 13003579 12957306 12955414 13045781 13118982
8173 13118982 13060955 13048113 13129843 13109499 13199292 13148067 13285387 13206716 13235554 13363788 13278023
8162 13278023 13281181 13350450 13391301 13439428 13431859 13471240 13603277 13481757 13689474 13655751 13651258
8151 13651258 13678473 13676621 13660169 13673852 13650818 13777010 13746780 13782591 13856444 13764864 13762192
8140A3762192J6944R8015K9986q7086n9244L8272J09886J36773j57547n3745J24872
8129A3959318m8011q367J46476p0649m7057Q1928J44285K2249j78509J28344O7567
8118A4197574p6386J03719O1015j3346O058j6405J31380l686j7793R675j7906
8107A4363899J44329N9365N5826p2289P7843O4350R3274O709N3164O1812P8840
8096A4987122k1583M2915o0765J85640o0743K9202P3890M9719K4438J11300J08818
8085A5469953m002K7194R2164m208o9064J96186O0153M7791R1819r8674M0200
8074A5849512J27846o9761M9830J26301J826J16953N2435N2283J38801L9968j32389
8063A6353605J16255Q6931K9369O2447J13613O7303P3954Q4869J14780M8997j8149
$$ plain form
8140 13762192 13779136 13877151 13907137 13820051 13760807 13799079 13908965 14045738 13888191 13834446 13959318
8129 13959318 13911307 13902940 14049416 13978767 13931710 14013638 14157923 14180172 14001663 14130007 14197574
8118 14197574 14121188 14224907 14285922 14272576 14278634 14262229 14393609 14389923 14372130 14381805 14363899
8107 14363899 14508228 14567593 14623419 14551130 14628973 14693323 14786597 14793306 14846470 14908282 14987122
8096 14987122 14965539 15008454 14947689 15133329 15072586 15101788 15175678 15225397 15249835 15361135 15469953
8085 15469953 15465951 15493145 15585309 15581101 15512037 15708223 15768376 15816167 15907986 15809312 15849512
8074 15849512 15977358 15907597 15957427 16083728 16085554 16202507 16254942 16307225 16446026 16485994 16353605
8063 16353605 16469860 16556791 16586160 16648607 16762220 16829523 16903477 16988346 17103126 17152123 17133974
8052A7133974J63555Q179K90235j3885J73333J10212L3090Q1249j133P7475P4738
8041A8131022J15736O8670L0559j193J33988M1431J75680O7509J18782M4025J37276
8030A9063485j01224J90852J03283K3496J21970K771J43884O5809J67599O5715
8020A9847640J25587K5504O9425L4048R4426Q1094M5202O6699j3348J12792J7751
8009B0506820N5966j0168J72262k3281J41444J54115j7198M9489M4850J20886
7999B1195185J31961N1675r2119J76564R1511J72853O2409J14746k2944M9690
7989B1931531J31059J00163j5544J12706J02825K1768J53198L5559N7106j6771
7979B2613600L06985q9159K93029J02076J51187k5962J11321J05849Q8300J17356
$$ plain form
8052 17133974 17297529 17305708 17595943 17582058 17755391 17865603 17898693 17979942 17978809 18056284 18131022
8041 18131022 18246758 18315428 18345987 18344794 18478782 18520213 18695893 18763402 18882184 18926209 19063485
8030 19063485 18962261 19153113 19256396 19279892 19401862 19404633 19548517 19614326 19781925 19847640
8020 19847640 19973227 19998731 20068156 20102204 20196630 20277724 20322926 20389625 20376277 20489069 20506820
8009 20506820 20562786 20552618 20724880 20701599 20843043 20997158 20979960 21029449 21074299 21195185
7999 21195185 21327146 21378821 21286702 21463266 21554777 21727630 21790039 21904785 21881841 21931531
7989 21931531 22062590 22162753 22147209 22259915 22362740 22384508 22537706 22573265 22630371 22613600
7979 22613600 22920585 22831426 23124455 23226531 23377718 23351756 23463077 23568926 23657226 23774582
7969B3774582J11883J97332J14575L4402K46478L908J84874Q6849J74850J13780
7959B5043513J75079K42331Q3927J49461K36953n16K33250r9243j78245m0036
7949B5846474o3477m924m5225o9881L8833O7078j9843Q682P7202l3954J7350N6555
7937B5874870N830L7364J40242M4545Q3311L4283R6447O7486J34820m267m994
7926B6509937J68055N7638L6794J8462Q1955O7454o30R5650R2041R2417P3686
7915B7293459m264J77727n7437J63828M6876O3543J52445N5567j06119J80040
7905B7965665O6926j0386J80924L7374J34329M6472J97830J08008O4299J53416
7895B8944857J03052Q322J37428P136J70975l0854J62414M1318M1226K01361J17504
$$ plain form
7969 23774582 23886465 24083797 24198372 24232774 24479252 24483160 24668034 24754883 24929733 25043513
7959 25043513 25218592 25460923 25544850 25694311 25931264 25930748 26163998 26064755 25886510 25846474
7949 25846474 25782997 25778073 25732848 25662967 25701800 25768878 25749035 25757717 25834919 25800965 25818315 25874870
7937 25874870 25880700 25918064 26058306 26102851 26186162 26220445 26316892 26384378 26519198 26514931 26509937
7926 26509937 26677992 26735630 26772424 26790886 26872841 26940295 26939665 27035315 27127356 27219773 27293459
7915 27293459 27289195 27466922 27409485 27573313 27620189 27683732 27836177 27891744 27785625 27965665
7905 27965665 28032591 28022205 28203129 28240503 28374832 28421304 28619134 28727142 28791441 28944857
7895 28944857 29047909 29056231 29193659 29200795 29371770 29340916 29503330 29544648 29585874 29787235 29904739
7884B9904739K4239J36750J91992Q2136R0021J87422o3474J39119K46158N5000
7874C0994102R1523J42611J00438J41621J17255J16624K17051J04304J98538N2225
7864C2276292J54906K15664P4668J69901J57307Q4713K41400k3686K76886J26067
7854C3754118K84800L22095r9167L6546J23220J93337J10137R0575K29705J05619
7844C5150985J48009N8061N7258K85218J01491J07718K49234R7630J72512K26930
7834C6655046R4770K15484J43000J26575J90970K39921K03896J31957J90347K89132
7824C8481098J86416K25914K65904J37006K88994K64629J23731L02711K33465
7815D0509868K13319K34621L23456J43897M11466K00023L07016J74050K90669
$$ plain form
7884 29904739 29928978 30065728 30257720 30339856 30429877 30617299 30553825 30692944 30939102 30994102
7874 30994102 31085625 31228236 31328674 31470295 31587550 31704174 31921225 32025529 32224067 32276292
7864 32276292 32431198 32646862 32721530 32891431 33048738 33133451 33374851 33351165 33628051 33754118
7854 33754118 34038918 34361013 34261846 34298392 34421612 34614949 34725086 34815661 35045366 35150985
7844 35150985 35298994 35357055 35414313 35699531 35801022 35908740 36157974 36255604 36428116 36655046
7834 36655046 36749816 36965300 37108300 37234875 37425845 37665766 37869662 38001619 38191966 38481098
7824 38481098 38667514 38893428 39159332 39296338 39585332 39849961 39973692 40276403 40509868
7815 40509868 40723187 40957808 41281264 41425161 41836627 42036650 42343666 42517716 42808385
7806D2808385J15044M04795J95122L89953K65956L06805L92035M19611K27368
7797D5525074M32437M46058L19626L40426L97766K36315L74924L36529L10939
7788D8720094L87752N17470M29983M90183N53150M51833M62815M27583M77825
7779E2918688M88660P44891N96839P42033O97872O41041O87789P58976N14320
7770E8791109O15126P63400O99565P96841P61382Q41079Q32926R70572J054418
7761F6126418R40910Q28324J266940J199066J226768J235752J611330J311579
7753G5747087J759626J691905J964437J983308K057159J991137K004862K331552
7745I1531073K521975K817034K860231L324731L689967M267829L697936L374575
$$ plain form
7806 42808385 42923429 43328224 43523346 43913299 44179255 44486060 44878095 45297706 45525074
7797 45525074 45957511 46403569 46723195 47063621 47461387 47697702 48072626 48409155 48720094
7788 48720094 49107846 49625316 50055299 50545482 51098632 51550465 52013280 52440863 52918688
7779 52918688 53407348 54152239 54749078 55491111 56188983 56830024 57517813 58276789 58791109
7770 58791109 59406235 60169635 60869200 61666041 62427423 63268502 64101428 65072000 66126418
7761 66126418 67067328 67895652 69162592 70361658 71588426 72824178 74435508 75747087
7753 75747087 77506713 79198618 81163055 83146363 85203522 87194659 89199521 91531073
7745 91531073 94053048 96870082 99730313 103055044 106745011 111012840 114710776 118085351
7737A18085351L577478M003371M465218N178741O504886O848503M986061K291604
7729A55941213K610418K909417L625841M632240N348584N871228O814130P509325
7721A95262396Q496535J0940798J3338953J7945171K0025880J3777045J4542143
7714B94328921J8221874K6145164L4540224Q606521p96951p865971l0159474k3097908
7706C19922400j5798998j3512784j1824705j0187697q995285o756060p775125
7699B45071746j1067613j6253070j7818270j4822138j6218678j4616258j1500697
7692A42775022r500936q862142q499389o506064o206896m514324m299098m224938
7684I0161235k875602j0315041r325919o339053n236451m661451l863833l225528
$$ plain form
7737 118085351 121662829 125666200 130131418 135310159 141815045 148663548 153649609 155941213
7729 155941213 158551631 161461048 165086889 169719129 175067713 180938941 187753071 195262396
7721 195262396 203758931 214699729 228038682 245983853 266009733 279786778 294328921
7714 294328921 312550795 338695959 373236183 381842704 381045753 373179782 343020308 319922400
7706 319922400 304123402 290610618 278785913 268598216 259602931 252846871 245071746
7699 245071746 234004133 217751063 199932793 185110655 168891977 154275719 142775022
7692 142775022 133274086 124411944 115912555 109406491 103199595 98685271 94386173 90161235
7684 90161235 87285633 76970592 67644673 61305620 56069169 51407718 47543885 44318357
7676D4318357k790908k926088k460115k248649j889042j836260j648162j531149
7668B6987984j285176j301348j100242j027522j014036j021618r28884q05291
7660A8503867r32691o21318p71609m98694o51092o61819m77273n93161m46545
7651A2849665n51582m96505m22589l23733n15633j90543l78544l26483l45714
7642I298339j68245l33311j65509l10820k00015k58094k06183j28489k51059j90063
7632G086551k77961j98637j24071r4218k46060Q020j64309j26331j09546j27945
7622E625493k6000k35813o9226j03780j07069j51169j02209k95994m2362l2182
7612D459689k51027q7808q0651R4345k93096j0850j48439j61209k9943r9618K386
$$ plain form
7676 44318357 41527449 38601361 36141246 33892597 32003555 30167295 28519133 26987984
7668 26987984 25702808 24401460 23301218 22273696 21259660 20238042 19309158 18503867
7660 18503867 17571176 16949858 16178249 15679555 15028463 14366644 13889371 13296210 12849665
7651 12849665 12298083 11801578 11378989 11055256 10539623 10349080 9970536 9644053 9298339
7642 9298339 9130094 8796783 8631274 8320454 8120439 7862345 7656162 7527673 7276614 7086551
7632 7086551 6808590 6609953 6485882 6391664 6145604 6153624 5989315 5862984 5753438 5625493
7622 5625493 5599493 5363680 5294454 5190674 5083605 4932436 4830227 4534233 4491871 4459689
7612 4459689 4208662 4120854 4040203 4134548 3841452 3830602 3682163 3520954 3491011 3391393 3393779
7601C393779j91519j13554q1594l393k9832j39810o8608j00258j34117O8107p0367
7590B528834j10711j0625q574n7760j17786j7361m959p9080p7628O2822j75922
7579A931250j6094m2567k8747q8598k1425Q8157j72837k8893m8079K9156j55528
7568A445795M7830o6121p5252Q1915k7677r0286l708n6899L6741j02515j13662
7557A076161R0968k6290l1245n6025m3401k3316J0738m7619L2191L2059j43779
7546H70442M5629p1951l2172R796j3410p9227J8885p675j835m8423O0616j00297
7534F50378q10M6179l9919j01876J04499q5395O0465m2835n4318J04841p9007
7523E62202R662J9424j25488M7676J560q5408J07359n8957K4175o6533O6695J979
$$ plain form
7601 3393779 3202260 3088706 3007112 3003719 2973887 2834077 2765469 2665211 2531094 2599201 2528834
7590 2528834 2418123 2407498 2398924 2341164 2223378 2206017 2201058 2121978 2044350 2107172 1931250
7579 1931250 1915156 1872589 1843842 1755244 1733819 1821976 1649139 1620246 1572167 1601323 1445795
7568 1445795 1493625 1427504 1352252 1434167 1406490 1316204 1312496 1255597 1292338 1189823 1076161
7557 1076161 1167129 1140839 1109594 1053569 1010168 986852 997590 949971 982162 1014221 870442
7546 870442 916071 844120 811948 821744 808334 729107 747992 740317 738482 690059 750675 650378
7534 650378 649568 695747 655828 553952 658451 573056 633521 590686 536368 641209 562202
7523 562202 571864 591288 465800 513476 515036 429628 536987 478030 502205 435672 502367 504346
7511E04346r5845K9766l2069j7729m206O3542l7702k5786O819l1563M7042o4778
7499C41837l2011N9386J9039o417p3424ro059Q214l3207M5494J3691K1556r2526
7486B65564N7981m437o8553O1789K2668q750l1118p8920L6874M5842n5742r1052
7474A52146R3317K3287j7500l477n910M0156M295J878j1195m9587M7423k6711
7462B48122j6364P2964o1514M8296o3780J48489n7438K3059m1910j0262p990J14898
7450C96570Q3822j38998j695n4710N9076m2363Q1595r5515J52022k70q4301M024
7438C59257L583K9394N3492j2335P5949n7653N2293M5172j8956K2868m0673Q1583
7426E93974m6503J09386r1943k3759M5984j8279R5752J1133p0378J38310K8383
$$ plain form
7511 504346 408501 438267 406198 388469 384263 447805 410103 384317 391136 359573 406615 341837
7499 341837 309826 369212 388251 381834 308410 308401 302342 310556 277349 322843 336534 358090 265564
7486 265564 323545 319108 250555 312344 335012 326262 295144 216224 253098 298940 243198 152146
7474 152146 245463 268750 251250 247773 241863 282019 286314 288192 276997 227410 274833 248122
7462 248122 231758 304722 243208 291504 227724 376213 318775 341834 299924 289662 281672 396570
7450 396570 480392 341394 339699 284989 344065 301702 383297 287782 439804 439534 355233 359257
7438 359257 362840 392234 445726 433391 509340 451687 503980 549152 530196 553064 512391 593974
7426 593974 547471 656857 564914 541155 587139 568860 664612 675745 605367 743677 772060
7415G72060k2479K8136n3084M9040k2425J7735N5132J01431j72494O957N6962
7404H16971J03375j69637o0494J35080l8194N4810j06344L7074j9333q5631J83729
7393H51406r2668P1275j4919m7779K0003r808j27622l0405J22319j22075q869
7382F10858p468n3063p4462J01156l6561j09265N4985N3884j37490L9014p3911
7371C67677J29536j93296J08092p0913j2514k6228o6789m403k2908k4843l2102
7360A51309m0794Q4060m5439j04684m6517J4676N8387r4494J39059j57285L7494
7349d228l7787M883M920p1094J1826k7783r979L6739o3543J01648r2669K3952
7337a23115r4994m2276n9071J41284j0772o2805R6456q2591q287o1159N2011O2130
$$ plain form
7415 772060 749581 777717 724633 773673 751248 768983 824115 925546 753052 760009 816971
7404 816971 920346 750709 690215 825295 787101 841911 735567 772641 753308 667677 851406
7393 851406 758738 830013 815094 767315 787318 777510 649888 619483 741802 619727 610858
7382 610858 603390 550327 475865 577021 540460 431195 486180 540064 402574 441588 367677
7371 367677 497213 303917 412009 341096 328582 302354 235565 231162 208254 183411 151309
7360 151309 110515 194575 149136 44452 -2065 12611 70998 -23496 115563 -41722 -4228
7349 -4228 -42015 -37132 -32212 -103306 -91480 -119263 -129242 -92503 -156046 -54398 -147067 -123115
7337 -123115 -218109 -260385 -319456 -178172 -188944 -251749 -155293 -237884 -246171 -307330 -255319 -193189
7325a93189l9992r2638K368r884O7252k5927O6926l0522n5519J73766j45084Q8666
7313a93777j09579R0081J6006j15764J8770N3147j67288J81993r1758J35830j01921
7302b84260K4994j9594k4297o8334O7604J935N4251p9814J1580K5439K9716j09391
7290c70171K3104O4667J4186m2092N6106L1491j29894P2050m9981k591J69952
7279a63173j8169j36824k6433K0208K4216J7152M3243j33405J28366j15424J10927
7268b49316L907j0933J6522m3051l8476O0797p2603J26556j26531N1456m5523
7257c27195M7857k4347O8448j72299J12383O3331m0736K9211j09410L5851L5457
7246b81449j2484n3822J7316k2098J05077j09742j0397J50780p4702l965K5218
$$ plain form
7325 -193189 -233181 -325819 -323451 -333335 -266083 -292010 -225084 -255606 -311125 -137359 -282443 -193777
7313 -193777 -303356 -213275 -197269 -313033 -294263 -241116 -408404 -226411 -318169 -182339 -284260
7302 -284260 -259266 -278860 -303157 -371491 -303887 -301952 -247701 -327515 -315935 -290496 -260780 -370171
7290 -370171 -347067 -282400 -268214 -310306 -254200 -222709 -352603 -280553 -330534 -333125 -163173
7279 -163173 -181342 -318166 -344599 -324391 -300175 -283023 -239780 -373185 -244819 -360243 -249316
7268 -249316 -245409 -256342 -239820 -282871 -321347 -260550 -333153 -206597 -333128 -281672 -327195
7257 -327195 -279338 -303685 -235237 -407536 -295153 -231822 -272558 -243347 -352757 -316906 -281449
7246 -281449 -293933 -347755 -330439 -352537 -247460 -357202 -367599 -216819 -291521 -295486 -270268
7235b70268n8233O9089l2472m8126N8339m9793O1195k8702M3315P0000o4802k6219
7223b76677o6689O6861k8025M4103j8970M650M7633m0715k7819J1188J1444k4128
7211b97144N8869n9194R408P5235n1949j1063k6014M8788n2768r1279J45428l4717
7199b86400j8633m6708J27326m1923q3594M2012j4465p343K6815N0179J5566j19394
7187c56562M1566O9504q0788J14457q7282Q5747j38638M7951N3859J5947r5492
7176c29731N8236j5085q000L5638m3368J0647M5968n3796K7404P5488q9264Q6946
7164a98917j01917J1245M5104k0452Q1227j14708N0341p1241K835J08643o0980
7153b68820n6065n9242J04350J00806p7230j1808n4366J39637j08852J6881r1293
$$ plain form
7235 -270268 -328501 -259412 -291884 -340010 -281671 -331464 -270269 -298971 -255656 -185656 -250458 -276677
7223 -276677 -343366 -276505 -304530 -260427 -279397 -274747 -227114 -267829 -295648 -284460 -273016 -297144
7211 -297144 -238275 -297469 -288061 -212826 -264775 -275838 -301852 -253064 -305832 -397111 -251683 -286400
7199 -286400 -305033 -351741 -224415 -266338 -349932 -307920 -322385 -329728 -302913 -252734 -237168 -356562
7187 -356562 -314996 -245492 -326280 -211823 -299105 -213358 -351996 -304045 -250186 -234239 -329731
7176 -329731 -271495 -286580 -294580 -258942 -302310 -291663 -245695 -299491 -272087 -196599 -285863 -198917
7164 -198917 -300834 -289589 -244485 -264937 -183710 -298418 -248077 -319318 -316483 -207840 -268820
7153 -268820 -324885 -384127 -279777 -178971 -256201 -268009 -322375 -182738 -291590 -274709 -366002
7142c66002J35730k1299q9874M8039l543K037J4967J7375K4962L071j04295J67436
7130a71396q662j68054Q188N7647k2428J14266j17426L4564o4044J28983j20563
7119c28925m9156J35441o4442P4048n2012m8006O8800n7291L9272o3780J92871
7108a53180j71934n0774J74857m4546p2386J8729j6884Q0785K5094j04571R3116
7097b21694J762j5940l9111N0298o2192Q1116o8130j29698J39110k7988k0066
7086c12533N4601j2016L0012m5067N342J667O925N18R015R62Q1982r4914O0171
7073b13335p568n3790L521n3423N2983n1239L0156L9988n230L6731o2790M6767
7061b37229l5598O7911p5250J01361k842r1984K4176q3585J1828K2958j834J65386
$$ plain form
7142 -366002 -230272 -251571 -341445 -293406 -296949 -294912 -279945 -262570 -237608 -234537 -338832 -171396
7130 -171396 -180058 -348112 -339924 -282277 -304705 -190439 -307865 -273301 -337345 -208362 -328925
7119 -328925 -378081 -242640 -307082 -233034 -285046 -333052 -264252 -321543 -282271 -346051 -153180
7108 -153180 -325114 -375888 -201031 -245577 -317963 -299234 -316118 -235333 -210239 -314810 -221694
7097 -221694 -219932 -235872 -274983 -224685 -286877 -205761 -273891 -403589 -264479 -292467 -312533
7086 -312533 -257932 -269948 -239936 -285003 -279661 -277994 -271069 -270551 -261536 -260574 -178592 -273506 -213335
7073 -213335 -220903 -274693 -271172 -324595 -271612 -322851 -292695 -252707 -257937 -221206 -283996 -237229
7061 -237229 -272827 -204916 -280166 -178805 -181647 -273631 -249455 -333040 -321212 -298254 -300088 -134702
7049a34702j46930j786O5922r8063J66387j04610l3511q4349J04058K6443N8418
7038a82723j01836R3253l8490r9986Q3718M4105l8793m5602K0178O720M1044n9685
7026b78097l5082R0699M8187j17107j654N5500M8098p9483o5620P7120n6825J01793
7014b12471o68M4983k9152p1856m678P690K8322q2610K1263o636O114O4665j9681
7001b54715M6499M5602o4825L6449j5730k4938l6115L33p7799J89700m7257l5996
6989b38792L6990l2819K5973j4390m1172N07P5164n2464J1760k4114o1362J06493
6977b08226p9443L6929r1763Q1652J7M3650O0351j9222j47565o879M7957Q9620
6965a92922j9757L337m0598k2987O4758k2080N2773p210R665j07230l385Q8319
$$ plain form
7049 -134702 -281632 -283418 -217496 -315559 -149172 -253782 -287293 -371642 -267584 -241141 -182723
7038 -182723 -284559 -191306 -229796 -329782 -246064 -201959 -240752 -286354 -266176 -259456 -218412 -278097
7026 -278097 -313179 -222480 -174293 -291400 -293054 -237554 -189456 -268939 -334559 -257439 -314264 -212471
7014 -212471 -213139 -168156 -197308 -269164 -273842 -266152 -237830 -320440 -299177 -305813 -299699 -235034 -254715
7001 -254715 -208216 -162614 -227439 -190990 -206720 -231658 -267773 -267440 -345239 -155539 -202796 -238792
6989 -238792 -201802 -234621 -208648 -223038 -264210 -263703 -188539 -241003 -229243 -253357 -314719 -208226
6977 -208226 -287669 -250740 -342503 -260851 -260834 -217184 -156833 -176055 -323620 -330499 -282542 -192922
6965 -192922 -212679 -209342 -249940 -272927 -208169 -230249 -177476 -184686 -175021 -282251 -285636 -197317
6953a97317o5768P000q7346J89079r3487n214L7339L998n7782O5019O451Q0536
6941a17492o1161j451p5559l0189J22603q685k2337k6956Q241l3888j4394J6478
6929b44790q675J6221J988n246m2981K184M9869k1045p8279J08086J7287m3103
6917b48484K6067L265l3796O0884M8103j31108M6776k0061J3205j3405K2723m793
6905b30624r741M7638j6379M7339n7528J1468l4378m0591O376K9336M7649l2728
6893b32163J9247N1974j08068O4365l9808p182j315n1393J16693r3975Q0171r3690
6881b95144M7933L6792N0241r1093P2205q0278k2784J68086j03808r2476J82717
6870a27609k8612k8323J7260N594K7841n5018r5115R1537l9103J11773j89483
$$ plain form
6953 -197317 -263085 -256085 -343431 -154352 -247839 -253053 -215714 -211716 -269498 -204479 -198028 -117492
6941 -117492 -178653 -180104 -255663 -285852 -163249 -171934 -194271 -221227 -212986 -246874 -261268 -244790
6929 -244790 -253465 -237244 -235256 -240502 -283483 -281299 -231430 -252475 -330754 -222668 -205381 -248484
6917 -248484 -222417 -219152 -252948 -192064 -143961 -275069 -228293 -248354 -235149 -248554 -225831 -230624
6905 -230624 -240365 -192727 -209106 -161767 -219295 -207827 -242205 -282796 -276420 -247084 -199435 -232163
6893 -232163 -212916 -160942 -269010 -204645 -244453 -251635 -252950 -304343 -187650 -281625 -201454 -295144
6881 -295144 -247211 -210419 -160178 -251271 -179066 -259344 -282128 -114042 -217850 -310326 -127609
6870 -127609 -156221 -184544 -167284 -161690 -133849 -188867 -283982 -192445 -231548 -119775 -309258
6859c09258R8358j13797J04878L6719m0106p2134J70452j02206J3948m2733J11431
6848a44448o2393J8839J9395r4721K9487N8000j7295m087j15826J60740p3363
6837b25672j1566m6003P4254n644l0994q859O165J05227l3497l1446l5789R9063
6825a44761l6837P5467j45951L0751P8678r1810J5601J9916K9924l8535J0325
6814a97232n0584J11811p1705p9353J26566K780r6923L9073N338l875k7618J2995
6802b28727K0262J9697r1670J1440n0686Q0273M0954J1625L5035l0666l1892P1111
6790a43244l8010L6544j0586N0124j10900N2357p9036P7806m2470L7833j00281
6779b69863J31657k6803r3739L9284M1963n6287P1029m6412K8870r3075O554M9944
$$ plain form
6859 -309258 -210900 -324697 -219819 -183100 -223206 -295340 -124888 -227094 -213146 -255879 -144448
6848 -144448 -206841 -188002 -168607 -263328 -233841 -175841 -193136 -197223 -313049 -152309 -225672
6837 -225672 -237238 -283241 -208987 -214631 -245625 -254484 -248319 -143092 -176589 -208035 -243824 -144761
6825 -144761 -181598 -106131 -252082 -221331 -142653 -234463 -218862 -198946 -169022 -207557 -197232
6814 -197232 -247816 -136005 -207710 -287063 -160497 -157717 -254640 -215567 -210229 -214104 -241722 -228727
6802 -228727 -208465 -188768 -280438 -268998 -319684 -239411 -198457 -186832 -151797 -182463 -214355 -143244
6790 -143244 -181254 -144710 -155296 -105172 -216072 -163715 -242751 -164945 -207415 -169582 -269863
6779 -269863 -138206 -165009 -258748 -219464 -177501 -233788 -162759 -209171 -180301 -273376 -266822 -216878
6767b16878N9423j00207k8640R7956j8776j0946p5213R6015j6974k3864L3616
6756b04488M341K8232o4703Q7338J770m5442q1814N7562J51297j74422L205r482
6744b46606L8584O4317q7761K8176m2942J25036l7327j02950P1890k6857P8319
6733a38121m5499K4969k001j7854j05138P9270l463N3717j17767K14451j83653
6722b41089n9280J13193l0815O6030P384l6286N227o771n4887P173m4686Q7857
6710a86950m2117O4088q5245J28574m2441m6389R5041n7100K4778m2147m5582
6699b35490m9706R8756L7443J6848j54020N1697Q0939j0409j03639L1252m7618
6688b83947J78524p4355J8607p9726M362J05916q094l1489q6982R5854M9087j21089
$$ plain form
6767 -216878 -157455 -257662 -286302 -188346 -207122 -218068 -293281 -197266 -214240 -238104 -204488
6756 -204488 -200147 -171915 -236618 -149280 -147510 -192952 -274766 -217204 -65907 -240329 -237124 -246606
6744 -246606 -208022 -143705 -231466 -203290 -246232 -121196 -158523 -261473 -189583 -216440 -138121
6733 -138121 -183620 -158651 -160652 -178506 -283644 -204374 -207837 -154120 -271887 -57436 -241089
6722 -241089 -300369 -187176 -217991 -151961 -144577 -180863 -175636 -182407 -237294 -230121 -274807 -186950
6710 -186950 -229067 -164979 -250224 -121650 -164091 -210480 -115439 -172539 -147761 -189908 -235490
6699 -235490 -285196 -186440 -148997 -132149 -286169 -234472 -153533 -163942 -267581 -236329 -283947
6688 -283947 -105423 -179778 -161171 -240897 -236535 -130619 -138713 -170202 -257184 -161330 -112243 -233332
6676b33332j8666K2933M6597K9832J8656j07107J11905r4414j1222L0166P9560
6665a25092j11519Q3864o8778O1643K0334j881M1023j03264K3382j0285N3361
6654a37212j49339R3534j1513m3087k500N2650L6300p3273K468N5977k8937J3117
6642a91815k2983k7006M9711l5382M0513P7704q7757K5689K4163m3588P9927o2610
6630a73434k0918J41409j25729O4381o7104P9492j15806N133K7774l7543P7046
6619a45299P633k0904K445O1990j62758J35961p7439j1377P8144N1841j66805
6608b46568J35993j34705O8124o0242k2511J50726L0962r8142l1965k210J768
6597b08770L3930O6324o8287l6268N9171n3307r7970J50512l8677L2181j8396
$$ plain form
6676 -233332 -251998 -229065 -182468 -152636 -133980 -241087 -129182 -223596 -234818 -204652 -125092
6665 -125092 -236611 -152747 -221525 -159882 -139548 -141429 -100406 -203670 -180288 -190573 -137212
6654 -137212 -286551 -193017 -204530 -247617 -250117 -197467 -161167 -234440 -231972 -175995 -204932 -191815
6642 -191815 -214798 -241804 -192093 -227475 -186962 -109258 -197015 -171326 -147163 -190751 -110824 -173434
6630 -173434 -194352 -52943 -178672 -114291 -181395 -101903 -217709 -212576 -184802 -222345 -145299
6619 -145299 -137666 -158570 -156125 -94135 -256893 -120932 -198371 -209748 -131604 -79763 -246568
6608 -246568 -110575 -245280 -177156 -237398 -259909 -109183 -78221 -176363 -208328 -210538 -208770
6597 -208770 -174840 -108516 -176803 -213071 -153900 -207207 -305177 -154665 -193342 -161161 -179557
6586a79557m523K412l7844L3240P5153r5023L6718j1474j9541L0849j5886P3070
6574a12406o5193O1473K7550n3856o9535N5589K8499p2335k6753K6733o121O8153
6562a38202j04720O0865N4365k8106j20291O3285P6975r3345J6647J12719j09337
6551b09145N8637N823L9605l8528o2782K0779L6625j3472Q626k5052n3096J27358
6539a04622p7590R0389q7923p893O9086J2060M354l8491o7066n6599J07337K6689
6527a30269M8008j23115J1434o017J12547n4281p4512Q7644k7537k23N4947j31578
6515b32952J00695o2985M3865l5832L7026L6476j07155J42227o5158m1572p100
6504a92465P4123k2492n1332P9097p4971N9980K2687p8496O4930k6856l842j6237
$$ plain form
6586 -179557 -184080 -181668 -219512 -186272 -111119 -206142 -169424 -180898 -200439 -169590 -185476 -112406
6574 -112406 -177599 -116126 -88576 -142432 -211967 -156378 -127879 -200214 -226967 -200234 -206355 -138202
6562 -138202 -242922 -182057 -127692 -155798 -276089 -212804 -135829 -229174 -212527 -99808 -209145
6551 -209145 -150508 -144685 -105080 -143608 -206390 -185611 -148986 -162458 -153832 -178884 -231980 -104622
6539 -104622 -182212 -91823 -179746 -187639 -118553 -106493 -102139 -140630 -207696 -264295 -156958 -130269
6527 -130269 -82261 -205376 -193942 -199959 -87412 -141693 -216205 -128561 -156098 -156321 -101374 -232952
6515 -232952 -132257 -195242 -151377 -187209 -150183 -113707 -220862 -78635 -143793 -185365 -192465
6504 -192465 -118342 -140834 -192166 -113069 -188040 -128060 -105373 -183869 -118939 -145795 -149637 -165874
6492a65874K6636n0624J18286k4612o9304K5239r296o6102J07146m1565j05458
6481b55528J54780p5134m2135L10L7064j6248P5639N3943j17193J26787j34125
6470a91840O5534L9139j9365L0808q2830P3348r4438O7897l6226J2420n7663K4140
6458a69076R1110q4092P0516p2846l763N1738m6986l8490J14573J7305m6584m9218
6446a65813L6798n6488Q5148j9334m9232L0613N3912j30270J38311l7247l1777
6435a45379m050k6069P2876k087k3717m734n9880N8629k1728l9708J0123j1149
6423a96873N3287M3973l1110K0960j37350J13862m569q2465J15136L2257q8959
6412a61851o2619J18094r7087K1010L5391J9973J6399J092l8000m94L0257l2964
$$ plain form
6492 -165874 -139238 -189862 -71576 -96188 -165492 -140253 -149549 -215651 -108505 -150070 -255528
6481 -255528 -100748 -175882 -218017 -217707 -180643 -196891 -121252 -67309 -184502 -57715 -191840
6470 -191840 -126306 -87167 -106532 -75724 -158554 -85206 -179644 -111747 -147973 -135553 -193216 -169076
6458 -169076 -77966 -162058 -91542 -164388 -168151 -116413 -163399 -201889 -87316 -70011 -116595 -165813
6446 -165813 -129015 -185503 -100355 -119689 -168921 -138308 -84396 -214666 -76355 -113602 -145379
6435 -145379 -149429 -175498 -102622 -104709 -128426 -133160 -193040 -134411 -156139 -195847 -185724 -196873
6423 -196873 -143586 -99613 -130723 -109763 -247113 -133251 -137820 -220285 -105149 -72892 -161851
6412 -161851 -224470 -106376 -203463 -182453 -147062 -127089 -110690 -109598 -147598 -148092 -117835 -150799
6400a50799m442N1582K7334j11522O4782k3317K4148n7676Q7426l7228K7117k0436
6388a23031m119k7516r941L2827K4206m1390O242N0197p4323j3591N8182J5947
6376a06310R170j2377k3048k0272P9691n8918J3540O7641r2746k826L7131o3597
6364a72921N5078q1086K6348m031R2971q5081J04146q8852n1637O2025J3244j3738
6352a43534N18K9140l9572m852K7894J28912j58440n0978J75095j42582N7307
6341a21092M4766k2382R965n7440J28248j46195l4987J20278j01865R4634P0897
6330a5173j23814P642O539p3141P2862M0782k2039j30753O2292r642L9842J7971
6318a26632J1370J5045n8545P1845r4890J30355q3023J2924O054K5114N707o7953
$$ plain form
6400 -150799 -155241 -103659 -76325 -187847 -123065 -146382 -122234 -179910 -92484 -129712 -102595 -123031
6388 -123031 -127150 -154666 -164607 -131780 -107574 -148964 -142722 -92525 -166848 -180439 -122257 -106310
6376 -106310 -97140 -109517 -132565 -152837 -73146 -132064 -118524 -50883 -143629 -146455 -109324 -172921
6364 -172921 -117843 -198929 -172581 -176612 -83641 -168722 -64576 -153428 -205065 -143040 -129796 -143534
6352 -143534 -143016 -113876 -153448 -158300 -130406 -1494 -159934 -210912 -35817 -178399 -121092
6341 -121092 -76326 -98708 -88743 -146183 -17935 -164130 -199117 -78839 -180704 -86070 -15173
6330 -15173 -138987 -131345 -124806 -197947 -125085 -84303 -106342 -237095 -174803 -184445 -144603 -126632
6318 -126632 -115262 -100217 -158762 -86917 -181807 -51452 -134475 -121551 -115497 -90383 -84676 -152629
6306a52629l1204j4310J69693l8232p6783O06k1851k7900J33269p5516K2705N1397
6294f0755P06J4260r2342k167o9284K0487j4381Q8472k7571p492M2139n1239N3038
6281a06129p0607J11046j76729J47378p297L4565q1958K8806n6829M633J48984
6270b4137j47051Q4587n2695l5386L7580R6828L0066j02804J8103K0043K8814
6259d6052j01007R5720r1806j17407J24654N0093J2393o1047P4113k7870K5045
6248f3171q4990j8500J19606j52878P1168k6437j5590K8835q326Q1987j7762M4937
6236d1121m5462L6015o8819k5892o4974O5108J1971q1094Q6791L6955o4720K2399
6224a32843R0080m7659L1592l8188j08017J44481q7959J30050r0792K464l2738
$$ plain form
6306 -152629 -183833 -198143 -28450 -66682 -143465 -142859 -164710 -192610 -59341 -134857 -112152 -60755
6294 -60755 -60049 -45789 -138131 -140298 -209582 -189095 -203476 -115004 -142575 -150067 -107928 -159167 -106129
6281 -106129 -176736 -65690 -242419 -95041 -102338 -67773 -149731 -120925 -177754 -173121 -24137
6270 -24137 -171188 -86601 -139296 -174682 -137102 -40274 -10208 -113012 -94909 -74866 -46052
6259 -46052 -147059 -51339 -143145 -260552 -135898 -85805 -73412 -134459 -60346 -88216 -63171
6248 -63171 -148161 -166661 -47055 -199933 -128765 -155202 -170792 -141957 -150283 -68296 -86058 -41121
6236 -41121 -86583 -50568 -119387 -145279 -210253 -145145 -133174 -214268 -127477 -90522 -155242 -132843
6224 -132843 -42763 -90422 -58830 -97018 -205035 -60554 -148513 -18463 -109255 -106791 -139529
6213a39529n8017N4259J0242Q76P4172j42151J19582m1663P871j19145M3825J27672
6201f2006j30595O6810J17634j22451r0640J06141o3528K9046J9974k2925L8314
6190a14226P7796L0160m4662l2451M7469n5306l4870j4308N3978L4174n0161n1245
6178a53652M998K4869k5175J23938r6809J06473q4980J1558j2981k3411R0554
6167c4618j14837M5950p11Q4843m9628k4291O0247n1721o0684O248N1965j3375
6155a00612J01410p0034l4048N133N2787J7406j63703O0324P3995j18342Q1541
6144i4143j41542K18434j38279J26696m3829l3998Q3068m1496l3311N3366L732
6133d1302j27187J90514j60911Q2276p4872L7150p939K3357p1104m2615P5539
$$ plain form
6213 -139529 -197546 -143287 -133045 -132169 -57997 -200148 -80566 -122229 -114358 -233503 -189678 -62006
6201 -62006 -192601 -125791 -8157 -130608 -221248 -115107 -178635 -149589 -129615 -152540 -114226
6190 -114226 -36430 -6270 -50932 -83383 -35914 -91220 -126090 -140398 -86420 -52246 -102407 -153652
6178 -153652 -148654 -123785 -148960 -25022 -121831 -15358 -100338 -88780 -101761 -125172 -34618
6167 -34618 -149455 -103505 -104216 -19373 -69001 -93292 -33045 -84766 -145450 -139202 -87237 -100612
6155 -100612 798 -69236 -103284 -98151 -45364 -27958 -191661 -131337 -57342 -175684 -94143
6144 -94143 -235685 -17251 -155530 -28834 -72663 -106661 -23593 -65089 -98400 -45034 -41302
6133 -41302 -168489 22025 -138886 -56610 -131482 -94332 -102271 -78914 -150018 -192633 -117094
6122a17094P2252j3238K145M1706o1720P725M9915r7127N285j6662O7181m1511
6110a01143m0237J9333m3881K8626N697L955L0125J8118R675m9135J8555k8568
6098a28880Q4562n1268j7098Q3107N321o2800j9064N5742j39349Q2246O7372j02366
6086a42475M5041q8220P6555m3055Q624Q9593j12053J16849l3765o2102K8683
6075a16325O0849l3403o6591Q1509L3856p0074r784N791n3494J45870p9309l5905
6063a37010k2076N6219K8196m1620Q647J5357M0084q0727R7080k1779j24655P7436
6051a04848P3084m8578K0692K1075j9395k1931M8394n8459J0342j7328J6557l3113
6039a13508N1018M6632o3859N7948p8142n5617J11499L8956p0555M1796n3450
$$ plain form
6122 -117094 -44842 -58080 -55935 -14229 -75949 -68224 -18309 -115436 -110151 -126813 -59632 -101143
6110 -101143 -141380 -122047 -165928 -137302 -131605 -127650 -97525 -79407 -69732 -118867 -100312 -128880
6098 -128880 -44318 -95586 -112684 -29577 -24256 -87056 -106120 -50378 -189727 -107481 -40109 -142475
6086 -142475 -97434 -185654 -109099 -152154 -143530 -53937 -165990 -49141 -82906 -145008 -116325
6075 -116325 -55476 -88879 -155470 -73961 -40105 -110179 -119963 -114172 -167666 -21796 -101105 -137010
6063 -137010 -159086 -102867 -74671 -116291 -107644 -92287 -52203 -132930 -35850 -57629 -182284 -104848
6051 -104848 -31764 -80342 -59650 -38575 -57970 -79901 -31507 -89966 -79624 -96952 -80395 -113508
6039 -113508 -62490 -15858 -79717 -21769 -99911 -155528 -44029 -5073 -75628 -33832 -87282
6028h7282o9051J22571r2216K1718j4750O7705p5756J4446k2108K6860Q9202o0516
6016g9177j966J13415j86685Q9404p6088L7523K1810L3052j30777K7950R0903
6005f0636m7219J7573K1220m2727n2063J70801j15128P7690o0996n0161K5268
5994a16378N8301K6358j20637R2693J08577j32029o1005Q1279R990N1901J2000
5983A1050j58866O0825Q0253l4607j3205p2630p1Q7567n4049J3298J5100L0385
5971c4950K3479m8035k0843n9929N9066k5416l4217K9714M9238J07480j37186
5960i1599k0109L4845j9694L3933j0593J4451k0593N1363m2972m0418J16992p4585
5948f8979N355k8689k706Q141M0275n0869K3296p928r458O3801J5219N1793j29122
$$ plain form
6028 -87282 -156333 -33762 -125978 -104260 -119010 -51305 -127061 -112615 -134723 -107863 -18661 -79177
6016 -79177 -81143 32272 -154413 -65009 -141097 -103574 -81764 -48712 -179489 -151539 -60636
6005 -60636 -107855 -90282 -69062 -111789 -163852 6949 -108179 -30489 -91485 -141646 -116378
5994 -116378 -58077 -31719 -152356 -59663 48914 -83115 -144120 -62841 -52851 -950 11050
5983 11050 -147816 -86991 -6738 -41345 -54550 -127180 -127251 -39684 -93733 -80435 -65335 -34950
5971 -34950 -11471 -59506 -80349 -140278 -81212 -106628 -140845 -111131 -61893 45587 -91599
5960 -91599 -111708 -76863 -96557 -62624 -73217 -58766 -79359 -27996 -70968 -111386 5606 -68979
5948 -68979 -63624 -92313 -95019 -86878 -46603 -97472 -74176 -82104 -91562 -27761 -12542 39251 -89871
5935h9871K5224L8212L1172m6877l4906l1921k3599O1273J0465k2774J7473k7167
5923i3296J3057l5053K2194M0732l8482k7401L9850L1527j0439j0291P8077r4399
5911h3924N3191j40872O0856M9023p1026R839R9004k8828o4105J085O5630M6757
5899c370q3161o9319K14612r6581j3755l384L726m6298j4491j5771M0246P0104
5887a7442k4323m5916J01021l1457p8195K5861P013n5086J1941K2143J35388j11662
5875f0714p8530M9958k1405M4631N7600k1017K904m5762R9256n6136r347J2577
5863b5985n3482M3721m4395J7946k0052j5107J02511L0955j79184J29378J2950
5852g44N951j17413N9091r8628R4225M6881M804r917m3461m9643M5617M0344n720
$$ plain form
5935 -89871 -64647 -26435 4737 -42140 -77046 -108967 -132566 -71293 -60828 -83602 -66129 -93296
5923 -93296 -80239 -115292 -93098 -52366 -90848 -118249 -78399 -46872 -57311 -67602 10475 -83924
5911 -83924 -30733 -171605 -110749 -61726 -132752 -122913 -23909 -52737 -116842 -115757 -50127 -3370
5899 -3370 -86531 -155850 58762 -37819 -51574 -54958 -51232 -97530 -112021 -127792 -87546 -17442
5887 -17442 -41765 -87681 13340 -18117 -96312 -70451 -63438 -118524 -106583 -84440 50948 -60714
5875 -60714 -139244 -89286 -110691 -66060 -8460 -29477 -26573 -72335 26921 -29215 -38562 -25985
5863 -25985 -79467 -35746 -80141 -62195 -82247 -97354 5157 36112 -143072 -13694 -744
5852 -744 5207 -112206 -53115 -151743 -57518 -10637 -5833 -15750 -59211 -108854 -63237 -22893 -28613
5839b8613Q2839j20687q4615O8972m7520R8927J9260k202O767q6795J4957Q3758
5827E048m9261J03731q6192L7156l0783K775l4305J3754J5067j06506J48471j03588
5815h4633O3820k3595j3708L035J08855m1102o7152O2522n4589k279p2985n0443
5803a72254n793N3606K3689k9588M4578m632n002N5549n8134m4046k0172J59956
5791b243r0673p4749M8433L6178j9894P1751M1715m7708j02017J56105r5736n52
5779g9390M7062Q1181n8631l0335O5426n7012j7213l078N3182M6o6754j3898J1105
5766f8309N217O5286m5382n3651P8322N4020j02416m308N5790j00409N2928l5538
5754i8450M8296o5563P9309o0984R1303j3218j7075J1443K6329m6671M5491n1920
$$ plain form
5839 -28613 54226 -66461 -151076 -82104 -129624 -30697 -11437 -13639 -6872 -93667 -78710 5048
5827 5048 -44213 59518 -26674 10482 -20301 -17526 -51831 -38077 -23010 -129516 18955 -84633
5815 -84633 -20813 -44408 -58116 -55081 53774 12672 -54480 8042 -46547 -48826 -121811 -172254
5803 -172254 -178047 -124441 -100752 -130340 -85762 -90394 -95396 -39847 -97981 -142027 -162199 -2243
5791 -2243 -92916 -167665 -119232 -83054 -102948 -31197 10518 -37190 -139207 16898 -78838 -79390
5779 -79390 -32328 48853 -9778 -40113 25313 -31699 -48912 -51990 1192 1238 -65516 -79414 -68309
5766 -68309 -63092 2194 -43188 -96839 -18517 35503 -66913 -71221 -15431 -115840 -62912 -98450
5754 -98450 -50154 -115717 -36408 -97392 -6089 -19307 -36382 -24939 1390 -45281 210 -51710
5742e1710L893o645N9497R5166j14315k8778J07304r156J2481q1116P2888l1444
5730B8065k9810K1075m4504k4782N8642N1348P6587l3778r4179J17699r2475l3829
5718E9O8628j3311n5538P45p8936o163L6263L6476r389M3060M4956m2998j24842
5705a00990J14899P874N0626m9160m3291J4547k7733R051l1038M5960o6440j0330
5693h6025J94664j75300J23391K1444r0510k5477M6696l0907l7555K1443M5067
5682F931M9196r1543K9217P4237q5202Q1988j6927n0674r122K1099K5508r853
5670B4855M6861l3188p9260K601M4100k4932l2506J50543o4005k5969j6578M4615
5658C7137p3924M711J3680N2823k0772J6002l8338J14496r9306k3761M3231m1815
$$ plain form
5742 -51710 -47817 -54462 5035 100201 -14114 -42892 64412 55256 67737 -13379 59509 28065
5730 28065 -1745 19330 -25174 -49956 8686 60034 136621 102843 8664 126363 33888 59
5718 59 68687 55376 -162 583 -78353 -84516 -48253 -11777 -21166 21894 66850 23852 -100990
5705 -100990 13909 21783 72409 23249 -20042 -5495 -33228 -24177 -55215 -9255 -75695 -86025
5693 -86025 108639 -66661 56730 78174 -12336 -37813 8883 -22024 -59579 -38136 6931
5682 6931 56127 -35416 -6199 68038 -17164 64824 47897 -2777 -11899 9200 34708 24855
5670 24855 71716 38528 -40732 -38131 5969 -18963 -51469 99074 35069 9100 -7478 37137
5658 37137 -36787 -32076 -18396 34427 13655 29657 -8681 105815 6509 -17252 25979 -15836
5646a5836M6595n1705o1099K6855J27497j3231P0671j64818M9491L1466j088m2699
5634B099J0958j5646l1990N9539l8448L0845L3494P713k7092L6484l7923j8059
5622A1974L0416o9175J15580o3695m2800M3337n3904Q0978k3331O6807j08218
5611a2031O6648l8357J29593j50693J31707p1092j3200L2004k162k7298m0357
5600D762J2058N399q424j7506N4438l1348M5880j4356M3869q675l9436K7796m6758
5587B7699J535n4684K6357M4607M497M6822j07683N8159K5957l9926j3735N2659
5575G2264j5302k7448o6536J77432m6699j4835L2707n3300L556q4576Q9406K5204
5563I1873p1213j800L2938N4970o2840j7441N1403n3741O0727j03475P5184o7147
$$ plain form
5646 -15836 30759 -20946 -82045 -55190 72307 59076 129747 -35071 14420 45886 44798 2099
5634 2099 13057 -2589 -34579 24960 -13488 17357 50851 58564 31472 67956 30033 11974
5622 11974 42390 -26785 88795 25100 -17700 25637 -28267 52711 29380 96187 -12031
5611 -12031 54617 16260 145853 -4840 126867 55775 42575 74579 72417 45119 4762
5600 4762 16820 22219 13795 -3711 50727 19379 65259 50903 94772 86097 46661 74457 27699
5587 27699 29234 -25450 907 45514 50011 96833 -10850 47309 73266 33340 19605 72264
5575 72264 56962 29514 -37022 140410 93711 78876 111583 58283 61839 -22737 66669 91873
5563 91873 20660 18860 51798 106768 43928 26487 77890 24149 84876 -18599 56585 -10562
5551a0562J16060m9555k9492J9351j33554O1429J12389m1188m5221P8926O0699
5540A39282q4885l3800L1479M6605r2405l299N9500L6807j35531J44812p1341
5529C7224N35m7348O5266m9943O795L189K438N071J8040K7693l7900N8529l637
5516H5952M8689j28946l5405N3978J06729j06442M9070l6001r8356P0768p7748
5505f7712P0309J0161p5274P6182K57k2697O7177j78439J69164P7539j50191L3327
5493I803N5313j09096j260M5345J5897l2994P4272k8920q7995k8412O4927K559
5481b0561O7005j01800K4978K5796m4038P5380k7111j6081p610n0823l4008Q8698
5469b0175n9126m533O2840P6499k6443M839o7181j8640J5397r246O9461l5881
$$ plain form
5551 -10562 105498 55943 26451 45802 -87752 -26323 86066 44878 -343 78583 139282
5540 139282 54397 20597 52076 98681 6276 2977 62477 99284 -36247 108565 37224
5529 37224 37759 -9589 55677 5734 12529 15718 18156 23227 41267 68960 31060 89589 85952
5516 85952 134641 5695 -29710 24268 130997 24555 73625 37624 -60732 10036 -67712
5505 -67712 2597 12758 -62516 13666 13923 -8774 58403 -120036 49128 126667 -23524 9803
5493 9803 65116 -43980 -45240 105 16002 -16992 57280 28360 -59635 -88047 -23120 -20561
5481 -20561 46444 -55356 -30378 -4582 -48620 26760 -351 -16432 -24042 -74865 -108873 -20175
5469 -20175 -79301 -83834 -20994 55505 29062 33901 -33280 -51920 -36523 -45769 23692 -12189
5457a2189l378K8944p4824j8204M3316M1994k7385p854k8450J9402J5499l66m004
5444b7499M5580k34k6358o0105P2852k1886m1748R4249J902j14213J21416l6279
5432G677k270o0629j7893k219J24484k9352k7823J8684k7097M0186k2302K5545
5420B6991j04710Q8135o8692N945J13076j44797J6880L0414j6308o0447J16833
5409C320l0775L6576J5060m2356M8114n3519n1511N9674Q5172j06168L9064m8261
5397d5610o0974l076M8610R5053m1454r6165J13257j01682J35680j39431K9775
5386f6017J40389j13499K5813n5232J9833M5047m4117o605j327N3954j9431o1153
5374h2345N2399K4920N3279j76905J18057j19236O2995Q2564L9933q9490j5947
$$ plain form
5457 -12189 -15567 13377 -61447 -79651 -36335 5659 -21726 -29580 -58030 -38628 -23129 -23495 -27499
5444 -27499 18081 17847 -8511 -68616 4236 -17650 -59398 34851 36753 -77460 43956 7677
5432 7677 5407 -55222 -73115 -75334 49150 19798 -8025 10659 -16438 23748 1446 26991
5420 26991 -77719 10416 -58276 -52331 60745 -84052 -67172 -36758 -53066 -113513 3320
5409 3320 -27455 9121 24181 -18175 29939 -23580 -75091 -15417 69755 -36413 2651 -45610
5397 -45610 -106584 -109660 -61050 34003 -7451 -103616 9641 -92041 43639 -95792 -66017
5386 -66017 74372 -39127 -13314 -68546 -48713 -3666 -47783 -54388 -55715 -1761 -21192 -82345
5374 -82345 -29946 -5026 48253 -128652 -10595 -129831 -66836 15728 55661 -33829 -49776
5363d9776p1882P5218M5028n9586J3764q0491J59870m08m7893L6228j44107k1207
5351a45242M9301O8504L403K0228L5253l4448R677m0775m5684O8778k5414j7025
5339e3444L9164j2291l5354m842J07211j60272J76776j3828k11497J41591J11621
5328H4835p8527L7877j01438L0919j19180J12034j0704N8387k6345R51r125m8934
5316f9250Q318O9674o1070Q0543q4500O481o853Q6960q0456N534N6199j19424
5304a07844J29205J8862J6728l8863L0452n2872q5226J11857p2759Q900L443N4087
5292A5970q924j11639J03317j11582J07892j5413k9737j6724J7122j12806O7360
5281i5164l4898L8302R1611l3500K904q0262J36822m6361J3320l9420O0199n4290
$$ plain form
5363 -49776 -121658 -46440 -1412 -60998 -47234 -127725 32145 31737 -16156 20072 -124035 -145242
5351 -145242 -95941 -27437 -24034 -3806 31447 -3001 6676 -34099 -79783 -11005 -36419 -53444
5339 -53444 -14280 -26571 -61925 -66767 40444 -119828 56948 43120 -168377 -26786 84835
5328 84835 6308 44185 -57253 -26334 -145514 -33480 -44184 14203 -12142 -11191 -20316 -69250
5316 -69250 -60932 8742 -52328 28215 -56285 -49804 -56657 30303 -50153 -44619 11580 -107844
5304 -107844 21361 40223 56951 18088 48540 -4332 -89558 22299 -50460 -41560 -38117 15970
5292 15970 7046 -104593 -1276 -112858 -4966 -20379 -50116 -66840 -49718 -162524 -95164
5281 -95164 -130062 -91760 -149 -33649 -30745 -111007 25815 -20546 -7226 -46646 13553 -40737
5269d0737k0240m0178l548O9174l0925k81n2485K4391O6903J7932m4738o4173
5257a18905J9251P5246L1359j3490o8255J11363J2231j29035O9957k6035N6552
5246B0239p2465Q830k4306J0279R1019q9494N423K8393n2610R1392r759q9588
5234h2647N7584l6571l1219L5485m6317p3731J29899L6253j67598K14760j5695
5223B0203n8656p68j062M1710J4137j30954R2356l9844J9614l1798m1266K9854
5211h6474L1871J10608o1561O9257n7739q1291P126N5350m1168J3839O2705j28784
5199a06261R928J01494o1804Q2328L4325m978j09682R983Q035J4823K0582K4737
5187B3510l7367j04845L4525M9268k4274j071n1448J40869m5938N0801q0966o1150
$$ plain form
5269 -40737 -60977 -101155 -104703 -35529 -66454 -66735 -119220 -94829 -27926 -9994 -54732 -118905
5257 -118905 -99654 -24408 6951 -6539 -74794 36569 48800 -80235 -10278 -36313 20239
5246 20239 -52226 -43396 -67702 -57423 33596 -55898 -50475 -22082 -74692 16700 6941 -82647
5234 -82647 -25063 -61634 -92853 -57368 -103685 -177416 -47517 -11264 -178862 35898 20203
5223 20203 -38453 -39221 -40283 1427 15564 -115390 -23034 -62878 -43264 -75062 -116328 -86474
5211 -86474 -54603 56005 -5556 63701 5962 -75329 -68203 -12853 -54021 -40182 22523 -106261
5199 -106261 -96333 5161 -56643 25685 60010 55032 -54650 -44667 -36632 -21809 -1227 23510
5187 23510 -13857 -118702 -84177 -34909 -59183 -60254 -111702 29167 -16771 34030 -46936 -108086
5175a08086P7802m673j23521K5022N5004m516N6576k912m034M5758j2138m7859
5163d7577k8899M274Q1109O4358r2483m0675O3821r018k8230R7697n4569o3769
5151e3961M1793M6435o9873L0859j9332j8585j1008j4238O8008L4733n6371L3215
5139A1675K5447j23176J20434p7512N9332O740q0395N1636J9219M9703r2966R9199
5127F9336j30903L0272p6738O5257j8619J04401p9086m1666P779p8632J67490
5116A8891o8186L2133n8408R1587n3361J5719K6581m4789K828P374R777P180j8540
5103c1214j5097M2609l1838L0714j16807P6675M6654q0815M8323K7652l9898Q7472
5091D4430r2609Q4205o6596K3108k6081J0058Q6610k7880L4325j69312J05034
$$ plain form
5175 -108086 -30284 -34957 -158478 -133456 -78452 -82968 -26392 -29304 -33338 12420 282 -47577
5163 -47577 -76476 -72202 8907 73265 -19218 -59893 3928 -5090 -33320 64377 9808 -53961
5151 -53961 -12168 34267 -35606 -4747 -24079 -42664 -53672 -67910 98 34831 -21540 11675
5139 11675 37122 -86054 34380 -43132 16200 22940 -57455 -5819 13400 63103 -29863 69336
5127 69336 -61567 -31295 -108033 -42776 -61395 43006 -36080 -77746 -69967 -148599 18891
5116 18891 -49295 -17162 -75570 16017 -37344 -21625 4956 -39833 -37005 -29631 -19854 -12674 -31214
5103 -31214 -46311 -3702 -35540 -4826 -121633 -44958 1696 -79119 -30796 -3144 -43042 44430
5091 44430 -48179 36026 -30570 -7462 -33543 -23485 63125 35245 69570 -99742 5292
5080E292j38798R7400P2286k4751j4098j9283k4414m2272J14628j31203J51992
5069D6779p2615Q1775j9333j447j29995N9022M5444L8046j57345O075Q7213J667
5057a4714K2433l9290P9732j8078l6838K5620k8416k1764o1077J2819M3716N4526
5045A8669o3698M2665R606Q69O0716r4598J8727L410m0870L7862L2117M3810k8053
5032D1232q1141M9847p7461R5620J2773j9390m2797n5014O8643n8762P7595O6889
5020G8034r3882l3144O7938n417p9728J13810p4400L8283N3131l6700K3998j08134
5008e6211N1338Q807L860L2017j11933J70219j70661N4443j4541L7538N3854o356
4996E2374m7062p7875J03998L1945m6124k153J7837N4150k7846k5718R9885j95098
$$ plain form
5080 5292 -133506 -36106 36180 11429 -2669 -21952 -46366 -88638 25990 -105213 46779
5069 46779 -25836 55939 36606 35159 -94836 -35814 9630 47676 -109669 -103594 -16381 -14714
5057 -14714 7719 -31571 48161 30083 -6755 18865 -9551 -31315 -92392 -79573 -35857 18669
5045 18669 -45029 -2364 7242 8111 68827 -25771 -7044 -3634 -44504 -6642 25475 69285 41232
5032 41232 -39909 9938 -67523 28097 40870 21480 -21317 -76331 -7688 -66450 11145 78034
5020 78034 -15848 -48992 18946 13529 -66199 47611 -26789 11494 64625 27925 51923 -56211
5008 -56211 -4873 3934 7794 39811 -72122 98097 -72564 -18121 -32662 4876 58730 52374
4996 52374 5312 -72563 31435 63380 17256 15103 32940 87090 59244 33526 133411 -61687
4984f1687L8477O2898R9625k18748R2206K4830p3796J3356l937M4346l3388K9584
4972A3766O1602k5846J0o8128N4476M4939o1717n1591K3489l5583O7085p2530
4960e0028L69P9193r730L3567L1356n1522j3441O6455j31692J26251O051p2593
4948A4236n4438j9240J46596j13303Q9141m2513L5977k8983N3356p5374K7060
4937C2515n7583J7536L063J3280M850J42438j79233l1534J01726n334m3990J9945
4925A7679l0375P343Q8386o5729l5499J13037M7272p8056Q2882j47354J03604
4914A03190p2112M161P1171o3777j1132r110J2458J5572o0734J02527n844m0657
4902D5713j1861J02258j11796l7221J04114n9731J681R6831k4170r1856O9837
$$ plain form
4984 -61687 -23210 39688 139313 -79435 12771 37601 -36195 -22839 -26776 17570 -15818 13766
4972 13766 75368 49522 49532 -18596 35880 80819 19102 -32489 -9000 -44583 22502 -50028
4960 -50028 -49659 29534 19804 53371 84727 33205 19764 86219 -45473 80778 86829 14236
4948 14236 -40202 -59442 87154 -26149 62992 20479 56456 27473 80829 5455 32515
4937 32515 -25068 -7532 -4469 8811 13661 156099 -23134 -54668 47058 41724 -2266 17679
4925 17679 -12696 -5353 83033 17304 -18195 94842 142114 64058 146940 -414 103190
4914 103190 31078 35239 106410 42633 31501 22391 34849 50421 -10313 92214 86370 45713
4902 45713 33852 136110 24314 -12907 91207 31476 33157 129988 105818 13962 83799
4891H3799K2549j496N7779j31982M5795O726m2380L8036k0750N5086n724m7085
4879F0353j8751Q8637p918J9266n6683L5005o9972m3612J82523j37660L8048m8961
4867D0275J62203j50212P2585j9987p5561O5962j7130l011J06604k6293j8830
4856A36605P703L1344k5374j3487P6019m5523K8301j16709J15624j98619K27841
4845B23725O752l1872q7213N3004J8878o5290J11211p6968K03287j95763Q1414
4834B41165M1337q142L9697m1160N3453r4106M3752K3228L5328j9801L9832J7472
4822C72055J7056L10l1438L1717L4432j9015j3096J105L1168j8798O3887k2389
4810D46994j1692J29315m931M5302o8106Q2645k6814k9223Q5282P0983J5817p3997
$$ plain form
4891 83799 106348 104852 162631 30649 76444 83170 40790 78826 58076 113162 107438 60353
4879 60353 41602 130239 122321 141587 84904 119909 49937 6325 188848 51188 89236 40275
4867 40275 202478 52266 124851 104864 29303 95265 78135 75124 181728 155435 136605
4856 136605 144308 175652 150278 136791 212810 167287 195588 78879 194503 -4116 223725
4845 223725 230477 198605 111392 164396 183274 117984 229195 152227 355514 159751 241165
4834 241165 282502 274360 314057 272897 326350 232244 275996 299224 334552 314751 354583 372055
4822 372055 389111 389421 357983 389700 424132 405117 392021 393126 424294 405496 469383 446994
4810 446994 435302 564617 559686 604988 536882 619527 592713 563490 648772 719755 735572 661575
4798F61575O6532M5951j14332J02821J38859q8389J3608r217J06001L0397q2188
4787H71618Q1887O1290P789J1241Q0559n4170K3788J09339k3243K1308L5189M8484
4775A275079K4224N9137n1587J17924m3610q74J14921j36405j5893P3553m2980
4764A373489m3107l1027K6085K8910J3753M5276l0000K3068q1466M3982k684l5619
4752A330660l363n4934l9888j16545J43117J4859j78974J9052L8622m3369L6230
4741A145467q866q579o1133N0469l0688M2529j33575J20224j06124Q2721l7200
4730A055245l0478J01839j43466q9178K06375j85273o3355L7262Q6071j03314
4720H71728q886p851n1381K5479j2983k7153N4326m2057p3484M8516R8605j09964
$$ plain form
4798 661575 728107 774058 659726 762547 901406 813017 826625 817408 923409 953806 871618
4787 871618 953505 1014795 1022584 1033825 1114384 1060214 1084002 1193341 1170098 1191406 1226595 1275079
4775 1275079 1299303 1358440 1306853 1424777 1381167 1380293 1495214 1358809 1342916 1416469 1373489
4764 1373489 1330382 1299355 1325440 1354350 1368103 1413379 1383379 1406447 1324981 1368963 1366279 1330660
4752 1330660 1327297 1272363 1232475 1115930 1259047 1273906 1094932 1113984 1152606 1109237 1145467
4741 1145467 1136601 1128022 1066889 1117358 1086670 1129199 995624 1115848 1009724 1092445 1055245
4730 1055245 1024767 1126606 983140 893962 1100337 915064 851709 888971 975042 871728
4720 871728 862842 854991 803610 829089 816106 788953 843279 801222 727738 776254 874859 764895
4708G64895J9183p824k5529j79684K43467m4218q4267m1255L4161Q5548m2968
4697G21509n8510k6048N0229l4266j3045o4570J743q8891J06998M2570K0631J0832
4685F69182j12075J04009M6952k0359p3496P0553n1278J0150o5779O7797k2822
4674F22834r74k1157p626M4541R7864p0871j8275j09266J28590n4168J8696n5818
4662E74370O388n101m6988j7030R2802K5577L845j2904m2114L7357K6103o4980
4650E77325M838M1826J5611j19918M2509P66K4252m7838M3110j0825L3466k2435
4638E82687R052Q4958k11388J87186j0700J8892r0373L2178p9476J31381j26830
4627E27567J15759m449p0485n5036L1488N6789o7602K4640j4266R1755q2029L3160
$$ plain form
4708 764895 784078 776254 750725 571041 814508 770290 686023 644768 678929 764477 721509
4697 721509 662999 636951 687180 652914 639869 575299 577042 488151 595149 637719 658350 669182
4685 669182 557107 661116 708068 687709 614213 684766 633488 643638 577859 645656 622834
4674 622834 621860 600703 593077 637618 735482 664611 646336 537070 665660 611492 630188 574370
4662 574370 580758 575657 528669 511639 604441 630018 633863 620959 578845 616202 642305 577325
4650 577325 582163 623989 639600 519682 562191 562957 587209 539371 582481 571656 605122 582687
4638 582687 591739 676697 465309 652495 641795 660687 570314 602492 523016 654397 527567
4627 527567 643326 638877 568392 513356 544844 601633 534031 558671 544405 636160 554131 587291
4615E87291J33044j22153k8079M0643L1297o2223k2224M3692j1008k4960m8958
4604E16362q3986O5287O0881K6764o0179J46720j00056J7443k3528n0688O2000
4593E77020M6754k5211j73840J97456m6069k7656l4970L4912J122m3985P6149
4582E81682J8390j601P466j0381j27868J05301o2814K7400O4125k01511K01230
4571F01419K342j15586P5777r5618J79863m1296j1583m1678J9697J4496N2418
4560F40251l4417J2646o0471k925j07767J50123l5355R0739j20732N0233j4295
4549E68030j7186K1585j9377m4913K0493K9702k1180J18626m8439m8576J04819
4538F63584l8458M1889n7145q2397m0924Q5785M6142k1937N5640L4772K2838j36919
$$ plain form
4615 587291 720335 598182 570103 610746 642043 579820 557596 601288 590280 565320 516362
4604 516362 432376 497663 558544 585308 525129 671849 571793 589236 565708 515020 577020
4593 577020 623774 598563 424723 622179 576110 548454 513484 548396 549518 505533 581682
4582 581682 600072 598471 605937 595556 467688 572989 510175 537575 601700 400189 601419
4571 601419 603761 488175 563952 468334 648197 606901 595318 553640 573337 587833 640251
4560 640251 605834 618480 558009 555084 447317 597440 562085 652824 532092 582325 568030
4549 568030 550844 572429 553052 508139 528632 558334 537154 655780 607341 558765 663584
4538 663584 625126 667015 609870 527473 486549 572334 618476 596539 652179 686951 709789 572870
4526E72870k8480Q3379o0808l1426O1584j5793K2477l5431K9032k9958Q8194j39595
4514E16045J31695j5650r8151L9719P3019o2637K898l3308L3057J8172N7400q4441
4502E77818J21391k0612j0921m9736M1206l6540k7762M323j5132j7237j0718P1129
4490F27209O351p7278O5406M0645j0043p7158N4302Q4050j01167Q1001j15462
4479E77856q355J06393l0879r0657k2150P1230L6426q2571J66814j20694J10489
4468G13902j76143N7780O8047k2804m692m4490l4419P8883P832Q1048p0814P8627
4456G32757m3299k5757Q7824j40943J06311o6382N2247n8222L0736j6536o0692
4445E98044L7333M1817L7514j64060J45677l9148N00r4280R83R8169J24492p7533
$$ plain form
4526 572870 544390 627769 566961 535535 597119 581326 603803 568372 597404 567446 655640 516045
4514 516045 647740 632090 533939 573658 646677 584040 586938 553630 586687 604859 662259 577818
4502 577818 699209 678597 667676 617940 659146 622606 594844 599167 584035 566798 556080 627209
4490 627209 633560 556282 621688 662333 652290 575132 629434 713484 612317 693318 577856
4479 577856 569501 675894 645015 554358 532208 603438 639864 557293 724107 603413 713902
4468 713902 537759 595539 663586 640782 636090 591600 557181 636064 643896 724944 654130 732757
4456 732757 689458 663701 751525 610582 716893 650511 702758 644536 675272 658736 598044
4445 598044 635377 677194 714708 550648 696325 657177 657677 563397 564380 662549 787041 709508
4433G09508m4695J5670N8516p5093L3640j100L6833j14819k8197P8612k4880Q7841
4421G31836q2401J2912O7092p0821m102k861p6326Q2197K941o434M9167L3650
$$ plain form
4433 709508 664813 680483 738999 663906 697546 696446 733279 618460 590263 668875 643995 731836
4421 731836 649435 662347 729439 658618 654516 651655 575329 657526 660467 654033 703200 736850
$$ [...]
##END NTUPLES=NMR SPECTRUM
##END=
