##TITLE=abcd
##JCAMPDX= 6.0         $$ Bruker NMR JCAMP-DX V2.0
##DATA TYPE= NMR FID
##DATA CLASS= NTUPLES
##ORIGIN= UXNMR, Bruker Analytische Messtechnik GmbH
##OWNER= root
$$ XWIN-NMR		Version 3.5
$$ Wed Jul 23 12:26:51 2025 Russian Standard Time (UT+4h)  servis@DPX200
##.OBSERVE FREQUENCY= 200.131235884673
##.OBSERVE NUCLEUS= ^1H
##.DELAY= (6, 6)
##.ACQUISITION MODE= SIMULTANEOUS
##.ACQUISITION SCHEME= undefined
##.AVERAGES= 32
##.DIGITISER RES= 18
##SPECTROMETER/DATA SYSTEM= spect
##.PULSE SEQUENCE= zg
##.SOLVENT NAME= CDCl3
##.SHIFT REFERENCE= (INTERNAL, CDCl3, 0, 16.5164)
##AUDIT TRAIL= $$ (NUMBER, WHEN, WHO, WHERE, WHAT)
$$ ##TITLE= Audit trail, XWIN-NMR		Version 3.5
$$ ##JCAMPDX= 5.01
$$ ##ORIGIN= Bruker BioSpin GmbH
$$ ##OWNER= servis
$$ F:\spectra/data/av/nmr/H1/1/audita.txt
$$ ##AUDIT TRAIL=  $$ (NUMBER, WHEN, WHO, WHERE, WHAT)
(   1,<2025-07-23 12:24:22.29 +0400>,<servis>,<DPX200>,
      <created by zg, POWCHK disabled, PULCHK disabled
       configuration hash MD5:
       00 E9 B6 7A A2 85 ED C7 34 08 36 98 17 FE 4E 26
       data hash MD5: 32K
       B3 1F FE DC D9 87 7D EB 50 B0 7B 09 E1 25 55 FB>)
$$ ##END=
$$ 
$$ hash MD5
$$ 1F BD 8A 70 9F 16 B2 7F 0C 63 B3 C0 82 43 B7 CB
##$RELAX= 
##$RELAX= 
##$RELAX= 
##$RELAX= 
##$RELAX= 
##$RELAX= 
##$RELAX= 
##$RELAX= 
$$ Bruker specific parameters
$$ --------------------------
##$DU= <F:\spectra>
##$EXPNO= 1
##$NAME= <H1>
##$PROCNO= 1
##$TYPE= <nmr>
##$USER= <av>
##$AMP= (0..31)
100 100 100 100 100 100 100 100 100 100 100 100 100 100 100 100 100 100 
100 100 100 100 100 100 100 100 100 100 100 100 100 100 
##$AQSEQ= 0
##$AQ_mod= 1
##$AUNM= <au_zg>
##$AUTOPOS= <>
##$BF1= 200.13
##$BF2= 200.13
##$BF3= 200.13
##$BF4= 200.13
##$BF5= 500.13
##$BF6= 500.13
##$BF7= 500.13
##$BF8= 500.13
##$BYTORDA= 1
##$CFDGTYP= 0
##$CFRGTYP= 5
##$CHEMSTR= <none>
##$CNST= (0..31)
1 1 145 1 1 1 1 1 1 1 1 1 1 1 1 1 1 1 1 1 1 1 1 1 1 1 1 1 1 1 1 1 
##$CPDPRG= <>
##$CPDPRG1= <>
##$CPDPRG2= <>
##$CPDPRG3= <>
##$CPDPRG4= <mlev>
##$CPDPRG5= <mlev>
##$CPDPRG6= <mlev>
##$CPDPRG7= <mlev>
##$CPDPRG8= <mlev>
##$CPDPRGB= <>
##$CPDPRGT= <>
##$D= (0..31)
0 2 0 0 0 0 0 0 0 0.06 0 0 0 0 0 0 0.0002 0 0 0 0 0 0 0 0 0 0 0 0 0 0 
0 
##$DATE= 1753259061
##$DBL= (0..7)
120 120 120 120 120 120 120 120 
##$DBP= (0..7)
150 150 150 150 150 150 150 150 
##$DBP07= 0
##$DBPNAM0= <>
##$DBPNAM1= <>
##$DBPNAM2= <>
##$DBPNAM3= <>
##$DBPNAM4= <>
##$DBPNAM5= <>
##$DBPNAM6= <>
##$DBPNAM7= <>
##$DBPOAL= (0..7)
0.5 0.5 0.5 0.5 0.5 0.5 0.5 0.5 
##$DBPOFFS= (0..7)
0 0 0 0 0 0 0 0 
##$DE= 6
##$DECBNUC= <off>
##$DECIM= 32
##$DECNUC= <off>
##$DECSTAT= 4
##$DIGMOD= 1
##$DIGTYP= 9
##$DL= (0..7)
0 120 120 120 120 120 120 120 
##$DP= (0..7)
150 150 150 150 150 150 150 150 
##$DP07= 0
##$DPNAME0= <>
##$DPNAME1= <>
##$DPNAME2= <>
##$DPNAME3= <>
##$DPNAME4= <>
##$DPNAME5= <>
##$DPNAME6= <>
##$DPNAME7= <>
##$DPOAL= (0..7)
0.5 0.5 0.5 0.5 0.5 0.5 0.5 0.5 
##$DPOFFS= (0..7)
0 0 0 0 0 0 0 0 
##$DQDMODE= 0
##$DR= 18
##$DS= 0
##$DSLIST= <SSSSSSSSSSSSSSS>
##$DSPFIRM= 0
$$ [...]
##$SUBNAM0= <"">
##$SUBNAM1= <"">
##$SUBNAM2= <"">
##$SUBNAM3= <"">
##$SUBNAM4= <"">
##$SUBNAM5= <"">
##$SUBNAM6= <"">
##$SUBNAM7= <"">
##$SUBNAM8= <"">
##$SUBNAM9= <"">
##$SW= 20.6817932712277
##$SWIBOX= (0..15)
0 0 3 0 0 0 0 0 0 0 0 0 0 0 0 0 
##$SW_h= 4139.07284768212
##$TD= 32768
##$TD0= 1
##$TE= 0
##$TE2= 300
##$TE3= 300
##$TEG= 300
##$TL= (0..7)
0 120 120 120 120 120 120 120 
##$TP= (0..7)
150 150 150 150 150 150 150 150 
##$TP07= 0
##$TPNAME0= <>
##$TPNAME1= <>
##$TPNAME2= <>
##$TPNAME3= <>
##$TPNAME4= <>
##$TPNAME5= <>
##$TPNAME6= <>
##$TPNAME7= <>
##$TPOAL= (0..7)
0.5 0.5 0.5 0.5 0.5 0.5 0.5 0.5 
##$TPOFFS= (0..7)
0 0 0 0 0 0 0 0 
##$TUNHIN= 0
##$TUNHOUT= 0
##$TUNXOUT= 0
##$USERA1= <user>
##$USERA2= <user>
##$USERA3= <user>
##$USERA4= <user>
##$USERA5= <user>
##$V9= 5
##$VALIST= <valist>
##$VCLIST= <CCCCCCCCCCCCCCC>
##$VD= 0
##$VDLIST= <DDDDDDDDDDDDDDD>
##$VPLIST= <PPPPPPPPPPPPPPP>
##$VTLIST= <TTTTTTTTTTTTTTT>
##$WBST= 1024
##$WBSW= 30
##$XGAIN= (0..3)
0 0 0 0 
##$XL= 0
##$YL= 0
##$YMAX_a= 4336575
##$YMIN_a= -4143014
##$ZGOPTNS= <>
##$ZL1= 120
##$ZL2= 120
##$ZL3= 120
##$ZL4= 120
##$ABSF1= 10
##$ABSF2= 0
##$ABSG= 5
##$ABSL= 3
##$ALPHA= 0
##$AQORDER= 0
##$ASSFAC= 0
##$ASSFACI= 0
##$ASSFACX= 0
##$ASSWID= 0
##$AUNMP= <proc_1d>
##$AZFE= 0.1
##$AZFW= 0.1
##$BCFW= 1
##$BC_mod= 2
##$BYTORDP= 0
##$COROFFS= 0
##$CY= 19
##$DATMOD= 1
##$DC= 2
##$DFILT= <>
##$DTYPP= 0
##$F1P= 11.0000007629395
##$F2P= -0.999999237060547
##$FCOR= 0.5
##$FTSIZE= 0
##$FT_mod= 4
##$GAMMA= 1
##$GB= 1
##$INTBC= 1
##$INTSCL= 1
##$ISEN= 128
##$LB= 0.05
##$LEV0= 0
##$LPBIN= 0
##$MAXI= 10000
##$MC2= 0
##$MEAN= 0
##$ME_mod= 0
##$MI= 0
##$NCOEF= 0
##$NC_proc= 0
##$NLEV= 6
##$NOISF1= 0
##$NOISF2= 0
##$NSP= 1
##$NTH_PI= 0
##$NZP= 0
##$OFFSET= 16.51637
##$PC= 1
##$PHC0= -275.1915
##$PHC1= 4.101552
##$PH_mod= 0
##$PKNL= yes
##$PPARMOD= 0
##$PSCAL= 4
##$PSIGN= 0
##$REVERSE= no
##$SF= 200.13
##$SI= 16384
##$SIGF1= 0
##$SIGF2= 0
##$SINO= 400
##$SIOLD= 16384
##$SREGLST= <1H.CDCl3>
##$SSB= 0
##$STSI= 0
##$STSR= 0
##$SW_p= 4139.07284768211
##$SYMM= 0
##$S_DEV= 0
##$TDeff= 0
##$TDoff= 0
##$TI= <>
##$TILT= no
##$TM1= 0
##$TM2= 0
##$TOPLEV= 0
##$USERP1= <user>
##$USERP2= <user>
##$USERP3= <user>
##$USERP4= <user>
##$USERP5= <user>
##$WDW= 1
##$XDIM= 8192
##$YMAX_p= 0
##$YMIN_p= 0
$$ End of Bruker specific parameters
$$ ---------------------------------
##NTUPLES= NMR FID
##VAR_NAME=  TIME,          FID/REAL,        FID/IMAG
##SYMBOL=    X,             R,               I
##VAR_TYPE=  INDEPENDENT,   DEPENDENT,       DEPENDENT
##VAR_FORM=  AFFN,          ASDF,            ASDF
##VAR_DIM=   16384,         16384,           16384
##UNITS=     SECONDS,       ARBITRARY UNITS, ARBITRARY UNITS
##FACTOR=    0.0002416,     1,               1
##FIRST=     0,             0,               0
##LAST=      3.9581328,     0,               0
##MIN=       0,             -4143014,        0
##MAX=       3.9581328,     4336575,         0
$$ Real data points
##PAGE= N=1
##DATA TABLE= (X++(R..R)), XYDATA
0@%%%%%%%%%%%%%%%%%%kKj6L0l1L3m0M4l9N7n9O4q0Q1r3R8j07J14j26J38j47J59
$$ 0 0 0 0 0 0 0 0 0 0 0 0 0 0 0 0 0 0 0 -2 0 -16 14 -17 16 -24 20 -19 38 -21 43 -37 44 -49 49 -58 56 -70 68 -79 80
40H0j70J81j95K10k20K48k62K81l15L34l68M10m52N04n66O37p40Q69j029J249
$$ 80 -90 91 -104 106 -114 134 -128 153 -162 172 -196 214 -238 266 -300 337 -403 466 -563 686
60F86j534J938k521L396m778P138j1650K1860n3828L43187J902944K97083j990578
$$ 686 -848 1090 -1431 1965 -2813 4325 -7325 14535 -39293 303894 2206838 2503921 513343
73E13343k900361j755996L07196J984794K285549J288170J34696m69775m10958
$$ 513343 -2387018 -4143014 -3835818 -1851024 434525 1722695 1857391 1387616 976658
82I76658j61733p2697j56245j05467J06145J75973j75331p71614j164382r44690
$$ 976658 814925 742228 585983 480516 586661 762634 587303 -184311 -1348693 -2293383
92b293383j52958P02720J049490Q24575M27968K51988L05946K92434n4175n61397
$$ -2293383 -2446341 -1743621 -694131 130444 558412 810400 1116346 1408780 1354605 793208
102G93208p08006k08475N41321P86143R7059j150814j960830j496439Q6208J681670
$$ 793208 85202 -123273 418048 1204191 1301250 150436 -1810394 -3306833 -3220625 -1538955
112a538955K138394J191396l53562j258604q92380K76969J194526J151629K72609
$$ -1538955 599439 1790835 1437273 178669 -713711 -436742 757784 1909413 2182022
121B182022p18105j139766q86224l95295j13402q4070o7801J02505L41055M21166
$$ 2182022 1463917 324151 -562073 -957368 -1070770 -1154840 -1222641 -1120136 -779081 -357915
131c57915K67992R2450J54686M19368N76737L59795j75007o35635o28866j80837
$$ -357915 -89923 2527 157213 576581 1153318 1513113 1338106 702471 73605 -107232
141a07232K21533J22207m36573r27993q00789k00R03136J193876O75420j61186
$$ -107232 114301 236508 -200065 -1128058 -1928847 -1929047 -1025911 167965 843385 682199
151F82199n87566k66257M61557Q73343N34034k90135r16798q78401l05404K30749
$$ 682199 94633 -171624 289933 1163276 1697310 1407175 490377 -388024 -693428 -462679
161d62679K49568j92907n86853m90048Q1299P06971R28736O30360J13350k20006
$$ -462679 -213111 -406018 -992871 -1482919 -1401620 -694649 234087 864447 977797 757791
171G57791k35070q3778L7184O0338L4222k537j24688m15046p55602q29074l97497
$$ 757791 522721 438943 476127 536465 570687 568150 443462 28416 -727186 -1556260 -1953757
182a953757M10943J108035J163909M75346m55413q98595n23358L49840J010668
$$ -1953757 -1542814 -434779 729130 1204476 749063 -149532 -672890 -323050 687618
191F87618R17743J38671p21068j062396p72141k14732J47842J45640j252K7028
$$ 687618 1605361 1744032 1022964 -39432 -811573 -1026305 -878463 -732823 -734075 -707047
201g07047K69168M65113L69959J5572k99485k58237J52026N82822O33946K13544
$$ -707047 -437879 27234 397193 412765 113280 -144957 7069 589891 1223837 1437381
211A437381m15116q56236q61724m98730m2585K90105M52451M55267K96409P635
$$ 1437381 1022265 166029 -695695 -1194425 -1237010 -946905 -494454 -39187 257222 264857
221B64857l00070m29179j87537L81963R08531R42582L41679n81117j228878j144559
$$ 264857 -35213 -464392 -651929 -269966 638565 1581147 1922826 1341709 112831 -1031728
231a031728l98424M40955P97447N12819j00072n33971m74223m3083L69510M98948
$$ -1031728 -1430152 -989197 -191750 321069 220997 -312974 -787197 -830280 -460770 38178
241C8178L84314K19024J42659J18567q061k87650n43254n50210k68980J23949
$$ 38178 422492 641516 784175 902742 894681 607031 63777 -486433 -755413 -631464
251f31464L63924K84652k1512k79637k94765r2864J77213L78840M46952M02560
$$ -631464 -267540 17112 -4400 -284037 -578802 -671666 -494453 -115613 331339 733899
261G33899K73208L5624k94556n63684n78112k86632J58319M55987L58680q3129
$$ 733899 1007107 1042731 748175 184491 -393621 -680253 -521934 -65947 292733 209604
271B09604n12413n73567j97923L57268P06403O18367K14659j65135k77736j44822
$$ 209604 -302809 -876376 -1074299 -717031 -10628 607739 822398 657263 379527 234705
281B34705L1353N4099r9142k53993k42794q5306O3842Q3394k5996j43680j25262
$$ 234705 266058 320157 221015 -32978 -275772 -361078 -297236 -213842 -239838 -383518 -508780
292e08780M8341K51780L52690L13950J76221J3874j14500k03964k57472k27450
$$ -508780 -460439 -208659 144031 457981 634202 648076 533576 329612 72140 -155310
302a55310r0181P8607J53178O3550j49133l25606k86119r171L28333M98568L99681
$$ -155310 -245491 -166884 -13706 49844 -99289 -424895 -711014 -720185 -391852 106716 506397
313E06397J13903j45756k07122r6809K2575K5938p5078j74989j65470m4018O4970
$$ 506397 620300 474544 267422 170613 193188 219126 144048 -30941 -196411 -240429 -175459
324a75459M3664q3829j87183j41935P0885L28843M44889L34890P4148j90041l25567
$$ -175459 -131795 -215624 -402807 -544742 -473857 -145014 299875 634765 708913 518872 193305
335A93305k77914j02554P8305J72036J41024q346k08810l40809l08869r6670K10796
$$ 193305 -84609 -187163 -108858 63178 204202 195856 -12954 -353763 -662632 -759302 -548506
346e48506M50955M68401K53479n3983k70247k84833j16807Q7791J75914J08286
$$ -548506 -97551 370850 624329 570346 300099 15266 -101541 -13750 162164 270450
356B70450l6463j61993k07664j76547j16161n3997L1541J49781K56700K92680
$$ 270450 233987 71994 -135670 -312217 -428378 -482375 -450834 -301053 -44353 248327
366B48327K11675K4117j75783k57707j73888J3777J85337K24436Q8975j46219
$$ 248327 460002 484119 308336 50629 -123259 -109482 75855 300291 389266 243047
376B43047l39252l78996k36047L3978K93615M09445L34748J20821j22305k61211
$$ 243047 -96205 -475201 -711248 -677270 -383655 25790 360538 481359 359054 97843
386I7843k15377l0044J64923K49585J68703l6360k38467l21427k61170j05295
$$ 97843 -117534 -147578 17345 266930 435633 399273 160806 -160621 -421791 -527086
396e27086O6137J75658J95137J57477J01078L2578l0341o3142n8988j7808N3212
$$ -527086 -460949 -285291 -90154 67323 168401 200979 170638 107496 48508 30700 83912
407H3912J10719R8106M642j34423k58969k89146j77844K9552K25099L15079K52323
$$ 83912 194631 292737 297379 162956 -96013 -385159 -563003 -533451 -308352 6727 259050
418B59050O5588j28802k04212j29598L5539J89443K30299J23745o3166k23303
$$ 259050 324638 195836 -8376 -137974 -102435 87008 317307 441052 377886 154583
428A54583k86434k31212q6918O4246J54416J70372J26960M7735k5317n5726m2132
$$ 154583 -131851 -363063 -449981 -385735 -231319 -60947 66013 113748 88431 32705 -9427
439i427K297O5609J12656J07491M8220m9133j56485k25516k12892j20787J8664
$$ -9427 -7130 58479 171135 278626 326846 277713 121228 -104288 -317180 -437967 -419303
450d19303J58614K33111J91018N3772r8031j76017j24894L9050K09508K67295
$$ -419303 -260689 -27578 163440 217212 119181 -56836 -181730 -142680 66828 334123
460C34123J65959m4674k48671l29338k45543o5578J02394J84592J60611O5338
$$ 334123 500082 455408 206737 -122601 -368144 -433722 -331328 -146736 13875 79213
470G9213l2530q0824p2738j7872O3397J35015J60981J26146K9233r9704k01564
$$ 79213 46683 -34141 -106879 -124751 -61354 73661 234642 360788 390021 290317 88753
481H8753k24600j65583n2396P0295J45629J41249P2223k0970r6079j06236l2677
$$ 88753 -135847 -301430 -353826 -283531 -137902 3347 75570 54600 -41479 -147715 -180392
492a80392R1053K00301K31247J41306m3238k26317l02295k34336n9861J22305
$$ -180392 -89339 110962 342209 483515 440277 213960 -88335 -322671 -382532 -260227
502b60227K01689J42348K841j17709j50214p8980M8384J53559J93140J65957Q3629
$$ -260227 -58538 83810 86651 -31058 -181272 -260252 -211868 -58309 134831 300788 384417
513C84417k5388j21386j73947j72145j11019j0648P5031J01606O5869j0518q3291
$$ 384417 359029 237643 63696 -108449 -219468 -230116 -155085 -53479 12390 1872 -81419
524h1419j02004n0111M6041J45127K04241J82932P7645o2510j81025k26759j69603
$$ -81419 -183423 -233534 -187493 -42366 161875 344807 422452 359942 178917 -47842 -217445
535b17445l5812R5657J47621R8873k2762j40383j69888q8412N4147J83851K36516
$$ -217445 -253257 -157600 -9979 88894 66132 -74251 -244139 -332551 -278404 -94553 141963
546A41963J82948N7479o7060j41169j53517j06849l1326L0193N5757M2833m737
$$ 141963 324911 382390 315330 174161 20644 -86205 -117531 -87338 -31581 11252 6515
557F515o6091j03361q8517k7393P1151J65788K02332J58586N4179p1379j65737
$$ 6515 -59576 -162937 -251454 -278847 -207696 -41908 160424 319010 373189 301810 136073
568A36073j76316r9699J1722R5498J06330L1699q3956j62909j54762o3409P4418
$$ 136073 -40243 -139942 -128220 -32722 73608 105307 21351 -141558 -296320 -359729 -285311
579b85311J91024K22604J60381M5232p2505j42822j33190n7362K8309P8018O7415
$$ -285311 -94287 128317 288698 333930 261425 118603 -14587 -71949 -43640 34378 101793
590A01793l045r1380j39037j21554n2718L9729J18157J49208J34465R2114K7784
$$ 101793 98748 7368 -131669 -253223 -305941 -266212 -148055 1153 135618 227732 255516
601B55516m5354r7248j02971o1652J2721P6261P5166j683j03730j67913j48087
$$ 255516 210162 112914 9943 -51709 -38988 37273 112439 110756 7026 -160887 -308974
612c08974m1151R4281J78663J75945J09106J8091n3647p7801o1768k6607J4758
$$ -308974 -350125 -255844 -77181 98764 207870 225961 172314 94513 32745 6138 20896
623B0896M7909M5460j034p2766j35439j46762q0371L4420J29544J59574J24244
$$ 20896 68805 114265 113231 40465 -94974 -241736 -322107 -287687 -158143 1431 125675
634A25675N2333j2071l9152m1073l7290k6530j504L1580M8289K0027o2868j54025
$$ 125675 178008 165937 126785 85712 48422 21892 20388 51968 100257 120284 57416 -96609
646i6609j76948r5243N3558J84887K20743J39078J182r8255j10006n2459K3867
$$ -96609 -273557 -368800 -315242 -130355 90388 229466 230648 132393 22387 -30072 -6205
657f205O8672O5138L1388j4342p1943j30710j56666j18325j2353J22731K10318
$$ -6205 62467 127605 158993 144651 72708 -58002 -214668 -332993 -345346 -222615 -12297
668a2297J87721O7877o7034j35156j00349K3Q7894J07724O3371o154p2243j20008
$$ -12297 175424 243301 176267 41111 -59238 -59215 28679 136403 199774 193620 121377 1369
680A369j44705j35928p2249M9233J77691K27136J52736j0830j59365j87957p1425
$$ 1369 -143336 -279264 -351513 -302280 -124589 102547 255283 244453 85088 -102869 -174294
691a74294J02150K05442J71211K6599j33335k12421j84321r5897j605P2723J20551
$$ -174294 -72144 133298 304509 331108 197773 -14648 -198969 -294866 -296471 -223748 -103197
702a03197J34145J04307K3151p9691j33570q3985M7396J72444J96806Q7179r3193
$$ -103197 30948 135255 158406 78715 -54855 -138840 -91444 81000 277806 364985 271792
713B71792k23569k24700j18115J5086R9845J08780P4170L9976J3179k1972n7702
$$ 271792 48223 -176477 -294592 -279506 -179661 -70881 3289 43265 56444 34472 -23230
724b3230o0169l002R8603J79468J53322N757j73813k62568k03372l4770J24581
$$ -23230 -83399 -86401 12202 191670 344992 350749 176936 -85632 -289004 -323774 -199193
735a99193J70410R2982k0818q0408o2523l01N0423O0894N9072P2991P9663L8048
$$ -199193 -28783 64199 43381 -37027 -99550 -99851 -49428 11466 70538 143529 223192 261240
747B61240n4660j52366j86051j12498K6499J25098J13230J6359p7960r2141j6905
$$ 261240 206580 54214 -131837 -244335 -217836 -92738 20492 36851 -41109 -133250 -150155
758a50155P7851J09487O9371J7762L186K1825L0221j5092j02315j51482j05209
$$ -150155 -72304 37183 106554 124316 127502 149327 179548 164456 62141 -89341 -194550
769a94550O192R4807R4602R697q0626q5649K065J00818J28583P6269l940l9676
$$ -194550 -188358 -93551 1051 10748 -69878 -155527 -153462 -52644 75939 152208 148268 108592
781A08592p972L4592J5668o4328j32889j25825l5651P2162J06705M4166m5179
$$ 108592 100620 135212 150880 86552 -46337 -172162 -207813 -135651 -28946 15220 -29959
792b9959p5824k6415N8313J05892Q1088K3113k046J6478K7546j6400j04369j65963
$$ -29959 -105783 -132198 -73885 32007 113095 136208 134162 150640 178186 161786 57417 -108546
804a08546j28778M370J33027J50881M5423r5157j55483q0146P0851J75758J64775
$$ -108546 -237324 -232954 -99927 50954 96377 1220 -154263 -234409 -163558 12200 176975
815A76975P2759j9733o0234n7346n8416q7762j04317n4938M8922J28789J09789
$$ 176975 249734 230001 169767 112421 54005 -33757 -138074 -193012 -144090 -15301 94488
826I4488j3676j50817j77712n3776J32771K46244K11620O0967r3950j55551j18869
$$ 94488 80812 -70005 -247717 -301493 -168722 77522 289142 350109 256159 100608 -18261
837a8261n0856q692M841J8364M3623N3147K467r7434j63590j11684N3309K29082
$$ -18261 -69117 -77809 -72968 -54604 -10981 42166 44633 -52801 -216391 -328075 -274766 -45684
849d5684K85916J66779n1583k14517k17149q5724O5850J27575P8052j5834p4052
$$ -45684 240232 407011 355428 140911 -76238 -161962 -96112 31463 109515 93681 19629
860A9629q1155p0463o6192n0320J1685J21196K12474J96257N3880j28364k20944
$$ 19629 -61526 -131989 -198181 -248501 -236816 -115620 96854 293111 346991 218627 -2317
871b317j55148J7091J58664J61646L4843j14175j80753j37908m0389L5335O3835
$$ -2317 -157465 -140374 18290 179936 214779 100604 -80149 -218057 -258446 -223111 -159276
882a59276P7879J03176J18664Q2121j6155j20229j44543n2607R0819J64063J01678
$$ -159276 -81397 21779 140443 222564 206409 86180 -58363 -110970 -20151 143912 245590
893B45590n7020j96031k09515r2872N6493J32088J10231M4820L446J1690L2267
$$ 245590 188570 -7461 -216976 -309848 -253355 -121267 -11036 33784 37230 48920 81187
904H1187J7201k7212m7252j1405N3230Q2473K7982q8335j71914j48650l3312Q5771
$$ 81187 98388 71176 23924 12519 65749 148222 176204 87869 -84045 -232695 -266007 -180236
916a80236J27764P6836m710l5796L631N6123O2117J7276l4581m1087M136M3373
$$ -180236 -52472 24364 19654 -16142 -12511 43612 105729 123005 88424 47337 51473 94846
928I4846J7115o2358j26259j15562k9913O8037J02471N6946o743k3452J6383O5469
$$ 94846 111961 49603 -76656 -192218 -222131 -154094 -51623 5323 -1420 -24872 -8489 56980
940E6980O8678J2720n1880n9442o023M6208L9622l2208j14223j33331o4069M1140
$$ 56980 125658 138378 86498 27056 21033 67241 106863 74655 -39568 -172899 -236968 -195828
952a95828J03198R3589M0954k621m404J9567K4065j876k4366j2438K5152M7867
$$ -195828 -92630 959 41913 39292 34888 54455 78520 76644 52278 39840 64992 112859
964A12859J4807p2157j47235j38966m0429Q2366J49997J20232K5146n4956o4539
$$ 112859 127666 55509 -91726 -230692 -271121 -188755 -38758 81474 106620 51664 -12875
975a2875j8134L4452N7726M6701K1656N405j2450n3773j07444j29028q3817J9039
$$ -12875 -31009 3443 61169 107870 129526 134931 122481 68708 -38736 -167764 -251581 -232542
987b32542J22142J52167Q3623k9287j01569q5554m16R1170J23123Q0564N229n8211
$$ -232542 -110400 41767 125390 96103 -5466 -91020 -91436 -266 122857 203421 208650 150439
999A50439r5076j04629r2671n8924J440P4567J16879R0111P364p6956j02309m1503
$$ 150439 55363 -49266 -141937 -200861 -199421 -124854 -7975 82136 89500 12544 -89765 -131268
1011a31268O7318J43605J32169M5042n9892j25437j24162p6018k1705J6966M1858
$$ -131268 -63950 79655 211824 256866 196974 71537 -52625 -128643 -150348 -133382 -91524
1022i1524N3054M4443J4693k7881n7448m0279K7724J03412J31738Q6625j1094
$$ -91524 -38470 5973 20666 -7215 -64663 -104942 -77218 26194 157932 244557 233463
1033B33463j05351j38638j00780k9006K9629N1145L6509Q123j2817k3032k5474
$$ 233463 128112 -10526 -111306 -140312 -110683 -59538 -23029 -14906 -27723 -50755 -76229
1044g6229j2631K2137O8296R8987R0091L0357n3013j09588j08356n8421N845M4022
$$ -76229 -88860 -66723 1573 100560 190651 221008 167995 58407 -49949 -108370 -102525 -58503
1056e8503L7466L756k4352l1763k0977J280K6676M9565O9422P6565N3447K164
$$ -58503 -21037 -17281 -41633 -73396 -94373 -93093 -66417 -16852 52570 129135 182582 184746
1068A84746n6776r2654q7142m4085R570L8105K9396P54k7927l9620k3669P951
$$ 184746 127970 35316 -51826 -95911 -86341 -48236 -18840 -18086 -46013 -85633 -109302 -101351
1080a01351M0805O7202P9398O6951K8200k1882o7107q5864o5856j9567K0695L4102
$$ -101351 -60546 6656 86054 153005 181205 159323 92216 6352 -59504 -79071 -58376 -24274
1092b4274J8133j6976m6449m6930j6841K5486O6501Q9422Q1482M5193l716n0490
$$ -24274 -6141 -23117 -69566 -116496 -133337 -107851 -41350 48072 129554 174747 171031 120541
1104A20541p7193o7961l1787P528K9054K4376o940m4103n9493m2785j729N2328
$$ 120541 43348 -24613 -56400 -48872 -19818 4558 -2382 -46485 -105978 -148763 -150492 -98164
1116i8164R4223J01557O9517J3772m3820p7376o8688k8299J2956L3124K2946j3569
$$ -98164 -3941 97616 167133 180905 137085 59709 -8979 -37278 -24322 8802 31748 18179
1128A8179n2959o7722n0720j1742L8052P9619R4078P7936L6012j7201n8674o4175
$$ 18179 -34780 -102502 -153222 -164964 -126912 -47293 46785 124721 160733 143532 84858 20683
1140B0683l4778O321L2871K7803j0992n5687p5204n9583j8931K8624O5180P6500
$$ 20683 -14095 -7774 25097 52900 41908 -13779 -88983 -148566 -167497 -138873 -73693 2807
1152B807O7278M5046R582k5842m4727l7890j1219K0623L2912Q144l9240p5952
$$ 2807 70085 115131 124713 98871 54144 16254 5035 25658 58570 66714 27474 -48478
1164d8478p8595m2631J2895N6388O8586N7204L9361K1076M149j0258k2440k4200
$$ -48478 -127073 -169704 -156809 -100421 -31835 25369 64730 85806 89955 79697 57257 33057
1176C3057p130J5825J9507n469m6300p7053p3099k8169K8053O3806O7061M8608
$$ 33057 25927 41752 61259 55790 9490 -67563 -140662 -168831 -140778 -76972 -9911 38697
1188C8697K3928Q388J196p444j7610j5155J409J8775J9727q835n6348q9150p7170
$$ 38697 62625 71013 72209 64765 47155 32000 33409 52184 71911 63076 6728 -82422 -159592
1201a59592k2524M2952Q3167P8687M1508K699j3311j2004n005J296O294J2599
$$ -159592 -182116 -139164 -55997 22690 64198 66897 53586 41582 36577 37873 44167 56766
1213E6766J8407Q220k8305p4149r5392o9671k212P2038J05507P7065J6925l2428
$$ 56766 75173 83393 55088 -19061 -114453 -184124 -186336 -114298 -8791 68274 85199 52771
1225E2771m5063j9199J7879M0097L7308K1885K35k9640o2736q5968q1554l4800
$$ 52771 7708 -11491 6388 46485 83793 105678 105913 76273 13537 -72431 -153985 -188785
1237a88785M0378R7598R7927M3657k8323o9923n0588J2832O9412Q0818M7334q396
$$ -188785 -148407 -50809 47118 90775 62452 -7471 -58059 -45227 24185 105003 152337 143941
1249A43941n5653p6078p3186n8753k9690J5372O0247P8190N5899p52n6685o6370
$$ 143941 88288 12210 -60976 -119729 -149419 -134047 -73800 4390 60289 59537 2852 -63518
1261f3518j6917N6577J00276Q6845J9533n7582r6432q5840m7816r008J9842L4173
$$ -63518 -80435 -23858 76418 163263 182796 125214 28782 -57058 -104874 -113882 -94040 -59867
1273e9867L7772L1930J0520k4221m4074k5307K5903P9906R6761N4262k6639r0460
$$ -59867 -22095 9835 20355 -3866 -47940 -73247 -47344 32562 129323 183585 156946 66486
1285F6486j00362o1156l439L5830L6282J2604m739r450r252p988k534J2588L9949
$$ 66486 -33876 -95032 -98471 -62641 -26359 -13755 -18494 -27944 -37196 -45184 -47718 -35130 4819
1298D819O6578O2026J6997m4754q3083p6455k9885K2283M1128K0072j1670k8387
$$ 4819 71397 133423 150420 105666 22583 -53872 -83757 -61474 -20346 -274 -11944 -40331
1310d0331k1152N2J7588K1045K0995L1761M3126L6985P074l6350o6734n9830k0134
$$ -40331 -61483 -61431 -43843 -22798 -1803 29958 73084 110069 117143 80793 14059 -45771 -65905
1323f5905J9328L1529J4015j5199l0384j8689N807K1990K4038K2432K6007L2457
$$ -65905 -46577 -15048 -1033 -16232 -46616 -65305 -59498 -37508 -13470 8962 34969 67426
1335F7426L0848O791l4039o1763n5775k0483K0085L8013K1352j3986l6039l0924
$$ 67426 98274 105065 71026 9263 -46512 -66995 -46910 -8897 12455 -1531 -37570 -68494
1347f8494n914K0606L6357L8218L5161L0268J5633j4275m5392n9260m2978k525
$$ -68494 -74408 -53802 -17445 20773 55934 86202 101835 87560 42168 -17092 -60070 -62595
1359f2595L6437M3732J3943k8096n2474m3161l986L8692N8647N3263L3582P344
$$ -62595 -26158 17574 31517 3421 -49053 -92214 -96200 -57508 1139 54402 87984 95328
1371I5328j7013l5214m3445l6945j1393K2654M0251K7472j0621n0240o4180l5625
$$ 95328 78315 43101 -344 -37289 -48682 -26028 14223 41695 31074 -19166 -83346 -118971
1383a18971J7878O3270P7046N5226J1652k7208m4914m0888k3561N98K1762K9375
$$ -118971 -101093 -37823 39223 94449 106101 78893 33979 -6909 -30470 -29872 -8110 21265
1395B1265J9765o768l9274n7985m5131k881M4968P4299O7552K7627k0725m8771
$$ 21265 41030 34262 -5012 -62997 -108128 -111009 -66041 8258 75810 103437 82712 33941
1407C3941m6534k1848J1298L1925L0160J1952j4354l9011m9239l9276j0240K5145
$$ 33941 -12593 -34441 -23143 8782 38942 50894 36540 -2471 -51710 -90986 -101226 -76081
1419g6081N4567O1720L9286M43l2222m4772l0955J584K9428L5375J9238r138l8059
$$ -76081 -21514 40206 79492 79935 47713 2941 -28014 -26430 2998 38373 57611 48473 10414
1432A0414m9281l8815j3057J5028L9471M8592L7072J3403j1967l0585l1712j2908
$$ 10414 -38867 -77682 -90739 -75711 -36240 12352 49424 62827 50860 20275 -11437 -24345
1444b4345J3964L1436L0808J0415k3873m8453m9503k8851L330L2887M6297L7148
$$ -24345 -10381 21055 51863 62278 38405 -10048 -59551 -88402 -85072 -52185 -5888 31260
1456C1260J7389k923k0174k5975j6410K157K0424L2548K5628k289l6990n5746
$$ 31260 48649 45726 25552 -423 -16833 -14676 5748 38296 63924 61635 24645 -31101
1468c1101n0119j9409K3575N1763N0804K6512l589k6103l0021j5158M543K0744
$$ -31101 -81220 -100629 -77054 -25291 25513 52025 48436 22333 -7688 -22846 -18303 2441
1480B441L0093K7417P818k1124m6431n5958l9493J519M3706N8960M1959M854l1550
$$ 2441 32534 59951 67769 46645 214 -55744 -95237 -93718 -50012 8948 50907 55761 24211
1493B4211m1944k2507J0285L3572L8443K5985J859k1780l7850m5657l9003j1770
$$ 24211 -17733 -40240 -29955 3617 42060 68045 69904 48124 10274 -35383 -74386 -86156
1505h6156K3261M8863M9277K1369k1714m7800l8739j532L8059N6165M0557L113
$$ -86156 -62895 -14032 35245 56614 34900 -12900 -51639 -53171 -15112 41053 81610 84723
1517H4723l1153m4537l9894k4562n648J1496K5456L2224K3823j945k9867l8034
$$ 84723 53570 9033 -30861 -55423 -61071 -49575 -24119 8105 31928 29983 116 -37918
1529c7918j8870J9936N3819N5242K1865k2654n0182m7623k3688M778J7075J4409
$$ -37918 -56788 -36852 16967 72209 94074 71420 21238 -26385 -50073 -45295 -28220 -13811
1541a3811R325P014K295n409j5387j8814l327K5182M6406M0238P988l0732n1117
$$ -13811 -4486 2528 4823 -586 -15973 -34787 -38114 -12932 33474 73712 81700 50968 -149
1554a49l8167n971J9526K1035O568q027j0173j480M270r74p737j953J7018L5733
$$ -149 -38316 -44287 -24761 -3726 2842 -5185 -15358 -16838 -12568 -13542 -21279 -23232 -6214 29519
1568B9519L5710R361k8221m7710l6208n639K0497K3723O670j1204j3357l073M189
$$ 29519 65229 74590 46369 -1341 -37549 -43188 -22691 1032 7702 -3502 -16859 -19932 -15743
1581a5743J356n088k867J4881L7580L8547R466l0859n4846m2984n277L2447L8013
$$ -15743 -14387 -19475 -22342 -7461 30119 68666 78132 47273 -7573 -50557 -55834 -23387 14626
1594A4626J5438j4253k8622k2055m730O830P991J1689K5904L6428K8138l213m3285
$$ 14626 30064 15811 -12811 -34866 -39596 -32766 -24775 -13086 12818 49246 77384 74171 30886
1607C0886o2405l9296J1570N1649N1479J3780l3772n5243l6862O14K7786L4770
$$ 30886 -31519 -70815 -59245 -7596 43883 57663 23891 -31352 -68214 -67600 -39814 -5044
1619e044K8914K0189J3348K126k0408m4999m4806j2422L3454N9668M2947j1241
$$ -5044 23870 44059 57407 59533 39125 -5874 -50680 -63102 -29648 30020 72967 61726
1631F1726o2903p0981l1042K5803O1844N8045K4887r439k3806k2600k0387j7360
$$ 61726 -1177 -72158 -103200 -77397 -15553 42492 67379 57940 34134 11534 -8853 -26213
1643b6213p502J2756L5455M0608J0349l9691p0863n6919k409N8336Q1527N0497
$$ -26213 -33715 -20959 14496 55104 65453 25762 -45101 -102020 -104429 -46093 35434 85931
1655H5931o846m7551m9364k1751R878K4204J9461J1934R674K552j6532m0385m8396
$$ 85931 79085 31534 -17830 -39581 -29703 -5499 13962 25896 35570 38122 21590 -18795 -67191
1668f7191k5506K4274O7223O6748K1682l4661o2416m4169L743M2045M2889J6313
$$ -67191 -92697 -68423 -1200 65548 87230 52569 -9847 -54016 -50273 -8228 34661 50974
1680E0974j1684k3931k0025j3417j5117j7434k918K5566M5573L7846K675l8044
$$ 50974 39290 15359 -4666 -18083 -33200 -50634 -53552 -27986 17587 55433 58108 20064
1692B0064n0013k1555K3540M8399L5804j666l3670l7082j5440M715P480n46l243
$$ 20064 -29949 -51504 -27964 20435 56239 54573 20903 -16179 -31619 -26904 -19424 -19970 -23213
1705b3213O755K2990K4739M033k3838l1782j2164K0690L8695K5333r757l5815
$$ -23213 -16458 6532 31271 35304 11466 -20316 -32480 -11790 26905 52238 42481 6666
1717F666l2884r609J1640J4506J559q724j093J7615K4733R587j6008l0031j7655
$$ 6666 -26218 -35827 -24187 -9681 -8122 -16846 -17939 -324 24409 33996 17988 -12043 -29698
1730b9698J3365L4847K6509k831k8762l3167j5635O076J2811L999j719M616J6982
$$ -29698 -16333 18514 45023 42192 13430 -19737 -35372 -29296 -16485 -12486 -14205 -9589 7393
1743G393K0190M803k0401l1718j4890J8071L9392L1741j365l5666m4483k4713
$$ 7393 27583 32386 11985 -19733 -34623 -16552 22840 54581 53216 17550 -26933 -51646
1755e1646M704K1306K1492J1068N070M567L746p584k0646j9398K3K7610M0908
$$ -51646 -46942 -25636 -4144 6924 11994 16561 20307 12723 -7923 -27321 -27298 312 41220
1768D1220K4756j5697m8894n0607k1456J7809M1689L4779R675j1253j8356j4677
$$ 41220 65976 50279 1385 -49222 -70678 -52869 -11180 23599 33274 22021 3665 -11012
1780a1012p356n59O041J7994K8219K3855j600l4271n1289l9097j041L8369N0295
$$ -11012 -18368 -18927 -12886 5108 33327 57182 55582 21311 -29978 -69075 -70116 -31747 18548
1793A8548K8581p464l2822l3656j2932J1306K3888K3434J8352R924l938k0578
$$ 18548 47129 39665 6843 -26813 -39745 -28439 -4551 18883 37235 47159 43221 22643
1805B2643l3920l4435j4525J8709M1305L6524P975k5439m1148k7266M716L0987
$$ 22643 -11277 -45712 -60237 -41528 -223 36301 44276 18837 -22311 -49577 -44861 -13874
1817a3874L6473K4395L371j3788k0968k2196k0604j1604M816K1259K7018J6610
$$ -13874 22599 46994 50365 36577 15609 -6587 -27191 -38795 -33979 -12720 14298 30908
1829C0908p660k9942l1713j0463J8739L6796L4469J3831j1777k4543k3358j5633
$$ 30908 23248 -6694 -38407 -48870 -30131 6665 41134 54965 43188 18645 -4713 -20346
1841b0346m998M527J0598J3729J1832N73j5717k4146j7461K558K5000L5617K6576
$$ -20346 -25344 -20817 -10219 3510 15342 15915 198 -23948 -41409 -38851 -13851 21766 48342
1854D8342K325j8694k6362k1277p624N357J0867J0312P745J37r969j7460j6564
$$ 48342 50667 31973 5611 -15666 -23290 -17933 -7066 3246 10991 11128 1159 -16301 -32865
1867c2865o167J2021K8362L0428J6448m330k1659k6169j6908p58J0582J4295J0978
$$ -32865 -39032 -27011 1351 31779 48227 43897 22238 -3931 -20839 -21597 -11015 3280 14258
1880A4258J258j0123j6818j7436j0718M669K0937K8702K2977P506j2341k3969
$$ 14258 15516 5393 -11425 -28861 -39579 -34910 -13973 14729 37706 45212 32871 8902
1892H902k1616q325O483J5700J5652M626q995j9473k1405j4166J642J9006K7794
$$ 8902 -12714 -21039 -14556 1144 16796 21422 12427 -7046 -28451 -42617 -40975 -21969 5825
1905E825K4731J0908p351k1236k0741j0128M618J4797J6495P244o458j7994k3236
$$ 5825 30556 41464 34113 12877 -7864 -17992 -13374 1423 17918 25162 18704 710 -22526
1918b2526j8763l900J4242K5501K5914J4956l427j7302j8421r618L872J3835J4692
$$ -22526 -41289 -45189 -30947 -5446 20468 35424 31997 14695 -3726 -13344 -9472 4363 19055
1931A9055N978n579j4322j9051j7458q601M936J6622K3256J9834N221j0479j7308
$$ 19055 25033 19454 5132 -13919 -31377 -39978 -35042 -18420 4836 24670 29891 19412 2104
1944B104j2682n54J2439J6389P908l651j1877j6100j4416q914k541N172J3792
$$ 2104 -10578 -11132 1307 17696 25604 21953 10076 -6024 -20440 -29354 -31895 -26723 -12931
1957a2931J9928J4684K617j0636j5810j0746M891J6802J5199M758q145j7044j7377
$$ -12931 6997 21681 24298 13662 -2148 -12894 -8003 8799 23998 28756 20611 3567 -13810
1970a3810j0316m693O82P144J4331J6611J1852j05j3717j8495p942R842K1878
$$ -13810 -24126 -28819 -28137 -20993 -6662 9949 21801 21696 7979 -10516 -18458 -8616 13262
1983A3262J9619M832j4875k5052k1054r404J297R074J2980J3417J1878N117p986
$$ 13262 32881 37713 22838 -2214 -23268 -32672 -31375 -22301 -9321 4096 15974 21091 13105
1996A3105j8564j6097j089J8910K9998K1694l033k7508l4301k3659k450J6170
$$ 13105 -5459 -21556 -22645 -3735 26263 47957 44924 17416 -16885 -40544 -42994 -26824
2008b6824K1378J5592O364j089q313j3747j3033m206J1096K6789K8805J0950j7194
$$ -26824 -5446 10146 16510 15421 7108 -6639 -19672 -23878 -12782 14007 42812 53762 36568
2021C6568l7691l6949j3948J5394L1843K5328O379j2212k0829j5781m447N623
$$ 36568 -1123 -38072 -52020 -36626 -4783 20545 26924 14712 -6117 -21898 -26345 -20722
2033b0722J3462K0583K2098J2042p746k7797l6952k3836N632L0842L4442J5168
$$ -20722 -7260 13323 35421 47463 39717 11920 -25032 -48868 -43236 -12394 22048 37216
2045C7216j3107l1043k7149n807J5175K3981K1689J2255J603p014j5761k2010
$$ 37216 24109 -6934 -34083 -39890 -24715 -734 20955 33210 34813 27799 12038 -9972
2057i972j9678l997J5952K7530K0865k096k6057l2379j5701J1024K9633K8958
$$ -9972 -29650 -33647 -17695 9835 30700 28604 2547 -29832 -45533 -34509 -4876 24082
2069B4082J2798o043j4706j2842r155n207k750K195R825J3899P035r219k2593
$$ 24082 36880 30837 16131 3289 -5866 -11073 -13823 -11628 -1803 12096 19131 9912 -12681
2082a2681k0949l604J8631K9796K1316Jj5161j7903q673K995O229J916k797j91
$$ -12681 -33630 -37234 -18603 11193 32509 32510 17349 -554 -9227 -6232 -3 1913 -884 -1075
2096a075L380K450m561j2362j2904m02J5975K2632J4160j761j4554j4723l450
$$ -1075 2305 4755 194 -12168 -25072 -25474 -9499 13133 27293 25532 10978 -3745 -7195
2109g195O171N810j154o044m462K108O153P28r785j2185k697J1574K0932J7496
$$ -7195 -1024 4786 3632 -2412 -6874 -4766 1387 2115 -7670 -19855 -22552 -10978 9954 27450
2123B7450J527j3436j6077q533Q67N101L305q45n14L122K450n217j2601j1688
$$ 27450 28977 15541 -536 -9069 -8202 -3101 204 -641 -1155 1967 4417 -800 -13401 -25089
2137b5089p69J6741K6727J9085j463j9059k3806j3601K983J4097J2771L510l444
$$ -25089 -25858 -9117 17610 36695 35232 16173 -7633 -21234 -18251 -4154 8617 12127 8683
2150H683p607r507q470o441p74J1094K2517K2138P643j2287k6392k4120m923J5385
$$ 8683 1076 -8431 -16901 -23342 -24116 -13022 9495 31633 39276 26989 597 -23523 -28446 -13061
2164a3061K3460J4459j841j7330k1380j3235k154Q263J4182J8814J5739O673o342
$$ -13061 10399 24858 23017 5687 -15693 -28928 -31082 -22819 -8637 10177 25916 32589 26247
2177B6247j8708k2464j0807Q674K1736K0641N667j6001k7635k2848n142J1667
$$ 26247 7539 -14925 -25732 -17058 4678 25319 30986 14985 -12650 -35498 -40640 -28973
2189b8973K2467K1286J1422J31q175j2838j3954o840M346J3879J6205Q138q300
$$ -28973 -6506 14780 26202 26333 18158 5320 -8634 -15474 -11128 2751 18956 27094 18794
2202A8794k2855k4503j2716O201K0973K4666J4048nj0067j2708q873n97O069Q869
$$ 18794 -4061 -28564 -41280 -35079 -14106 10560 24608 24603 14536 1828 -7045 -7642 -1573 7296
2216G296Q073L599n375j3506j7473j2982k253J1427J9336J6376O001m897j0630
$$ 7296 15369 18968 13593 87 -17386 -30368 -32621 -21194 -1858 14518 20519 15622 4992
2229D992r293j013O111Q200N818J354n213r362j0843r823n774J982R623J3559
$$ 4992 -4301 -5314 797 8997 14815 16169 10956 1594 -9249 -19072 -24846 -22864 -13241 318
2243C18J1836M418m885r391o914MO997R504O592j345q486j1863j1060q015j281
$$ 318 12154 16572 11687 2296 -4618 -4614 2383 11887 18479 17134 8648 -3215 -14275 -22290 -23571
2258b3571M957R819J2566R979K411n894r792q170N12R998J2939P428l212j2977
$$ -23571 -18614 -8795 3771 13750 16161 10267 475 -7695 -7183 2815 15754 23182 19970 6993
2272F993j7185j3101l693N171J0674J2589R881L102l405q630r174m281O575J4007
$$ 6993 -10192 -23293 -26986 -21815 -11141 1448 11329 14431 11026 2396 -6778 -11059 -4484 9523
2286I523J3780M839r320k0796k0677r369M529J5042J6795R608q98p011q109o202
$$ 9523 23303 28142 18822 -1974 -22651 -32020 -27491 -12449 4346 13954 13056 6045 -2064 -8266
2300h266r70N996J0797J1311O997m115j6573k0881j4525k6J4418K0327J3081j328
$$ -8266 -9236 -3240 7557 18868 25865 21750 5177 -15704 -30229 -30255 -15837 4490 17571 16243
2314A6243j1924j2921o210L756J1540J1003O876K019l488j0328j3855j2525n476
$$ 16243 4319 -8602 -14812 -11056 484 11487 18363 20382 16894 6566 -7289 -19814 -25290
2327b5290N926J5607J5605M624p707j4356j0780J602J2598J4444P637j230p585
$$ -25290 -19364 -3757 11848 16472 8765 -5591 -16371 -14769 -2171 12273 19910 18680 11095
2340A1095q806o696m699m089j748M375R478Q992K831o425j1927o581M603J2716
$$ 11095 2289 -4407 -9106 -13195 -14943 -10568 -1090 7902 10733 4308 -7619 -14200 -9597 3119
2354C119J2563M207n912j0592p427j837l65j622k346J19N519R432N551l691j0015
$$ 3119 15682 19889 13977 3385 -4042 -5879 -6244 -7866 -10212 -10093 -4574 4858 10409 6718 -3297
2369c297p360J536J0673J3072M368o028j0907q022l104R29M66j164M30O896R942
$$ -3297 -10657 -9121 1552 14624 18992 12964 2057 -5965 -9069 -8140 -7674 -8838 -8408 -1512 8430
2384H430M265n033j2392j0427J650J4762J7019O834p562j6501j5606n028M826
$$ 8430 12695 7662 -4730 -15157 -13507 1255 18274 25108 17546 1045 -14561 -19589 -14763
2397a4763P766N832M075L540K381j522p808j1303n369Q807J9088J7116K311j6213
$$ -14763 -6997 -1165 2910 6450 8831 7309 -499 -11802 -17171 -8364 10724 27840 30151 13938
2411A3938k5499j8049J200J5191J8260R985j440p965p293m949l388n62M663J1899
$$ 13938 -11561 -29610 -28410 -13219 5041 15026 13586 5621 -1672 -6621 -10009 -10571 -5908 5991
2425E991J4526P943p398k3121k3820q881J1771K4064K0380K882j4348j8301j0236
$$ 5991 20517 28460 21062 -2059 -25879 -34760 -22989 1075 21455 24337 9989 -8312 -18548
2438a8548J974J0049J1272P432M738K164l819j2561j7493j3016J621J7724K3075
$$ -18548 -16574 -6525 4747 12179 16917 19081 15262 2701 -14792 -27808 -26187 -8463 14612
2451A4612J1735q357k1313j9349l153J4548K0667J2746J80q528r859p614n490
$$ 14612 26347 17990 -3323 -22672 -25825 -11277 9390 22136 22316 13788 3929 -3685 -9175
2464i175m825k167N397J3185J2303K305j2002j8609j1264O199K0930J9285O288
$$ -9175 -14000 -16167 -10770 2415 14718 17023 5021 -13588 -24852 -18653 2277 21562 27850
2477B7850r450j6795j1682j245M218K887j63N10L328N451J394p165j0766l842
$$ 27850 18400 1605 -10077 -11322 -7104 -4217 -4380 -3870 -542 4909 6303 -862 -11628 -15470
2491a5470Q341J6058J3289L36j2814j5626o656L810P714L817l639n944p45N335
$$ -15470 -7129 8929 22218 22554 9740 -5886 -12542 -8732 -1018 2799 -840 -6784 -7529 -2194
2505b194M919j203n568m204L669J1633J0777M73r692j2263o207K049O251K444
$$ -2194 2725 1522 -4046 -8250 -4581 7052 17829 18302 8610 -3653 -9860 -7811 -1560 884
2519H84m497m450P45N861O071l40p151o349K728J2111J2177L313q403j4716j0714
$$ 884 -3613 -8063 -7318 -1457 4614 4274 -2877 -9226 -6498 5613 17790 21103 12700 -2016 -12730
2534a2730l34O146N234J168j095l06J566J965l067o306k209P385J3454J2031Q05
$$ -12730 -13064 -6918 -1684 -516 -1611 -1917 -351 1614 -1453 -7759 -9968 -2583 10871 22902 23707
2549B3707j3034j8094j1514J404J0404J1187L925m454o827l924j022K41J971N358
$$ 23707 10673 -7421 -18935 -17531 -7127 4060 7985 3531 -3296 -7220 -8242 -8001 -6030 -672
2563f72Q380J0460M996o788j6089j5784n707P042J5731J1726q15j0952j2187o652
$$ -672 7708 18168 23164 16376 287 -15497 -21204 -14162 1569 13295 12480 1528 -10659 -17311
2577a7311J951Q955R626P440N479J875m086j0070j2205q243J871J1681J3254M576
$$ -17311 -15360 -6405 3221 10661 16140 18015 13929 3859 -8346 -16589 -14718 -3037 10217 14793
2591A4793p429j5010j2559j689R988J4689J1404M215k004o369p933o934n046K52
$$ 14793 7364 -7646 -20205 -21894 -11906 2783 14187 18402 16398 10029 2096 -4838 -9884 -9632
2605i632O254R299N640k528j1223j3757o843N210J3876J4581Q328j617q120q957
$$ -9632 -3378 5921 11561 9033 -2190 -15947 -22790 -17580 -3704 10877 19205 17588 9468 511
2619E11m982j874J204M273M861L259l23o264j0503p910K9P943J3209J1114K403
$$ 511 -4471 -6345 -5141 -868 3993 7252 6929 665 -9838 -17748 -17719 -9776 3433 14547 16950
2634A6950n360q620o491k423K264M670L394J315o11m279p794o699k206M283R478
$$ 16950 11590 2970 -3521 -5944 -3680 990 4384 5699 5088 809 -6985 -13684 -15890 -11607 -2129
2649b129J1173O176k132o619p757n055R77N361M716K500j57m068p212o927l539
$$ -2129 9044 15220 13088 6469 -1288 -6343 -5366 -5 4711 7211 7054 2986 -4226 -11153 -14692
2664a4692J111P303J0671P477J160m130p838o352p68L987N215L533R40l442n895
$$ -14692 -13581 -6278 4393 11870 13030 8900 1062 -5290 -6058 -2071 3144 6677 7617 4175 -1720
2679a720o349m321q55M703R299P911K985k706o576o934j517L833M843M037J010
$$ -1720 -8069 -12390 -13245 -8542 757 8668 11653 8947 2371 -4563 -6080 -2247 2596 6633 7643
2694G643k249n280m822m278k720J870O101Q057M976M68n542p156k973K499N286
$$ 7643 5394 114 -4708 -8986 -11706 -9836 -3735 4322 9298 9766 4224 -2932 -5905 -3406 1880
2709A880M906J619l012n232l700k689j492P4K205M788N148L838j792o084n294
$$ 1880 6786 8405 5393 161 -3539 -6228 -7720 -7646 -5441 -653 4495 8333 6541 457 -4837
2724d837j190M298O439M133j306n435m651k334k40j66O8J13L610N652L649j252
$$ -4837 -6027 -1729 4710 8843 7537 2102 -2549 -4883 -5123 -5289 -5221 -5108 -1498 4154 7803 6551
2740F551n715n785k151M370P616M206j462n000n282k559M46K45p26R38M033N591
$$ 6551 836 -4949 -7100 -2730 4886 9092 7630 2630 -2652 -5211 -4765 -4520 -5246 -4308 -275 5316
2756E316L312k416p431p744j033P128R970O081k112q410q555l581J721L543L221
$$ 5316 8628 6212 -1219 -8963 -9996 -2868 7102 13183 11071 2661 -5894 -9475 -7754 -4211 -990
2771i90K780J988K220m86m857q042m833K813J1010J1809M701o970j3796j0754
$$ -990 1790 3778 5998 5512 655 -7387 -12220 -9407 1603 13412 18113 11143 -2653 -13407
2785a3407j576O999J0260O281r1l438m290l888m298l070J065O742J1791Q637j273
$$ -13407 -14983 -7984 2276 8557 8466 5028 738 -3150 -7448 -10518 -9453 -2711 9080 17717 16444
2800A6444j1858j4773q334M696J3900J3322K624p063j1235q549j896L326M816
$$ 16444 4586 -10187 -18521 -13825 75 13397 16021 8958 -2277 -10826 -12722 -9396 -4580
2813d580M707O017N468O46n754j0589r952j074J0932J5121Q451l857j4260j4707
$$ -4580 127 6144 11612 12258 6504 -4085 -14037 -15111 -4179 10942 19393 15536 1276 -13431
2827a3431n658N766J0951Q435K547k288l371k370k528l544j906M163Q896Q848
$$ -13431 -19089 -13323 -2372 6063 8610 6322 2951 581 -1947 -5491 -7397 -3234 5662 14510
2841A4510J424q755j5401j0552J496J1129J2500N678m645q921n963J258M493L443
$$ 14510 15934 7179 -8222 -18774 -17278 -6149 6351 12029 7384 -1537 -7500 -6242 -1749 1694
2855A694K015Q05J981K970j087p596r805n317L082R794Q978P51p679q375k037
$$ 1694 3709 4514 6495 9465 8378 782 -9023 -14340 -11258 -1464 7514 8265 586 -7789 -9826
2870i826M940Q507N285j033m123j426J829P01k419o160n593l23N826O308L39m255
$$ -9826 -4886 3621 8906 7873 3750 2324 4153 4854 2435 -3725 -9318 -9641 -3815 2493 2832 -1423
2886a423n434o50N953P884K732l171m121q62K896L442j303p438q244k309M231
$$ -1423 -6857 -7507 -1554 6330 9062 5891 1770 908 3804 7246 5943 -1495 -9739 -12048 -7817
2901g817P201M280k412n628k456L458O074M344N23k061r44K027R51m236q726p054
$$ -7817 -616 3664 1252 -4376 -6832 -3374 2700 7044 7567 5506 4562 6589 7540 3304 -5422 -12476
2917a2476n20O508R503M001m753q640m880K572Q939R240M055j738l686l391l342
$$ -12476 -12996 -6488 3015 7016 2263 -6377 -11257 -8685 254 9494 13549 11811 8125 4734 1392
2932A392m561m642k368K561P047N970j054p826r193k946O752J3884J1387L267
$$ 1392 -3169 -7811 -10179 -7618 -571 5399 4345 -3481 -12674 -15620 -8868 5016 16403 19670
2946A9670n769r309p448k802J101J367J136J430J176o09l809o397m574K897J0820
$$ 19670 13901 4592 -2856 -5658 -4557 -3190 -2054 -624 552 -57 -3866 -10263 -14837 -11940 -1120
2961a120J2893Q164j635j0186j0979n142K579O007L954j20m290n167l775k482
$$ -1120 11773 19937 18302 8116 -2863 -8005 -5426 581 4535 4415 125 -5042 -8817 -11299
2975a1299j168K232O856R138Q409K480n277r206p263j14N225O432K188m742q372
$$ -11299 -12467 -10235 -3379 5759 14168 16648 11371 2165 -5098 -5212 13 6445 8633 3891 -4481
2990d481p093k606J603M716N177N234M769L424p46l782m515l184J073M256L761
$$ -4481 -11574 -14180 -12577 -7861 -2684 2550 7319 10743 9997 6215 1700 -1484 -411 3845 7606
3005G606j470o518p759n806k46M316O103M347L114J764R25j66p15j912j597Q03
$$ 7606 6136 -382 -8141 -13947 -14193 -9877 -3774 573 3687 5451 6376 6210 5495 3583 1986 2789
3021B789J616L91j843n079n885m432K65L552M978M842L238M99L46L24r72r90k92
$$ 2789 4405 4796 2953 -2126 -8011 -12443 -12178 -8626 -3648 1194 4432 4931 5277 5601 4629 3639 3347
3038C347l3R0N38j477m462n937m175j077L898O688O552K998l18k418k376p02J452
$$ 3347 3314 3404 3942 2465 -1997 -7934 -12109 -13186 -9288 -2600 3952 6950 6632 4214 1838 1136 2588
3055B588K045J384n5j361m088n794n149k834J067O091P804N467J023l028n070
$$ 2588 4633 6017 5962 4601 513 -5281 -10430 -13264 -12197 -6106 1698 7165 8188 5160 90
3070I0k873K036M586M529J477k726n916o323m139k035J169L614N262M521K595
$$ 90 -2783 -747 3839 8368 9845 7119 1203 -5120 -9259 -11294 -10125 -6511 -1249 3272 5867
3085E867n94m357m124N9M700O411M032j369o876r040n311o82L196M751L406J519
$$ 5867 5273 916 -3208 -3149 1551 7962 11994 10625 3749 -5291 -10602 -11284 -8088 -3337 69 1588
3101A588K60J40j308j758k79J606M514M590J689m503p980p580k742L392N732M129
$$ 1588 1848 1988 680 -1078 -1357 249 4763 9353 11042 6539 -1441 -9021 -11763 -8371 -2639 1490
3117A490K40k542j743O40K419K368O54L39R28J409k26l208n532n155j551L642
$$ 1490 1730 -812 -2555 -1915 504 2872 3526 3865 4793 6202 5976 2768 -2764 -7919 -9470 -5828
3133e828M927K374o24l158j269K467M877J871p81k470j745J643K524m04m511o356
$$ -5828 -901 1473 849 -2309 -3578 -1111 3766 5637 4856 2386 641 2284 4808 4404 -107 -6463
3149f463l507J584N062M722J148j882j477J200K269J509p33k573n02K890K885
$$ -6463 -9970 -8386 -3324 1398 2546 664 -813 387 2656 4165 3432 859 357 3247 6132
3164F132j402n828p955l924K984Q453P161J313m050n071k157K939M617K428k20
$$ 6132 4730 -1098 -9053 -12977 -9993 -1540 5621 6934 2884 -2187 -4344 -1405 3212 5640 5420
3179E420m51o55j222k997n882o288o31O705J0414O286j615q907q485j596O986
$$ 5420 4969 4314 3092 95 -5787 -12075 -12706 -6001 4413 10699 9084 177 -8308 -9904 -2918
3194b918R652N948p41n997o550m001k179j628k67K754O256O775K147n974r788
$$ -2918 6734 12682 11941 5944 -606 -4607 -6786 -8414 -8681 -5927 329 7104 9251 3277 -6511
3209f511n675L943J0949J2070L900o980j2391r550j987M395N795K975L58K3M19
$$ -6511 -12186 -8243 2706 14776 18676 11696 -695 -10245 -12232 -7837 -2042 933 1291 1314 1733
3224A733j461m044l562M7O581J1106P549k554j1228j3257n862M162J0335P580
$$ 1733 272 -3772 -7334 -7287 -706 10400 17949 15395 4167 -9090 -14952 -10790 -455 7125
3238G125n86o597o105j448K025L512K583J636L200M618J512m337r070q318j061
$$ 7125 6539 -58 -6163 -7611 -5586 -2074 509 2145 5345 9963 11475 7138 -1932 -10250 -11311
3253a1311P383R454L482n729r716o238J335Q531Q007K299j642k863j11J451l74
$$ -11311 -3928 5526 9008 3279 -6437 -12675 -11340 -2809 5198 7497 5855 2992 2881 4332 3958
3268C958l370n117q86M111M620N37n128p679k750N286R079O259q49n759m851J353
$$ 3958 588 -4529 -5415 -1304 3316 3853 -1275 -8954 -11704 -6418 2661 8920 8071 2312 -2539 -1186
3284a186N222L732k238n693n220p25L515K772j035l968j482K970N360L599j317
$$ -1186 4036 7768 5530 -163 -5383 -6108 -2593 179 -856 -4824 -6306 -3336 2024 5623 4306
3299D306m451k039L668O099K394l754r410p146M63O346O734J313m543o163j165
$$ 4306 -145 -2184 1484 7583 9977 6223 -3187 -10333 -9870 -3524 3210 4523 -20 -6183 -7348
3314g348M009N406K873k67p53R19K106q28n780p791l176L747Q457N971j503q781
$$ -7348 -3339 2067 4940 4673 3920 4839 6945 6117 337 -7454 -10630 -6883 1574 7545 6042 -2739
3330b739q393j168P216J0314O752m82n247m840k249p13j221j609L03L263M711
$$ -2739 -11132 -12300 -5084 5230 11982 11500 6253 1413 -836 -1549 -2770 -4379 -4076 -813 3898
3345C898J303n652q794n140L545J0904J2492M644n362j0235p781q66M059N017
$$ 3898 5201 -451 -9245 -14385 -10840 64 12556 17200 11838 1603 -6178 -7044 -2985 2032
3359B032J467j494j808j136k188l622l203K34O338J1024P493p39q978j0297n138
$$ 2032 3499 2005 197 -939 -3127 -6749 -9952 -9718 -3380 7644 15137 14398 5420 -4877 -10015
3374a0015L723Q942O459j191o238p407l968O99K864K510K537M543M111K429k950
$$ -10015 -6292 2650 9109 7918 1680 -5727 -9695 -8996 -6132 -3622 -1085 3458 7569 9998 7048
3389G048o888o350m05O685P865K394m891r624q179o05N706O434M118K01p31j01
$$ 7048 160 -6190 -6595 90 7955 10349 5458 -4166 -12345 -12950 -7244 -810 3308 3509 2778 2677
3405B677J293n91k716j939J027L423L200l38n866q048m343K710O589N942J680
$$ 2677 3970 3379 663 -1276 -249 3174 6374 6036 170 -7878 -12221 -9511 -2922 3020 4700
3420D700k726l299L07L130K591N71k050k162j01J168l04l574m265k071J405M843
$$ 4700 1974 -1325 -1018 2112 4703 5274 3224 1062 961 2129 1825 -1749 -6014 -8085 -6680 -1837
3436a837M222L43k572j691J403L742K956m50l612l707l41J567J710j210l543l792
$$ -1837 2385 2728 156 -1535 -132 3610 6566 6116 2504 -1203 -1544 23 1733 523 -3020 -6812
3452f812m21L241M101K121o1q77M80J703J344j303k939j685M14K129J441j977
$$ -6812 -7233 -3992 109 2230 2169 1292 1772 3475 4819 3516 577 -1108 -694 1435 2876 899
3468H99n615l891o0M100N704M158j39k593j860l54P05Q38O6p3K25M87j537l534
$$ 899 -4716 -8607 -8667 -4567 1137 5295 5156 2563 703 349 1054 1892 1958 1885 2110 2597 1060 -2474
3486b474m226k554K003N596O300K221k367m075l631L99K978M098J033n55k225
$$ -2474 -6700 -9254 -7251 -1655 4645 6866 4499 424 -3207 -2808 170 4268 5301 4746 2521
3501B521l193k735k251j505P23L988M898L036o90l588m413j345K684N176L742
$$ 2521 -672 -3407 -5658 -7163 -6440 -2452 2446 5482 4792 1204 -3209 -4554 -1870 3306 7048
3516G048M57l180n142l955j201N44J421K367K770J340J85j530k805j767J214L886
$$ 7048 7505 4325 -817 -4772 -5973 -5429 -4008 -1641 1129 2469 2654 1124 -1681 -3448 -2234 1652
3532A652M192J877j486n143n128j982M74K502K684J605Kj117m55j080n98M58K062
$$ 1652 5844 7721 6235 1092 -4036 -6018 -5544 -3042 -358 1247 1249 132 -323 -1403 -2001 -1543 519
3549E19K732K743K38k603m398l408j172J309L031K309l48j176r55j204K20J154
$$ 519 3251 5994 6232 3629 -769 -4177 -5349 -4040 -1009 1300 952 -224 -1179 -2383 -2163 -1009
3565a009J495J557J851J087p68k374k815k342p86J941K320O91k57j476j886j54
$$ -1009 486 2043 3894 4981 4213 1839 -976 -3318 -4104 -2163 157 848 591 -885 -2771 -2925
3581b925J190J384J472J828J147R6j152k024j995j762J20J277J506R21m19k088
$$ -2925 -1735 -351 1121 2949 4096 4192 3040 1016 -979 -2741 -2621 -1344 162 1083 664 -1424
3597a424j821m52Q06K167K734J837N66o33j319j909j756p18N89J049J379P5j774
$$ -1424 -3245 -3697 -2891 -724 2010 3847 4413 3780 2461 552 -1204 -1922 -1333 -284 1095 1170 -604
3614f04k320j521m98K074L134L132J287n60j228k103j565j07K60J118J143N4j567
$$ -604 -2924 -4445 -4943 -2869 265 3397 4684 4124 2896 793 -772 -879 -619 499 1642 1696 129
3631A29k528j948j294Q95L020L421K204O20j370k000j457j90P65J462M76k80j567
$$ 129 -2399 -4347 -5641 -4746 -1726 1695 3899 4519 3149 1149 -308 -498 267 1729 2205 1925 358
3648C58j897k320j803K94J974K911K736J611j86j979j979r4O29J653J706K28j992
$$ 358 -1539 -3859 -5662 -5368 -3394 -483 2253 3864 3678 1699 -280 -374 255 1908 3614 3842 1850
3665A850k403k822k212k1R20K545K747K212O57j241j571j265M73J571K396N18
$$ 1850 -553 -3375 -5587 -5608 -4688 -2143 604 2816 3473 2232 661 -604 -131 1440 3836 4354
3681D354q82k287l386k331q74Q12J546K193J893N53m33p51m18L2J403J880J314
$$ 4354 3472 1185 -2201 -4532 -5406 -4594 -3048 -855 1038 1591 1158 407 -11 21 1424 3304 4618
3698D618q0j859l653k774j249L34J006K006J500R78k45l69o97m6J179K211J902
$$ 4618 4538 2679 -974 -3748 -4997 -4663 -3657 -1651 -151 827 582 213 -484 -530 649 2860 4762
3715D762N89r33l195l381j976l25Q93J797J146L23j18k84m2k50J180J865J670
$$ 4762 5351 4418 1223 -2158 -4134 -4459 -3566 -1769 -623 -300 -418 -702 -744 -994 186 2051 3721
3732C721J014L37k159l270k202j145K74J188J227j12j57j84J88M2J011J142J093
$$ 3721 4735 5072 2913 -357 -2559 -3704 -3430 -2242 -1015 -1127 -1284 -1468 -1280 -1238 -227 915 2008
3749B008J518J403n23k389k485j920j004Q63J174K10l45P4j26J75O73Q65O79R14
$$ 2008 3526 4929 4406 2017 -468 -2388 -3392 -2529 -1355 -1145 -1490 -1416 -1542 -1367 -694 171 850 1764
3767A764K165R48n80k010l098k455Q8J385J165N95q35j077n39N72R73P19J412
$$ 1764 3929 4877 4297 2287 -811 -3266 -3178 -1793 -628 -33 -868 -1945 -2484 -1912 -939 -220 1192
3784A192J902J462K49j045l047l155j561J053K434K065k04k263k826o90J187J703
$$ 1192 3094 4556 4805 3760 713 -2442 -4003 -2950 -516 1549 1345 -918 -3744 -4434 -3247 -1544
3800a544K682J930J194R58m54k560l189k432k38J973L548J404k144m113l191j03
$$ -1544 1138 3068 4262 5220 4766 2206 -983 -3415 -3653 -1680 1868 3272 1128 -2985 -6176 -6279
3816f279K612M385L535R54n18j310j778j582j419n82P75K387K179r90l944m167
$$ -6279 -3667 718 4253 5207 4689 3379 1601 19 -1400 -1982 -1207 1180 3359 2369 -1575 -5742
3832e742k336J663N445N328J905j348k664k891o1P96P46N81J28M39p22k312l643
$$ -5742 -8078 -6415 -970 4358 6263 4915 2251 -640 -701 95 841 1422 1550 1989 1267 -1045 -4688
3849d688k644M1L912N982L706o7l525m291j181K313L649J613r17k440k626j561
$$ -4688 -7332 -7291 -3379 2603 6309 6242 2717 -1574 -2755 -442 3207 4820 3903 1463 -1163 -2724
3865b724o69j347o89J191L207L903K167j658l779k098J339L693L652M31l580m911
$$ -2724 -3393 -4740 -5429 -4238 -1031 2872 5039 3381 -398 -2496 -1157 2536 6188 6619 3039 -1872
3881a872k695K2J579P58j79n43O01K562K026j42j350p64J081K695K757j497m418
$$ -1872 -4567 -4545 -2966 -2208 -2387 -2930 -2329 233 2259 2117 767 3 1084 3779 6536 5039 621
3898F21m359j189J641K641Q15k164k919J48K665M151K334m97j874n75J316J287
$$ 621 -3738 -4927 -3286 -645 170 -1994 -4913 -4765 -2100 2051 4385 3888 2014 1439 2755 4042
3914D042n93k778k705j602J530J633r79k888k326J312M584N382K221k120l972
$$ 4042 3449 671 -2034 -3636 -2106 -473 -1452 -4340 -6666 -5354 -770 4612 6833 4713 741
3929G41k200J636L411J878j453m265l201j060l6N65n33k15K240M559L607M9l658
$$ 741 -1459 177 3588 5466 4013 -252 -3453 -4513 -4549 -3984 -4517 -4732 -2492 2067 5674 5723 2065
3946B065l994q61L994N682K380l504o964o280j711K740L777K040R2K84J268Q42
$$ 2065 -1929 -2790 1204 6886 9266 5762 -1202 -7482 -9193 -6453 -2676 -636 -544 -260 1008 1850
3962A850j1j720j345J728M858M349q40o054q577n640J343O069O116J635k528l744
$$ 1850 1839 119 -1226 502 5360 9709 8869 2815 -5762 -11402 -10059 -3990 2126 3761 1233 -2511
3978b511j873K206K590K164J057J819J487M20k992o281o512j943M043P122M605
$$ -2511 -4384 -2178 412 2576 3633 5452 6939 7359 4367 -1914 -8426 -10369 -6326 796 5401
3993E401j686o188n519J24N313O930M239L7l099k660j508j521k878k073J67K851
$$ 5401 3715 -2473 -7992 -7868 -2555 4375 8614 8651 5552 2892 1384 -137 -3015 -5088 -4921 -2070
4009b070L931J302l731o223k835L243P961P730J920l754o134l627J05K138J573
$$ -2070 1861 3163 -568 -6791 -9626 -6383 1578 9308 11228 7474 1340 -2287 -2182 -44 1529
4024A529j495j998p83R51k39j537k256k17L954P138M705r31n387n693j570L156
$$ 1529 34 -1964 -2747 -1796 -2035 -3572 -5828 -6045 -2091 5047 9752 8821 3434 -2259 -3829 -673
4040f73M990P85l503n306l172Q10K670K113p7m24J734L117K371j48l119l449O40
$$ -673 4317 5102 1599 -3707 -6879 -6069 -3399 -1286 -1363 -1787 -53 3064 5435 5287 2168 -1281 -641
4057f41L371K727j360n209n621k244K869N880K643j072l269j274K170M211K899
$$ -641 2730 5457 4097 -1112 -6733 -8977 -6108 -228 2415 1343 -1926 -3200 -1030 3181 6080
4072F080r12k500j493K97M30j448l444l477k5M007M418O63l098m587p93M160O897
$$ 6080 5168 2668 1175 1472 1902 454 -2990 -6467 -6492 -2485 1933 2596 -502 -5089 -5882 -1722 5175
4089E175L966p90m951m768j501J685J457p08j414q67N35J044m01k142j637K056
$$ 5175 9141 8351 3400 -1368 -2869 -1184 273 -435 -1849 -2716 -2181 -1137 -1538 -3680 -5317 -3261
4105c261N610O151J791m010o721m810Q90M317L939J85l646m831j972Q03J957J522
$$ -3261 2349 8500 10291 6281 -440 -5250 -4360 -43 3896 4081 435 -4396 -6368 -5565 -3608 -2086
4121b086J209K215L249K605o14m598n094j651L272N265L275k340p039o118j385
$$ -2086 -877 1338 4587 7192 6578 1980 -3114 -4765 -1493 3772 7047 4707 -2332 -8450 -9835
4136i835L175N356L992R08p71m39j34m78j135j333J74K689K984L38m777o683m187
$$ -9835 -6660 -1304 2688 3596 2825 2386 2252 1774 639 -694 -520 2169 5153 5491 714 -5969 -10156
4153a0156R32N869O422K592j913l721j946O10K545K126M06j069l85m93j380l221
$$ -10156 -9224 -3355 3067 5659 3746 25 -1921 -1311 1234 3360 3766 2697 2312 1819 439 -2782
4169b782l480j654K637N619L845j46l459l618o91L401M638K865j458l244l145
$$ -2782 -6262 -7916 -5279 340 4185 4039 580 -3038 -3729 -328 4310 7175 5717 2473 -672
4184f72j288p0o20q90n61J427K381K061n98j991j836J228L969L259R05k482m481
$$ -672 -1960 -2030 -2650 -3540 -4101 -2674 -293 1768 1170 -821 -2657 -1429 2540 5799 6704 4222 -259
4201b59k535K74J675J012j188j827j105R40K378J492k65k23M51K034J716L29k882
$$ -259 -2794 -2520 -845 167 -1021 -2848 -3953 -3013 -635 857 592 369 820 2854 4570 4899 2017
4218B017k790j275N91J298N12j825k798r56K233K966K407M67j259j318M65J804
$$ 2017 -773 -2048 -1457 -159 353 -1472 -4270 -5226 -2993 -27 2380 2847 1588 270 735 2539
4234B539O52m37j536j532r74M23o75j748j278M27K458L180J674p34k092j424J080
$$ 2539 3191 2754 1218 -314 -1288 -865 -1540 -3288 -4566 -4139 -1681 1499 3173 2439 347 -1077 3
4251CK151K383J53k594l207j525l86J00J61O93O65J339J445K83j420j061K4K246
$$ 3 2154 4537 4690 2096 -1111 -2636 -3022 -2922 -2761 -2068 -1403 -64 1381 1664 244 -817 -793 1453
4269A453K856J656j545l810l361j964O27J972J902M0l26l60j65L85M56N40J063
$$ 1453 4309 5965 4420 610 -2751 -4715 -4088 -2116 -214 -174 -500 -860 -1025 -640 -184 356 1419
4286A419J890J527m10k445l386k544l47J922K194R77n25j774j147K31J692J729
$$ 1419 3309 4836 4426 1981 -1405 -3949 -4296 -2374 -180 797 272 -1502 -2649 -2418 -726 1003
4302A003J667Q25M26p96j104k073k080q48O58J823J069k87j418j643n32J365K265
$$ 1003 2670 3495 3921 3125 2021 -52 -2132 -2980 -2322 -499 570 283 -1135 -2778 -3310 -1945 320
4319C20K063J267L0j277r82j076r13o84J12K82M51P4j42j349p83K40J551J943
$$ 320 2383 3650 3680 2403 1421 345 -568 -1252 -1140 -858 -407 -333 -475 -1824 -2607 -2367 -816 1127
4337A127J670M31q16j132o10p29j12r9k50k29j5O6m48m85l61N62Q19J618J031
$$ 1127 2797 3228 2412 1280 670 -59 -171 -270 -520 -749 -764 -698 -1146 -1631 -1992 -1430 -611 1007 2038
4356B038N49n55p30p65o21qk90M1l20r4r9l44k77J51O1J042J169J103J81k95j065
$$ 2038 2587 2032 1302 537 -84 -92 -382 -341 -661 -755 -854 -1198 -1475 -1324 -1263 -221 948 2051 2232 1937 872
4377H72r85l69r6L0R17k47m29q23n93k85K73Q97J163J236M29J07q59j004q26p5
$$ 872 -113 -482 -578 -548 369 122 -307 -1130 -1723 -2008 -1735 -838 325 1561 1990 2097 1238 234 -592 -667
4397f67N75Q43K60p21p44j203q92M12J307J094R54N44l55m35p12k41l04J98N74
$$ -667 -92 751 1011 290 -454 -1657 -2549 -2137 -830 264 1218 1762 1407 972 260 19 -285 -87 487
4416D87N42R5j041j110j577J5R30J588R69Q01n53n63o81R8K35K78M72l66m4j89
$$ 487 1029 1124 83 -1027 -2604 -2589 -1659 -71 898 1699 1146 583 -98 0 235 513 985 619 575 386
4436C86j178r47j29r2J005J027J247K7j030m62j55L84R06L61m68n90q6n56o57
$$ 386 -792 -1739 -1868 -1960 -955 72 1319 1346 316 -146 -301 83 989 1350 882 292 206 -350 -1007
4455a007k81l26J47O52R67R25j63n64n95j37O51J019p4k77l73q41m41j13k36o26
$$ -1007 -1288 -1614 -1467 -815 152 1077 914 350 -245 -382 269 1288 1214 937 564 -277 -718 -831 -1067 -1693
4475a693j38J179J139L02O18o94r19m09R47N93O90j46p94j020o15m49k18J52N02
$$ -1693 -1831 -652 487 789 1407 713 -206 -615 332 925 1615 1469 675 -345 -960 -1409 -1627 -1475 -973
4494i73P67P60R63k73j136o18J54P48J321M15l72j365j329q91q8M83Q66L87K18
$$ -973 -206 554 1517 1244 108 -510 -356 392 1713 2128 1756 391 -938 -1829 -1917 -1434 -568 -181 37
4513C7O50L4l06n41m15L21J391J301k22r36j708j431m83O17J197M15L13j54m51
$$ 37 687 721 415 -126 -541 -220 1171 2472 2250 1314 -394 -1825 -2308 -1691 -494 -79 234 80 -371
4532c71P7J64M23pQ45P82N02p31j291j979o71J88Q75J405M53l83q55o08M39M00
$$ -371 -294 -130 293 286 1131 1913 2415 1684 393 -1586 -2257 -2069 -1194 211 664 281 -574 -1182 -743 -343
4552c43Q03P80N39J69j04r00j404j106k06L83Q02O87j2p59n92J59O06P04J356
$$ -343 460 1240 1779 1948 1844 944 -460 -1566 -1772 -1389 -587 100 88 -671 -1263 -1104 -498 206 1562
4571A562L80j23l80o51p27p28l72k50K10N24N47k20n80l01K1R25J070Q49O8k76
$$ 1562 1942 1819 1439 788 61 -667 -1039 -1289 -1079 -555 -8 -228 -808 -1109 -1088 -163 907 1756 1824 1548
4591A548l86p51o85m62l10l97O20L99K7N1k82l80L17M18J129O02N17q8q47j056
$$ 1548 1162 411 -274 -736 -1046 -1443 -823 -424 -397 -346 -628 -1008 -691 -273 856 1458 1975 1887 1040 -16
4611a6k11p29p0L66J13j35L16l26l81k8O46P49R22Q49J30p81q26r68o24K10L52
$$ -16 -227 -956 -1026 -660 -547 -682 -366 -692 -1073 -1101 -455 294 1216 2065 2195 1414 588 -380 -1004 -794 -442
4632d42K77J83l09q35o14L15O71O33R86Q01O42m72p36j102o84J6O88K2L84n93
$$ -442 -165 18 -291 -1126 -1740 -1425 -754 -121 865 1666 2308 1836 1100 -2 -686 -670 18 40 424 -169
4652a69r33p90L1P96R49J014L63K05j8o11l27n51k78L84R6M6j04o12j216n97O92
$$ -169 -1102 -1892 -1861 -1065 -116 898 1261 1466 1448 837 510 -41 -319 65 161 207 103 -509 -1725 -2322 -1630
4673a630J024J054Q89J03o81l71J09J18n1M8l62l59r0j74m00n53k02K02Q94J129
$$ -1630 -606 448 1337 1440 759 388 497 615 564 612 250 -109 -199 -373 -773 -1326 -1528 -1326 -432 697
4693F97J87j78k01k35M61M28m6o61n29p84J07M45l6m96q13N4Q67Q44P16K06k63
$$ 697 884 706 505 270 731 1159 1113 452 -77 -861 -754 -309 -345 -841 -1654 -1600 -733 111 827 1033 770
4714G70k59o2J30L56p15m51k06K79K31k57q55q11J93O25J230J437l64l59q37k87
$$ 770 511 449 579 935 220 -231 -437 -158 73 -184 -1039 -1850 -1657 -1032 198 1635 1271 912 75 -212
4734b12M67N51J78l12k43m73n71k83o24l71N90R01J641R20r73q85j331lJ465J346
$$ -212 255 806 984 672 429 -44 -615 -898 -1522 -1893 -1303 -402 1239 2159 1186 301 -1030 -1033 432 1778
4754A778M03r59r26j213n79k40N07o4N24J019R08m1q58r86o67Q94J985J451m15
$$ 1778 2181 1222 296 -917 -1496 -1736 -1229 -1293 -769 250 1158 1117 259 -727 -1394 -500 1485 2936 2521
4773B521j475k299j253M78R47J244J22Q4m26k01L51n79m31P53J256J320L00o10
$$ 2521 1046 -1253 -2506 -2028 -1081 163 285 369 -57 -258 93 -486 -917 -164 1092 2412 2712 2102
4791B102k489j854j50Q08J988J057m28j717p48J05N87R49P02J55m3M18J9r42j297
$$ 2102 -387 -2241 -2391 -1583 405 1462 1034 -683 -1431 -1326 -739 210 912 1067 1024 1442 1461 519 -778
4810g78q82R4J337J208K92j216j778m18Q69J568J300K04q68l05k39r8q6l19n43
$$ -778 -1660 -1566 -229 979 1271 55 -1723 -2141 -1272 296 1596 1800 932 627 388 290 204 -115 -658
4829f58j71O24P06k94j013p90k02J160J745R54o69j079p94K5Q88R05m29j043p51
$$ -658 -829 -205 501 207 -806 -1596 -1798 -638 1107 2061 1392 313 -481 -456 432 1337 908 -135 -886
4848h86j45K85J74J72m13PN85J209J56o50q73k90O61J258M07q10j582r74q9J216
$$ -886 -1031 -746 -572 -400 -813 -806 -221 988 1144 494 -379 -669 -8 1250 1657 847 -735 -1709 -1798 -582
4868e82J392j85q45n83j73R78P14K28k64j09J58L29k80j066r07o86O88J581Q01
$$ -582 810 625 -220 -803 -976 2 716 944 680 571 729 1058 778 -288 -1195 -1881 -1193 388 1189
4887A189k30j400j216j79J704J686O38n93q17q33l26L42l96q4O7J16P85J38q64
$$ 1189 959 -441 -1657 -1836 -132 1554 2192 1599 782 -51 -377 -35 -431 -515 -448 -332 453 591 -273
4906b73j032r69J312J697J628N41j279k087p37N37K62J022j27k82o25j02k80m10
$$ -273 -1305 -2274 -962 735 2363 2904 1625 -462 -1199 -662 -400 622 495 213 -412 -514 -794 -1204
4924a204l5N2J083J702N74k44j927j221k85Q15J690N93l67j490j014j95P6O29
$$ -1204 -1239 -1187 -104 1598 2172 1928 1 -1220 -1505 -690 1000 1593 1226 -264 -1278 -1473 -1397 -768
4942g68O59K80L20P66k65n62p91q24O39J106J379l31j180j575r54K42J233J114
$$ -768 -109 171 491 1257 992 430 -361 -1185 -546 560 1939 1608 428 -1147 -2101 -1859 -626 488
4960D88M99n20l03r8J10j7k65k6N42P45J38n37j027r77n62J025R13M50m2o79m71
$$ 488 987 467 164 66 176 159 -106 -132 410 1155 1293 756 -271 -1248 -1810 -785 128 578 536 -143 -614
4981f14k94Q65O05J32j74mj01J02m9p09n68k27M76P25M1k9n72j88J12P44M88P4
$$ -614 -908 -43 562 694 520 516 415 517 468 -241 -809 -1036 -560 165 206 177 -395 -583 -471 273 761 835
5003H35m55l96J3M04n9l32m26l83J4P51n7j30l81N07j11M21M60j34p5m17N66j01
$$ 835 380 -16 -3 401 342 10 -416 -799 -785 -34 -91 -221 -602 -95 -206 215 675 541 466 49 615 514
5025E14J64j50q11n77j07N75L77l5j05j90L2L40K06K81K04k34K93j2K2p97q01
$$ 514 678 528 -283 -860 -967 -392 -15 -50 -155 -345 -313 27 233 514 718 484 777 765 787 -10 -811
5046h11L7J44K95M62j29m74k66K57K95M47N41N39n92j78M2n18k23j07q7J68J37
$$ -811 -774 -630 -335 127 -2 -476 -742 -485 -190 257 798 1337 745 567 609 91 -132 -239 -326 -158 -21
5067b1j68l85k06j33K11O19O52L90J79l74l04l92J1p3k50J76J17n8k40k83k79
$$ -21 -189 -574 -780 -913 -702 -83 569 959 1138 764 460 68 79 6 -244 -68 49 -9 -249 -532 -811
5088h11q8O00N06N97j12L02j94n10k18k17j42P9K61k87rn30j10j78L35N81O23
$$ -811 -899 -299 207 804 692 994 800 290 72 -145 -287 -208 53 -234 -243 -773 -883 -1061 -726 -145 478
5109D78K87K58j76m41l42J15j11p0R7k06k3o15k72k42M38M88M32O41J09N3p96
$$ 478 765 1023 847 406 64 179 68 -2 95 -111 -134 -749 -1021 -1263 -825 -337 95 736 845 898 102
5130A02J20J7J33j27k7k59l50K54m80k43k42M16O00Q01L14N1o24m44K04Q8j5J29
$$ 102 222 239 372 245 218 -41 -391 -137 -617 -860 -1102 -686 -86 715 1029 1080 456 12 216 304 289 418
5152D18k47n15k2l02l30k45K81M78Q02N05K63m74k94l09k6L52O10k78n40n71m96
$$ 418 171 -344 -366 -668 -998 -1243 -962 -484 318 823 1086 612 318 9 -17 335 945 667 127 -444 -940
5173i40q2M2L02L98K67O68J60j07l67l88K33J0O55L34p49p56q68j11M97K89L61
$$ -940 -1022 -980 -678 -280 -13 655 815 708 341 -47 186 196 851 1185 436 -320 -1188 -1299 -802 -513 -152
5194a52p8J55L88j41J18R9l52K50Q7O41m99o33p64m94J22N32P12o9o7j60J50M38
$$ -152 -230 -75 313 172 290 389 37 287 374 1015 516 -117 -881 -1375 -1253 -721 -9 -78 -145 -305 -155 283
5216B83P09r7l17p9j15J72n47n15l68k42L20Q3P41J4l44r7K22P28L93L9k12p86
$$ 283 992 895 578 499 384 556 9 -506 -874 -1116 -796 -713 28 42 -302 -399 -177 551 944 983 771 -15
5238a5j89L02r1j45k65l68k36K39N05J16P4N8N03K09M33o5q35j18q1K10L5j75
$$ -15 -204 98 7 -138 -403 -771 -1007 -768 -263 -147 -73 -15 488 697 1130 1065 230 112 31 241 276 101
5260A01o32q13J27K44N72M08K40j25K54K88J61j21l66o0q2M9J16p11n25o24J65
$$ 101 -531 -1344 -1217 -973 -401 7 247 122 376 664 825 704 338 278 196 245 361 -350 -875 -1499 -1334
5281a334O76P22P92n05k0n02L53J68M36J10l15n64J29l64m17m95k98K49R57R00
$$ -1334 -658 64 856 351 331 -171 182 350 786 896 581 17 146 -218 -635 -1130 -1428 -1179 -222 678
5301F78j47n49k69L5L71P68J43K7m18p06n58l1Q4r9R1k4N62L22k72k3m32K25Q30
$$ 678 531 -18 -287 -252 119 887 1030 1057 639 -67 -625 -656 -572 -671 -580 -604 -42 280 8 -15 -447 -222 608
5324F08P82N0n94p06q92o4J41N18J34m47j00R3J83M8K16%N73O37M1j69j66j200
$$ 608 1390 1440 846 140 -752 -816 -675 -157 -23 -470 -570 -477 -294 -246 -30 -30 543 1180 1221 1052 886 -314
5346c14m34j30M37L20J37l64m60N6K59L12K17N53K53P9J04k99o81l69p2j84K22
$$ -314 -748 -878 -441 -121 16 -348 -808 -752 -493 -181 36 589 842 921 1025 726 45 -324 -396 -580 -358
5367c58K19j68k62m18K51O52O53L38l59Ok19RL02k55k21l49j07l34K04j27Q1j21
$$ -358 -139 -307 -569 -987 -736 -84 569 907 548 554 335 344 646 391 170 -179 -286 -620 -416 -543 -462 -583
5389e83J31M41L46P4K9J74J03l21K65k24k77l93k65j26R8O4J49ppL74L3K50J63
$$ -583 -452 -11 335 409 438 612 715 394 659 435 158 -235 -500 -626 -528 -464 -315 -322 -329 45 78 328 491
5412D91K69l08J04K23m90k74n79j64L07K09J4o8M8j04J62K12N03K49L7k36k85
$$ 491 760 452 556 779 289 15 -564 -728 -421 -212 -198 -266 -218 -322 -160 52 555 804 841 605 320
5433C20R5l33j42l12l63M34k0l2J12k97L57R2P07J28J54j73j02n25j79j2po7j92
$$ 320 415 82 -60 -372 -735 -301 -321 -353 -241 -538 -181 -89 618 746 900 727 625 100 -79 -91 -98 -165 -357
5456c57q8m17M39K06k11N02P5N90j02j50K49m43j43M9j78R9m6m88m58o6K52K54
$$ -357 -445 -862 -423 -217 -428 74 149 739 637 487 736 293 150 199 21 120 74 -414 -872 -938 -686 -432
5478d32K23K81J62J88L51K2l50J74l26m10M7J44o29r9p9l05L77M03N50j90K46
$$ -432 -209 72 234 422 773 795 445 619 293 -117 -70 74 -555 -654 -733 -1038 -661 -258 292 102 348
5499C48L7K4M34J91n93m1m92l28%J81j82k13p6K15J74M59P2K69j21L90J43j67
$$ 348 385 409 843 1034 441 400 -92 -420 -420 -239 -421 -634 -710 -495 -321 138 210 479 358 748 891 724
5521G24l20k17m03P2j76Q4j89j11l52L9R4P67N85J04n1k70N8j84O9j50l61r7K4
$$ 724 404 187 -216 -144 -320 -236 -425 -536 -888 -849 -755 12 597 701 650 380 438 254 323 173 -188 -285 -261
5544b61r1j40l99P3M4N39N25L71k4k99OM3q0M93l03m11j45k11l78P1k12P7J51
$$ -261 -352 -492 -891 -818 -774 -235 290 661 637 338 344 387 307 800 497 86 -59 -270 -648 -577 -789 -712 -561
5567e61L61P75QJ17m51k72L81M88n7j78o33m47m79l0L64K04%J52K85K32m3K48
$$ -561 -200 575 583 700 249 -23 358 846 789 611 -22 -469 -948 -978 -614 -410 -410 -258 27 259 216 464
5589D64l69j40L39M36r8k90n93n31j89J86M69J90k82J87r6M31M17qO6j60n0L84
$$ 464 95 -45 294 730 632 342 -251 -782 -971 -785 -316 -126 -408 -221 -317 114 531 523 589 429 379 763
5611G63j6p22n53k35MM51M39n4n02j22q4M60P54K12j51m94J71J13k72j20k85j37
$$ 763 747 25 -528 -763 -759 -308 131 77 -425 -547 -631 -171 583 795 644 150 321 434 162 42 -243 -380
5633c80j43L79J01j09k41j01K19N22O72m0m66k74k43K69J22m1p2m60k85l6L34
$$ -380 -523 -144 -43 -152 -393 -494 -275 247 919 879 413 139 -104 165 287 246 174 -286 -571 -607 -273
5654b73OJ09r6K81K17N07j89k47n20J26M57K26n9n82k38m13J29L67K09P8q4O2
$$ -273 -267 -158 -254 27 244 751 562 315 -205 -79 378 604 545 -37 -275 -688 -559 -192 17 95 11 73
5676G3K0k6K81o9l73J6L01L09l01q4n14l02N17J47J48K93m56m13J17K07K77J91
$$ 73 93 67 348 279 -94 -78 223 532 231 147 -367 -669 -152 -5 143 436 -20 -433 -316 -109 168 359
5698C59j45k04nk31L45j79k85j45K97L38N11k94o16l91L28L93M28n0k41l61j42
$$ 359 214 10 5 -226 119 -60 -345 -490 -193 145 656 362 -254 -645 -317 76 504 454 213 -148 -290
5719b90p8L11Rj74L05J19j90k5k11j83j06M52M67J75k85m14l48P2R3N13L88m37
$$ -290 -368 -57 -48 -222 83 202 12 -13 -224 -407 -513 -61 406 581 296 -118 -466 -394 -301 212 600 163
5741A63m08L92l28J40j72J91j77J76R3j45J07k69J18k15M01M01J0j49m22r3j62
$$ 163 -245 147 -181 -41 -213 -22 -199 -23 70 -75 32 -237 -119 -334 67 468 478 329 -93 -186 -348
5762c48M08K38n20J7j14K18k1Kl28K74K68L20r4R5k37l12k82L12L13o9j55l11
$$ -348 60 298 -222 -205 -319 -101 -122 -120 -448 -174 94 414 320 415 178 -134 -416 -104 209 140 -15 -326
5784c26n2m8L64M9%n1J32J60K26k3L1j95l6oj56M58r15Oj91K56kK46J00l3N2J2
$$ -326 -378 -426 -62 -13 -13 -64 68 228 454 431 462 267 231 225 69 527 -388 -382 -573 -317 -319 -73 27 -6 46 58
5810E8K89q0nj08J46j48k34L0j86l08P7l4N31k56M40m77K31J89N5J32j60q9K26
$$ 58 347 267 262 154 300 152 -82 -52 -238 -546 -469 -503 28 -228 212 -265 -34 155 210 342 182 93 319
5833C19j93l11k8k18J08K5J55J9k1K11n0J06J56L29j38J45m84J19j82n5O9l26
$$ 319 126 -185 -213 -431 -323 -298 -143 -124 -145 66 16 122 278 607 469 614 130 249 67 12 81 -245
5855b45k20K65n5r1N0lL45J86K52q2J69j3k62k59pj58K49n59K31K71n43P0ML30
$$ -245 -465 -200 -255 -346 -296 -299 46 232 484 402 571 558 296 37 30 -128 121 -438 -207 64 -479 -409 -405 -75
5879g5j37L29K74r8j81K35Rj90Lk82k9p5q2k42L25o1j62K60L68P8J35q7J33j59
$$ -75 -212 117 391 293 112 347 356 166 169 -113 -142 -217 -299 -541 -216 -277 -439 -179 189 267 402 315 448 289
5903B89n6J1J62r6l58k18j62j28K23K31j97J34L17r2L70l11p9J60j31M61n75m2
$$ 289 233 244 406 310 -48 -266 -428 -556 -333 -102 -299 -165 152 60 430 119 40 200 69 530 -45 -87
5925h7P2k96p4K93l21K16m7J42j5Q1L59N3n1L0l1N4j92K7q82K31M8J98K30k40
$$ -87 -15 -311 -385 -92 -413 -197 -244 -102 -117 -36 323 376 325 355 324 378 186 213 -669 -438 -390 -192 38 -202
5949b02R9Mj56K36J93L16k22J32k3l4k16o2m44J03j02K51j38J31n4k88J3K60M66
$$ -202 -103 -99 -255 -19 174 490 268 400 377 343 127 65 -379 -276 -378 -127 -265 -134 -188 -476 -463 -203 263
5972B63L93k72k30n4j50J5J74k86j38l5L48o4m1k26j05K64L81L25m3k35l16j11
$$ 263 656 384 154 100 -50 -35 139 -147 -285 -320 28 -36 -77 -303 -408 -144 237 562 519 284 -32 -143
5994a43J34J62M8J60l03l68k88L19J58N2j06mN86j0l9k60k52k01M76L48j61k62
$$ -143 -9 153 201 361 58 -310 -598 -279 -121 -69 -175 -179 407 397 358 98 -154 -355 121 469 308 46
6016D6l46j57QL10J77l5P4q7n5J28J83j44j65L7j7L06m8j87p52N2M20J78J48L70
$$ 46 -300 -457 -449 -139 38 3 77 -10 -65 63 246 102 -63 -26 -43 263 215 28 -724 -672 -252 -74 74 444
6040D44l72q0R0r4L14Q7k20q2k18J28j93k79LR7K47M27J42l31r2j00K16q1M63
$$ 444 72 -8 82 -12 302 389 169 87 -131 -3 -196 -475 -472 -375 -128 299 441 110 18 -82 134 53 516
6063E16J62o34j67j89q1N1L27l5k74Q1M9N1J98j19j00L09M23l2m66l8m92L59r7
$$ 516 678 44 -123 -312 -393 -342 -15 -50 -324 -243 -194 -143 55 -64 -164 145 568 536 70 32 -460 -101 -198
6086a98K32k03r5j15J61Q5j1L22J03j33j50N75k45l75j41j28J06Q0L65j30k60
$$ -198 34 -169 -264 -379 -218 -133 -144 178 281 148 -2 573 328 -47 -188 -316 -210 -130 235 105 -155
6107a55l10Q7J85M20K12j71j36p8J93Qj02k52j44P8nL2p8m3k98K89K96K59K56
$$ -155 -465 -378 -193 227 439 268 132 54 247 255 153 -99 -243 -165 -170 -138 -216 -259 -557 -268 28 287 543
6130E43k54j86k83K49P3Lk8j05l67J25p2K04O6j43K49%J99J51l62l81Q0M19M35
$$ 543 289 103 -180 69 142 145 117 12 -355 -230 -302 -98 -32 -175 74 74 273 424 62 -319 -239 180 615
6153F15j90j26l91m24q6K05K25M71j29l32J74K59n9m18K46J53m1K79k29k24k96
$$ 615 425 299 -92 -516 -602 -397 -172 299 170 -162 12 271 212 -206 40 193 152 431 202 -22 -318
6174c18j62Q2L19M99k91j12k88l0P8N42Q1m0K3k99l21K56j41k57J02J33K39N0
$$ -318 -480 -398 -79 420 129 17 -271 -301 -223 319 400 360 383 84 -237 19 -122 -379 -277 -144 95 145
6196A45m75P5n1J70J49K37K6P4k44j75k32oK77l98L78J78k58R6K61j86k1n3K55
$$ 145 -330 -255 -306 -136 13 250 276 350 106 -69 -301 -307 -30 -428 -50 128 -130 -34 227 41 20 -33 222
6219B22J15l39j76Q6j80M48Jr2k18q9k33K11K95m6J4K22l10M09J4j1j98r6oJ4
$$ 222 337 -2 -178 -92 -272 176 177 85 -133 -222 -455 -244 51 5 19 241 -69 340 354 343 145 49 43 57
6243E7pN3k92L0j10J71J68R3J09j05q5j22J16K15r7j22L7j73j82J80q5N1k73L27
$$ 57 50 103 -189 -159 -269 -98 70 163 272 167 82 -40 76 291 194 72 109 -64 -246 -66 -151 -100 -373 -46
6267d6k01L99O9m92K31R1J02j48M74n50O4j25j16L40j28O1J1q6n0K8J75J53J1
$$ -46 -247 152 221 -271 -40 51 153 5 479 -71 -7 -132 -248 92 -36 25 36 -50 -100 -72 103 256 267
6290B67l7R5J39j87j49k58k49J28K52n0p3j72r7K30NJ80o1M07l11q7J01J41k98
$$ 267 230 325 464 277 128 -130 -379 -251 1 -49 -122 -294 -391 -161 -156 24 -37 370 59 -28 73 214 -84
6313h4k8m3K02m6r2k14k1mJ31P0M32j19o5o0J18k45K82j87M9k43J73J40p3r2m3
$$ -84 -112 -155 47 1 -91 -305 -326 -330 -199 -129 303 184 119 59 177 -68 214 27 76 -167 6 146 73 -19 -62
6338f2j5J08J95L8l04P2M7P2J56j69k64L33l21n4j74O15k61j47j46J84J25K21
$$ -62 -77 31 226 264 -40 32 79 151 307 138 -126 207 -114 -168 -342 273 12 -135 -281 -97 28 249
6360B49rLm25L23n5j94M54n49K17j54j49J95j84K26p1n0J50L8J53n8q0M42m52
$$ 249 240 243 -182 141 86 -108 346 -203 14 -140 -289 -94 -278 -52 -123 -173 -23 15 168 110 30 472 20
6383B0K14l7k75m7J41j49J62r9n4j33M8L09j4J68J57j86r6j21l6J25o5j50k37
$$ 20 234 197 -78 -125 16 -133 29 -70 -124 -257 -209 100 86 254 411 225 129 8 -28 97 32 -118 -355
6406c55J70P8R5n2j86K59k20L34J16r6j18r1J30k07R3P0j67k20Q0l4L08j97K18
$$ -355 -185 -107 -12 -64 -250 9 -211 123 239 143 25 -66 64 -143 -50 20 -147 -367 -287 -321 -13 -210 8
6429HP1k62L69j45m5K40M5j68o8k4L2j53k43N2K16R2j9k4j21N9K49k87J80L08
$$ 8 79 -183 186 41 -4 236 281 113 45 21 53 -100 -343 -291 -75 17 -2 -26 -147 -88 161 -126 54 362
6453C62n13L26J05l59j74o0o7m0J60L19q8J03k01J22p7M49k11Rj47j06J92J16
$$ 362 -151 175 280 -79 -253 -313 -380 -420 -260 59 -29 74 -127 -5 -82 367 156 165 18 -88 104 220
6475B20l98K7o6Jk7M17j96j93N6k5J60K11J07k16K00l01Jm4J26l20L45l11L44
$$ 220 -178 -151 -217 -216 -243 174 -22 -215 -159 -184 -24 187 294 78 278 -23 -22 -66 60 -260 85 -226 118
6498A18K04l49j64J51K0J51J19j22n6k28m6K41p0r5L6r8j14P9J28K56l85L06o0
$$ 118 322 -27 -191 -40 -20 131 250 128 72 -156 -202 39 -31 -126 -90 -188 -302 -223 -95 161 -224 82 22
6521B2P0J25k6k7k56J92P1k01L21n16K3N3K9j35K15J17q2m1J2l7J46J38k63M6
$$ 22 92 217 191 164 -92 100 171 -30 291 -225 -202 -149 -120 -255 -40 77 -5 -46 -34 -71 75 213 -50 -4
6545dl0J63q4P5m09k05M85j60L40k85M2q3R4J82j8n8kp7O0p3l4N1p0P4%Q6Q9J7
$$ -4 -34 129 45 120 -289 -494 -9 -169 171 -114 -72 -155 -61 121 103 45 43 -34 26 -47 -81 -30 -100 -26 -26 60 149 166
6573A66l29R9pL51k34j7J10n10K98K69k40j19k62K24J69j33M08l03j28K37o4K30
$$ 166 -163 -64 -71 280 46 29 139 -371 -73 196 -44 -163 -425 -201 -32 -165 243 -60 -188 49 -15 215
6595B15n3r2j50q4O3J79n0j16o4j07K01K97l45L3K57l18K24J13r2Jj03p9j6M9
$$ 215 162 70 -80 -164 -101 78 28 -88 -152 -259 -58 239 -106 -73 184 -134 90 203 111 112 9 -70 -86 -37
6619c7L25k22k3j31N6k29J83P3J92k73L07P2k88K40k23MJ4J44j33p9n7j89K63
$$ -37 288 66 43 -88 -32 -261 -78 -5 187 -86 221 293 5 245 22 26 40 184 51 -28 -85 -274 -11
6642a1nL5k6o9J57j32K2Pj67J68R3j13K8J04j50j80J63P3J36M5R7l76L2J31r4
$$ -11 -16 19 -7 -76 81 -51 -29 -22 -189 -21 72 -41 -13 91 -59 -239 -76 -3 133 178 275 -101 -69 62 -32
6667c2R4j88P1O4L53o30K35J08Lk50j7J60R6l33M98k08NJ47L3m66L94m39L24N0
$$ -32 62 -126 -55 9 362 -268 -33 75 78 -172 -189 -29 67 -266 232 24 29 176 209 -257 137 -302 22 72
6691G2k93M3K33k77L81k22j9J10j32J88k23K22M3r4n5J38J05J9m46K70J7q2K6
$$ 72 -221 -178 55 -222 159 -63 -82 28 -104 84 -139 83 126 32 -23 115 220 239 -207 63 80 -2 24
6714B4j20L59l53P5k70K59J04N2J34k38K1J33k48J21j08J6P9r6j18Q2p9N9M09
$$ 24 -96 263 -90 -15 -285 -26 78 130 264 26 47 180 -68 53 -55 -39 40 -56 -174 -92 -171 -112 297
6737B97k33m1J6p2lm3N3L5J41k60m0o5M47j43k69%K4M04m23L07k07R2P8O3j58
$$ 297 64 23 39 -33 -36 -79 -26 9 150 -110 -150 -215 232 89 -180 -180 -156 248 -175 132 -75 17 95 158 0
6762@J88j34lN4j10n9j21M57n11L60l65M06l1n8J14o9k62K43l6j2L1j43J37Jn7
$$ 0 188 54 51 105 -5 -64 -185 272 -239 121 -244 162 131 73 187 118 -144 99 63 51 82 -61 76 77 20
6787B0k1R3J2Pj50N1J2J03k8J84K6k62j77J71j48R3p1L0L2j06J34o6Pj0N2J35
$$ 20 -1 92 104 111 -39 12 24 127 99 283 309 47 -130 41 -107 -14 -85 -55 -23 -129 5 -61 -54 -64 -12 123
6813A23k5k9J93j35mL05l74k02j41K84j86K43j34K3J33q1J88k66J86k93K47Q4
$$ 123 98 69 262 127 123 428 54 -148 -289 -5 -191 52 -82 -59 74 -7 181 -85 101 -192 55 139
6835A39j6r7q0L5l25L20K38M5l64o1J44K56k29Q9j27m3L4P6J00l05K78j79j2R6
$$ 139 123 26 -54 -19 -344 -24 214 259 -105 -166 -22 234 5 94 -33 -76 -42 34 134 -171 107 -72 -84 12
6859A2k68K42R0m7J12%j45K30k99l4Q1m5K66j25l47K33j64J93n7N7NK03r4m0r4
$$ 12 -256 -14 76 29 141 141 -4 226 -73 -107 -26 -71 195 70 -277 -44 -208 -15 -72 -15 -10 193 99 59 -35
6884c5K84j94j83N9J40r4L8m0j29j43J71J97J5j12k2K43l42R6K40m8L5l15J49
$$ -35 249 55 -128 -69 71 -23 15 -25 -154 -297 -126 71 86 -26 -48 195 -147 -51 189 141 176 -139 10
6907A0K33j15k03r7K13J10l72N47k66p4mn5J06p2N3K34l23P8MK23l41PrK47k84
$$ 10 243 128 -75 -172 41 151 -221 326 60 -14 -18 -73 33 -39 14 248 -75 3 7 230 -111 -104 -113 134 -150
6932a50K22j14k0J60k12J89n4R2k07K50j3j99pL85k32k61L7K34l48K10o7MK0O2
$$ -150 72 -42 -62 98 -114 75 21 113 -94 156 143 -56 -63 322 90 -171 -134 100 -248 -38 -105 -101 -81 -19
6956a9L00j65J6m0j9Ol3r0J4j75o3O2J26r5L38k51J80k80L6O9P7j90n0O47n47
$$ -19 281 116 132 92 73 79 46 -44 -30 -205 -268 -206 -80 -175 163 -88 92 -188 -152 -83 -6 -196 -246 401 -146
6981a46J80l64L78m03L26j51J61j7j16K9K07K86j51l04J76m9nJ33k40K7N9j24
$$ -146 34 -330 48 -355 -29 -180 -19 -36 -152 -123 84 370 219 -85 91 42 37 170 -70 -43 16 -108
7003a08K10l39J30m5K16J38k35J96m6j49J58n6r2o2N3j33K38j71k70N61k10K22
$$ -108 102 -237 -107 -152 64 202 -33 163 117 -32 126 70 -22 -84 -31 -164 74 -97 -367 194 -16 206
7025B06Pk70k1J40m8oK18j68o9J50k99L1J58P8n3k96K45q2k56J78L17k60J3j0
$$ 206 213 -57 -78 62 14 8 226 58 -11 139 -160 -129 29 107 54 -242 3 -79 -335 -157 160 -100 -87 -97
7049i7O8J20m05M26m7j46L4r9N5R6K0k0P0Rl1Q2L81m15O9j19n1j26j93L06L3j41
$$ -97 -29 91 -314 112 65 -81 -47 -146 -91 5 25 5 75 84 53 135 516 101 170 51 0 -126 -319 -13 20 -121
7075a21L3J27L4o6k58L24J9P5p9K32l60J85j30j44%J01j94P7K52j52Ok51K66L4
$$ -121 -88 39 73 7 -251 73 92 167 88 320 -40 145 15 -129 -129 -28 -222 -145 107 -45 -39 -290 -24 10
7099A0P9J29k45J80k07J67n8k67M3j53K39n6R2j36q0K42l0J15P3j41O0J25k71
$$ 10 89 218 -27 153 -54 113 55 -212 -169 -322 -83 -139 -47 -183 -263 -21 -51 64 137 -4 56 181 -90
7122i0J85j5j61K04m3j98k59Q0j9K66QJ55k83j3L66J02j87R3k80%J98j78N1j54
$$ -90 95 80 -81 123 80 -118 -377 -297 -316 -50 -42 113 -170 -183 183 285 98 191 -89 -89 109 -69 -18 -172
7146a72J29n7P8k05J40o6K50J18r4k7k35O5J79j2j4Q9P9l49R0Pq6m4l6J06k9J89
$$ -172 -43 -100 -22 -227 -87 -153 97 215 121 94 -141 -76 103 91 77 166 245 -104 -14 -7 -93 -137 -173 -67 -96 93
7172I3j06J58J5n5j1n2k45K07rmL6l00RN4q6M03j4J05q1j61J23K52k83Q3M6k81
$$ 93 -13 145 160 105 94 42 -203 4 -5 -9 27 -273 -264 -210 -296 107 93 198 117 -44 79 331 48 131 177 -104
7198a04K45l71N8P8j09J61J18Pk27K9K41Q0p5m0r1M4k32K72k34Q2P8k28K05J03
$$ -104 141 -230 -172 -94 -203 -42 76 83 -144 -115 126 206 131 91 0 44 -188 84 -150 -68 10 -218 -13 90
7222I0j00J76l02k1K37j15J69J94j82j59M8J65n59L7L00p4L2R0k24M26k07j46
$$ 90 -10 166 -136 -157 80 -35 134 328 146 -13 35 200 -359 -322 -22 -96 -64 26 -198 228 21 -125
7244a25K50j62K21N5k17m2Q1o5J43M8k24Mj61K92j02M5j22p2J58P0p4J81Op9j77
$$ -125 125 -37 184 239 22 -20 61 -4 139 187 -37 -33 -194 98 -4 41 -81 -153 5 75 1 182 188 109 -68
7269f8kO1J15m5l35J32j01P6K53q4q8J77l91N16j74l3J33l21K69K4k70j3O6J98
$$ -68 -70 -9 106 61 -274 -142 -243 -167 86 2 -86 91 -300 216 42 9 142 -179 90 114 -156 -169 -103 95
7293I5k88J61j1J50P7N6m02J44J13m9l7r1J63k75L38k90J49j83K85K2k64J63J53
$$ 95 -193 -32 -43 107 184 240 -162 -18 95 46 9 -82 81 -194 144 -146 3 -180 105 127 -137 26 179
7316A79M9k53L12j42j27q6J17J37k05k76O5J73r3J87k11J66n6j28R8o9K12K0p0
$$ 179 228 -25 287 145 18 -68 49 186 -19 -295 -230 -57 -150 37 -174 -8 -64 -192 -94 -163 49 69 -1
7339aK8k20K52j36P2L4j79j5K57l7j95K48J59k03K08j54j73n7J24KJ01o5j95K13
$$ -1 27 -193 59 -77 -5 29 -150 -165 92 55 -140 108 267 64 272 118 -55 -112 12 14 115 50 -145 68
7363F8j96J06m32N25k18J38J53j67L49j78J06Jk55L1o0K6j57N1J29k30j9L2N7
$$ 68 -128 -22 -454 71 -147 -9 144 -23 326 148 254 255 0 31 -29 -3 -160 -109 20 -210 -229 -197 -140
7386a40L75j27k90J15m9QL10j40j65J12l2q1K3K7lp4J91j36P9j52L14l17K23J22
$$ -140 235 108 -182 -67 -116 -108 202 62 -103 9 -23 -104 -81 -54 -57 -131 60 -76 3 -149 165 -152 71 193
7410A93M3l09J64l22M2R9J15q2j64L38m20L40j19p9K67Kr3K0P2p5j07J8n3P9l8
$$ 193 236 -73 91 -231 -189 -90 25 -57 -221 117 -303 37 -82 -161 106 108 15 35 107 32 -75 -57 -110 -31 -69
7435f9o8P7j45J49K94j78K28k46k35M33m64J79MJ49J82m68l4J97L1r5j46K19M3
$$ -69 -137 -60 -205 -56 238 60 288 42 -193 240 -224 -45 -41 108 290 -178 -212 -15 16 -79 -225 -6 37
7458C7O6k01L96j99j50J03K21k60J6j02j11o5J44rK1q5K10K3Jj58L1Q3J49j18
$$ 37 103 -98 298 99 -51 52 273 13 29 -73 -184 -249 -105 -114 -93 -178 32 55 56 -102 -71 12 161 43
7482D3J86m04K12k13n9J31j99O6Q5L15j04j02J26m2k0O7l0N2l1M9l95J8K70j26
$$ 43 229 -175 37 -176 -235 -104 -303 -237 -152 163 59 -43 83 41 21 88 58 110 79 128 -267 -249 21 -105
7506a05J93j43P3q9j3L1K30K3n2R5n1O5m10P6K06l19m2J63j64j25M10L8p0j02
$$ -105 88 -55 18 -71 -84 -53 177 200 148 243 192 257 -153 -77 129 -190 -232 -69 -233 -358 52 90 20 -82
7530h2L20k17L8L21k80j2J04j45j21j8o1q7P5N5J85M2K3P3K89j89mk32j02L5r
$$ -82 238 21 59 380 100 88 192 47 -74 -92 -153 -240 -165 -110 75 117 140 213 502 313 309 77 -25 10 1
7555Ak16M21l30o8j58J43J47M8j54L11j87j78L11L69j93k88J97j96J02j23l60
$$ 1 -215 206 -124 -192 -350 -207 -60 -12 -166 145 -42 -220 91 460 267 -21 176 -20 82 -41 -401
7576d01R4L3o8K55k6j31K82j78M48j70P2J29j65m0j7k11k80J38Q9j54M1M11m14
$$ -401 -307 -274 -342 -87 -113 -244 38 -140 308 138 210 339 174 134 117 -94 -374 -236 -147 -301 -260 151 -263
7599b63L84l25L09M6l6R4K23l44R1j90p0R4q8j92K58j07oP0j49K05L3j12L82k08
$$ -263 121 -204 105 151 115 209 432 88 179 -11 -81 13 -75 -267 -9 -116 -122 -52 -201 4 37 -75 307 99
7623I9k21L13j52lj44j2O5J78j52l9m8J45J81o5k1m8J23o6pj95J42j7j44K8j2
$$ 99 -122 191 39 36 -108 -120 -55 123 -29 -68 -116 29 210 145 124 76 199 133 126 -69 73 56 -88 -60 -72
7648g2k74P4K09M1K0M8J45p0J26j88K29o2j86Q8j94j08L9L0k80K68l40J53L48
$$ -72 -346 -272 -63 -22 -2 46 191 121 247 59 288 226 40 128 -66 -174 -135 -105 -385 -117 -457 -304 44
7671D4j53K7j57L79Rl2J62l6l5j87Rj69J19l17L73m5k00L73k68RN8J59J12m9p2
$$ 44 -109 -82 -239 140 149 117 279 243 208 21 30 -139 -20 -337 36 -9 -209 164 -104 -95 -37 122 234 185 113
7696A13J13k96L32m98J71j47k3qK16k32L41p1K03J63k24j0l15K81J92m51K38r1
$$ 113 226 -70 262 -236 -65 -212 -235 -243 -27 -259 82 11 214 377 153 143 -172 109 301 -150 88 -3
7718cj52J10k69K72m08J95n1M52K09l48J51j53L09j09J9l18k7q7r8L7O0J17J39
$$ -3 -155 -45 -314 -42 -450 -255 -306 146 355 7 158 5 314 205 224 -94 -121 -208 -306 -269 -209 -92 47
7741D7k48K21L34qj78M9O2j89J4Lo3k71J45j11m6K70k43R6j2j0J80p4J8K71j21
$$ 47 -201 20 354 346 168 217 279 90 104 107 44 -227 -82 -193 -239 31 -212 -116 -128 -138 42 -32 -14 257 136
7766A36P8j21r4q4r3K7k30J63Q6j62K06J21J06n7PK66l38K05M4m5k51J63k31K7
$$ 136 214 93 -1 -85 -178 -151 -381 -218 -132 -294 -88 33 139 82 89 355 17 222 266 221 -30 133 -98 -71
7790g1j73nQ3M0j81J76K85l36L12k2J16N2l10L02k22o1m9l03R1K62j6k71J73M4
$$ -71 -244 -249 -166 -126 -307 -131 154 -182 130 108 224 276 -34 268 46 -15 -64 -367 -276 -14 -30 -301 -128 -84
7814h4J20p7M09j88N4o2j00o7pl8J07l21K48k9M1m5j40J8l4L35J86r0j80j16J58
$$ -84 36 -41 368 180 234 172 72 5 -2 -40 67 -254 -6 -35 6 -39 -179 -161 -195 140 326 236 56 -60 98
7839I8K52l93O2K3m5j35J25l95J80J67k85M31K03o3r5J55j79j8o2K55k59j09J2
$$ 98 350 -43 19 42 -3 -138 -13 -408 -228 -61 -346 85 288 225 130 285 106 88 26 281 22 -87 -75
7862g5k59J46o8J23j3q4M07j22K58k16k17L17j23J04r1k43K85m86O9lJ88p0j4
$$ -75 -334 -188 -256 -133 -146 -230 177 55 313 97 -120 197 74 178 87 -156 129 -357 -288 -291 -103 -173 -187
7885a87J04J27k18P7P8J98l1j53M69l60j2j89l2q6J97j5p9j05l1L50nJ7J92l0
$$ -187 -83 44 -174 -97 -19 179 148 -5 464 104 92 -97 -129 -215 -18 -33 -112 -217 -248 102 97 114 306 276
7909B76l00K41jn1k32o7J37j30o9P8J43k81J99j57M35l5rk48K55k31M63l99K21
$$ 276 -24 217 216 165 -67 -134 3 -127 -196 -118 25 -256 -57 -214 221 186 177 -71 184 -47 416 17 238
7932B38m15l6Q2M7J64m52L59M8o4K7K09r5J70k39O9J56m32K74j55k43K83j73l5
$$ 238 -177 -213 -131 -84 80 -372 -13 35 -29 -2 207 112 282 43 112 268 -164 110 -45 -288 -5 -178 -213
7955b13L0J16j46Q1J08K6j4P3j21J08JM73l85j10j46l39K42j06L19n4Pj27J77
$$ -213 -183 -67 -213 -132 -24 2 -12 61 -60 48 49 522 137 27 -119 -458 -216 -322 -3 -57 -50 -177 0
7978@J52n9j39J73O5p6L0j01k63J16j00K8O3nJ48m5l22K90J21M0o1L01p7M7k21
$$ 0 152 93 -46 127 192 116 146 45 -218 -102 -202 -174 -111 -116 32 -13 -335 -45 76 116 55 356 279 326 105
8003A05j06k19jJ63j11J92j97Mk40J20J52M75j04J02k44j4m3J08m02L36k39L8
$$ 105 -1 -220 -221 -58 -169 23 -174 -170 -410 -290 -138 337 233 335 91 77 34 142 -260 76 -163 -125
8025a25KJ16k52Oj11N67k74K91j25J40p7j28J50j27P6K9k18L9j76k57L50J2k18
$$ -125 -123 -7 -259 -253 -364 203 -71 220 95 235 158 30 180 53 129 158 -60 -21 -197 -454 -104 -92 -310
8048c10J88K91j54K04j12J11Q6k73J8O4K4j85j74L2j75J83P8j94L39J9j03K44
$$ -310 -122 169 15 219 107 218 304 31 49 113 137 -48 -222 -190 -365 -182 -104 -298 41 60 -43 201
8070B01j7P1j4m3l3K7k12n5j97L9j33O5K61r7Q1j25M60J30q5Nk31J13j85n6k37
$$ 201 184 255 241 198 165 192 -20 -75 -272 -233 -366 -301 -40 -137 -56 -181 279 409 324 329 98 211 26 -30 -267
8095b67J01o6K79k10j16J68p4J05J29j51J75L27m0j37J43k35j20n5k20KJ81o9
$$ -267 -166 -232 47 -163 -279 -111 -185 -80 49 -102 73 400 360 223 366 131 11 -44 -264 -262 -81 -150
8117a50j37J03L0J23O9M00K7j85j95j1q0J15k03mj7K2k42O7J3R3Q5L3M15j07J73
$$ -150 -287 -184 -154 -31 38 438 465 280 85 74 -6 109 -94 -98 -115 -93 -335 -268 -255 -162 -77 -44 371 264 437
8142D37l18k0O2l4j8q3j58o4k19O9J13J73p1L52j95R5J87p6k53K55k49O9Q1l6
$$ 437 119 99 161 127 109 26 -132 -196 -415 -346 -233 -60 -131 221 26 121 308 232 -21 234 -15 54 135 99
8166I9p9m14J23m14M49r6L22q2L09j21J77J12J8j81J9o2j47k19k48J21J68o2P
$$ 99 20 -394 -271 -685 -236 -332 -10 -92 217 96 273 385 403 222 241 179 32 -187 -435 -314 -146 -208 -201
8189b01J12P5p9J5R4K49K0M0j5k50j01k21K46l02P4N8l3l9M0J37pJ23K65j8Nj81
$$ -201 -89 -14 -93 -78 16 265 285 325 310 60 -41 -262 -16 -318 -244 -186 -219 -258 -218 -81 -88 35 300 282 287 106
8215A06J00M3l46k3q4J33J37M2l78K61J22J04l3J18P7k8l05J15k03K78q4k08K9
$$ 106 206 249 -97 -120 -204 -71 66 108 -270 -9 113 217 184 302 379 351 46 161 -42 236 152 -56 -27
8238b7j00k12L02l67K15K50K12k37N7J08J68k80K4j64M6M2l12J23Nl00m7L74j30
$$ -27 -127 -339 -37 -404 -189 61 273 36 93 201 369 89 113 -51 -5 37 -275 -152 -147 -447 -494 -120 -250
8261b50K96j29O9n7J41M7j7O7M4j08m7j40j89Q5n8Q8O5j29L60k24J02M0J9L74
$$ -250 46 -83 -14 -71 70 117 100 167 211 103 56 -84 -273 -188 -246 -158 -93 -222 138 -86 16 56 75 449
8285D49k94L03j15l40J8j13r5N5n1J94j33L1j26J66K57lP1J12l60J01j92p4J54
$$ 449 155 458 343 3 21 -92 -187 -132 -183 11 -122 -91 -217 -51 206 203 274 386 26 127 -65 -139 15
8308A5O7k12p8O5j18J39L5K9l8J71J15J05j46l6p8J01Q2l87J36k48q0M18k8l09
$$ 15 82 -130 -208 -143 -261 -122 -87 -58 -96 75 190 295 149 113 35 136 218 -169 -33 -281 -361 57 29 -280
8332b80K64j96J97N0K90j30J03k6j68m5O6N3l17k25L0n1K36n67N22J97J31M4J70
$$ -280 -16 -212 -15 35 325 195 298 272 104 59 125 178 -139 -364 -334 -385 -149 -716 -194 3 134 178 348
8355C48j00q5n9K34k24j68K96m39k01K63J18k05k7K51j62K87L01j87L3Jj36K00
$$ 348 248 163 104 338 114 -54 242 -197 -398 -135 -17 -222 -249 2 -160 127 428 241 274 275 139 339
8377C39j77j68m20J79J74j51K8P9l7j02M19J24j09R9r9J49j91R1j51l4q1l9j72
$$ 339 162 -6 -426 -247 -73 -224 -196 -117 -154 -256 163 287 178 277 178 327 136 227 76 42 -39 -78 -250
8400b50O9N6k44K77J52k3N5J61J86p4o4m0K7K9l18j03O1k00O3j73m5J90J60K10
$$ -250 -181 -125 -369 -92 60 37 92 253 439 365 301 261 288 317 -1 -104 -43 -243 -180 -353 -398 -208 -48 162
8424A62J7k54K91K21j39N7j67R2j64l86K48m16J82j33J32L12p8K10p0j14J8K19
$$ 162 179 -75 216 437 298 355 188 280 116 -270 -22 -438 -256 -389 -257 55 -23 187 117 3 21 240
8446B40p6J63k94J50k49oj59j77rJ75M2K8K93N7m9M6k03L14p5J44k74k05N0k45
$$ 240 164 327 33 183 -66 -72 -231 -408 -417 -242 -200 -172 121 178 129 175 -28 286 211 355 81 -124 -74 -319
8470c19L24k1q2nk14M4L24p7J85L27j65l9r0K17m81L8J46m64K56k52K51P9l40
$$ -319 5 -16 -98 -103 -317 -273 51 -26 159 486 321 282 192 409 -72 -34 112 -352 -96 -348 -97 -18 -358
8493c58J84O7j70O04j09J73q1j63P6k37J67k24k30k2J16j84J30K35l58P58o5j01
$$ -358 -174 -107 -277 327 218 391 310 147 223 -14 153 -71 -301 -323 -207 -391 -261 -26 -384 374 309 208
8515B08j9K29l36p4J07o7j67j18K13k13j06J41n4m6J68R3K21k48K09J57j5q6r7
$$ 208 189 418 82 8 115 48 -119 -237 -24 -237 -343 -202 -256 -302 -134 -41 180 -68 141 298 283 197 100
8538A00J59j42q4k41P6l01K60M3j06L1L93l46L38pL5J58k84L64m78O0k12N5j31
$$ 100 259 117 33 -208 -132 -433 -173 -130 -236 -205 188 -158 180 173 208 366 82 446 -32 28 -184 -129 -260
8561b60nj52J88M4n1N19j26O1k07K34K60j57k70j94j3k2J87P3k32N4k70L54k20
$$ -260 -265 -417 -229 -185 -236 283 157 218 11 245 505 348 78 -116 -129 -151 36 109 -123 -69 -339 15 -205
8584b05K27R5k16K22K20j99J71p1k34%Q4k05j7j12J00k60J89J80j31J16M13k73
$$ -205 22 117 -99 123 343 144 315 244 10 10 94 -111 -128 -240 -140 -400 -211 -31 -162 -46 367 94
8606I4L14j18l78K08P4j32J7j49k3j83L7p6O5J21K74j09J23J40n3p6Nj46M2K55
$$ 94 408 290 -88 120 194 62 79 -70 -93 -276 -239 -315 -250 -129 145 36 159 299 246 170 175 29 71 326
8630C26n00L1j05n8J30j18L20mk3J67j4N3l4K47j32j93J64k54j21J91l02J19j93
$$ 326 -174 -143 -248 -306 -176 -294 26 22 -1 166 152 205 171 418 286 93 257 3 -118 73 -229 -110 -303
8653c03Q7J53p1K62r7J12j29R3N0L18m77n2p4J84j0o5k09mp5L41j99K21k7J64
$$ -303 -216 -63 -134 128 31 143 14 107 157 475 -2 -54 -128 56 46 -19 -228 -232 -307 34 -165 56 29 193
8677A93k41L24k02M7K05k88l4k9j4J0k98J18L5j64K69K62j07J94j67p3M8J01J0
$$ 193 -48 276 74 121 326 38 4 -25 -39 -29 -327 -209 -174 -338 -69 193 86 280 113 40 88 189 199
8700A99j55ll2j21j44M5J09m0J94LM5N2k51O5J08L38j79j64r4j07l10K37n0rR1
$$ 199 44 41 9 -112 -256 -211 -102 -142 52 55 100 152 -99 -34 74 412 233 69 -25 -132 -442 -205 -255 -264 -173
8725a73j07k8L43j08J90Q3J02k80L43k23j91K73m29K34j25j07l4K0L29P0k75L01
$$ -173 -280 -308 35 -73 117 200 302 22 365 142 -49 224 -205 29 -96 -203 -237 -217 112 182 -93 208
8747B08p6j47J88j39J41j83J49j13j4L7n6j74j1K64j92j97L78q4K16l3j8m2kN9
$$ 208 132 -15 173 34 175 -8 141 28 14 51 -5 -179 -190 74 -118 -315 63 -21 195 162 144 102 100 159
8771A59j65j32L5m2j30p4j10K72J86J44J2J10n25M51k45L26q0N9j13k69M6r2n
$$ 159 -6 -138 -103 -145 -275 -349 -459 -187 -1 143 155 265 -260 191 -54 272 192 251 138 -131 -85 -177 -182
8794a82J37k18N2k35N31M5J1K26j56n0j10J35l41N3Q3l44R6M8mk34L59l1K16j09
$$ -182 -45 -263 -211 -446 85 130 141 367 211 161 51 186 -155 -102 -19 -363 -267 -219 -223 -457 -98 -129 87 -22
8818b2K05K0O4j85j74L07k96p0J83j03M0j95L42l08J35k65L05J08Q7K50r1n0n8
$$ -22 183 203 267 82 -92 215 -81 -151 32 -71 -31 -226 116 -192 -57 -322 -17 91 178 428 337 287 229
8841B29k43L7q2j59R2j19J70k66o6J80Q1K07PJ71L0k05R2j07j17M4J69j84ll5
$$ 229 -14 23 -59 -218 -126 -245 -75 -341 -407 -227 -146 61 68 239 269 64 156 49 -68 -24 145 -39 -42 -77
8865g7j32J0J49p7K02j67R9M4N1J38m35L28M3j11j1j92J03k84nL01R0j10R1r2
$$ -77 -209 -199 -50 -127 75 -92 7 51 102 240 -195 133 176 65 54 -138 -35 -319 -324 -23 67 -43 48 -44
8889d4K08rN5q6K48j36j59j67J08l6J13l67K90k98J24M38m31J04J35J70j33l4
$$ -44 164 155 210 124 372 236 77 -90 18 -18 95 -272 18 -280 -156 282 -149 -45 90 260 127 93
8911I3j26K85j31k55J15k1j84l1MJ23M3n2J68j63L46Kr7J71k44j68K32J16k97
$$ 93 -33 252 121 -134 -19 -40 -224 -255 -251 -128 -85 -137 31 -132 214 216 119 290 46 -122 110 226 -71
8934g1j7m8k39J52L87n61K64M4L43j61L6J7Q7l14L91l25L94k91j86j33L6L24o5
$$ -71 -88 -136 -375 -223 164 -397 -133 -89 254 93 129 146 233 -81 310 -15 379 88 -98 -231 -195 129 64
8957F4j27O3pPL5N0L6j31J28q4K4Q1k50j18J76k71K96n3J02J26k56Q7Q6K14j59
$$ 64 -63 0 -7 0 35 85 121 -10 118 34 58 139 -111 -229 -53 -324 -28 -81 21 147 -109 -22 64 278 119
8982A19r1K00k0P2j50k01j12J88l6j16j84M11p3mP6k19L35J75j00k50J56Om0k18
$$ 119 28 228 208 280 130 -71 -183 5 -31 -147 -331 80 7 3 79 -140 195 370 270 20 176 182 142 -76
9006g6j38l1K89j03K16k38r8J60j46QK48k0l9M4Q7k81L00l22J12N5l9L5k17Q0
$$ -76 -214 -245 44 -59 157 -81 -179 -19 -165 -157 91 71 32 76 163 -118 182 -140 -28 27 -12 23 -194 -114
9030a14L7K78m58J78J78J49J23j23j36k38K74r6j99j8oM5P0k28L31j22L5J11K19
$$ -114 -77 201 -257 -79 99 248 371 248 112 -126 148 52 -147 -165 -171 -126 -56 -284 47 -75 -40 71 290
9053B90j70K23p6l19J08M7j74J72j29m07K58j4J36j62K77j58J00jR2k5P9p3j43
$$ 290 120 343 267 -52 56 103 -71 101 -28 -435 -177 -191 -55 -217 60 -98 2 1 93 68 147 74 -69
9076f9K61p9m93L91j18j46l7K2J3K8J67L4J24L5j2n1J18k03P4q6j22K35k70J06
$$ -69 192 113 -380 11 -107 -253 -290 -268 -255 -227 -60 -26 98 133 121 70 188 -15 59 -27 -149 86 -184 -78
9100g8Lk6j91J62K13o7J2N6p6K18l4j8O4l87M66m23j82J08l7j00K05J13nj28K77
$$ -78 -75 -101 -292 -130 83 16 28 84 8 226 192 174 238 -149 317 -106 -288 -180 -217 -317 -112 1 -4 -132 145
9125A45j2k70J65m7J58Ok81n2J69j45o9R6M2J94q9NN3M4L10j4p0k82k11J97j41
$$ 145 133 -137 28 -19 139 145 -136 -188 -19 -164 -233 -137 -95 99 10 15 68 112 422 408 338 56 -155 42 -99
9150i9K53l30M0j11J55k0J13M3L0O7J7J67k16P8o6l7k44J41j22J11j47m6JJ30
$$ -99 154 -176 -136 -247 -92 -112 1 44 74 141 158 325 109 187 121 84 -160 -19 -141 -30 -177 -223 -222 -92
9174i2k50J36P5K67j37J41J22J10q3k89k1N9r9m9j82Q4n6J08o8J80J56n8R8R3
$$ -92 -342 -206 -131 136 -1 140 262 372 289 0 -21 38 -61 -110 -292 -208 -264 -156 -224 -44 112 54 152 245
9198B45j94O1L55m41L2k07r5j33P2k30L55o4K23L5K41l5r4k22L03J9l2N3l00j35
$$ 245 51 112 467 26 58 -149 -244 -377 -305 -535 -180 -244 -21 14 255 220 126 -96 207 226 194 247 -53 -188
9222a88j46J06Q2j80J99M4n9N5J89J20kK52l69J96N4l18R2j72k67p9M4J93k88
$$ -188 -334 -228 -146 -326 -127 -83 -142 -87 102 222 220 472 103 299 353 35 127 -45 -312 -391 -347 -154 -442
9245d42L15J37j44K40J85m1Nj6j35n8lR1m36K8j40L8K30j20J49L5J75J47kJ11
$$ -442 -127 10 -134 106 291 250 255 239 104 46 43 134 -302 -274 -414 -376 -146 -266 -117 -82 93 240 238 349
9269C49k3q8j39M53p01K93j50m02K33j26J59p8k32L57K45j3j94K55J0k8q3k41
$$ 349 326 238 99 552 -149 144 -6 -408 -175 -301 -142 -220 -452 -95 150 137 -57 198 208 180 97 -144
9291a44K11l9k06N5j70j00J69j65K42R7O1j59L38R6j23O5Q2k27J2n6l11J10k75
$$ -144 67 28 -178 -123 -293 -393 -224 -389 -147 -50 11 -148 190 286 163 228 310 83 95 39 -272 -162 -437
9314d37r2J49P5L56q3j15J33J34P0L83k01k39j69j4ml34P8o4K34j58J44J22o0
$$ -437 -529 -380 -305 51 -32 -147 -14 120 190 573 372 133 -36 -50 -54 -388 -310 -374 -140 -298 -154 -32 -92
9337i2N3J28J54J01j04J11J38l72p4k59p1p8N2L20j16j99L03l1K45Pj36K75K7
$$ -92 -39 89 243 344 240 351 489 117 43 -216 -287 -365 -313 7 -109 -308 -5 -36 209 216 80 355 382
9360C82j29j14r0K6l70j5R9m2m4Q3n8L58Q8j04j05M26o3q1M1j60n8L8p6l13J0
$$ 382 253 139 49 75 -295 -310 -211 -253 -297 -214 -272 86 174 70 -35 391 328 247 288 128 70 108 32 -281 -271
9385b71j71J21K5RJ04K23Q1J83P6M6j16k25J63l56J30j45p5M7l6J20j52K6R5J50
$$ -271 -442 -321 -296 -287 -183 40 121 304 380 426 310 85 248 -108 22 -123 -198 -151 -187 -67 -219 -193 -98 52
9409E2RJ85m0Oj61K79k84j73K9j11J16l69J74K7J57K0mn4K00K5J35J51j75j94
$$ 52 61 246 206 212 51 330 46 -127 -98 -209 -93 -462 -288 -261 -104 -84 -88 -142 58 83 218 369 194 0
9433@J16N5l85l7j9O1J03M1o9J56Q3k1j4N3K1Q0kp1l36L04l05K19j03k12j4J85
$$ 0 116 171 -214 -251 -270 -209 -106 -65 -134 22 105 84 70 123 144 224 222 151 -185 119 -186 33 -70 -282 -296 -111
9459a11j06J04K53Q4l3J96l8r3J11k35p5r0k08K42j86r6K41l20L29p2J87L9j07
$$ -111 -217 -113 140 224 191 387 349 256 367 132 57 -33 -241 1 -185 -281 -40 -360 -31 -103 84 123 16
9482A6ON5J16J94j86k41J29m59K85j49L51l51J26p6J53j14K93J08r6J21k20Q4
$$ 16 22 77 193 387 201 -40 89 -370 -85 -234 117 -234 -108 -184 -31 -145 148 256 160 281 61 145
9504A45Kq4r9k40J5J1j02K44q4k3J1K70j8J25j40P0K86m04o0j1j77J72q4o5J47
$$ 145 147 63 -36 -276 -261 -250 -352 -108 -192 -215 -204 66 48 173 33 103 389 -15 -75 -86 -263 -91 -175 -240 -93
9529i3N5q8p4MJ81K92n8L4K4k44J39j27r2j27J71n34N00J41l07M8J02R1O1K5N1
$$ -93 -38 -126 -200 -196 -15 277 219 253 277 33 172 45 -47 -174 -3 -537 -37 104 -203 -155 -53 38 99 124 175
9554A75j24Q1R0l45L4M41m42j58p0L16J01n6l40M17r2k09L59j98M31m38j69m0
$$ 175 51 132 222 -123 -89 352 -90 -248 -318 -2 99 43 -297 120 28 -181 178 -20 411 -27 -196 -236
9576b36L53k21J48r6m7j73j50M06o5O4j79J84J40k60J47K77j75j06J11k77R7k31
$$ -236 117 -104 44 -52 -99 -272 -422 -16 -81 -17 -196 -12 128 -132 15 292 117 11 122 -155 -58 -289
9598b89K03L7j74K69l54K17J07K64l44K77r5q0J45l33q2J09M3j90K08qk3m9K40
$$ -289 -86 -49 -223 46 -308 -91 16 280 -64 213 118 38 183 -150 -232 -123 -80 -270 -62 -70 -93 -142 98
9621I8P2k22M03l88Q1Q4p3J34k42j04J10l0j1q4J89l08J35K57N8l2L0n6j05J64
$$ 98 170 -52 351 -37 44 128 55 189 -53 -157 -47 -77 -88 -172 17 -291 -156 101 159 127 157 101 -4 160
9645A60j80J45q8j33M9j14J47k1j62N4K10r7K48j33J08j60K27o5l5k25mJ5P3j2
$$ 160 -20 125 37 -96 -47 -161 -14 -35 -197 -143 67 -30 218 85 193 33 260 195 160 -65 -69 -54 19 7
9669Gj81k34K42O2Q2M3J43q8j16M9J69J05j83j4n3K34j86l14K70j05o6l1J70K81
$$ 7 -174 -408 -166 -104 -22 21 164 76 -40 9 178 283 100 86 33 267 81 -233 37 -68 -134 -165 5 286
9693B86m17K55k65J12J04k0J41j46K7j46j63mm5J08O4N5p2J02J24j05J07r6J09
$$ 286 -131 124 -141 -29 75 55 196 50 77 -69 -232 -236 -281 -173 -109 -54 -126 -24 100 -5 102 6 115
9716A15K7r0P1j11p4q7Q6p9R0J4k1K4K7j38J39O3K9o4k8M27l69n3n4L8j2m0j20
$$ 115 142 52 123 12 -62 -149 -63 -142 -52 -38 -59 -35 -8 -146 -7 56 85 21 -7 420 51 -2 -56 -18 -30 -70 -190
9743a90j06K86r8J19J08k9k10O9r2J22K96k43K0NJ77k62j02k33M50k27J62j6r5
$$ -190 -296 -10 -108 11 119 90 -120 -51 -143 -21 275 32 52 57 234 -28 -130 -363 87 -140 22 6 -89
9766h9R5K79j20J65J54m09Q3j68Rj84j13R6J76m6J96j74Oj54J54k87L73J16J10
$$ -89 6 285 165 330 484 75 158 -10 -1 -185 -298 -202 -26 -72 124 -50 -44 -198 -44 -331 42 158 268
9789B68j23P7k00n5J39k92J95J0l83L73k59K75QJ14k32L99k33L07k44k72N3j57
$$ 268 145 222 22 -33 106 -186 9 19 -364 9 -250 25 33 147 -85 314 81 388 144 -128 -75 -232
9811b32j8K69k92J59j69L41j73N3J45k3j35J05R8J8J40j05j91k33J70N1k6k72
$$ -232 -250 19 -273 -114 -283 58 -115 -62 83 60 -75 30 128 146 286 181 -10 -243 -73 -22 -48 -320
$$ [...]
16382bK4
16383B2
##END NTUPLES=NMR FID
##END=
