##TITLE=abcd
##JCAMPDX= 6.0         $$ Bruker NMR JCAMP-DX V2.0
##DATA TYPE= NMR FID
##DATA CLASS= NTUPLES
##ORIGIN= UXNMR, Bruker Analytische Messtechnik GmbH
##OWNER= root
$$ XWIN-NMR		Version 3.5
$$ Wed May 21 18:30:35 2025 Russian Standard Time (UT+4h)  servis@DPX200
##.OBSERVE FREQUENCY= 200.131235884673
##.OBSERVE NUCLEUS= ^1H
##.DELAY= (6, 6)
##.ACQUISITION MODE= SIMULTANEOUS
##.ACQUISITION SCHEME= undefined
##.AVERAGES= 32
##.DIGITISER RES= 18
##SPECTROMETER/DATA SYSTEM= spect
##.PULSE SEQUENCE= zg
##.SOLVENT NAME= CDCl3
##.SHIFT REFERENCE= (INTERNAL, CDCl3, 0, 16.5164)
##AUDIT TRAIL= $$ (NUMBER, WHEN, WHO, WHERE, WHAT)
$$ ##TITLE= Audit trail, XWIN-NMR		Version 3.5
$$ ##JCAMPDX= 5.01
$$ ##ORIGIN= Bruker BioSpin GmbH
$$ ##OWNER= servis
$$ F:\spectra/data/av/nmr/H1/1/audita.txt
$$ ##AUDIT TRAIL=  $$ (NUMBER, WHEN, WHO, WHERE, WHAT)
(   1,<2025-05-21 18:25:46.20 +0400>,<servis>,<DPX200>,
      <created by zg, POWCHK disabled, PULCHK disabled
       configuration hash MD5:
       00 E9 B6 7A A2 85 ED C7 34 08 36 98 17 FE 4E 26
       data hash MD5: 32K
       B4 20 CB 7A 01 85 C0 94 43 77 1B EA D8 50 1C 4B>)
$$ ##END=
$$ 
$$ hash MD5
$$ 9A F8 D8 86 7C DB 60 C5 9B 68 06 A2 F6 8B 68 CE
##$RELAX= 
##$RELAX= 
##$RELAX= 
##$RELAX= 
##$RELAX= 
##$RELAX= 
##$RELAX= 
##$RELAX= 
$$ Bruker specific parameters
$$ --------------------------
##$DU= <F:\spectra>
##$EXPNO= 1
##$NAME= <H1>
##$PROCNO= 1
##$TYPE= <nmr>
##$USER= <av>
##$AMP= (0..31)
100 100 100 100 100 100 100 100 100 100 100 100 100 100 100 100 100 100 
100 100 100 100 100 100 100 100 100 100 100 100 100 100 
##$AQSEQ= 0
##$AQ_mod= 1
##$AUNM= <au_zg>
##$AUTOPOS= <>
##$BF1= 200.13
##$BF2= 200.13
##$BF3= 200.13
##$BF4= 200.13
##$BF5= 500.13
##$BF6= 500.13
##$BF7= 500.13
##$BF8= 500.13
##$BYTORDA= 1
##$CFDGTYP= 0
##$CFRGTYP= 5
##$CHEMSTR= <none>
##$CNST= (0..31)
1 1 145 1 1 1 1 1 1 1 1 1 1 1 1 1 1 1 1 1 1 1 1 1 1 1 1 1 1 1 1 1 
##$CPDPRG= <>
##$CPDPRG1= <>
##$CPDPRG2= <>
##$CPDPRG3= <>
##$CPDPRG4= <mlev>
##$CPDPRG5= <mlev>
##$CPDPRG6= <mlev>
##$CPDPRG7= <mlev>
##$CPDPRG8= <mlev>
##$CPDPRGB= <>
##$CPDPRGT= <>
##$D= (0..31)
0 2 0 0 0 0 0 0 0 0.06 0 0 0 0 0 0 0.0002 0 0 0 0 0 0 0 0 0 0 0 0 0 0 
0 
##$DATE= 1747837545
##$DBL= (0..7)
120 120 120 120 120 120 120 120 
##$DBP= (0..7)
150 150 150 150 150 150 150 150 
##$DBP07= 0
##$DBPNAM0= <>
##$DBPNAM1= <>
##$DBPNAM2= <>
##$DBPNAM3= <>
##$DBPNAM4= <>
##$DBPNAM5= <>
##$DBPNAM6= <>
##$DBPNAM7= <>
##$DBPOAL= (0..7)
0.5 0.5 0.5 0.5 0.5 0.5 0.5 0.5 
##$DBPOFFS= (0..7)
0 0 0 0 0 0 0 0 
##$DE= 6
##$DECBNUC= <off>
##$DECIM= 32
##$DECNUC= <off>
##$DECSTAT= 4
##$DIGMOD= 1
##$DIGTYP= 9
##$DL= (0..7)
0 120 120 120 120 120 120 120 
##$DP= (0..7)
150 150 150 150 150 150 150 150 
##$DP07= 0
##$DPNAME0= <>
##$DPNAME1= <>
##$DPNAME2= <>
##$DPNAME3= <>
##$DPNAME4= <>
##$DPNAME5= <>
##$DPNAME6= <>
##$DPNAME7= <>
##$DPOAL= (0..7)
0.5 0.5 0.5 0.5 0.5 0.5 0.5 0.5 
##$DPOFFS= (0..7)
0 0 0 0 0 0 0 0 
##$DQDMODE= 0
##$DR= 18
##$DS= 0
##$DSLIST= <SSSSSSSSSSSSSSS>
##$DSPFIRM= 0
$$ [...]
##$SUBNAM0= <"">
##$SUBNAM1= <"">
##$SUBNAM2= <"">
##$SUBNAM3= <"">
##$SUBNAM4= <"">
##$SUBNAM5= <"">
##$SUBNAM6= <"">
##$SUBNAM7= <"">
##$SUBNAM8= <"">
##$SUBNAM9= <"">
##$SW= 20.6817932712277
##$SWIBOX= (0..15)
0 0 3 0 0 0 0 0 0 0 0 0 0 0 0 0 
##$SW_h= 4139.07284768212
##$TD= 32768
##$TD0= 1
##$TE= 0
##$TE2= 300
##$TE3= 300
##$TEG= 300
##$TL= (0..7)
0 120 120 120 120 120 120 120 
##$TP= (0..7)
150 150 150 150 150 150 150 150 
##$TP07= 0
##$TPNAME0= <>
##$TPNAME1= <>
##$TPNAME2= <>
##$TPNAME3= <>
##$TPNAME4= <>
##$TPNAME5= <>
##$TPNAME6= <>
##$TPNAME7= <>
##$TPOAL= (0..7)
0.5 0.5 0.5 0.5 0.5 0.5 0.5 0.5 
##$TPOFFS= (0..7)
0 0 0 0 0 0 0 0 
##$TUNHIN= 0
##$TUNHOUT= 0
##$TUNXOUT= 0
##$USERA1= <user>
##$USERA2= <user>
##$USERA3= <user>
##$USERA4= <user>
##$USERA5= <user>
##$V9= 5
##$VALIST= <valist>
##$VCLIST= <CCCCCCCCCCCCCCC>
##$VD= 0
##$VDLIST= <DDDDDDDDDDDDDDD>
##$VPLIST= <PPPPPPPPPPPPPPP>
##$VTLIST= <TTTTTTTTTTTTTTT>
##$WBST= 1024
##$WBSW= 30
##$XGAIN= (0..3)
0 0 0 0 
##$XL= 0
##$YL= 0
##$YMAX_a= 57235
##$YMIN_a= -44370
##$ZGOPTNS= <>
##$ZL1= 120
##$ZL2= 120
##$ZL3= 120
##$ZL4= 120
##$ABSF1= 10
##$ABSF2= 0
##$ABSG= 5
##$ABSL= 3
##$ALPHA= 0
##$AQORDER= 0
##$ASSFAC= 0
##$ASSFACI= 0
##$ASSFACX= 0
##$ASSWID= 0
##$AUNMP= <proc_1d>
##$AZFE= 0.1
##$AZFW= 0.1
##$BCFW= 1
##$BC_mod= 2
##$BYTORDP= 0
##$COROFFS= 0
##$CY= 19
##$DATMOD= 1
##$DC= 2
##$DFILT= <>
##$DTYPP= 0
##$F1P= 11.0000007629395
##$F2P= -0.999999237060547
##$FCOR= 0.5
##$FTSIZE= 0
##$FT_mod= 4
##$GAMMA= 1
##$GB= 1
##$INTBC= 1
##$INTSCL= 1
##$ISEN= 128
##$LB= 0.05
##$LEV0= 0
##$LPBIN= 0
##$MAXI= 10000
##$MC2= 0
##$MEAN= 0
##$ME_mod= 0
##$MI= 0
##$NCOEF= 0
##$NC_proc= 0
##$NLEV= 6
##$NOISF1= 0
##$NOISF2= 0
##$NSP= 1
##$NTH_PI= 0
##$NZP= 0
##$OFFSET= 16.51637
##$PC= 1
##$PHC0= -183.8496
##$PHC1= -4.898466
##$PH_mod= 0
##$PKNL= yes
##$PPARMOD= 0
##$PSCAL= 4
##$PSIGN= 0
##$REVERSE= no
##$SF= 200.13
##$SI= 16384
##$SIGF1= 0
##$SIGF2= 0
##$SINO= 400
##$SIOLD= 16384
##$SREGLST= <1H.CDCl3>
##$SSB= 0
##$STSI= 0
##$STSR= 0
##$SW_p= 4139.07284768211
##$SYMM= 0
##$S_DEV= 0
##$TDeff= 0
##$TDoff= 0
##$TI= <>
##$TILT= no
##$TM1= 0
##$TM2= 0
##$TOPLEV= 0
##$USERP1= <user>
##$USERP2= <user>
##$USERP3= <user>
##$USERP4= <user>
##$USERP5= <user>
##$WDW= 1
##$XDIM= 8192
##$YMAX_p= 0
##$YMIN_p= 0
$$ End of Bruker specific parameters
$$ ---------------------------------
##NTUPLES= NMR FID
##VAR_NAME=  TIME,          FID/REAL,        FID/IMAG
##SYMBOL=    X,             R,               I
##VAR_TYPE=  INDEPENDENT,   DEPENDENT,       DEPENDENT
##VAR_FORM=  AFFN,          ASDF,            ASDF
##VAR_DIM=   16384,         16384,           16384
##UNITS=     SECONDS,       ARBITRARY UNITS, ARBITRARY UNITS
##FACTOR=    0.0002416,     1,               1
##FIRST=     0,             0,               0
##LAST=      3.9581328,     0,               0
##MIN=       0,             -44370,          0
##MAX=       3.9581328,     57235,           0
$$ Real data points
##PAGE= N=1
##DATA TABLE= (X++(R..R)), XYDATA
0@%%%%%%%%%%%%%%%%%%%%%%%%%l2O4o4O4o4O4o4O4r3J25j28J28j42J74j92K01
41A05k33K56k88L20l52L91m23M74n23N70o25O90p63Q43r33J035j149J285j445
60g65J630j856K140k510L008l708M788o703J1103m0110p935P5113O507l3510l7286
75c0094Q502K4627J6817p125n104n66k219j3683l794J1328J4913l277j7372j5419
89b2466O955K2744J3218j3400j9599k483J4290J2501K429n684o037l850k583q95
103d860O156P032n253j4906n197Q953J0072K562P5Q28k129p048m363Q984J7242
118A8148K881k0928k1522L032J9479J0858o623j2111l276P819O924m212p051M420
132b162J1843L055r775j0365J826J1994N819j0340j3414J792J1642K887q025n834
$$ plain form
0 0 0 0 0 0 0 0 0 0 0 0 0 0 0 0 0 0 0 0 0 0 0 0 0 0 0 -32 32 -32 32 -32 32 -32 32 -61 64 -64 64 -78 96 -96 105
41 105 -128 128 -160 160 -192 199 -224 250 -273 297 -328 362 -401 442 -491 544 -605 680 -765
60 -765 865 -991 1149 -1361 1647 -2061 2727 -3976 7127 -32983 -40918 34195 40702 7192 -30094
75 -30094 -21592 3035 19852 12727 7623 7057 4838 -8845 -12639 -1311 13602 10325 -7047 -22466
89 -22466 -15511 7233 20451 7051 -12548 -15031 -741 11760 14189 8505 2468 -1382 -3965 -4860
103 -4860 1296 8328 3075 -11831 -17028 -8075 1997 4559 4634 5462 3333 -3715 -8078 906 18148
118 18148 21029 101 -21421 -18389 1090 11948 5325 -6786 -10062 -2243 4681 469 -6582 -2162
132 -2162 9681 12736 2961 -7404 -5578 6416 12235 1895 -11519 -9727 1915 4802 -3223 -9057
146i057K186N320L250J003K233L684j608q820n195O288Q870O1q201r414l899N683
162g616J0945M838n174p722k303M679Q048L970l500n344j648K60M56J767N06l211
178a049k539J305N37k734j233K985M464K401j232k716P13L533J77l414j174J131
194A155j056k463r30p05r00R44K128J659J739J395q15j426J30M63R89K574M33
211E314m772n106j05K331J446R81qj981k025k79J850M529M675n19n025k983J098
228e79K330K238N61m179o281j655L638L907J043j748k554M14M046L266P9j142
244C384j814k197O34L346M69m132m002q69J498K819J984j007k060k74Q69J581
260B29L031K085j549k518q06n14o10R25P81j830k679j031M94J808K360O30p48
$$ plain form
146 -9057 -6871 -1551 1699 2702 4935 8619 7011 -1809 -7004 -716 8154 8215 14 -9400 -13299 -7616
162 -7616 3329 8167 2993 -4729 -7032 -2353 5695 9665 6165 821 -827 -567 -111 1656 2162 -1049
178 -1049 -3588 -2283 -1746 -4480 -5713 -2728 1736 4137 2905 189 902 4435 4612 1198 24 1155
194 1155 99 -2364 -3294 -3999 -4899 -3955 -1827 -168 1571 2966 2151 725 855 1318 2307 4881 5314
211 5314 542 -4564 -4669 -2338 -892 89 81 -1900 -3925 -4204 -2354 2175 6850 6331 1306 -1677 -579
228 -579 1751 3989 4550 371 -5910 -7565 -3927 -20 1023 -725 -3279 -2865 1181 4447 4526 3384
244 3384 1570 -627 7 3353 3822 -310 -4312 -5181 -3683 -864 1120 113 -1947 -2221 -1352 229
260 229 3260 5345 3796 1278 472 -42 -652 273 1054 -776 -3455 -4486 -3992 -2184 176 806 58
277E8N97J197j62M06J640l78k805j555M74J52n69r93j463j04K052J461k02K54
295F0Q17o0N24J649L44j257n90m49j742j162M67L50m63n01p61k64J825K022K01
314A010J98J337J20j428j69J085j42j349j529j477k18J200J70j276K0J426Q48
331a74Q27J204M3q29N58J066m90j036o31j133j131O3J41m58R1K05l53Q13K216
350I92P80q46L52J251n6q35m87o42n89k73r60j254L09R75l93k79J200J029K46
369E20Q01Q11l19k00M55m28j142m30m01r49m44j34m96L00J257J54m85J185J833
388A888K23n67J03M1j80q4o98j340n39j75q25j41J123L08o63N17J376N64M06P46
408B083m1n50L5k18r46n49k91q83n61L45j85l78R40J162j97J76J410R24k58l86
$$ plain form
277 58 655 1852 1690 2096 3736 3358 553 -1002 -528 -376 -945 -1938 -3401 -3505 -1453 8 -194 60
295 60 877 817 1341 2990 3334 2077 1487 1038 -704 -1866 -1399 -1049 -1512 -2013 -2774 -3038 -1213 809 1010
314 1010 1208 2545 2665 1237 1068 2153 2011 662 -867 -2344 -2562 -1362 -1192 -2468 -2448 -1022 -174
331 -174 653 1857 1900 1071 1629 2695 2205 1169 538 -595 -1726 -1663 -1522 -1980 -1889 -1684 -2037 -1224 992
350 992 1772 926 1278 2529 2473 1638 1151 509 -80 -353 -1313 -2567 -2258 -1283 -1676 -1955 -755 274 520
369 520 1321 2132 1813 1613 2068 1640 498 68 -333 -1282 -1726 -1860 -2356 -2056 -799 -645 -1130 55 1888
388 1888 2111 1544 1647 1688 1508 1424 726 -614 -1153 -1328 -2153 -2294 -1171 -863 -1526 -1009 367 931 1337 2083
408 2083 2042 1492 1527 1309 363 -186 -477 -1360 -1921 -1576 -1761 -2139 -1199 -37 -234 -58 1352 2276 2018 1632
428A632l60m39J20j05j302j020L7k62o37O19J070J19J28Q05M23J34Q25N57m64
447A880o08m75r51n41K41m33r06M9L10m08K94J463Q98J8L40L10j66J92L48n57
467A298q90n76r01o31N32M27r09o60P63R91Q61J118L32r15m56P38P46K81l98j740
487A1j892j25R31K44l7q1p53l79J407J903O14j14l25o73p6R38K61j006j180j219
507a551q93N39J413J58r75j99N51O95J203J148k44q31r2J57j60r3m84j107o48
526a413Q7l92j49J121Q77o55o18P32J263J291P16q24j594m02N15j26n92m80o75
545a318m12K64l9k74J059J746R1j028M7J092R82J83j114j797n16Q51L09m65m02
564g41o36r18K27J277R04N54O75r0q91n1J031Q32j45j234j964p70J255R38r69
$$ plain form
428 1632 1272 833 953 848 -454 -1474 -1437 -1699 -2336 -1717 -647 -528 -400 405 828 962 1787 2344 1880
447 1880 1272 797 -154 -695 -454 -887 -1793 -1744 -1434 -1842 -1548 -85 813 831 1171 1481 1315 1507 1855 1298
467 1298 408 -168 -1069 -1700 -1168 -741 -1650 -2310 -1547 -556 305 1423 1755 840 384 1122 1868 2149 1751 11
487 11 -1881 -2006 -1075 -831 -868 -949 -1702 -2081 -674 1229 1843 1729 1404 731 655 1593 1854 848 -332 -1551
507 -1551 -2444 -1905 -492 -334 -1309 -1508 -957 -262 941 2089 1845 1014 922 1079 919 826 342 -765 -1413
526 -1413 -1326 -1718 -1867 -746 131 -524 -1142 -410 853 2144 2860 2036 442 40 555 429 -163 -643 -1318
545 -1318 -1730 -1466 -1505 -1779 -720 1026 1117 89 136 1228 2210 2393 1279 -518 -1034 -183 126 -339 -741
564 -741 -1377 -2295 -2068 -791 113 667 1342 1252 361 310 1341 2173 2028 794 -1170 -1940 -685 253 -716
583g16j475m12O86J766K040J27j644p04R21J075K58n63j012n59o2p77j043N64
601a530J526j16j366k31J150J391Q22l27j080m3J204N17p59q47n87m59j98m38
619a371q83K43J728Q51r52n68R36J292O83j44p42k96M26m06j473p28L74J19j20
638a031K81Jk01N75P94j17l39M76R56P00Oj296j649j32R78L07m25n46j066q83
658b611O86J727Q76k2q1j13K31Q42N81m72j019j174r28L26J264j19j602p10R88
677a330J236O84J28l73j36O97N84k29l62k51o68m00J94m2l95L1j11r21m18J091
697i91J404O72J89k23l37J00K02k18j2K61q06j676p23M22M79N04O28Rk77M72Q66
718I45K51j33k44k25K16L29p31j343k25O53L3l19m7r5J0N49L77p0M92J090L79
$$ plain form
583 -716 -2191 -2603 -1917 -151 1889 2016 372 -332 589 1664 1922 1359 347 -212 -274 -1051 -2094 -1530
601 -1530 -4 -120 -1486 -1717 -567 824 1646 1319 239 196 1400 1917 1158 311 -276 -735 -933 -1371
619 -1371 -2254 -2011 -283 568 -384 -952 -16 1276 1959 1815 1073 777 1203 797 -676 -1404 -1030 -911 -1031
638 -1031 -750 -749 -950 -375 419 302 -37 439 1395 2095 2101 805 -844 -976 2 309 -116 -662 -1728 -2611
658 -2611 -1925 -198 678 656 575 462 693 1535 2116 1644 625 -549 -1477 -1151 113 -6 -1608 -2318 -1330
677 -1330 -94 590 718 345 209 906 1490 1261 899 648 -20 -420 -226 -268 -663 -632 -743 -1664 -2082 -991
697 -991 413 1085 1274 1051 714 814 1016 798 786 1047 241 -1435 -2158 -1736 -1257 -753 -125 -116 -393 79 945
718 945 1196 1063 819 594 810 1139 408 -935 -1160 -507 -474 -793 -840 -935 -925 -376 1 -69 423 1513 1892
739A892n29q33o93J66R82O8j721j613lP15O38P95N76r5k30k2K58Q87R98m18j603
760B15r70J16L10K60j16r79o88Q49J254J1o93k73M31J097J062r3r38m82j20k82
780b9O8L35n23j065m74J9O1P11J282O34j70l64k12K57R67L68r37j135m22k78j99
801a106L04K25k90n8L93K33K39N58K13j79J46L50k5n2j74q70q60K85O12k95o39
822i90l79j54M37J087P65J35M8N9k33k1K49k35m82j78m98j140l62P50P49K13O3
843a17k09j01N97Q18J19q7j3l71m07K0j01o33k83J27j67k11K42J62j77K81P35
864B24N66M74K17n16o05O1J92l41l20j92p15o60K08N31L24M76L87k2J4L02J60
885G65J24L76p1q97n85l5k39k36K03k3m16O2M33K18K16N04L35J28L44p5n87j98
$$ plain form
739 1892 1363 530 -163 3 985 1053 -668 -2281 -2284 -1569 -931 -136 440 345 115 93 351 1238 2236 1818 215
760 215 -755 -639 -329 -69 -185 -1164 -1852 -1003 251 262 -431 -704 -273 824 1886 1793 855 373 253 -29
780 -29 39 374 -149 -1214 -1688 -1669 -1608 -897 385 1019 849 485 273 530 1497 1865 928 -207 -629 -907 -1106
801 -1106 -802 -577 -867 -925 -532 -299 -60 498 711 532 678 1028 1003 951 777 -93 -953 -668 -56 -351 -990
822 -990 -1369 -1523 -1086 1 766 901 949 1008 775 754 1003 768 286 108 -390 -1530 -1892 -1142 -393 -180 -117
843 -117 -326 -427 170 988 1107 1020 1007 636 229 249 148 -485 -768 -641 -808 -1019 -777 -615 -792 -511 224
864 224 790 1264 1481 965 360 421 613 272 -48 -240 -955 -1615 -1407 -876 -552 -76 311 289 303 605 765
885 765 889 1265 1194 297 -288 -323 -562 -798 -595 -618 -1034 -972 -539 -321 -105 399 734 862 1206 1131 544 346
907C46J24l72m91l2k68n52m1L85K94L32N59K44pL08J30k47K2K42m05o51k52l06
929f38m83P0M27M4p5K19J48K07N76M22n1Q0J38m39m88L1j64n54j81R3l15k22K36
952i19L37L28N92L09p8J61L02j60k63J18j95o92l81l2k57j59J98R2J8M81L67l
974A64K70M51K8j08J70j65o57k49l6l92l53P9Pj26K30K57R9M76N92P3r2K62q5
997H95m86j22J44l80n80k48k04o4L36K44r0K78M86J47J01M83K07l33j84k9l94
1018B07l62kk49m96j08J17P2L86L93l0N1O01L52j88P6J49l62m96j52k18k95q0
1040f34j15k89J30L88J12J66O28K75k08J59M49n0l98k51k63l72o3j17m20o4K51
1061f86l6N6M92L90J10M62L04m16m00L36L36l67o29o24k78K89K23l77k25N66L99
$$ plain form
907 346 470 98 -393 -425 -693 -1245 -1286 -901 -607 -275 284 528 521 829 959 712 734 976 571 -80 -332 -638
929 -638 -1121 -1051 -624 -580 -655 -436 -288 -81 495 917 866 946 1084 645 157 188 24 -530 -711 -618 -933 -1155 -919
952 -919 -582 -254 338 647 569 730 1032 872 609 727 532 -160 -541 -573 -830 -989 -791 -699 -681 -200 167 164
974 164 434 885 913 805 975 810 153 -96 -132 -524 -877 -798 -791 -917 -687 -430 -331 145 737 810 718 980 895
997 895 409 287 431 51 -529 -777 -981 -1045 -709 -465 -555 -277 209 356 457 940 1147 814 630 601 207
1018 207 -155 -157 -406 -902 -1010 -893 -821 -435 -42 -72 -21 580 932 744 820 969 607 111 -41 -259 -554 -634
1040 -634 -749 -1038 -908 -520 -408 -242 386 661 453 612 1061 1011 613 362 99 -273 -336 -453 -873 -937 -686
1061 -686 -722 -666 -174 216 326 788 1092 676 276 612 948 581 -48 -672 -950 -661 -438 -815 -1040 -474 -75
1082g5r9K19O12K71k5k2l20l81R5J45m54n94l46j31L21N07j34m68M29R98K98k41
1104F05J3J26l1k9j61m28j44j43m92l97J47K00J00N40L71l48k03O89P45k7l76
1125G57k70j27Pk62p07l82L84J86l54p7K70J41L69O43J27l53J23N08J05m87n92
1146Il76J51K41n32p93K88Q02j4l80K75N66L87K00l5k33J8K83j79n70n00m04j9
1168h15M88J84p44l50O97O60p6J04N32L98o6m10m09n1K89k44o22j79M8k98q1M12
1190e33J08j08M23P77K34k77j92LK21J18l71n37l5k6n96l06L95K49j57J79N18
1211H7J53M6L18K48Rj50l73k08K42j25q42m98M08J62l11N1N16K82J29K34J17K5
1233E20J24j4r5M5k07n96k81J43k92m34L33O29k5l00J58M82L51J69o7kK89j25
$$ plain form
1082 -75 -174 45 657 928 903 881 561 180 275 420 -34 -628 -974 -1105 -784 -277 -411 -879 -450 548 846 605
1104 605 618 744 713 684 523 95 -49 -192 -684 -1081 -934 -734 -634 -94 277 -71 -274 415 1160 1133 757
1125 757 487 360 367 105 -602 -984 -600 -414 -768 -845 -575 -434 -65 578 705 352 475 983 1088 601 9
1146 9 -367 -216 25 -507 -1300 -1012 -210 -224 -604 -329 237 624 824 789 556 574 857 678 108 -392 -796 -815
1168 -815 -327 -143 -887 -1237 -540 120 44 148 680 1078 1012 602 193 142 431 187 -435 -614 -566 -864 -945 -533
1190 -533 -425 -533 -110 667 901 624 432 435 656 774 403 -134 -169 -195 -791 -1097 -702 -453 -610 -431 87
1211 87 240 286 604 852 861 711 338 130 372 247 -595 -1093 -685 -523 -834 -783 -267 15 144 378 495 520
1233 520 644 630 535 580 373 -223 -504 -361 -653 -1087 -754 -125 -150 -450 -292 190 541 710 643 641 930 805
1255H05p26m02J61j49n00KK80p0o9L55L21J57K04K51J30J32j74m39j89P8l70m99
1277g11J96L21l97m13K90M91K19Q2J17K39L86L5l70n1K13l27o48o2J90k70l40
1298h10N3Q0M7L79M68K69J01J8j02J31J71l86m92O4N6n83l97K72K51j35l4K34
1320c45L55L71J43j29RK63j34k28J60Mo39m46J02Kk68J6K80J85J98J66J36L62
1342E63L45j55k99J33K9m52l75mk90m19J05L79J89N9R4O1K34K74J0J1L27M9o03
1365B65m70J05K9k37j36j18j71L6K90J41J44K46J42J94L65O3m31j51J43k45n39
1386c35j68P2j18j44l7J15L74M57R7o4J98J77r7J8J52l10n31j69N4j22o5O6q6
1409d66r2N3J05K35N50L42j67j86J55q6j35Q8j22m99m08Jk3j7P9J06J92M60L08
$$ plain form
1255 805 79 -323 -162 -311 -811 -809 -529 -599 -668 -313 8 165 369 620 750 882 708 269 80 158 -212 -711
1277 -711 -515 -194 -591 -1004 -714 -223 -4 78 195 434 820 855 485 434 647 320 -328 -390 -200 -470 -810
1298 -810 -757 -677 -630 -251 217 486 587 605 503 634 805 419 -73 -9 47 -536 -933 -661 -410 -545 -579 -345
1320 -345 10 381 524 395 404 667 533 305 465 469 -170 -616 -514 -512 -780 -764 -484 -299 -101 65 201 563
1342 563 908 753 454 587 616 164 -211 -215 -505 -924 -819 -440 -251 -192 -98 -37 197 471 481 492 819 868 265
1365 265 -205 -100 -71 -308 -444 -562 -733 -697 -407 -266 -122 124 266 460 825 888 457 306 449 204 -335
1386 -335 -503 -431 -549 -693 -730 -615 -241 216 313 249 447 624 527 545 697 387 -144 -313 -259 -381 -446 -380 -466
1409 -466 -558 -505 -400 -165 385 727 560 374 529 443 308 396 274 -225 -633 -632 -655 -672 -593 -487 -295 165 473
1432D73j45L3L42Qk92r6k9k33k21k03l09r3L21K44m8qM8N5L34M55N0k48N4L4l17
1457B09k25M8q8k56k21k91q2L39M11N3J26K88Q2j6K52J33k55k59p5k78k16o7j73
1480e61j32J70K62l5J16K68Q4PK39J65m0QM0l63m05q6N4n6j1j90l21P4M68K28
1504a7J04K69K33n0j15K8n7p5ml16m80j63J03k4P3J91M5K7L35K48j6K9J99kj13
1529D52n9k26l06q4%k55n9J89kp9J54K03J18L24L56m6k46q1n7j07K2j58l95k32
1553e74L4o9o7K99L21J10P1J62j0P5K43J9k26j70j47k63j52K1j32j30J73J34l3
1576c11O8K71J57J36K28N3j53n5l4k56j68l7j94j64J7m2j60J55M50K08N8J27N4
1599D08l2R8K6j72j43o4k42l13o7L1l9J20J85pl9K61K42J35R9P6j34q0p3k02k50
$$ plain form
1432 473 328 361 703 711 419 323 294 61 -160 -363 -672 -765 -444 -200 -248 -256 -208 -153 181 636 686 438 492 526 209
1457 209 -16 32 -56 -312 -533 -824 -906 -567 -156 -103 23 311 393 377 629 762 507 248 173 -105 -321 -388 -561
1480 -561 -693 -523 -261 -296 -180 88 172 179 418 583 543 551 591 228 -177 -263 -209 -265 -276 -466 -787 -713 -245 -17
1504 -17 87 356 589 539 424 452 395 320 316 0 -480 -643 -540 -564 -491 -300 -255 -228 107 355 339 368 567 565 452
1529 452 393 167 -139 -223 -223 -478 -537 -348 -350 -429 -275 -72 46 370 726 680 434 353 296 189 211 53 -342 -574
1553 -574 -540 -609 -676 -377 -56 54 125 287 277 352 595 614 388 218 71 -192 -344 -323 -455 -585 -412 -278 -311
1576 -311 -243 28 185 321 549 602 449 394 360 104 -64 -101 -295 -459 -442 -484 -644 -489 -39 169 227 354 408
1599 408 376 474 500 328 185 121 -121 -434 -501 -470 -509 -389 -204 -211 -250 11 253 388 487 563 429 349 276 74 -176
1624a76k4l6k11o4O2kQ9L56K02kJ07J75K7k8k9j73j99k9j00l15j98Q6K4M3J89
1649b26J17lK05K45J3oJ22L5j41j54k63k61k5J35j29j88P6R3P9K06K42R0Q5K12
1673E59j8j96o4k8j20j11j73l00o9J85O3j46O7K44J62J40K08M3p9P1Jj98j66m2
1697C3j89j50l4j15j26K01K49po7K55L07Q5O0p3j94m3K3j45j94mj86k23L6J15
1721c86K9J30L29J44r0M3K04J05j4j39k16j24M1j27k84q0J0o5Q1K57J45L1J40
1744A64J30PJ3P8M3p8j28l52k69O4J02k05j08J88J62JJ68J97M6O3J17L4m6Kj53
1769B40k59r7j25k07M0K65o1j99N1K81K18Q7J30PO1J4j61j63J0r1k86j60O5j4
1793c54q6J35J63l5J5K62K52J26Oj26j43k1n2k14j19Q2j41k47K6J94j4P5K21J68
$$ plain form
1624 -176 -200 -236 -447 -511 -449 -451 -362 -6 196 194 301 476 503 475 446 273 74 45 -55 -370 -568 -482 -458 -415 -226
1649 -226 -109 -112 93 338 351 345 467 502 361 207 -56 -317 -342 -207 -336 -524 -448 -355 -276 -70 172 262 347 559
1673 559 541 345 281 253 133 22 -151 -451 -520 -335 -272 -418 -351 -107 55 195 403 446 367 438 439 241 75 33
1697 33 -156 -306 -340 -455 -581 -380 -131 -138 -205 50 357 442 502 429 235 192 215 70 -124 -128 -314 -537 -501 -386
1721 -386 -357 -227 102 246 156 199 403 508 494 355 139 15 56 -71 -355 -435 -425 -490 -409 -152 -7 24 164
1744 164 294 301 314 392 435 357 229 -123 -392 -328 -226 -431 -539 -351 -189 -188 -20 177 223 286 403 437 391 393 240
1769 240 -19 -116 -241 -448 -408 -143 -204 -403 -352 -71 147 234 364 371 432 446 285 122 132 41 -245 -405 -340 -354
1793 -354 -440 -305 -142 -177 -162 100 352 478 484 358 215 194 142 -72 -191 -109 -250 -497 -471 -277 -291 -216 5 173
1817A73R5R6L9K5n8j45k45L1J58k00l50r8N9k3Q7K48J55P0Q2M2J1O4P6r0n0r9
1843A53k66k30O9O5k39r9J90K26M9J11Q6J11R8K7r2M0O4j74k87l9o1k18l6J60
1867b92O8l6Q4J82J33J17K6p1J11J28q7k10o3j87k67n8J69oq5O8J27K1M7J57J77
1892B53K27L8k27k09R2lk86j77M6m8m5J1K2J1J33J97J31R7R8j9k0J0j07k56J4
1917a7J03j86k73l1Q8K6M0J12P4J59J54K9K7J07l8k29o3Pj67j82oRj42o6J31J03
1943b31J79K15L5K1R0np6%K6j85j68Qn8k24q9J13J13J09P8L9J01J54K6m4P7J24
1969D28j10k09j24r9j62l0L6n8l4J15J19J10J14P1M4J60O4j62j46L0o3k22j31
1992b59Rp6l2Q4L1N8J74J11k6J01J53m3nO3o4k16r8m0j42r1K5%NO1R1P9J76J77
$$ plain form
1817 173 268 364 403 428 370 225 -20 11 169 -31 -381 -479 -420 -443 -356 -108 47 117 199 241 252 316 392 302 252 153
1843 153 -113 -343 -274 -209 -448 -547 -357 -131 -82 29 115 226 324 351 259 299 363 189 -98 -137 -198 -416 -452 -292
1867 -292 -224 -260 -176 6 139 256 282 211 322 450 363 153 90 -97 -364 -422 -253 -259 -344 -276 -149 -128 -81 76 253
1892 253 480 518 291 82 174 171 -115 -292 -246 -294 -339 -328 -306 -295 -162 35 166 263 361 342 322 332 225 -31 -17
1917 -17 86 -100 -373 -404 -316 -290 -250 -138 -64 95 249 278 305 412 374 145 82 89 -78 -260 -266 -257 -399 -465 -334 -231
1943 -231 -52 163 198 219 309 304 228 228 254 69 -99 -91 -149 -373 -462 -349 -236 -127 -49 -10 91 245 271 227 304 428
1969 428 318 109 -15 -114 -276 -306 -270 -328 -362 -247 -128 -18 96 167 211 371 435 273 127 157 94 -128 -259
1992 -259 -250 -326 -358 -274 -243 -185 -11 100 74 175 328 285 280 343 279 63 -35 -75 -217 -308 -283 -283 -278 -217 -126 -47 129 306
2020C06JLR2k5k55n7k3j31j68m5k3j7N8O9J6J54J99J1K0J21J1j01j4oj44j51k6
2047a25q3j41K1N8RP1J20M9J33J79N4n3M2Lj48j51m5j06j51m3k3j7P1J51M7Q8
2073A0J10J14k6P2P6j24r0l7j08j43n2k0j18l0Q3K5O8J82N4K1J67J25p0o1P0j15
2099A83j65j14k1j45k7lj8jJ85J37L8J31J20j9k6P5n9j34l6p1j88j14K6j3j5L5
2125b39J7L9J56J50L9K1J08ko9m4m3j16j16l8j31r3P4M0l5J42J27P1J09J60J1
2150C38p8K8pj43j17l3j53q2Lk9k3J10J00J1O2J37Q2J8O8L9j03j10k4j02j07m6
2176a61p0j34M1Q1ON6K04R3L5J12L7k4n2J3j02j61n5r0o9m0J2k6P5J97L4PJ04
2203A23J27L5j6J6m8j05o2j41j04j5j6o0n0Q7K1L2K25J31K4j4J00m0m9k7q8j34
$$ plain form
2020 306 307 310 402 377 122 65 42 -89 -257 -302 -325 -342 -284 -215 -199 -45 154 165 185 306 317 216 202 196 52 -99 -125
2047 -125 -208 -349 -328 -270 -261 -190 -70 -21 112 291 345 292 334 337 189 38 -7 -113 -264 -307 -330 -347 -276 -125 -78 10
2073 10 120 234 208 280 356 232 142 105 -3 -146 -198 -218 -336 -366 -283 -258 -190 -8 46 67 234 359 289 228 298 183
2099 183 18 -96 -117 -262 -289 -292 -310 -311 -126 11 49 180 300 281 255 330 271 137 101 30 -158 -272 -246 -259 -274 -239
2125 -239 -222 -183 -27 123 162 183 291 289 220 176 133 17 -99 -137 -268 -361 -287 -247 -282 -140 -13 58 167 327 338
2150 338 260 288 281 138 21 -12 -165 -247 -244 -273 -296 -186 -86 -75 -13 124 206 224 292 331 228 118 94 -8 -115 -161
2176 -161 -231 -365 -324 -243 -237 -181 23 116 151 263 300 276 224 237 135 -26 -81 -171 -240 -280 -268 -294 -219 -22 12 19 123
2203 123 250 285 269 285 237 132 70 -71 -175 -190 -206 -266 -316 -229 -208 -176 49 180 204 190 290 250 201 174 86 -48
2229d8o3p0j59j5Q7J3K0J45J53J3L4J22L2j4Oo4p6o9j05j46k7L7l6o4J09J15m
2256g4P6J79Q5lPMp2n8q4j36n1oj59j11J33J03j9P0J83N4K2O1O2pmp8j22p5n7
2285g7j38q1O1R1r4MJ66Q2M8P0J36L2kl6j27n1l3j32p7J2l3j31MJ65M6J2J02J77
2313A96M6OMl8k4k4j53j28N5p4j68l3J40J1k9J18J81L5K2O5O0J7n3j23r8L5m5
2340Aj93n5L9k6o4J12J59N6N5J05L0K2l2l9jM4j36k26m2L5q4j20R1J21O3J9J12
2367D6N6P4M8j1KM9j01j87q5J4j41r3R3R6n3OJ03J13Q6P0J4M2P2q8j47J3J2k06
2395a03j72N0R5o3n6J01Q3N4O0O4J07J15m1j46j7l3j30j19L4j0j42j7R5N3nN5
2421h8J04J30J02J3m6QPj63j30N5J3j61q5nL1k4P6J51J00P3QjQ3N1j41q4L4m5
$$ plain form
2229 -48 -111 -181 -340 -355 -268 -255 -235 -90 63 76 110 232 264 250 256 192 116 47 -58 -204 -231 -194 -230 -294 -185 -70 -74
2256 -74 2 181 266 263 270 274 202 144 60 -76 -127 -133 -292 -403 -270 -167 -186 -116 67 121 143 204 266 259 255 177 55 -20 -77
2285 -77 -215 -296 -235 -144 -238 -234 -68 14 62 132 268 300 298 262 135 84 51 -81 -158 -146 -179 -310 -306 -141 -95 -83 19 196
2313 196 242 248 252 214 190 166 13 -115 -60 -134 -302 -335 -195 -184 -213 -95 86 121 143 208 268 285 232 109 11 46 1
2340 1 -192 -247 -208 -234 -298 -186 -27 29 84 189 219 241 209 170 169 213 77 -149 -191 -156 -240 -360 -269 -148 -85 -66 46
2367 46 102 176 224 213 215 264 163 -24 -109 -95 -236 -329 -236 -140 -193 -187 -84 29 115 185 199 241 313 225 78 91 103 -103
2395 -103 -275 -225 -130 -193 -249 -148 -65 -11 49 113 220 335 294 148 131 98 -32 -151 -117 -127 -269 -286 -191 -138 -143 -88
2421 -88 16 146 248 261 215 223 230 67 -63 -8 5 -156 -241 -246 -215 -239 -163 -12 88 161 169 168 251 302 161 77 111 66
2449F6j65p2M0o2j27O9J14J07M4P7M3Q5J3j10J5Q9n2k38o3K0n9j10mP2N6P0O0
2476b2Q8P2M5k5lJ17n9j28k1l7j23j70K2P3MJ0K5N3J10O4J3N1J06j4j22l2L0j58
2504c1j30k6Ok3n1N5O1P3N6KQ1J80Kn8qOj42j17J8m2j07l3L4RM2N5J7J33J16L0
2534B08l8P9N9j40j27j9k4r6m8k1m9qM4L7Q4J27M2j7R7M6o1n0K8m1j57n9l9m7
2562a90l3k6L4L4J08J01M1Q0Q2o7RM6k1j47m3m8p8k7n8oJ5Q6N3QJ18R5j9L3M2
2591B22l0n7j6Lj44r9m4j9lj4K2J2J49N1ML3J33M4o2l9l6p8n0o3p1q6O9j9l2Q9
2621a31R0M0N8J15K6k6M0Mp4q0k1n3j02l2m5l6P6M1J7N8J19M3%M8M8l8l6l6r6
2650A7o1m1o8p8M9jK1K4Q0R0L3Q7L7k6KJ5p0p1n6m6p8j6K5p4L4P8O1J0P3R3JM8
$$ plain form
2449 66 -99 -171 -131 -193 -320 -251 -137 -30 14 91 134 219 232 122 137 226 174 -64 -127 -107 -166 -276 -280 -208 -152 -82 -22
2476 -22 66 138 183 158 155 272 213 85 64 27 -96 -266 -244 -171 -167 -157 -132 -79 31 95 108 159 265 251 129 97 127 -31
2504 -31 -161 -187 -181 -204 -255 -200 -139 -66 -10 -8 73 253 255 197 189 195 53 -64 -46 -88 -195 -228 -194 -185 -143 -88 -71 62 178 208
2534 208 170 249 308 168 41 22 -2 -98 -146 -167 -216 -224 -180 -143 -59 68 110 93 190 236 175 125 153 112 -45 -104 -143 -190
2562 -190 -223 -249 -215 -181 -73 28 69 149 231 164 173 219 198 51 8 -40 -118 -145 -203 -209 -194 -108 -55 -47 71 166 147 180 222
2591 222 192 135 119 122 -22 -121 -165 -184 -187 -201 -179 -167 -18 33 37 70 203 247 185 146 110 32 -18 -81 -152 -238 -169 -188 -220 -131
2621 -131 -41 -1 57 172 198 172 212 216 142 62 41 -12 -114 -146 -191 -227 -151 -110 -93 -35 84 127 127 175 223 185 149 113 17
2650 17 -44 -85 -153 -231 -182 -183 -162 -138 -58 32 65 152 189 163 165 180 110 39 -17 -63 -141 -157 -132 -206 -172 -94 -33 -23 50 143 144 192
2682A92M0l3o2k0q8j11n7Pn8m1L6N8MJ13O7L1P3N5Oq0rm5r0n7l5p1n7N1%j2P2
2713a21J04K3P1M7L9j5N5rq6l8l5j01o5o%m6J7Q0J3L7J25K8L5O4j2n0m0%r9j20
2743a05%o7m0OL1K9K8R7N4M6P6L0m8K9Np8r0k2l5j06j3kj5K3J09K4K8Q6P6QL9
2774B03J4o2n7l2m6r0n2po8K7K6K6K7R3O0J4N9M0J3o8J7p6j02k6k4n2n4L6qK4
2804a45P8N2L1M1R4jJ0Jj3n6n4m3r9j9J1l5l5O3K5K7R9R2K1j1O4j1m3l9m2q3k2
2835d2l9q9l3N4J8j9L6J18K5M6Q8rk5%k1n1m5l2q6o3L4k0l8L5J20K7M9O7J1K8
2865A44L5K0p2j5l5r8n7mo1m3J4R6J0J2O8L7M0M3J0J4lj2j06n9j6p9l7l1N0l5
2895a70j0J09P4K7N1M2M4J6j0o2o8Pp5r0j6K9l3k8O2N2J0M7Q5N4K6Mk9Oj6j00
$$ plain form
2682 192 232 199 137 117 29 -82 -139 -132 -190 -231 -195 -137 -133 -20 47 78 151 206 212 132 123 78 -12 -69 -104 -175 -232 -181 -181 -193 -121
2713 -121 -17 6 77 124 163 148 203 194 108 70 35 -66 -131 -137 -137 -183 -166 -86 -73 -36 89 117 152 216 204 154 114 114 15 -105
2743 -105 -105 -172 -212 -206 -175 -146 -118 -21 33 79 155 185 137 166 171 93 3 -19 -54 -160 -173 -175 -190 -167 -58 -34 -6 80 156 164 203
2774 203 217 155 98 66 20 -70 -122 -129 -197 -170 -144 -118 -91 2 62 76 135 175 188 120 137 61 -41 -67 -91 -143 -197 -161 -169 -145
2804 -145 -67 -15 16 57 151 150 160 161 148 92 38 -5 -104 -123 -112 -147 -182 -119 -94 -67 32 124 145 134 198 187 144 105 63 -20 -42
2835 -42 -81 -170 -203 -149 -131 -150 -114 4 29 75 163 154 129 129 108 57 12 -20 -106 -169 -135 -155 -193 -158 -38 -11 38 105 116 144
2865 144 179 199 127 112 77 -21 -78 -82 -143 -186 -172 -76 -66 -54 14 51 91 134 144 158 155 143 37 -22 -38 -117 -154 -185 -135 -170
2895 -170 -180 -71 3 30 81 123 167 183 173 111 43 50 -25 -115 -131 -102 -135 -163 -101 -49 -39 8 93 147 173 177 148 154 138 38
2925C8j14j4K6m0r2N9J5k1M5P1P0P0N0j6j3j2m4r6M6m9q0o9K8rm0K4J10M9N8O6
2955A16jQJ6j9rk0j7j16l2Nm5q6J4J10P6NJ6M0P9M4l2k5J7j5q8n9j8n3r5LN1N
2987a25OP5R0K5J5KPQ9lj22k0ro2j00k5L8j4K0K7M1N9J3M1N5O9Pn2n4J7q3r5l0
3019i8M3o0k9K9qM0K5M6N7P2J2k5L4J9r3j25J3L5p6p3j9M8M%M9M6R2M7L0KL7m6
3051A28p2K7l7o9o1J2k1m8j3K6P3R1L5QN5M0l7o2M2j2p5r1Ol7o4l6M2K7L9N8N
3082b1O9P5l9j6N6L4p7n5Pr4o1m4OJ5K8K5M5N6O7j8KJ16Rm5n4Kk6j01o4k4%j6
3114a43M6J3J4N6K3K7Q7K3n5L6Ml5j24k9rm9k5J9kRK2K4M1P9M9l0M9M8m0r5J0
3145D3l4j9o3k9k1J1K3J4K0O0Q1K1L1O9o4l5J6j4j04n9j2k0k7j6k0L7P4L4qM2
$$ plain form
2925 38 -76 -90 -64 -104 -196 -137 -122 -143 -98 -27 43 113 163 147 134 122 78 -18 28 -21 -101 -170 -142 -151 -191 -167 -57 -8 50 116
2955 116 115 123 139 120 111 91 74 -42 -74 -69 -114 -200 -186 -76 0 5 21 61 140 184 152 127 144 129 41 -18 -36 -89 -184 -181 -130 -125
2987 -125 -119 -44 46 71 86 88 95 184 181 59 39 30 -32 -132 -157 -119 -133 -113 -86 -45 14 27 68 123 192 199 147 93 110 27 -68 -98
3019 -98 -55 -115 -144 -115 -123 -83 -58 -12 45 117 129 104 138 157 64 -61 -48 -13 -89 -162 -181 -133 -129 -129 -80 -34 58 105 135 137 174 128
3051 128 56 83 46 -23 -84 -72 -93 -141 -154 -128 -55 36 71 79 134 174 137 75 117 105 30 -61 -55 -92 -156 -192 -150 -123 -84 -26 -21
3082 -21 48 123 84 68 124 158 81 26 33 -61 -122 -166 -160 -145 -117 -92 -47 9 76 58 60 176 185 140 86 88 62 -39 -103 -127 -127 -143
3114 -143 -97 -84 -70 -14 9 36 123 146 91 127 131 96 -28 -57 -66 -115 -140 -121 -123 -114 -92 -68 -27 52 101 71 120 168 128 33 43
3145 43 9 -10 -73 -102 -123 -112 -89 -75 -55 5 86 107 138 207 143 108 124 110 6 -53 -65 -85 -112 -128 -148 -111 -37 -3 -11 31
3175C1J03Om8J1kn6k8k2m5o7rLmM6J3J0N2R3J2j3N3K2m5k9Oo9m7o3j1j8NMlQ6
3209b3N1J2RR0K9m3mon3m7rp2m5l2K6l3L3K2P3K3N8M1j5K3M5k0q8j0m4k7m4jn0
3242a31jM5K0QR1L3J8L8O1l1m4Jl6o1m7m5m4RRJ%N2N6J3N3O2k2qL2l6o3j9l7o8
3276i1j5%l6mO0L7rO0P3L1K4L6k9m6j4k9n4k9k7l0k0K3j6K6M7P7J8J6N2J7k2j7
3308A09rn4l3m5o5j7Ol0j3N4N7%QJ14J6mM9j8n4m6J1p1l5l0jm4L9K6JL7R5K0N
3341G8M7J4%m7j4k6n6j8m5l9j7L1j2L7N1QL9M8N0q%j3m3l3k6m1q9kJ3l1l0R2L4
3374d8QM7O1JL0K1k5qj2l8n0rk9o8j4N3L2qK7O1K3M2RJ5K1l1j3p8k8mq3k5J3j6
3408a23LL0P1K2J4N6K8MK0m1l4pj8q2m5K5j9l7PP2oK4O6K0M8K2J2k7J2pq8m3K2
$$ plain form
3175 31 134 140 92 103 101 45 17 -5 -50 -117 -126 -123 -127 -81 -68 -58 -6 87 99 86 139 161 116 87 93 24 -23 -86 -97 -115 -110 -106 -109 -23
3209 -23 28 40 49 139 168 125 121 115 62 15 6 -66 -111 -143 -117 -150 -117 -95 -22 1 59 100 85 108 153 133 45 35 -9 -36 -80 -81 -131
3242 -131 -132 -87 -67 -59 32 65 83 121 182 151 107 108 72 11 -36 -81 -125 -116 -107 -106 -106 -54 2 15 68 130 108 100 132 96 33 14 -23 -91
3276 -91 -106 -106 -142 -146 -86 -49 -58 2 75 106 130 166 137 91 77 48 -6 -35 -62 -92 -112 -89 -105 -79 -32 45 63 79 131 148 126 109
3308 109 100 46 13 -32 -97 -114 -108 -138 -151 -97 -40 -40 -32 82 98 94 143 125 71 25 36 -35 -70 -100 -101 -145 -106 -80 -79 -42 53 73 78
3341 78 125 139 139 92 78 52 -4 -22 -67 -106 -123 -92 -104 -67 -16 -8 31 79 129 121 121 108 65 32 6 -35 -124 -126 -113 -144 -174 -82 -48
3374 -48 -40 7 68 69 99 120 95 87 75 37 -13 -22 -51 -119 -133 -80 -48 -56 -29 32 55 97 106 121 142 111 98 20 -8 -12 -95 -120 -107 -123
3408 -123 -120 -90 -19 3 17 73 101 105 125 84 50 43 25 -57 -102 -77 -96 -133 -126 -54 -60 -36 30 50 98 120 132 105 117 110 22 -21 1
3441Ao4m3MKJ4NQ0K6L4K6L4%J1k3o7m2K6p7p5kJ5k4J5M8L2J2L8M4N8Jkn2nK8m4
3476C4q8J1j2o4j6N2L0K2K1K7L7N2ORKlo1p9M4l3r5j6K3J1MMP0j1N4N1l0M5J0
3509A11l8l0k1oj04lpj3jj6N0L7J5K7K5P7L6m2KLl8p6m4K7m9JnJ7J0J9J2M5M3
3542F4N6l8j4M2j2q3j0J1n9m5qK%pMO2M5L8J2J2M2j9m3m0N9p2n0Mk1l6k4L1K1
3575g6P3K1L3L1L0%m9L8L0n0r3J3j7n5q2J8M7K8K6M9NN5Nl3M3K4m5m1Nk7q7p9
3607a60N4Qoj8M4M4M8kJ6L3P5l5l0J6k2j01l2J4j7k3J3J7kO9j9J9P3N2k2lJ9J6
3639A38j13m2Lj6n8pK0RMj8K6N9O8J1j8M0J9n2o6j3Jl4l1Mj5k3J9J5N5M0mO8L0
3672A19Pm6k3K6k1m8n3qJ1m2l6K0N2L8lL6O6J4n1M0J7m8n0j1qo1k7k0j4J2L9j7
$$ plain form
3441 1 -63 -106 -102 -100 -86 -81 -1 25 59 85 119 119 130 107 40 -2 24 -53 -128 -130 -115 -139 -124 -76 -44 -32 6 50 108 109 107 55 50 78 34
3476 34 -54 -43 -55 -119 -135 -83 -53 -31 -10 17 54 106 112 121 123 120 59 -20 24 -9 -104 -120 -97 -86 -82 -78 -8 -19 35 86 56 101 111
3509 111 73 43 22 16 -88 -91 -98 -111 -112 -128 -78 -41 -26 1 26 103 139 97 99 102 64 -12 -56 -29 -78 -77 -82 -65 -55 -36 -24 21 64
3542 64 120 82 68 110 98 15 5 16 -43 -88 -96 -94 -94 -101 -97 -35 10 48 60 72 114 95 52 12 71 -1 -51 -47 -68 -104 -128 -97 -76
3575 -76 -3 18 51 82 112 112 63 101 131 81 -12 1 -16 -71 -153 -135 -88 -60 -34 15 20 75 80 47 90 114 69 28 33 6 -81 -160
3607 -160 -106 -98 -104 -122 -78 -34 14 12 28 61 136 101 71 87 65 -36 -68 -54 -71 -94 -81 -64 -66 3 -16 3 76 128 106 103 122 138
3639 138 25 -17 -14 -30 -88 -95 -75 -66 -62 -80 -54 5 73 84 66 106 125 73 7 -6 -5 -39 -70 -66 -81 -104 -85 -70 -15 25 21 89 119
3672 119 126 80 57 83 62 14 -39 -47 -36 -78 -114 -94 -42 -4 -7 29 95 109 58 98 115 67 17 6 -2 -63 -90 -110 -124 -112 -73 -90
3704i0M4O6RJ2PN1Mn1J5m4k4n9j5j8J5nRM4O6J1k2K0N6M0l9nok1p6j2m6rok2P
3739i4N1pj4O7O2Jj1L7j1l0j6n9k0j3l3Kj0kK8OM5N9qKO9L0n7j9pj5j4m9k3pK3
3774c7m1J3L0L5pM4O4%pJ1qk9l6k5n7m2lk0k2M2L2K3QM6K1JN1Mk4j2l5j6m9nk5
3809g5k6L4j8PJ4N9J2K0M5OL9lqm9m1Jl0m0k6K3k5K1JO7j5K6K6J8L2rj4k7k6l6
3843a7k4j1j6k9j7J4K2K8K5O0K4k2N0K2k7rPp0k7k2k5j0J9k1K4J7M2jM3L2K3j2
3875I2kK8m4j8m1n0k2Kj0k2K8J6j4M2N6j3K3J7K3j5k9k4l4j5l3nl0oJ6K2L7K1
3907dL0J0N9J3mk1kj4m3Mk1m1l7J2j3K6L1j4L4N3J1jL2k2qpl7m0l5k5J8m3JQM3
3942d7J7L5J3L3%J6M3m7Pn0j7pk2l2k6LQMM9M6qN5K0lJ8%j9n4j9ll8mm0ok5N7
$$ plain form
3704 -90 -46 20 29 41 48 99 103 52 67 23 -1 -60 -75 -93 -78 -83 -74 -30 36 47 25 45 101 141 102 97 91 70 -6 -18 -64 -73 -79 -101 -94
3739 -94 -43 -50 -64 3 65 66 55 92 81 51 35 -24 -44 -57 -90 -88 -98 -100 -72 -66 -21 38 30 32 101 131 74 55 48 33 19 -30 -53 -60 -37
3774 -37 -78 -65 -35 0 -7 37 101 101 94 105 97 68 32 7 -50 -92 -95 -115 -137 -95 -63 -40 -32 14 35 36 87 91 67 55 20 4 -45 -50 -75
3809 -75 -101 -67 -85 -78 -64 -5 7 27 72 78 117 114 106 57 16 17 -13 -53 -79 -56 -81 -60 -59 8 -7 19 45 63 95 86 72 45 19 -17
3843 -17 -41 -52 -68 -97 -114 -100 -78 -50 -25 35 59 37 87 109 82 73 80 10 -17 -39 -64 -74 -55 -76 -52 -35 7 6 49 81 104 92
3875 92 90 118 74 56 15 -35 -57 -55 -65 -87 -59 -43 -57 -15 41 28 51 68 91 76 47 23 -11 -26 -59 -64 -94 -100 -84 -62 -25 -4
3907 -4 26 36 95 108 104 83 81 67 24 28 7 -34 -71 -59 -72 -46 -15 -29 5 58 69 68 100 78 70 63 26 -14 -49 -74 -56 -99 -98 -90 -47
3942 -47 -30 5 18 51 51 67 110 63 70 20 3 -4 -26 -58 -84 -81 -73 -69 -20 26 18 73 93 90 108 108 89 35 16 13 -25 -29 -69 -75 -100 -43
3978d3j8M0J4M7j2K1K6%l1PLp3k0j3k9poJ4L7j0M5L3J6L2RK3k3j0l7nl5k9j3%
4012d7Nk1K6K9K1J4K6J5K6j3J4m5J2l8n3m0rRk2LJ6NJ6N8QL1K7Nk1J1lo0l3%M
4047b4m2k2J6L9qJ4K3K3N2RjJ8j3k9j9km0m4LRl4JJ5L2NM4OMJ8M6l1l1K5k4o0
4082b2j6Ko6QJ7J2K3J0K9K8N5j1j4K3p%n0Pqn0k5oMj8J3M2L1J4M4J1PK4l8k6p
4117D0On8n8Oj6mnK3K5lL0L2J9M5mk7J9mp0m0K8k6m0k4L4ONK4J8N4LL4kL1Mm5
4153F0n2J8k7k9j8mnJ2kk0O6M3JLK4J2m0rLmn7k7Pj3k0j5ON8J3jL8M7j5rMK2m3
4190B7k4J2l2k0k1k1PL5jK1K0M2K4j6RL4J2p8Qll4n9pj5J7j3J7L6QJ2J6J8M0j8
4224E3k5qM1o7l4m8J6Lk8K9j5M1K6JM8N8j7j5J4L2n9j0k1j7l3m4K3OJ7KkK7M2
$$ plain form
3978 -43 -61 -21 -7 40 28 49 75 75 44 51 54 -19 -39 -52 -81 -88 -94 -80 -43 -53 -8 25 41 73 82 105 82 72 35 30 -5 -34 -47 -47
4012 -47 -42 -63 -37 -8 13 27 53 68 94 81 95 50 62 24 -29 -69 -78 -69 -91 -88 -72 -67 -51 7 15 46 73 78 57 68 65 5 -28 -28 -24
4047 -24 -66 -88 -72 -33 -41 -27 -4 19 71 80 79 97 84 55 36 34 -6 -50 -47 -38 -72 -71 -56 -24 -19 25 31 35 53 99 68 37 62 38 -22
4082 -22 -38 -36 -102 -94 -77 -65 -42 -32 -3 25 80 69 55 78 71 71 21 28 20 -30 -55 -61 -57 -75 -62 -20 11 25 69 80 87 111 73 47 40
4117 40 46 -12 -70 -64 -80 -84 -89 -66 -41 -44 -14 18 37 82 78 51 70 66 -4 -44 -16 -42 -82 -106 -72 -66 -61 -37 -19 35 38 72 70 101 105 60
4153 60 8 26 -1 -30 -48 -52 -57 -45 -47 -67 -1 42 43 46 70 82 42 33 36 32 -25 -52 -45 -58 -78 -93 -87 -29 -16 -17 21 68 53 44 48 70 27
4190 27 3 15 -17 -37 -58 -79 -72 -37 -38 -17 3 45 69 53 62 96 108 30 38 35 1 -58 -65 -80 -63 -76 -59 -23 -15 -3 13 31 71 53
4224 53 28 20 61 -6 -40 -88 -72 -69 -97 -68 -83 -42 -16 -15 33 91 74 59 73 105 46 36 15 -2 -35 -79 -56 -50 -33 -31 -33 -6 36
4257C6JJ5L7J3m8j9j1l0k8j8j7NJ2k5jL8M0lrO1Rmk3K6m1k2Nl3k5rj8K5nK7K8
4292a1PN4K0Oj0L1k1j1k7nm8j6j8ok0J6QL0QM1nJ4J3K4l1J0l3l7j3k6l9j0QK6
4326g1k0O0K5k1N9M6moqmk2Ll4k1rk4k2J1M0K1oK2N1k0L5QLj4j7l2l8Nl3k4nO
4362f0J0k0QL9K3mK6L5qqJ9m1k6k0j1k9J9j6q%M0J7L2K7K5nNM5l5k4j5j9l2j1
4396b2k8j8J9J2K1pK8L9k3J5L4jk6Ml2l6j1j3j8rK1j0qM7J0lL2L2OJ4oj4l6K2
4430C5l1m4j4J3j7QJ3K2QK4L8LK2j4K7l4Nj8m0k2j0m6j6K5J5NK0K3J6nN3jk4p
4464C2lk7qk5ml5nP%KO3l5O6lK6K2%L2m2%m6j5m1kJ7k3qN2kNJ4nL0K9pkj0j8l7
4503fj9k7j6KlqK1qL7J9J1J0K3j3J6K2k9j9j2j3m1j0Pj1J5K2L6OPK6K6m%nkmj0
$$ plain form
4257 36 37 52 89 102 54 35 24 -6 -34 -52 -69 -64 -52 -77 -78 -40 0 -3 -12 49 58 54 31 57 16 -6 -1 -34 -59 -68 -86 -61 -66 -39 -11
4292 -11 -4 50 70 76 66 97 76 65 38 33 -15 -31 -49 -55 -75 -59 -51 -21 -13 28 23 37 50 74 43 53 20 -17 -30 -56 -95 -105 -97 -71
4326 -71 -91 -31 -6 -27 32 78 74 68 60 56 34 37 3 -18 -27 -51 -73 -62 -22 -1 -7 15 66 46 81 89 92 78 61 29 -9 -4 -37 -61 -66 -60
4362 -60 -50 -70 -62 -23 0 -4 22 57 49 41 60 19 -7 -27 -38 -67 -48 -64 -72 -72 -32 -15 17 44 69 64 69 114 79 55 40 21 -11 -22
4396 -22 -50 -68 -49 -37 -16 -23 5 44 21 36 70 69 43 47 15 -21 -32 -45 -63 -72 -51 -61 -69 -22 -12 -15 17 49 55 69 63 49 13 35
4430 35 4 -40 -54 -41 -58 -50 -37 -15 -7 17 55 58 80 66 93 59 64 46 6 -16 -26 -72 -88 -63 -48 -43 -23 0 16 11 64 63 39 32
4464 32 29 2 -6 -31 -35 -70 -75 -68 -68 -66 -3 -38 28 25 51 73 73 105 63 63 17 2 -39 -41 -24 -47 -55 -3 -5 0 14 9 39 68 61 59 49 31 -6
4503 -6 -25 -52 -68 -66 -69 -77 -56 -64 -27 -8 3 13 36 23 39 61 32 13 1 -12 -53 -63 -56 -67 -52 -30 6 12 19 45 71 67 67 62 60 56 46
4540D6n7lk6Qj6j0J6J5K2K7rM0%oJ0k2oo6L0l7ll1MJ1j5L1NM3J4J9K1JJ0nj7m
4576D0j2k2k6%mj7PM1k9K6L5KJ5J2Mj8Lk3m4k6K1k2m9NJ5J5J2pL4K4L9k3KJ4J8
4611F2m4m3Rl0j9Rjj1K3K9oL7J1J8RLL1j0k8qk1m2lOl6J3J0j1L5qJ3mL5L1jj2
4647D6Rl5m4j3j9l%J0k8rN0LL0J2K1qL2jRp0J9k6l5kpRmL7rQLM8K3QJ1nl8K5k1
4686C6k6k0nk1j1j8QnNL4mL4K4kk7K7j6m2J8J7l5j3j8k0QK6nJ4K8L2J9j7M3Mj4
4721E8k7Rj5k2k2k3oLK8KJ4K1oPL8rj8K9j3j6l5l4nk4J0k4J3JK0KK7M1k2K8%L5
4757F5j3l3j8lm0lroLJ5J1L3L9J7rJ3L1l6Mj1pj9m0kk7Jm%OM0j4J3K1M1k8k6J6
4794B1K1l5k0rpj5j3k9J2M1KKL0L5RrJ8K1m2mmrj3k1k8PJ7qj9N7M3j1OQKJ0k0
$$ plain form
4540 46 -11 -14 -40 -32 -48 -58 -42 -27 -5 22 13 53 53 47 57 35 29 -37 -7 -44 -47 -78 -74 -63 -78 -47 -42 1 15 34 55 56 66 61 44 40
4576 40 28 6 -20 -20 -24 -41 -34 7 -22 4 39 41 56 68 72 54 57 34 -10 -36 -15 -37 -86 -81 -66 -51 -39 -46 -12 12 51 28 30 44 62
4611 62 18 -25 -16 -46 -65 -56 -57 -68 -45 -16 -22 15 26 44 53 56 87 77 49 41 20 -22 -25 -19 -55 -42 -32 -43 -8 -16 -3 -7 28 59 58 46
4647 46 55 20 -24 -37 -56 -59 -59 -49 -77 -86 -36 -33 -3 9 30 22 54 53 62 -8 11 -15 -50 -52 -59 -50 -54 -17 -26 -18 -15 33 56 64 75 70 32 57 36
4686 36 10 -10 -15 -36 -47 -65 -57 -62 -57 -23 -27 7 31 29 2 29 13 -29 -11 6 -29 -42 -60 -80 -72 -46 -51 -37 -9 23 42 25 68 72 58
4721 58 31 40 25 3 -19 -42 -48 -45 -17 -15 -1 20 14 21 59 50 32 61 48 32 -3 -37 -42 -66 -56 -80 -67 -66 -46 -44 -17 24 2 30 30 65
4757 65 52 19 1 -2 -42 -45 -54 -60 -57 -42 -31 2 41 58 49 62 93 57 61 50 43 24 -16 -18 -45 -44 -48 -48 -42 -2 -16 -3 18 59 31 5 21
4794 21 42 7 -13 -22 -29 -44 -57 -86 -74 -33 -31 -29 1 36 45 36 54 75 33 29 25 16 3 -18 -46 -39 -22 -30 -49 8 51 40 46 54 56 66 46
4831D6jrl6k2k7kojPj5M4RJ8K5QOqK4k6j2mm2l0j7J1K9LLj3L4M8nrL8qJ1J1k2
4869F0l3Nm2j2p%Omk5O5jj0L2K7j9l1J6Nm1j0Nn1K8ql6%J7K7K1J6RL0kNJ9k2n
4906C4k8j6jl2qJ1lJ1RJ1K9RK0L3j6j4j7Qk8Kl0k6mRpj6L5J9QjJ9%JPjk6j8K4
4944Gk3kl3m8K5pL5J0pM7J8K0J3mk5K0Lk2k8k9R%JplJ0K6K6oRK3k8K9jn0J3k0
4981Am9OOk6j7J0K7J4J0L7RJ0NOj5l4J1j2l3j8J6Rk1J2J4JQK0J5L3JQj3r%j7k
5018B3l7jj9J8l3J5%NJ6K8J5K8k7%Lk1Rm1mk0nk2J2J4oK5K0J8K7qK6Mm1K3j2j3
5054A9j4k3%j9J7oRj7O1oJ8J4j0L4pk9qpj9k3rj9jj4J6J6pL5qJ8%K7k0J4l2RP
5091A6m7Pk6j5K3Nj6M4K4RJ4kK7pMj5Mk1j2k0nj2rk0J6J0PL1RkK4j5%k6kJj8k6
$$ plain form
4831 46 45 36 0 -22 -49 -51 -57 -58 -51 -66 -22 -13 5 30 38 44 36 60 34 22 18 -24 -54 -71 -60 -31 -28 -25 -38 -4 44 39 30 68 60 71 82 60
4869 60 27 32 -10 -22 -29 -29 -23 -27 -52 13 12 2 34 61 42 11 27 32 -9 -19 -14 -65 -37 -45 -81 -81 -64 -37 -16 0 9 39 37 42 61 39 34
4906 34 6 -10 -11 -43 -51 -40 -43 -32 -23 -12 17 26 46 79 63 49 32 40 12 14 -16 -42 -46 -37 -44 -60 -25 -6 2 1 20 20 21 28 27 1 -17 7
4944 7 -16 -18 -51 -99 -74 -81 -46 -36 -43 4 22 42 55 51 26 46 49 27 -1 -30 -21 -21 -20 -27 -30 -20 6 32 26 35 58 30 59 58 8 21 1
4981 1 -48 -42 -36 -62 -79 -69 -42 -28 -18 19 28 38 43 49 34 0 11 -1 -34 -52 -36 -27 -48 -36 -22 -21 -13 7 22 55 56 64 51 42 42 25 23
5018 23 -14 -15 -34 -16 -49 -34 -34 -29 -13 15 30 58 31 31 34 13 22 -19 -23 -43 -48 -70 -58 -44 -50 -25 -5 13 40 32 58 62 21 44 32 19
5054 19 5 -18 -18 -37 -20 -26 -17 -34 27 21 39 53 43 77 70 41 33 26 7 -16 -25 -44 -45 -59 -43 -27 -34 1 -7 11 11 38 18 32 0 9 16
5091 16 -31 -24 -50 -65 -42 -37 -53 -9 15 24 38 36 63 56 60 45 49 28 16 -4 -9 -21 -30 -50 -34 -24 -17 14 23 21 45 30 30 4 2 3 -15 -41
5129d1OLn1L7J2k0K1K4L0K0mmK5j8J3l8l4Lmj2j4M8j7Rk0K1L1K0K2nj6JMj6rl9
5165a2j9Nl2%MOK8J8j0K9j7J8JJ9k8Nj4k0j6Ok2j8ML1OOL6j1N5KQj3qJ1j8l1K
5202A1pl5KJ5J5j4RJ8K6rL1k7L2ol7%jl0k9jj8k1RJ6K1QJ2J4J0RlJ4Nj4jm6nK
5240b5Jj8pL6k5L5L7l4M4K7k3J6qj3k8Rk7j1m3L4lpJ1PJK4L1k8J4J2j7jk2j1l0
5275d2kk6K0nj0K0J3J4J0MK1M6Pk8J%l6rj2J7k0j6J8j9K2J2oL9L2k0rlOpk0k4
5311a2n%m5oRj2K0QL6J6J8j3K4rj2j4LJ2m4j4jJ4l9K1PL1L0KlJ3K1Kmj4qJ1j9
5348B4l4Rnk4j5L1K1j0j2K0J7%k9L5kj2k0k8M9n2l0MjQRnN0j3K1J0J9K6k6Kk4
5383A3Lj3j8k9K7j0J9l5L6L3j0J9OL1%l1mjl0ok0pK6l5oKJ2pNL9KJj9K5K1m6J0
$$ plain form
5129 -41 -35 -32 -83 -46 -34 -54 -33 -9 21 41 37 33 58 40 53 15 -19 -16 -20 -32 -46 2 -15 -6 -26 -5 26 46 68 63 47 48 52 36 27 -12
5165 -12 -31 -26 -58 -58 -54 -48 -20 -2 -12 17 0 18 19 38 10 15 1 -19 -35 -29 -51 -69 -65 -34 -28 -22 14 3 58 60 68 55 47 58 40 9 11
5202 11 4 -31 -29 -14 1 -13 -4 14 40 31 62 35 67 61 24 24 23 -7 -36 -37 -55 -76 -67 -51 -30 -22 -10 4 14 23 20 34 39 25 24 -22 -27 -25
5240 -25 -24 -42 -49 -13 -38 -3 34 0 44 71 48 64 56 43 15 24 -3 -14 -57 -23 -26 -33 -22 -15 -14 10 41 13 27 39 22 21 -1 -12 -42
5275 -42 -44 -70 -50 -55 -65 -45 -32 -18 -8 -4 17 63 70 42 43 43 7 -2 -14 3 -17 -33 -15 -34 -12 0 -6 33 65 45 36 33 39 32 12 -12
5311 -12 -17 -17 -62 -68 -59 -71 -51 -43 -7 9 27 14 38 29 17 3 6 18 -26 -40 -41 -27 -66 -45 -38 -7 23 25 22 35 56 58 54 40 32 43 24
5348 24 -10 -1 -6 -30 -45 -14 7 -3 -15 5 22 22 -7 28 26 14 -6 -34 15 -37 -67 -63 -64 -56 -47 -52 -2 -15 6 16 35 61 35 37 13
5383 13 16 3 -15 -44 -17 -27 -8 -43 -7 26 16 35 41 72 72 41 37 36 6 0 -20 -27 -1 -36 -42 -40 -28 -35 -30 9 11 12 -7 18 39 -7 3
5420Coj1l0j3K0j2j5L7j1O4kNoM2j6j2Ojl2OJk6j0Lj6J0K5j1J8QL5k1%OJ2j7j1
5457B2l0nj8k0k6L0J6k0K0J7oM0lK4k2K0k8Pm1J7Jk9PJ0J0l1O2j8K7pOL6jl7K2
5492E2qj7oj4k5j1pkK3qJ2MJ3J2NJ0k0k4L4l1j1%Rl0k6M7k4j4L6nN5pj2K4J7q
5528D3j1j3mj7L1m0llqK4NjRK0J8m%J3k9Rk7Ll5l4K0j9PPlK5qML5k2M6l1NK7k5
5567A4k1Qk3k0RKOJNL0PK6%J4Qqj2qOk2k7qk7K6j0J9mK0j6K8KJ0nlj3kjm2Qj5
5607c8ooqLK1K4Nk0J8K4J4j6K2oj2kk3okJ3k5L0j5OK1J2J1nK4j2nj1j5mj8j8J3
5644a2qk3%k5M1J0J7KK6j1%moJ5m1l3K0j5J3JkmQQL5kNLJ9J4Pm4J3j7njj4k2j1
5683d3L4mPKL6k3RJ1j0pQk6Lj8l0K9k6j9qM4j5K8K3rJ0NJ3nK5l4jk6PJjl6K2J7
$$ plain form
5420 3 -3 -14 -44 -57 -37 -49 -64 -27 -38 26 24 29 23 65 49 37 43 42 10 16 17 -9 -19 -16 -32 -22 3 -8 10 18 53 32 32 38 50 33 22
5457 22 -8 -13 -31 -51 -77 -47 -31 -51 -31 -14 -20 20 17 41 19 39 11 18 -23 -6 -5 -34 -27 -17 -7 -38 24 6 33 26 32 68 67 30 52
5492 52 44 27 21 7 -18 -29 -36 -38 -15 -23 -11 -7 6 18 23 33 13 -11 23 -8 -19 -19 -10 -40 -66 -19 -43 -57 -21 -26 29 22 10 34 51 43
5528 43 32 19 15 -2 29 -11 -14 -17 -25 -1 4 3 12 32 50 46 46 59 30 39 12 15 -20 -54 -34 -53 -46 -39 -42 -17 -25 -21 14 -8 38 7 12 39 14
5567 14 -7 1 -22 -42 -33 -31 -25 -24 -19 11 18 44 44 58 66 58 46 38 44 22 -5 -13 -40 -14 -24 -5 -9 11 -5 23 25 35 30 27 14 12 11 -31 -23 -38
5607 -38 -44 -50 -58 -55 -34 -10 -5 -25 -7 17 31 15 37 31 19 17 -6 -12 -14 -1 -26 4 -11 -5 16 28 39 34 58 46 41 30 15 11 -7 -25 -12
5644 -12 -20 -43 -43 -68 -27 -17 0 2 28 17 17 13 7 22 -19 -52 -32 -47 -34 -33 -35 -39 -31 -23 12 10 15 18 37 51 58 14 27 10 5 4 -10 -32 -43
5683 -43 -9 -13 -6 -4 32 9 18 29 19 12 20 -6 -3 -21 -51 -22 -48 -67 -75 -31 -46 -18 5 -4 6 11 24 19 44 10 9 -17 -10 -9 -10 -46 -24 -7
5721gKNNL0lLpM1k1l2Mopj1j3Nj4K2k2K0Jj4J5PJ9j6j3mOrj8Mmj6qmJ9joN5nJ6
5763A8KrJ3NJ1l4%Jj7k4J2NMJ0jL8j5J9l%kJ5n1Qlk3lj4Pj3J7k9K6j1K3K9Rml
5802A3pj5J8j9rK9l9mk4L1oJM5qK8J1%qJ5ooj9k0j1Mk6QNMJ0j5L4Jj1MPj1j0J7
5841A1k1k1jj5lj6J1K5pJQJ7mJ9J2MnJ8k9Oj2qrk2MK0J9ql0N2MPqK7Jj7Rj9j4
5880Fj0oj9kNNj7K9kj4J8%J7Lk3J1jk0j1Nj1KLmmK5J4MQL0j0J3oqQj1oj3J4l1
5920imJ4k%J5QnK1j0qL2k0k0k2J0k2j9%l0J0J9mJ1J2j8L0RJ1K3j6qJ2j6rj5qm
5957c2QJ3j4QMK6OK7j5J8Jj7jpj6J2n9KK6k6RJ5qJ1j3L3lJ9k3J3j7j0Pl1k0NL
5994d6j2QLL1j1JJ3K8L8j7j9J6lj3nJ0j0k2lK1k5J1J6J0K1lmJ2%j9j2%k7rQj9
$$ plain form
5721 -7 -5 0 5 35 32 35 28 69 48 16 20 14 7 -4 -17 -12 -26 -4 -26 -6 -5 -19 -4 3 22 6 -7 -11 -5 -14 -32 -28 -32 -48 -56 -60 -41 -42 -48 7 2 18
5763 18 20 11 24 29 40 6 6 7 -10 -34 -22 -17 -13 -3 -4 34 19 38 35 35 33 48 -3 5 2 -21 -24 -38 -31 -44 -27 -56 -30 -41 -18 11 20 16 13
5802 13 6 -9 9 -10 -19 10 -29 -33 -57 -26 -32 -31 14 6 34 45 45 37 52 46 40 21 1 -10 -6 -32 -24 -19 -15 -5 -20 14 15 4 8 15 4 -6 11
5841 11 -10 -31 -32 -47 -50 -66 -55 -30 -37 -36 -28 -11 -15 4 16 20 15 33 4 10 -2 -10 -19 -41 -37 -17 2 -6 -36 16 20 27 19 46 47 30 39 20 6
5880 6 -4 -10 -29 -31 -26 -21 -38 -9 -11 -25 -7 -7 10 13 -10 1 0 -20 -31 -26 -37 -35 -32 -36 -40 -15 -1 3 11 41 31 44 38 30 38 27 21 8 22 -9
5920 -9 -13 1 -1 -1 14 22 17 38 28 20 52 32 12 -10 0 -22 -41 -41 -71 -61 -42 -46 -35 -23 -41 -11 -2 9 32 16 8 20 4 -5 -20 -28 -32
5957 -32 -24 -11 -25 -17 -13 13 19 46 31 49 50 33 32 25 9 21 -38 -36 -10 -36 -27 -12 -20 -9 -22 11 8 27 4 17 0 -10 -3 -34 -54 -49 -46
5994 -46 -58 -50 -47 -16 -27 -26 -13 15 53 36 17 33 30 17 12 22 12 -10 -13 8 -17 -6 10 20 41 38 34 46 46 27 15 15 -12 -21 -13 -32
6030c2MrrQL0j0J8NjNK5kk4nKk1J8j9j8K1j4J4K0J0QJ5m%Qmnkkj2k6Qj8K3rNJ
6071Bk3K6LpNK5l6K1rk2nkj5oM%J8k0J5RM1nkmK1JJk2Pk7pLj6JPkK0PK1j7K8j7
6113B2K6j3j3Lk3j0Ok3k7lJ2Pk2K3L5MKJ1j7j6K3kk1j0J3l8K6rk2K5NL1j1QK8
6148C0j1L0Oj5Jonj0k0j6j1LL2l7L8Nj6LK4lJ0k8J6j6%j2k3J7mj5ljM%J2K2No
6186@Qj0J6j0k6L3k1Nj5J%J7qL2J6lj0K4j5%J4j4J4m6%k7K8j6Loj1KL1KpJ9Qk1
6224GJ0l4oNRk4LJk0K5J4j0j4K4J6J5Kjj4OKRj4rkqj7L2j4mJ0LjK3rK4%j7j0j8
6264fJ0j4k4j6K2m0K9NJ4l2K0K3jJ3qjJ2Jpj2k1K7k6J7MNk2K7J2J2%J1Lj2J5K
6300D2k4Rpl6J4k1qK3k3L8K0j2nlJ8%j5kmj7k3j2k2K0qqOK1PKM2nJ7j7mRJ5l4
$$ plain form
6030 -32 -28 -37 -46 -38 -8 -18 0 5 4 9 34 32 8 3 5 -16 2 -17 -35 -14 -28 -14 6 16 24 39 35 35 43 39 34 32 30 18 -8 0 -18 5 -4 1 2
6071 2 -21 5 8 1 6 31 -5 16 7 -15 -20 -22 -37 -43 -39 -39 -21 -41 -26 -17 24 19 17 13 34 35 36 14 21 -6 -13 -10 -26 -25 -18 -20 0 7 28 11 39 22
6113 22 48 35 22 25 2 -8 -2 -25 -52 -55 -43 -36 -58 -35 0 4 6 17 0 -16 7 5 -16 -26 -13 -51 -25 -34 -56 -31 -26 5 -6 2 30
6148 30 19 49 55 40 41 35 30 20 0 -16 -27 -24 8 -29 9 14 -2 1 25 22 32 4 20 4 4 -8 -31 -14 -18 -33 -36 -37 -33 -33 -21 1 6 0
6186 0 8 -2 14 4 -22 11 -10 -5 -20 -19 -19 -2 -10 22 38 35 25 49 34 34 48 34 48 2 2 -25 3 -13 -10 -16 -27 -25 6 8 1 20 28 7
6224 7 17 -17 -23 -18 -9 -33 -30 -29 -49 -24 -10 -20 -34 -10 6 21 23 22 8 14 16 25 11 2 0 -8 -25 7 -7 -11 -1 2 1 24 15 39 39 22 12 -6
6264 -6 4 -10 -34 -50 -28 -68 -39 -34 -20 -52 -32 -9 -10 3 -5 -6 6 7 0 -12 -33 -6 -32 -15 -11 -6 -28 -1 11 23 23 34 37 25 40 42
6300 42 18 27 20 -16 -2 -23 -31 -8 -31 7 27 15 10 7 25 25 10 8 4 -13 -36 -48 -70 -50 -58 -66 -60 -39 -32 -30 12 7 24 7 3 12 27 -7
6338gK1O%m3L1kj7PJ9joM9l7J6j1lqok2Llj7kloJ9mL1k3RK6j5J4j2k4J0J0jj1
6377a3k9J9oJ3MmJ7KK2J0nQomRQl3J7k8j4J7l9L6j6J8Qk7J1NMJ1qPOn4J3j2k5
6415e8Lk2L5J3j1J0K6J4qK9pj4J1k3J4l1K4nl1J8j0K2j4J2J0J7qJ1OnJ0o%k2j4
6450dj6j0KJ3j2J2J9k7K1K0ll8L1k5NJ2j8j9PK3l8K2k3J4JOL2mPMK3Mrj7J1j1
6486A5j4jmjKLLJ2NKK5rnoj3Lpl0j1nJ1Mk3j3K7lKJ0J7J4j7qK8l3pJ7J3j2mnj1
6527b9PJ7J4jL0qJ0J5j4Rj3Pl5MKj5j7K5pnk4K3KJ4J6j6J9k4onNj1mQk8j9K6J4
6565a4Nj3kL1kJ4njMJj6klJ3o0K6L5k4J7RmLJ1j5RjL3l9jmkk5Rl1RjLK5qoJ8R
6607Ek0PL3j8K4n8J1J2j3lj2j1K5Kj3N4j3K5j1PpJ6Ll7J0j9K6k1j2J9k5J5K2j8
$$ plain form
6338 -7 14 20 20 -23 8 6 -11 -4 15 14 8 57 20 36 25 22 14 8 -14 -11 -14 -31 -33 -36 -42 -23 -27 4 -19 -10 16 1 15 3 -21 -11 -1 -2 -13
6377 -13 -42 -23 -29 -16 -12 -16 1 3 25 35 30 38 32 28 37 45 12 29 1 -13 4 -35 1 -15 3 11 -16 -5 0 4 15 7 14 20 -34 -21 -33 -58
6415 -58 -55 -77 -42 -29 -40 -30 -4 10 2 31 24 10 21 -2 12 -19 5 0 -31 -13 -23 -1 -15 -3 7 24 16 27 33 28 38 32 32 10 -4
6450 -4 -20 -30 -28 -15 -27 -15 4 -23 -2 18 15 -23 8 -17 -12 0 -18 -37 -30 -7 -45 -23 -46 -32 -31 -25 7 3 10 14 37 41 32 15 26 15
6486 15 1 0 -4 -5 -3 0 3 15 20 22 47 38 33 27 14 17 10 -20 -31 -36 -25 -21 -44 -57 -30 -33 -31 -21 -4 10 -7 -15 13 -20 -27 -10 3 -9 -13 -18 -29
6527 -29 -22 -5 9 8 38 30 40 55 41 50 37 44 9 13 15 0 -17 8 1 -4 -28 -5 -3 11 27 11 30 6 0 -5 0 -11 -15 -7 -35 -54 -28 -14
6565 -14 -9 -22 -24 7 5 19 14 13 17 18 2 0 -3 10 -50 -24 11 -13 4 13 9 12 23 8 17 16 49 10 9 5 3 -22 -13 -44 -35 -36 -33 -8 -16 -22 -4 5
6607 5 -15 -8 25 7 31 -27 -16 -4 -17 -20 -32 -43 -18 -16 -29 25 12 37 26 33 26 42 45 8 18 -1 25 4 -8 11 -14 1 23 5
6641EK2npK5j2J1l7jMl7OJ6Rj8k1QNLK7lPOkJj5K1j1j%kk5Rj0K8j2PN5k3lqJ9
6682D1Mj1j4j4J3j1k0J7j2qj7%Mj9K9LJ1K6j3j4j1nL1l1J0l8J3KNk4K8kK0J4K0
6717B7J0Lj0j9K8j5qL3l0kJ4j8mPj3O%K0j3J4Kk3J0Nlk1j5Kmm4K3K6j7j2L2oJ6
6754A%k2K2rL1l6j6L8j8J6mk7oPK0J5RrJ0J3mK1%l2J1ll4pJ1j5mLqK6%j5J3J8
6792A6npk6J5k2jJ6Kj9lkPkJ9QK2j1K6k5L4j2Lj2k2Pqj2J2kLK0j3lnM7jj7%Rj4
6832B2j0jj0rj1NQk6ONKJ8nJ9%j7J2oN%l1J4k1J1ljO%K3%OJ9RrK3j8orKMl7J7
6874FNr%MJ0JRkkLj6Rj5j3K3j7Kjk2k2K7ROnppJ8JK9k0Lo%OKk0pLK2k2L4OoL0
6918D9oj6J4j5J2j6j0KJjl8K5k0kmJ7j3J0jpJ6oJ4J3j7j3J0j2Nj8JOJ1jrL4kJ4
$$ plain form
6641 5 27 22 15 40 28 39 2 1 5 -32 -26 -10 -1 -19 -40 -32 -27 -24 3 0 7 13 11 12 -3 18 7 6 6 4 -21 -12 -22 6 -6 1 56 33 30 22 41
6682 41 45 34 20 6 19 8 -12 5 -7 -15 -32 -32 -28 -47 -18 -15 -4 22 9 -5 -16 -21 10 -21 -11 -49 -36 -34 -29 -53 -25 -27 -7 7 27
6717 27 37 40 30 11 39 24 16 49 19 17 31 13 9 16 3 9 9 29 16 30 32 9 19 24 21 0 -15 -13 -17 -61 -38 -12 -29 -41 -9 -15 1
6754 1 1 -21 1 -8 23 -13 -29 9 -9 7 3 -24 -30 -23 -3 12 21 12 22 35 31 52 52 20 31 28 -6 -13 -2 -17 -21 -18 -26 0 0 -15 -2 16
6792 16 11 4 -22 -7 -29 -30 -14 -12 -31 -34 -36 -29 -31 -12 -4 18 7 33 8 42 30 33 21 -1 6 -2 -14 -2 -4 -1 19 6 3 -2 45 44 27 27 36 22
6832 22 12 11 1 -8 -19 -14 -6 -32 -26 -21 -19 -1 -6 13 13 -4 8 2 7 7 -24 -10 -31 -20 -23 -24 -18 -18 5 5 11 30 39 30 53 35 29 20 22 26 -11 6
6874 6 11 2 2 6 16 17 26 24 22 25 9 18 3 -10 13 -4 -2 -3 -25 -47 -20 -11 -5 -10 -17 -24 -6 -5 24 4 7 1 1 7 9 -11 -18 -15 7 -15 19 25 19 49
6918 49 43 27 41 26 38 22 12 14 15 14 -24 1 -19 -21 -25 -8 -21 -11 -12 -19 -3 -9 5 18 1 -12 -2 -14 -9 -27 -26 -20 -9 -10 -19 15 13 27
6956B7JkK6ok1J0j5k1K2k0nQj0jL1kK4j2Jj5j7J3Ol8J2lj3j0Jj5rL9Rj2Lrj7N0
6994A0j0j2PKqMqJ3j8kj2L1qRMK8LLLl2K2lj4J2j8j6NqoQJj1K2nKR%Rj1Kj0j5
7036a8j5J0j2mK1qRoLNJ1J4j1jJ9l1L4nqkQj9J3j8J0J0j5M6oj3J5rj2j2rJ4J3
7073B1Rl3k1n%K8k5mJ9Qj7K8qj6K9j9NNl8%J0KRj0jJ4OK6k7K2J8lPlLroj6Rk4
7113gkoRm%K1Rk6K4Jpjj2kJj8nj3k0J5QqK0K8J1oNRMrj7LKj9rK5qJ8l2%K5%QJ7
7157C2J2Pk3K2Lj1ol2O%ork0L2k5k6K9J8j5MK5lj9PLj2j5Jj1l1L2OOPQJ7j0L0
7195C3j0LmRoRqj9J8j0Nl9K7PnpK8k7K4J3l2Ol2K2j3j8KrJ6Pkj1JJ9j8J3J0mk1
7234b3J4j3QJ8l2KJ0qJ3MJk5N1j0PJ0J4J0l2lMrk2NLpjj3j6K5k7K7KNJ4j9LJ2
$$ plain form
6956 27 28 26 52 46 25 35 20 -1 21 1 -4 4 -6 -7 24 22 46 34 35 20 3 16 22 -16 -4 -7 -20 -30 -29 -44 -53 -14 -5 -17 -14 -23 -40 10
6994 10 0 -12 -5 -3 -11 -7 -15 -2 -20 -22 -34 -3 -11 -2 2 30 33 36 39 7 29 26 12 24 6 -10 -5 -13 -19 -11 -10 -21 1 -4 -2 7 7 16 5 7 -3 -18
7036 -18 -33 -23 -35 -39 -18 -26 -17 -23 -20 -15 -4 10 -1 -2 17 -14 20 15 7 5 13 -6 7 -11 -1 9 -6 40 34 21 36 27 15 3 -6 8 21
7073 21 30 -3 -24 -29 -29 -1 -26 -30 -11 -3 -20 8 0 -16 13 -6 -1 4 -34 -34 -24 -22 -13 -23 -24 -10 -4 22 -5 17 35 32 39 36 39 30 24 8 17 -7
7113 -7 -9 -15 -6 -10 -10 11 20 -6 18 19 12 11 -1 -3 -2 -20 -25 -38 -58 -43 -35 -43 -23 5 16 10 15 24 28 19 2 5 7 -12 -21 4 -4 14 -18 -18 7 7 15 32
7157 32 44 51 28 50 53 42 36 4 10 10 4 -5 -25 7 -18 -44 -15 3 -12 -8 17 14 -5 2 5 -7 -22 -21 -32 -63 -31 -25 -19 -12 -4 13 3 33
7195 33 23 26 22 31 25 34 26 7 25 15 20 -19 8 15 10 3 31 4 28 41 9 15 -17 5 -8 -26 -24 -33 -17 -10 -12 -23 -22 -3 -21 -8 2 -2 -23
7234 -23 -9 -22 -14 4 -28 -26 -16 -24 -11 -7 -6 -31 20 10 17 27 41 51 19 16 20 11 -11 -6 -3 -10 -11 -24 -40 -15 -42 -15 -13 -8 6 -13 -10 2
7272Bmk0NjJrj4OJ4j2J5NK7j2j2J3K0J5Jj6Oj4j6NJ0l6J6J5oJ0MK3k2M1k4k1J8
7309C3jk3j9jj2jj3J0kkjrK8J0J1j1mRlj8Kk9K8Pj9JJ3MK0omM7KK0k3Mj4k7J5
7348B2pmj8J2l2K7NjJ0Knk0L2Kj5Kpok0Kj3k5LL7k8JpK3K4%nOJ3LJj7Mj1rK6k6
7389a9L7k5K8J1mKj8J3L4k8pj2Nj2l1L2j7Kj0j4mOJ5KK7l3J8Lj7qK0Kl4MM%%J0
7427a8j9%K6JL4kj1J7jj4jj2J6kj9M7n1J2j5J4J3pkJ0Jj5J1j1K7l8pjJk7K2L0
7463Il4j2RK3k3J6K8pnJ7j6j0Pj7Pj0mkJL1%kK1mJ1lJ0Rmj4j7Ok1j3K3ooJ0k9
7502b1K2oJLJ8Ok3k0K3k5j3PkrKj5J0J5%J1K0J2j9J4pNPk6M6j9k0lkJ3JJ5%J9
7540D0j6pNOJ4l3J6jpk2j1K7m1K0nj4J5JJ1j6QJ6pNj8%K1jk2j5K1k3J4K2MJ5k7
$$ plain form
7272 2 -2 -22 -17 -18 -17 -26 -40 -34 -20 -32 -17 -12 15 3 -9 4 24 39 40 24 30 16 0 5 15 -21 -5 10 4 14 18 41 19 60 36 15 33
7309 33 32 9 -10 -11 -23 -24 -37 -27 -29 -31 -32 -41 -13 -3 8 -3 -7 2 -1 -19 -17 -46 -18 -11 -30 -29 -16 -12 8 2 -2 45 47 67 44 48 34 7 22
7348 22 15 11 -7 5 -27 0 5 4 14 16 11 -9 23 25 10 12 5 -1 -21 -19 -32 -57 -54 -17 -45 -44 -51 -28 -4 -4 -9 -3 10 13 14 -3 1 -10 -19 7 -19
7389 -19 18 -7 21 32 28 30 12 25 59 31 24 12 17 5 -26 6 -11 -9 -19 -33 -37 -31 -16 -14 13 -20 -2 1 -16 -24 -4 -2 -36 -32 -28 -28 -28 -18
7427 -18 -37 -37 -11 -10 24 22 11 28 27 13 12 0 16 14 -5 42 -9 3 -12 2 15 8 6 16 17 2 13 2 29 -9 -16 -17 -16 -43 -21 9
7463 9 -25 -37 -28 -5 -28 -12 16 9 4 21 5 -5 2 -15 -8 -18 -22 -24 -23 8 8 6 27 23 34 31 41 50 46 32 15 21 0 -13 10 4 -2 8 -21
7502 -21 1 -5 -4 -1 17 23 0 -20 3 -22 -35 -28 -30 -39 -37 -52 -42 -27 -27 -16 4 16 -3 11 4 9 16 -10 36 17 -3 -6 -8 5 6 21 21 40
7540 40 24 17 22 28 42 9 25 24 17 -5 -16 11 -30 -10 -15 -29 -14 -13 -2 -18 -10 6 -1 4 -14 -14 7 6 -16 -31 -10 -33 -19 3 7 22 -5
7577eK2OKP%J0ok7J5Ql0%%rOmNLJ6j4J8nJ6j5k8nJ8k2j4LNpRlK6j0Qj1MK1kJ0
7619B1nJj0l1L1qjqnK7k7L3J5NppJ2kj5J6Ml1mpnpoj6kJ3PmmK0kj%rOkJolMk4
7664d3J0jK6j0%J3J1K5j5J0Kj0kL1l1j4j2oJ6NprOK2j4J5kJ9k8j9K4qpk6p%J1
7701b5kJjMrk1N1J4kmqK3l2j0qK3%%PJ3Pj3J6j7K3j1RNoj4jnKKLk0j4QoK2j3J9
7743A0k9J8Rj3mlok2qL2mj5J9j4MKjJ4L0j9LPrJJ1k4KJ4ppPJ1j2J5rK2oJJ0lm
7784B3nj6J4k2J2j2j9NrPj9kK0j1K0j7K5KNJ2l3K7qk3Kk5M5j3MlK7rK2lmlK9k5
7822B0J5j1rj3J6j9j2K6j1KJk3L7LnJ2k0j6%jpJl6J1J6k6K8mj6K2J0k%JJ8lJ0
7859A5%Kj2k4LJ4J8j6%J4Rk5J6L5k5Jj5J4k0nmMok0J1j3OmQJ1nRj2J3qNJ1j4l0
$$ plain form
7577 -5 17 23 25 32 32 42 36 9 24 32 2 2 2 -7 -1 -5 0 3 19 5 23 18 34 19 -9 -14 4 -18 -32 -29 -24 -31 -22 -25 1 -9 -1 -12 -8 13 11 21
7619 21 16 17 7 -24 7 -1 -2 -10 -15 12 -15 18 33 38 31 24 36 34 19 35 39 8 4 -3 -8 -15 -21 -37 -39 -26 -19 -23 -27 -7 -9 -10 -10 -19 -13 -15 -14 -20 -23 -19 -43
7664 -43 -33 -34 -8 -18 -18 -5 6 31 16 26 28 18 16 47 16 2 -10 -16 0 5 -2 -11 -5 17 3 18 16 35 7 -12 12 4 -3 -29 -36 -36 -25
7701 -25 -27 -26 -27 -23 -32 -53 -2 12 10 6 -2 21 -11 -21 -29 -6 -6 -6 1 14 21 8 24 7 30 19 28 33 27 13 12 7 9 11 14 -6 -20 -12 -18 4 -9 10
7743 10 -19 -1 8 -5 -9 -12 -18 -40 -48 -16 -20 -35 -16 -30 -26 -24 -25 -11 19 0 3 10 1 2 13 -11 -9 5 -2 -9 -2 9 -3 12 3 25 19 20 30 27 23
7784 23 18 2 16 -6 6 -6 -25 -20 -29 -22 -41 -43 -23 -34 -14 -31 -6 -4 1 13 -20 7 -1 -24 -22 -47 -2 -15 -11 -14 13 4 26 23 19 16 45 20
7822 20 35 24 15 2 18 -1 -13 13 2 4 5 -18 19 22 17 29 9 -7 -7 -8 -15 -14 -50 -39 -23 -49 -21 -25 -41 -19 -9 -11 -11 -10 8 5 15
7859 15 15 17 5 -19 -16 -2 16 0 0 14 23 -2 14 49 24 25 10 24 4 -1 -5 -1 -7 -27 -16 -29 -23 -27 -19 -8 -13 -4 -16 -3 -11 -6 5 -9 -39
7898c9L4j8mkQK8k3J6PpJ1mK3rj2J6Kj4qok%K8n6L8j8K8lLLj5j3J9Kk2nj3J8k4
7937c3M0k8j1j8K1jJ2mJ8j7J0Qj2K6J0nl6nK0Nk6L5%J0mO%J8PpJrkqQj2qLj8M
7977bk3K8plNNjp%JJ2k9RomorJ1Kj1OJ0J3OJ4qL7j6j4j3qPjj4M0k5j3K5kL6l5
8018A0L3j6K%j2pL3m2J1j8j3lonOnJ9rJ6j0PJ6mqj5K4Pl5K0j5PnlL1qlRPK6m1
8058AJ6J1j1j0qJ3Jj2j7j2K0J1J1l0L9k0jNJ0k3%Lj6RJ1l2j5OlJ4nJ2J3mKJ5l8
8095c4L9%L1m0RKj0oJ5j3%J8llJ4JK5lj6J2Kl1Rj9Qj8k4K8j2l0J1KLJ0J9k0J3
8132a1J5poj4J4qj5oJ6J0K0j4j5J7KrL1KKnJ5JoNl2K0l7J4j0j5J7J0opN1j2kj4
8170A1lRnl4Kj6Prj6J2%J4RJ1kmmJ8kJRj4nj6K6j8J9j7K9j9K4J1Lj4J4lk1RRj2
$$ plain form
7898 -39 -5 -23 -27 -29 -21 7 -16 0 7 0 11 7 30 21 9 25 27 13 5 -1 -3 -3 25 -31 7 -11 17 14 17 20 5 -8 11 13 -9 -14 -27 -9 -33
7937 -33 7 -21 -32 -50 -29 -30 -18 -22 -4 -21 -11 -3 -15 11 21 16 -20 -25 -5 0 -26 9 9 19 15 21 21 39 46 39 40 31 29 21 29 17 9 12 -6 -2
7977 -2 -25 3 -4 -7 -2 3 2 -5 -5 -4 8 -21 -12 -18 -22 -28 -37 -26 -24 -35 -29 -19 -6 0 14 6 43 27 13 0 -8 -1 -2 -16 24 -1 -14 11 9 45 10
8018 10 43 27 29 29 17 10 43 1 12 -6 -19 -22 -28 -33 -27 -32 -13 -22 -6 -16 -9 7 3 -5 -20 4 11 -24 -4 -19 -12 -17 -20 11 3 0 9 16 42 1
8058 1 17 28 17 7 -1 12 13 1 -16 -28 -8 3 14 -16 23 3 2 7 17 -6 -6 -3 -19 -10 1 -31 -46 -40 -43 -29 -34 -22 -9 -13 -11 4 -34
8095 -34 5 5 36 -4 5 7 -3 -9 6 -7 -7 11 8 5 19 20 45 42 26 38 40 9 18 -1 7 -11 -35 -7 -19 -49 -38 -36 -33 -23 -4 -24 -11
8132 -11 4 -3 -9 -23 -9 -17 -32 -38 -22 -12 8 -6 -21 -4 -2 -11 20 22 24 19 34 35 29 34 2 22 -15 -1 -11 -26 -9 1 -5 -12 39 27 25 11
8170 11 8 17 12 -22 -20 -36 -29 -38 -54 -42 -42 -28 -19 -8 -10 -14 -18 0 -2 -1 8 -6 -11 -27 -1 -19 0 -17 12 -7 17 28 31 17 31 28 7 16 25 13
8210A3Nk1nj3%NjJ3mjKQqJ9j7pj4Oj2Nj5nmK3ljOL3pPLmJ4%jpqJ6l7PJ5oNrJ1
8255FJ0k1kL5j9J4qk0%K5l3qJ4rJ1l9K5%rMJ5mjkj1RJ4M%k1kjmJ2M2k4K5j0mJ5
8295B8J2LkMrlOj6nk8L9l9%RMmLmrj2K4rOJ3mj3j1l1J8%J1nj0K4MK0LjL6m2K8
8336C8Nm8J4mmJ%j1K7l9L6K6j4rPK4k2JLk1kj0pJK6n2K4j0J3lK2j7jKnK2j2J4
8374A5m4L6ol8J3j2J5J5PQQJ2J1K0m3J0JrJ7k1qlLlRlJ6%onRn%%Lk2jNj7Knk1
8416c7J5nOkK1nNqJ0K9k7pmJ2j8nRkK3Jq%K1lRJ4k1J1k6J8Lk9j0K6j9nLm2L6J1
8456@l0NK3Oj4J7Kj8j7MlJ0j9oJ1J3k3%OMK2OK5rJ2K6k3k2jK1nk0MJ4j4j2J8p
8494FmOJ0K2Jql1Kj1l%nj5J0j3%J4k9M6Mj7lK1nj1J1k4L0qMk3OJ9QNj3J3K0%k1
$$ plain form
8210 13 18 -3 -8 -21 -21 -16 -17 -4 -8 -9 -7 1 -7 12 -5 -12 -26 -20 -32 -27 -42 -47 -51 -28 -31 -32 -26 7 0 7 10 6 20 20 19 12 4 20 -17 -10 5 -1 4 -5 6
8255 6 16 -5 -7 28 9 23 15 -5 -5 20 -13 -21 -7 -16 -5 -44 -19 -19 -28 -24 -9 -13 -14 -16 -27 -18 -4 0 0 -21 -23 -24 -28 -16 26 2 27 17 13 28
8295 28 40 43 41 45 36 33 39 23 18 -10 29 -10 -10 -1 3 -1 2 -2 -11 -23 1 -8 -2 11 7 -6 -17 -48 -30 -30 -19 -24 -34 -10 -6 14 17 16 52 10 38
8336 38 43 -5 9 5 1 2 2 -9 18 -21 15 41 27 18 25 49 27 28 31 10 8 -2 -9 -8 18 -34 -10 -20 -7 -10 12 -5 -6 -4 -9 13 1 15
8374 15 -29 7 1 -37 -24 -36 -21 -6 1 9 17 29 40 60 17 27 28 19 36 15 7 4 7 4 13 10 26 26 20 15 24 19 19 19 22 0 -1 4 -13 -11 -16 -37
8416 -37 -22 -27 -21 -23 -2 -7 -2 -10 0 29 2 -5 -9 3 -15 -20 -11 -13 10 11 3 3 24 21 30 44 23 34 8 26 29 0 -10 16 -3 -8 -5 -47 -11 0
8456 0 -30 -25 -2 4 -10 7 9 -9 -26 -22 -25 -15 -34 -40 -29 -16 -39 -39 -33 -29 -7 -1 24 15 27 53 30 8 7 28 23 3 7 21 7 -5 13 6
8494 6 2 8 18 40 41 33 2 4 -7 -10 -10 -15 -30 -20 -33 -33 -19 -48 -2 2 -15 -18 3 -2 -13 -2 -26 4 -4 0 -23 -17 2 10 15 2 15 35 35 14
8534A4L7k1J2qPk9KOl0J7J3k1jjK2j2RqNjlPk1j2KK0k2k9J0j5J1K5j3K6opJ6J4
8572A5L1l7jK7l3J0lj2MJ0k6K0K1Pj9jK9jk7J4rqJ8j0k1mKlmj8lK5j4K7Rj7lP
8610BNk0J7k3kOj6J0JnJ2qk%N3k2J5K1k1KMk4j4Rj1K3j4J6%j4oJ5Rk4K1Kj2%k7
8649b2J9l3MMrrK0j5OL5j2kK2j1J0j1LJ7j1K1k9j4K4k8K9KMqJ2j0L3oNK5k4mj6
8686B1lLk0J0ok2K8l1K1RmJJ5j7nLk7QPLmlj4mJ1Rj1L0oJ5k9L3jK1lj3k%q%j9
8727dj2pL7NNkj8K5%l5L4Jk8lJ2m1K7k8K4j4j0%mJ5QpJ6qK9j0j4j1olL0j9j6K3
8765iJ2KQPQoLK1k4K1Kl5K8m1L2m1K0Qqk0%K1oK3j7lkjKN%j9k2K1qn0K3KK6MP
8806fj2jNJ2K8k8K1j7j3L1moj6J2Kj4J3JlLJ6OjJ6k2mk5qJj4Lkj9L7pj8j4N0k3
$$ plain form
8534 14 51 30 42 34 41 12 14 20 -10 7 20 -1 -2 -3 19 7 16 8 13 12 9 16 -5 -17 -15 5 -17 -46 -36 -51 -40 -15 -28 -2 -8 -15 1 15
8572 15 46 9 8 35 2 12 9 -3 1 11 -15 5 26 33 14 13 42 41 14 28 19 11 29 19 -2 -6 -4 -7 -11 -29 -32 -7 -21 6 15 -2 -5 2
8610 2 7 -13 4 -19 -21 -15 -31 -21 -20 -25 -13 -21 -23 -23 30 8 23 44 23 25 29 5 -9 0 -11 12 -2 14 14 0 -6 9 18 -6 15 17 5 5 -22
8649 -22 -3 -36 -32 -28 -37 -46 -26 -41 -35 0 -12 -14 8 -3 7 -4 -1 16 5 26 -3 -17 7 -21 8 10 14 6 18 8 41 35 40 65 41 37 21
8686 21 18 21 1 11 5 -17 11 -20 1 10 6 7 22 5 0 3 -24 -16 -9 -6 -10 -13 -27 -31 -20 -11 -22 8 2 17 -12 21 20 41 38 25 23 23 15 15 -4
8727 -4 -16 -23 14 19 24 22 4 29 29 -6 28 29 1 -2 10 -31 -4 -32 -8 -22 -32 -32 -36 -21 -13 -20 -4 -12 17 7 -7 -18 -24 -27 3 -16 -32 -9
8765 -9 3 5 13 20 28 22 25 46 22 43 45 10 38 -3 29 -12 8 16 8 -12 -12 9 3 26 9 6 4 3 5 10 10 -9 -31 -10 -18 -68 -45 -43 -17 -13 -6
8806 -6 -18 -19 -14 -2 26 -2 19 2 -11 20 16 10 -6 6 8 -6 7 8 5 8 24 30 29 45 23 19 -6 -14 -13 -27 -24 -26 -45 -8 -15 -33 -47 3 -20
8845b0J5JoQ%rrJ4pk3jJ6kKJ7MJ2J0nqK4LkJ8l4Pj2Onjj7J3j5J2pJ1NJ2Lrj9J1
8887A3k8jOj6M%k2J4kJ4QRj9QJ2J5Mj8PKok0PK%OoK6krK0Rk9J4KMj2jj8J8k5j8
8929b8J8mj3jNMK9Mj8%Nlmpk4MJ5j1lPj4PJ4NJ7rPK6moJ1Prj2qK5j5j1OJ3k4M4
8971D5l8J8Pk2JJ4k7K6j3j2Qk9JQj4qMJ9mORj2K9l0J3rJ1j9J3k2K3j3J8j0JJ7
9007Ijj3L7j5K7NMj6jRl0Oj6Jk7J5KJOLK1k6jLj3K6m0K8k9J8j7k1J8jj3J9J3Q
9045aJ4Lj7K3%j5NKK4m1Kj8J8K6m0L0j0QM1l9Oj1K0oJ7k0k2qJ1j1kmj0J4j6K%
9082b5J6LKj7Nk3PJ9J0k0Kj3K9Rk8J0J2O%K4lJ1qJ5l1K2j4j7J1Lpj2j1MnK0K1
9119B7pj2J7j7J0l1J1nj2mJ4k7QOJrkK4J6k2QOJ9j6j4J0nnNj8J2K2mk2PM6j4j
$$ plain form
8845 -20 -5 -4 -10 -2 -2 -11 -20 -6 -13 -36 -37 -21 -23 -21 -4 0 12 22 17 9 33 36 34 52 18 25 13 19 14 13 -4 9 -6 6 -1 10 15 27 30 21 2 13
8887 13 -15 -16 -10 -26 -22 -22 -44 -30 -32 -18 -10 -1 -20 -12 0 15 19 1 8 10 4 -16 -9 -7 -7 -1 -7 19 17 8 28 37 8 22 24 28 16 15 -3 15 -10 -28
8929 -28 -10 -14 -27 -28 -23 -19 10 14 -4 -4 1 -2 -6 -13 -37 -33 -18 -29 -32 -25 -39 -32 -18 -13 4 -5 2 28 24 18 29 36 27 15 7 32 17 6 12 25 1 45
8971 45 7 25 32 10 11 25 -2 24 11 -1 7 -22 -21 -13 -27 -35 -31 -12 -16 -10 -1 -13 16 -14 -1 -10 1 -18 -5 -27 -4 -17 1 -9 -8 9
9007 9 8 -5 32 17 44 49 53 37 36 45 15 21 5 6 -21 -6 -4 -3 3 6 27 1 0 3 -10 16 -24 4 -25 -7 -24 -45 -27 -28 -41 -22 -9 -1
9045 -1 13 16 -1 22 22 7 12 14 38 -3 -1 -19 -1 25 -15 15 5 13 54 15 21 10 30 24 41 21 -1 -9 2 -9 -11 -15 -25 -11 -27 -25 -25
9082 -25 -9 -6 -4 -21 -16 -39 -32 -13 -3 -23 -21 -34 -5 4 -24 -14 -2 4 4 28 25 36 28 43 12 34 20 3 14 17 10 -2 -13 -9 -14 6 27
9119 27 20 8 25 8 18 -13 -2 -7 -19 -23 -9 -36 -28 -22 -21 -30 -32 -8 8 -14 -6 0 19 3 -11 -1 -6 -11 -6 -24 -12 10 6 -16 -9 37 23 22
9157B2K3j0%j9J3Lqk0j2K2l5J0%j7J2mJ7OJ7k5pK7qjj9Qk7LOJ3j6J6KJ7j9K9L
9194B2NJ5j9j6MMlj9J8qj0J6J4j9j2OJ7kmjK5j1l3K7l1Ok1RRk4j1J9K7rnRj3K0
9232Aj2RrRJ7l9qL3j0jRj1J2RJ9j2J4%j1LJ4j2Kk6K3k0onmKLpJNJ8j4J1MpJ1k5
9273a0l3K9j6Pj5jpM2Rj3J2J3l5L2J2k1K5Lj5Rl7J0nRj0LRJ5k5K8qPLk7J7Jqj1
9311bl3J0jj2L1j4rL0KnKqL4k3nqjpRMk6J7j6J2OjK2koN6m1NK2Oqj5Jj1k2J1r
9352epmJ4J5pJ2pJ0mPj9j9K9l3qJ4k5QJ0j2OJ5k3J7J6J2Oj0j0OqJ4k1J4qqRMn
9391eJ5oK6k1J4J1j1Mok6Pnj3KoJ9nj2mL5j3j0J3Opk3%kRm4N0l2J6j0j5J4K8K2
9429A5pmj3L6rK2j1Qk4qNj6L1k8mrK0ORrJ8Kj4k8K5j6J1n0j8N0j4rMj9K7PqJ7
$$ plain form
9157 22 45 35 35 16 29 32 24 4 -8 14 -21 -11 -11 -28 -16 -20 -3 3 20 -5 -12 15 7 6 -13 -5 -32 -29 -23 -10 -26 -10 -8 9 -10 19 22
9194 22 27 42 23 7 11 15 12 -7 11 3 -7 9 23 4 -8 -2 15 13 9 8 33 22 -11 16 -15 -9 -30 -21 -12 -36 -47 -28 -1 -10 -15 -6 -19 1
9232 1 -11 -2 -11 -2 15 -24 -32 1 -9 -10 -1 -12 0 9 28 16 30 30 19 22 36 24 26 0 23 3 -3 -8 -12 -10 -7 -14 -13 -8 10 -4 7 11 4 15 -10
9273 -10 -43 -14 -30 -23 -38 -39 -46 -4 5 -8 4 17 -18 14 26 5 30 33 18 27 -10 0 -5 4 -6 -3 6 21 -4 24 16 23 26 -1 16 17 9 -2
9311 -2 -35 -25 -26 -38 -7 -21 -30 0 2 -3 -1 -9 25 2 -3 -11 -12 -19 -10 -6 -32 -15 -31 -19 -13 -14 8 6 0 56 15 20 42 48 40 25 26 15 -7 4 -5
9352 -5 -12 -16 -2 13 6 18 11 21 17 24 5 -14 15 -18 -26 -12 -37 -29 -19 -31 -25 -10 -33 -16 0 12 18 8 -2 4 -4 10 -11 3 -5 -13 -4 0 -5
9391 -5 10 4 30 9 23 34 23 27 21 -5 2 -3 -16 -14 -20 -1 -6 -18 -22 13 0 -10 3 9 2 -21 -21 -23 -14 -58 -8 -40 -24 -34 -49 -35 -7 15
9429 15 8 4 -9 27 18 40 29 37 13 5 10 -6 25 -3 -7 -16 4 10 19 10 28 30 16 -12 13 -3 8 -42 -60 -10 -24 -33 -29 -48 -21 -14 -22 -5
9467eoJ2nqNl%Mj0J3j9J1rJ0OJ3k1K3QmM3j4j7q%Lj5jJ2k2pJ6pj0jRNJ3j8Prp
9509a3JmLk0JK0l9J6j2K7rQJ2K0k5RL7j4lJ2j0l0J9lj1J2j3J9J2%Mj3OmNJ0j5
9546A5J8k4j8Rj8%j2NQJ2k2J5J1qJqKj0J7k1LoJ0j8J6OMJ0%K8k2K2j6L1j0pj8
9583EJJ0mj6J2j3J2k1NJ9qJ5j0KJ7ll1K6jm0Qj6PpJ5j7J2j5J1LJ0J4K6j7%lj0
9620bj0jpkOJ0J0lNJL4qLj5J9Jmlj0Qj4j5Jk3kJ2j8L1k0k3N0l3J2j6J8j3j4K0
9658a5qJ0Ll1OJ3j8P%jK7J6OjJ9mqK8j6jk4ooOJ1NKj9J6JNPj2nj5QPl1PNj5j4
9700c5Pj3K9j3K0j7L1Qk2K4OLl2Ok3J7j1J4J3j2OJJ7J6j0PJ5k7LRk4J8l8RJ2m7
9736c3J5PjnPK8j7j6J9jj9O%j6RJ0l1KL2l6L1OJ9m2M2j6K2KQqk9Q%pLJmK9k0l
$$ plain form
9467 -5 -11 1 -4 -12 -7 -10 -10 -6 -16 -3 -22 -11 -20 -10 -4 9 -12 11 19 15 58 44 27 19 19 22 7 6 18 -4 -11 5 -2 -12 -13 -4 1 14 -4 3 -6 -13
9509 -13 -12 -16 -13 -33 -32 -12 -51 -35 -47 -20 -29 -21 -9 11 -14 -5 32 18 15 27 17 -13 6 3 -8 4 -9 10 22 22 26 13 19 15 20 30 15
9546 15 33 9 -9 0 -18 -18 -30 -25 -17 -5 -27 -12 -1 -9 -8 -16 -14 -24 -7 -28 -25 -31 -21 -39 -23 -17 -13 -3 -3 25 3 25 9 40 30 23 5
9583 5 6 16 12 -4 8 -5 7 -14 -9 10 2 17 7 9 26 23 -8 18 17 -23 -15 -31 -24 -31 -16 -33 -21 -36 -25 -22 -12 2 28 11 11 8 -2
9620 -2 -12 -13 -20 -22 -16 -6 4 1 6 7 41 33 36 21 40 41 37 34 24 32 18 3 4 -19 -21 -9 -27 4 -16 -39 11 -22 -10 -26 -8 -21 -35 -15
9658 -15 -23 -13 -10 -41 -35 -22 -40 -33 -33 -34 -7 9 15 14 33 29 21 49 33 32 8 2 -4 2 13 18 20 1 17 18 23 30 18 13 -2 6 13 -18 -11 -6 -21 -35
9700 -35 -28 -41 -12 -25 -5 -22 9 17 -5 19 25 28 -4 2 -21 -4 -15 -1 12 0 6 7 24 40 30 37 52 25 28 37 13 31 -7 2 14 -33
9736 -33 -18 -11 -12 -17 -10 18 1 -15 4 3 -16 -10 -10 -26 -17 -7 -38 -36 -4 -40 -9 -3 16 -26 16 0 22 24 32 24 -5 3 3 -4 -1 0 -4 25 5 2
9776BJ0j3K1J7j1j0RPj5j0k8L1j2J1k9MQj6J9j9J5J9j5oPpjmOJ2rmj1Pj0jNJ5
9814fMJ4J6oj1K3J7j5j9K4k8j4K5m0J4j5J6kKJ9j2K1k8kj0K0j4j0J2l3RJ0J4l4
9848c9J2J0PNmJ2MJ3pQrJkoNJ2m0J4J6NJ6j5QJ5qj4K1k1qJ2m3J1prj8J7LqLJ3
9888a5J4J8k3oJ9j6j1Mj9J1nQJ6k2kK6QQ%J2j3jJ7j8MJ1lj4j6J0Oj5J8Kj0L0L
9925C6j4kj0L1k9j8NlnPk4j9L4pj6OJ8jJ1kk1J2mJ5j1kJ2mknJ7lJ2MJ5l0L3Kk
9964C6j0k7K6Opj8%qNlJ2j1lJ9k0kJ4k8J7jK2j9JpJ2kl5nJ3k7OLK2QJ9mLJ7j6
10003HnJ2j0NPrjQj7lJ7Pj3qK0L1rj8jqj2LOj8J4l0Lk1J5Qj%J2nj4J1LJjJ6k5
10044b2joK2l1K3jJ0LK1kJ5J7pNj1j5JRj1k8J2%kj2Pj9K3j4kN0l5Mj7lLnmj8Q
$$ plain form
9776 2 12 -1 20 37 26 16 25 32 17 7 -21 10 -2 9 -20 -16 -8 -24 -5 -24 -9 10 -5 -11 -4 -11 -12 -16 -10 2 -7 -11 -22 -15 -25 -26 -21 -6
9814 -6 -2 12 28 22 11 34 51 36 17 41 13 -1 24 -16 -2 -17 -1 -3 -1 18 6 27 -1 -3 -13 7 -7 -17 -5 -38 -29 -19 -5 -39
9848 -39 -27 -17 -10 -5 -9 3 7 20 13 21 12 13 11 5 10 22 -18 -4 12 17 33 18 26 41 33 19 40 19 11 23 -20 -9 -16 -25 -43 -26 -23 -31 -28 -15
9888 -15 -1 17 -6 -12 7 -9 -20 -16 -35 -24 -29 -21 -5 -27 -29 -3 5 13 13 25 12 11 28 10 14 25 22 8 -8 2 8 -7 11 13 3 33 36
9925 36 22 20 10 41 12 -6 -1 -4 -9 -2 -26 -45 -11 -18 -34 -28 -10 -11 0 -2 -23 -11 -15 0 -11 -13 -1 -5 -7 -12 5 2 14 18 33 3 36 38 36
9964 36 26 -1 25 31 24 6 6 -2 3 0 12 1 -2 17 -3 -5 9 -19 -2 -3 19 0 1 -6 6 4 -31 -36 -23 -50 -44 -41 -19 -11 8 4 7 24 8
10003 8 3 15 5 10 17 8 7 15 -2 -5 12 19 6 -2 18 49 40 22 21 13 1 4 10 -8 6 -24 -21 -42 -27 -19 -20 -20 -8 -13 -27 -16 -13 -12 -13 3 -22
10044 -22 -23 -29 -7 -38 -15 -16 -6 -3 18 16 31 48 41 46 35 20 21 30 19 -9 3 3 1 -11 -4 -23 0 -14 -16 34 -1 3 -14 -17 -14 -19 -23 -41 -33
10083c3rRKJ7pjMJ2pnK6j1K9m2J8mJ2ooPj4J1mN%L3j4L3j8j0oMqrj1%j2K4kl6
10123b9K5j1lJ1j1L5l3K3Ol2O%j9J0j4J3J0oP%RmJ8jj5L4qk8J1lkJ2l1J4J5kn
10160BmK2j3pM%NrkRk7J7l1PMj0J7lJ4k2%J3RoK0l2L4nLj8JJ5pkKMKMlNJ0OJ0
10203C8Ok2RMk4Oj3o%jnk3L1rjQj2NlLkOj8morK3ok2jK8Pj1K4J8okpJ6j5j2NK1
10246A8k3K3k4j3K6LKQn%J5Kloj5ojk2LNoj5j2K4lLMOL7k9QqknJ6lJ2l0MpJ8M
10288ClJ9lJ8Jk1K1rOk9N1l0j9PMj7Pj4j6M3l1K6Jk3J8l1L9k5j4qJ9j2Nkrj2k
10325d2K3J0j7J5K1k9J7J0oMkKMk3K9j1j3%KQJ6J3mk%qnj0J6k0Mj3moKmQl8K2
10364c1MJ4PMJ8k1j0j5L3k8j4J1JnJ6kJJ8pNQJ1j0J3j5L8njk6mj1KQJ6j7rJ0K1
$$ plain form
10083 -33 -42 -33 -31 -14 -21 -22 -18 -6 -13 -18 8 -3 26 -16 2 -2 10 4 -2 5 -9 2 -2 3 3 36 22 55 37 27 21 25 17 8 -3 -3 -15 9 7 -29
10123 -29 -4 -15 -18 -7 -18 17 -16 7 13 -19 -13 -13 -32 -22 -36 -23 -13 -19 -12 -12 -3 -7 11 10 -5 29 21 -7 4 1 -1 11 -20 -6 9 7 2
10160 2 -2 20 7 0 4 4 9 0 -2 7 -20 -3 -34 -27 -23 -33 -16 -19 -5 -27 -27 -14 -5 -11 9 -23 11 6 9 -9 -8 7 0 -2 0 4 6 10 7 12 22 28 38
10203 38 44 22 31 35 11 17 4 -2 -2 -3 -8 -31 0 -9 -10 -2 -14 -9 -12 -9 -11 -5 -23 -27 -33 -42 -19 -25 -47 -48 -20 -13 -24 0 18 12 10 3 19 4 -8 -3 18
10246 18 -5 18 -6 -19 7 10 12 20 15 15 30 32 29 23 8 2 1 -21 -18 -13 -19 -34 -46 -22 -25 -22 -18 -12 25 -4 4 -4 -6 -11 5 2 14 -16 -12 -19 -1 3
10288 3 0 19 16 34 35 14 35 26 32 3 54 24 5 12 16 -1 6 -8 -24 19 -12 14 15 -8 10 -21 18 -7 -21 -29 -10 -22 -17 -19 -28 -40 -42
10325 -42 -19 -9 -26 -11 10 -19 -2 8 2 6 4 6 10 -13 16 5 -8 -8 -6 2 18 31 27 25 25 17 12 2 18 -2 2 -11 -15 -21 -19 -23 -15 -53 -31
10364 -31 -27 -13 -6 -2 16 -5 -15 -30 3 -25 -39 -28 -27 -32 -16 -18 -17 1 -6 -1 7 18 8 21 6 44 39 38 12 8 -3 -1 7 23 6 -3 7 28
10402B8k9QJ8j8nrJ9l4J0j3j5J3%rJ2K0k5J6QKNJ0mJ3k5J2k1Kj2L6m0K3J5JNn
10438A2J1J4qj7J8j0Pk0pjQj0J6k8J4j2OPJ9j1j1Ljk1J6j2mkJj2JOJNKJ9N%JN
10478A0ljPO%qkJ0KnK1j4rNRmOjk3NK8j8k5J3oj3k5K0j2RPj9J2LJ7j2QpRk0Qk
10520a4k6K4jJ9J2k2PpQK3j0K2lj5K9rJj0k0J5KKj1rj7J3n%Qnn%j5K8j8j5J0l
10558a7k4K5j6J3k9L2k2K2jRK4j4Om%npJ2Pj4J0KnPL9j1%k6J5j6L9l8K4lk9Mj7
10595hKj2NPj0LjK0j5mJ0nkJ0j1j5J7l5J5KOj4NRJ8POROJ0j2J6k8mJ9k7K4j5r
10634aPj2QOj3KJ1k2J4RJ0j4k5J0l1KpK3Kj9kQQj7K3jK3KrpJ0K6k1Nj3JOqJ8J1
10674B3J6j3j7L2j1JoJjkl2qL3j4J4k7MNMpj1J4jj9L0j6j0Qkj6Lj0MJ1k1MK8K1
$$ plain form
10402 28 -1 7 25 7 2 -7 12 -22 -12 -25 -40 -27 -27 -36 -24 -4 -29 -13 -5 -3 2 12 8 21 -4 8 -13 -11 -23 13 -27 -4 11 12 17 12
10438 12 23 37 29 12 30 20 27 7 0 -1 7 -3 13 -15 -1 -13 -7 0 19 8 -3 0 -1 -22 -6 -18 -22 -24 -23 -35 -34 -28 -27 -22 -20 -1 4 4 5 10
10478 10 7 6 13 19 19 11 9 19 21 16 37 23 14 19 28 24 30 29 6 11 39 21 -4 9 3 -10 -35 -15 -27 -18 -11 -30 -18 -15 2 -10 -2 -9 0 -20 -12 -14
10520 -14 -40 -16 -17 2 14 -8 -1 -8 0 23 13 35 32 17 46 37 38 28 8 23 25 27 16 7 -10 3 -2 -2 6 1 -4 -4 -19 9 -9 -24 -14 -17
10558 -17 -41 -16 -32 -19 -48 -16 -38 -16 -17 -8 16 2 8 4 4 -1 -8 4 11 -3 7 9 4 11 50 39 39 13 28 12 51 13 37 34 5 9 -8
10595 -8 -6 -18 -13 -6 -16 -13 -14 6 -9 -13 -3 -8 -10 0 -11 -26 -9 -44 -29 -27 -21 -35 -30 -21 -3 4 10 19 25 35 23 39 11 7 26 -1 23 8 -1
10634 -1 6 -6 2 8 -5 -3 8 -14 0 9 19 5 -20 -10 -41 -39 -46 -23 -21 -40 -42 -34 -26 -43 -20 -21 2 4 -5 -12 -2 24 3 8 -5 -4 2 -6 12 23
10674 23 39 26 9 41 30 31 25 26 25 23 -9 -17 16 2 16 -11 -7 -2 2 -5 -16 -2 -3 -22 8 -8 -18 -10 -12 -28 -25 -35 -31 -20 -41 -37 -9 12
10712A2j8NJ7j7K3oj2mRj3OJ3j8KQj4K3qKJ7j3J9Jk7%J0lj5pJ2l5kJ3jpJ1jrL0
10751Ckk6L9k5JK%k1J0J2KLj4J2J1KJNRplK5j9j0NJ8j5j2OjK4j9pJ6j9rj0mL3
10790A6k7J3nk6NL0k9j1%j3K6RM%kJ5KRj7OPj1j0J0K0rn%j7L2K4Lj4l1K8jMj9
10828A6KkKnOk3Pj9Oj0RK2l0J3lQqLMj7pK0j9jOj0K1j2J8Kj7J1J5MK8j3J2J1k6
10867B4mJ0j3Rj0Nlk2K7Oj6jj9mK7j4Nl%k6K6k4k8L1l8L1JJ6J6k6L0k8J8J1Qj3
10903IJ2rk1QPrJ0nJ0OLJ8LJ2j4j2J2j1J2pl1nkJ9l1J4j1J4j2KKlNk8J6K6k7R
10941iJk6LLkkK2JJ7k6J0L0Qj1j2NLj4J2k4K1Jj9J9jj7M0k0Pj7RPoK2k3kl0K2
10979Bk4mJ7pj5j9J8J0J5J4l9L9k0j3K2k2RJ0k1J2%K6j5j%NQLj0J5PlK4k3Ql1
$$ plain form
10712 12 -6 -1 16 -1 22 16 4 0 9 -4 2 15 -3 -1 7 -7 16 8 10 27 14 33 34 7 7 17 14 -1 -8 4 -31 -33 -20 -21 -28 -17 -18 -27 3
10751 3 1 -25 14 -11 -10 -8 -8 -29 -19 -7 -5 -2 -16 -4 7 9 10 15 24 17 14 39 20 10 15 33 18 6 12 11 35 16 9 25 6 -3 -13 -17 16
10790 16 -11 2 -3 -29 -24 6 -23 -34 -34 -47 -21 -12 -8 -8 -10 5 7 16 -1 5 12 1 -9 1 21 12 7 7 -10 22 46 49 35 4 32 31 35 16
10828 16 18 16 18 13 19 -4 3 -16 -10 -20 -11 11 -19 -6 -9 -1 -9 -6 -2 -19 -26 -6 -25 -26 -20 -30 -9 -21 -3 -1 -18 -7 8 12 40 27 39 50 24
10867 24 20 30 17 26 16 21 18 -4 23 29 13 12 -7 -11 16 2 7 4 4 -22 4 -20 -48 -17 -55 -24 -23 -7 9 -17 13 -15 3 14 22 9
10903 9 21 12 -9 -1 6 -3 7 2 12 18 21 39 42 54 40 28 40 29 41 34 3 -2 -4 15 -16 -2 -13 1 -11 -9 -7 -10 -5 -33 -17 9 -18 -9
10941 -9 -8 -34 -31 -28 -30 -32 -10 -9 8 -18 -8 22 30 19 7 12 15 1 13 -11 10 11 -8 11 10 -7 33 13 20 3 12 19 13 35 12 10 -20 2
10979 2 -22 -26 -9 -16 -31 -50 -32 -22 -7 7 -32 7 -13 -26 -4 -26 -17 -7 -28 -16 -16 10 -5 -6 -6 -1 7 10 0 15 22 19 43 20 28 -3
11015cNj8jK2nlLOj5OlJ8j2KqJ2k4rK7l5j6K1j4J2RPoJ2j9%J0KL2j1l5K5J9k6
11053a3jNL0l1J4RJ1j0J1nNj5L6l1J3pk5rkkj5K3Kj9qK8j2J3%K7l4Oj3j5J3NL
11090a3Rj0oK0l2L7K2J5k7LJ5j4J2j7J3q%j8J7j0j1J9j2J8j7J7j0K4k8J2Ll4m
11123a5J4j1J1l2Prj0jK6j7QL1j8J8j4J1%rJ0j1j9K6J0nQK6k5OpmKRLK7j9Qoj9
11161A0j3J1Jqj2pNj0J6J7j8mK6m6NqJ9qOpl3K8JpK6p%QQNJJPj1L2oNk4J1nll4
11203b2L4Oj7Rj0nK6o%k3J9KJk1Pj4j8J8J4j0K1j3Ol8K5j1K2Kj0nRk1MK3k0J0
11239f%J8oJK0JJ3J5k3Kj2%oK0k9J2Qj4jnkj3LJ1%KRk3PLKk3jk8pL6rj2PJ2J0
11280hPj0J0mkOJ2rmkK1j8Nj5L7j4kKK5nj2K1k8mJ8j5pJ2k5Lj2k0J1J9j7J4k6
$$ plain form
11015 -3 2 -16 -17 5 0 -3 0 6 -9 -3 -6 12 0 2 -6 6 -18 -27 0 -35 -51 -30 -44 -32 -23 -16 -22 -10 -29 -29 -19 -17 15 4 -31 -6 13 -13
11053 -13 -14 -9 21 -10 4 13 24 14 25 20 25 10 46 15 28 21 -4 -13 -15 -17 -32 -9 -7 -26 -34 -6 -18 -5 -5 22 -12 -6 -19 -34 -21 -16 -13
11090 -13 -4 -14 -20 0 -32 5 27 42 15 18 33 19 31 14 27 19 19 1 18 8 -3 16 4 22 5 22 12 36 8 20 23 -11 -15
11123 -15 -1 -12 -1 -33 -26 -35 -45 -46 -20 -37 -29 2 -16 2 -12 -1 -1 -10 0 -11 -30 -4 6 1 9 35 10 16 9 5 7 16 19 46 27 35 29 10
11161 10 -3 8 9 1 -11 -18 -13 -23 -7 10 -8 -12 14 -32 -27 -35 -16 -24 -18 -25 -58 -30 -29 -36 -10 -17 -17 -9 -1 4 5 6 13 2 34 28 33 9 20 15 12 -22
11203 -22 12 18 1 10 0 -5 21 15 15 -8 11 13 14 -7 0 -14 -32 -14 0 -10 11 -2 4 -34 -9 -20 2 4 -6 -11 -2 -23 -19 4 -16 -6
11239 -6 -6 12 6 7 27 28 41 56 33 35 23 23 17 37 8 20 28 14 13 8 6 -7 -4 7 7 9 18 -5 2 5 7 -16 -17 -45 -52 -16 -25 -37 -30 -18 -8
11280 -8 -1 -11 -1 -5 -7 -1 11 2 -2 -4 17 -1 4 -11 26 12 10 12 37 32 20 41 13 9 27 12 5 17 -8 -5 -17 -37 -26 -7 -24 -10 -36
11317c6J8kNJ7k0K6l2J6k0j2J2K0j7%J1J9qK0jLMk1J7MRml4K2JJ8j8mkkj0pK2
11354A4J2l1oL7oj2rj7J7j5pkqoNKJ3k7K1J6QmNoLj7Pjk0OK4MmmL9j2j6MoL8l
11395C6poNk4J4Ol1J0nkJqpK2mj8oj1J1LJ6k1j0J1j9K5j2K4k7j5L3jJ4NJ5Lk5
11432eoK5j2J3%j6K4%oj4J1j1K8j1pMj4KKk0K%j0ok2J6jk2J4K7nk0JrJK6Nlj0
11471b9J7q%JkRj9L3QJ6k5J4J8oj3%ORk5J5k7K1Nl4LJ8%k0J9MJ2%k4qJ1k4J0j9
11509c4K0k0pK7k0J4k3L7rnJ3oLRNLnk7M3j3NJ4lj9mJ7nk5M1Nj5Ok0J1j8K2lk2
11547hK4l6NOlj4K1k3J9k1j4J6RJ0m2K6k0J3K5j2k8J9K0J5j1K8k3J4J3K2k9K0
11579D1k0qK1j8jMmPj1Oj9KL3m0J1Ql4L0k4L1j9j3K2l0rj0K3rlJK0j9jL6mNQj3
$$ plain form
11317 -36 -18 -20 -15 2 -18 8 -24 -8 -28 -40 -28 -8 -25 -25 -14 5 -3 17 16 19 23 2 19 23 32 28 -6 16 17 35 17 13 11 9 -1 -8 14
11354 14 26 -5 -11 26 20 8 -1 -18 -1 -16 -23 -25 -33 -39 -34 -32 -19 -46 -25 -9 -1 -5 0 -6 -3 -20 -13 -14 -34 -28 -4 0 -4 -8 31 19 3 7 1 39 36
11395 36 29 23 28 4 18 24 -7 3 -2 -4 -3 -11 -18 4 0 -18 -24 -35 -24 -21 -5 -26 -36 -25 -44 -19 -31 -7 -34 -49 -16 -17 -3 2 17 20 -5
11432 -5 -11 14 2 15 15 -1 23 23 17 3 14 3 31 20 13 17 3 5 7 -13 -11 -11 -21 -27 -49 -33 -34 -56 -42 -15 -20 -40 -39 -48 -47 -21 -16 -19 -29
11471 -29 -12 -20 -20 -19 -21 -12 -31 2 10 26 1 15 33 27 14 14 20 29 4 19 -8 13 18 -16 -13 5 5 -15 4 8 20 20 -4 -12 -1 -25 -15 -34
11509 -34 -14 -34 -41 -14 -34 -20 -43 -6 -15 -20 -7 -13 -10 -1 4 7 2 -25 18 5 10 24 21 2 -2 15 10 -15 26 31 16 22 2 13 -5 17 14 -8
11547 -8 16 -20 -15 -9 -12 -26 -5 -28 -9 -30 -44 -28 -19 -9 -51 -25 -45 -32 -7 -19 -47 -28 -8 7 -4 24 1 15 28 50 21 41
11579 41 21 13 34 16 15 19 15 22 11 17 -2 0 33 -7 4 12 -22 8 -16 15 -4 -17 5 -25 -34 -44 -21 -30 -33 -32 -12 -31 -32 4 0 5 13 0
11617@j3k5K6%jJ0NJ3njpJ0%K7kPl0loMj4PJ0k0pj3K8j7OQj0k2K6k7KK0j5nk0
11656e4J4qML6rk1MK1pJPK6k4QklJ8kplK8j8j2K4rJJ2mj2KmjLJk7qJ6j5j0J5k
11697b1J1j7rK6Kqj3J1k9JK2J0k4K7j4OPLkmJ2J2k%MJ6rnrJ6j4OKPk3J9k4K0j1
11736Bk4Qj3Pj5RK8k5oJrk2L5jj3j6LK5j5L3l2J1QlK0J8%jn2L3LPlJ6l2J8K2p
11774A8poJ1lJ7j4jj6%nlqRrn%j3RppK2kj4MK4j1jJ5l7L5rpJlKMK2LJ5mJ3%j2
11817B0J4l8K5J3mk1j3OJ3lJ1qrJ7m6M6j5j0%j9j0K2j6j8J7J9l2M%J2J1j6J2j4
11851c0OPkPoK1%N%j4OOQppJ9KmjJK0j8oK5l8J1J3l7oMK1ll0NOJ1nj4Pqj6QJ2
11894b1Lmk2RN%M0k6pJ4Kj0L9j3jJKrJ3jJ8j8jj0J8Kj1KJ5nmj3j1JJ1j8or%Mo
$$ plain form
11617 0 -13 -38 -12 -12 -13 -3 2 15 10 9 2 12 12 39 37 44 14 11 5 9 -5 2 12 -8 -15 -28 0 -17 -11 -3 -13 -35 -9 -36 -34 -14 -29 -34 -54
11656 -54 -40 -48 -44 -8 -17 -38 -34 -13 -20 -19 -12 14 -10 -2 -4 -7 11 9 2 -1 27 9 -3 21 12 13 25 21 9 11 7 6 9 10 -17 -25 -9 -24 -34 -19 -21
11697 -21 -10 -27 -36 -10 -8 -16 -29 -18 -47 -46 -24 -14 -38 -11 -25 -19 -12 -9 -11 -15 -3 9 7 7 11 27 18 13 4 20 6 12 14 21 -2 17 -7 13 2
11736 2 -22 -14 -27 -20 -35 -26 2 -23 -29 -28 -37 -59 -24 -25 -38 -54 -51 -26 -41 -8 -40 -29 -21 -24 -4 14 14 13 -39 -6 -3 4 1 17 -15 3 25 18
11774 18 11 5 16 13 30 16 15 -1 -1 -6 -9 -17 -8 -17 -22 -22 -35 -26 -33 -40 -18 -20 -34 -30 -6 -17 -18 -3 -40 -5 -14 -21 -20 -23 -21 -17 5 8 23 19 32 32 20
11817 20 34 -4 21 34 30 9 -4 2 15 12 23 15 6 23 -23 23 8 -2 -2 -21 -31 -9 -25 -43 -26 -7 -39 -35 -35 -23 -12 -28 -16 -30
11851 -30 -24 -17 -19 -12 -18 3 3 8 8 -6 0 6 14 7 0 19 21 17 16 17 37 19 13 38 0 11 24 -13 -19 -15 6 3 -27 -22 -16 -5 -10 -24 -17 -25 -41 -33 -21
11894 -21 -18 -22 -44 -35 -30 -30 10 -16 -23 -9 -7 -17 22 9 8 9 11 2 15 14 32 14 13 3 21 23 12 14 29 24 20 7 -4 -3 8 -10 -16 -25 -25 -21 -27
11935b7rrrK8OokJJ5k2J4j3j1L3k1MJ9j3oJ5K0j0MRlK3j2J9ok4Lkk2K3mOm3L8
11973Fj6RjllK0m3MlomqNKj3J4klNJ7J7pjnJnJ2J6j3Rj3K0k0K3J1qmJ1knK1l1
12015DK2lkpqRkk5J1Mqk2j0J0J9j9Mp%kNj9K6kqj5QJ0Mk2K3OLLqJ0J4KMMK3l4
12057EJ1J7k7J0PLj8j8J8J0rj4J6mJmj9OLk3QmNl2NoK7j6J8KJMJmJ6pj4KmK6j8
12098a9K3pmK4j6K4j4J5j%J3lj4j8LJ4j8pnkKkj0K2l9K3j2J8j1k1K9j4q%J3jj
12135b4k0QJ6j1mL3k5L4j4OPmlJ3rJ1j5j5K0KJ7rQMj6kJ2oJKj2j1qLj5J0Ol2K
12174d0K4Oj2qmKJ4j8LMk6M2J1qj1J2J9nPJ2k2K5l2J7rRJ8moj2j1j2J2J0Jj6K3
12211A5l0Pr%j3PJ1k1j8N4n2J7rJ4Kj9NLJ%%NK4l3J7J2n%mPL2k1PQj2P%j0K2K
$$ plain form
11935 -27 -36 -45 -54 -26 -20 -26 -28 -27 -12 -34 -20 -33 -44 -11 -32 -28 -9 -22 -28 -13 7 -3 1 10 7 30 18 37 31 7 10 8 -14 9 5 11 -32 6
11973 6 -10 -1 -2 -5 -8 12 -31 -27 -30 -36 -40 -48 -43 -41 -54 -40 -42 -45 -40 -23 -6 -13 -14 -19 -18 -23 -11 5 -8 1 -12 8 -12 11 22 14 10 21 19 14 35 4
12015 4 26 23 21 14 6 15 13 -12 -1 3 -5 -27 -37 -27 -8 -27 -23 -30 -30 -32 -27 -46 -20 -22 -30 -45 -37 -27 -23 -45 -22 -16 -13 -10 -18 -8 6 8 12 16 39 5
12057 5 16 33 6 16 23 26 8 -10 8 18 9 -5 11 7 8 4 -15 -9 -6 -29 -21 -25 -20 -52 -47 -53 -26 -42 -24 -22 -21 -17 -16 -20 -4 -11 -25 -23 -27 -1 -19
12098 -19 4 -3 -7 17 1 25 11 26 25 25 38 35 21 3 6 20 2 -5 -10 -12 -10 -12 -22 0 -39 -16 -28 -10 -21 -42 -13 -27 -35 -35 -22 -23 -24
12135 -24 -44 -36 -20 -31 -35 -2 -27 7 -7 -1 6 2 -1 12 3 14 -1 -16 4 6 23 14 22 26 10 8 20 14 15 17 5 -6 -14 -11 -26 -16 -10 -42 -40
12174 -40 -16 -10 -22 -30 -34 -32 -18 -36 -33 -29 -55 -13 -2 -10 -21 -9 10 5 12 24 2 27 -5 12 3 12 30 26 20 8 -3 -15 -3 7 8 -8 15
12211 15 -15 -8 -17 -17 -30 -23 -12 -33 -51 3 -49 -32 -41 -27 -25 -44 -39 -36 -35 -35 -35 -30 -6 -39 -22 -10 -15 -15 -19 -12 20 -1 6 14 2 9 9 -1 21 23
12251B3J2kmj3QLk7J5k4Rpopj2j1Oj0J6j6L3Kj1mj5K0J0k4pM0l5oK3j0J0mMK3
12288B%k3RL1j1RJ6nqroOokj5MK9k4K0k7l1L1kj6L5j1rJk2Kj6K5oj8J3K8lj2p
12327b8J0%J7molmN%K2j0RRj4K3pmoL2k5K1k1J0k0nL1l6J5j9pJJ1k1Oj1J6oJ6
12365ck5MooJ0noJ2OOJ3j3J2j7J2nKK0j6J4kJ0k1J5L0k6rK1qjJ1Oo%j4j6J1j1
12403aJ1j4mRJj1Lk1J1orPK7m0J2j3LnK8rjmK2j0J4j0PmK7k3J5Ok9M2%k1K5Kk3
12442A4KKRj5j0KJ1j3pj0J2oJjk9L6j2pmMj0k0jJ9LpKRj2N4j2j5K0kRk5J0nNn
12482dMNj5RK6pQkj0L3m2oJ4JOk7RPj1k8jPMj3k2L8MrrL0l1jKpK2oNk9N0k4j9
12523c9L0J5Nk0J7K4j8pNJ4j4mK1l0J1%j5j5K6oJ7nk2J8kj9Lrj5K6k3jJ4lj1j5
$$ plain form
12251 23 35 33 29 16 24 27 0 15 -9 0 -7 -13 -20 -32 -43 -37 -47 -31 -47 -14 -12 -23 -27 -42 -22 -12 -36 -43 -3 -38 -44 -21 -31 -21 -25 -21 2
12288 2 2 -21 -12 19 8 17 33 28 20 11 5 11 5 3 -12 -8 21 -3 17 -10 -41 -10 -12 -28 7 -4 -13 -12 -34 -32 -48 -23 -29 -47 -34 -6 -9 -21 -28
12327 -28 -18 -18 -1 -5 -11 -14 -18 -13 -13 9 -1 8 17 3 26 19 15 9 41 16 37 16 26 6 1 32 -4 11 -8 -15 -14 -3 -24 -18 -29 -13 -19 -3
12365 -3 -28 -24 -30 -36 -26 -31 -37 -25 -19 -13 0 -13 -1 -18 -6 -11 -9 11 -5 9 7 17 -4 11 41 15 6 27 19 18 29 35 29 29 15 -1 10 -1
12403 -1 10 -4 -8 1 2 -9 -6 -27 -16 -22 -31 -24 3 -37 -25 -38 -35 -40 -12 -21 -22 -26 -4 -14 0 -10 -3 -7 20 -3 12 18 -11 31 31 10 35 37 14
12442 14 16 18 27 12 2 4 15 2 -5 -15 -3 -9 -8 -9 -38 -2 -14 -21 -25 -21 -31 -51 -52 -33 -30 -37 -35 -26 -38 16 4 -11 9 7 16 -9 1 -4 1 -4
12482 -4 0 5 -10 -1 25 18 26 24 14 47 5 -1 13 14 20 -7 2 9 -2 -30 -31 -24 -20 -33 -55 -17 -13 -22 -31 -1 -32 -33 -31 -38 -16 -22 -17 -46 4 -20 -39
12523 -39 -9 6 11 -9 8 32 14 7 12 26 12 8 29 -1 10 10 -5 -20 6 0 17 12 -10 8 6 -13 -10 -19 -34 -8 -31 -32 -18 -21 -32 -47
12559d7J3NOrqJ5kJ7j1PK7k3P%qL3mj2J5k6lJ2L0r%k5J7j7K8j7Knq%oMj2Kj4K1
12599ej2k4J6L1l4j4K3l2J8j0qmkL3mj2JL2rQL0k1J5lmmK1m0M3k9JJ3J0lnJ0j5
12636A1NkNok0J9j5k1J1Rl4%J0Oj3J3j2K1jj5PJ6K6m5J4j1K9j2k3K1j1J6JROk0
12672fK8J6j9jNNJk2KKKj0J5l1L0%JoNlk9Mj3RrmK0k2k8J7Pk5J7j5PNJ7k0K3m
12712b9kLK3nrJ4K5rLk5M0rqJ7k2J5j6J5J8l1Qqlj0mJ1Jj1ll3J6OMk0rK7j2Nj8
12751d5J0mnmL2oj3K6l2J8mJ4kJ9K3k2J5Oj1J7Nkqmj9J4Qlk1mJ8Oj6Pl1J9Qj2
12789cOrk3qJ5J%Kl3J3J4j8K4j3K5k1nPJ1k4J3j1L7j1KJ6pOrL1lK1k5MLlOj4j6
12828AJ8j9mJ1j9lK1k1kj4%K7rpmmj2j4L8m0J9rK3Lk5L3%K5m5K2K1J4j6Lj7J9
$$ plain form
12559 -47 -34 -29 -23 -32 -40 -25 -27 -10 -21 -14 13 -10 -3 -3 -11 22 18 6 21 -5 -8 4 34 25 25 0 17 0 28 11 13 8 0 0 -6 -2 -14 -12 -26 -5
12599 -5 -17 -41 -25 6 -28 -42 -19 -51 -33 -43 -51 -55 -57 -24 -28 -40 -39 -7 -16 -8 22 1 16 13 9 5 26 -14 29 0 1 14 24 21 16 26 11
12636 11 16 14 19 13 -7 12 -3 -24 -13 -4 -38 -38 -28 -22 -35 -22 -34 -13 -14 -29 -22 -6 20 -25 -11 -22 7 -5 -28 -7 -18 -2 -1 8 14 -6
12672 -6 22 38 19 18 23 28 29 7 9 11 13 3 18 -13 17 17 18 12 17 14 -15 -11 -24 -15 -24 -28 -8 -30 -58 -41 -34 -59 -42 -57 -50 -45 -28 -48 -25 -29
12712 -29 -31 -28 -5 -10 -19 -5 20 11 14 -11 29 20 12 29 7 22 6 21 39 8 16 8 5 -5 -9 2 3 -8 -11 -44 -28 -22 -18 -38 -47 -20 -32 -27 -45
12751 -45 -35 -39 -44 -48 -16 -22 -35 -9 -41 -23 -27 -13 -15 4 27 5 20 26 15 32 37 35 27 23 4 18 26 23 2 -2 16 22 6 13 -18 1 9 -3
12789 -3 3 -6 -29 -37 -22 -21 -21 -19 -52 -39 -25 -43 -19 -32 -7 -28 -33 -26 -15 -39 -26 -37 0 -11 -9 7 0 6 -3 28 25 46 21 25 28 25 31 17 1
12828 1 19 0 -4 7 -12 -15 6 -15 -17 -31 -31 -4 -13 -20 -24 -28 -40 -54 -16 -56 -37 -46 -23 -20 -45 -12 -12 13 -32 -10 11 25 9 12 -5 14
12864A4nJ2JqLonJ9NLk5Rj9J8Jj6Lj6jPKj3j6K1j5k5L6j7j9L8j7JQj5mK6j2K1
12902fj1MK7k7nJ8J2LRk0qK6Mk3K8Jk4MQJ1k3oK2k5J2k3kk0K1Ml0L3l8L4kJ0l8
12939d0%Kk3J8Nj0NJK0j6J2J5lJ3nj2J0Qj6pL1nk4M7j9lQrJ7mpRj3On1K7Pprm
12979b6J5l0K1J5l0K0k2rK3k8J2J1k2PMLL0l1RnJ9kJ5jK8l2PpJ6Pokl2L5j1QM
13016A3lQk1Qj5LJ9j0nJmMk9j3J7npqJ3nRrnRrQK3k6L1l4L4J0j0NoJ1%QPK0j1
13057B6j2Oj4J2NplkrJ5k0LmJ6j6Nk3MJNj7OjOJ2k8J0j2j2M0l3Qj2K3K5n3L8j9
13095c1M1m3M1LrMlJ1NJ6k6J5j6PkKnPQJ3k3j7J1j6kK2l7J2k2kqJ8J0plJk9L1
13133b3j2LoJLMLPOkL3mk6PL2nj0NjJ8qj0QNLj3qmj4K4j0jj4o%%LomNoj2J2ro
$$ plain form
12864 14 9 21 22 14 17 11 6 25 30 33 8 17 -2 16 17 1 4 -12 -13 -6 -4 -17 -33 -12 -27 -52 -16 -33 -52 -14 -31 -30 -22 -37 -41 -15 -27 -6
12902 -6 -17 -13 14 -13 -18 0 12 15 24 4 -4 22 26 3 31 32 8 12 20 31 8 2 24 -1 11 -12 -14 -34 -13 -9 -39 -6 -44 -10 -12 -2 -40
12939 -40 -40 -38 -61 -43 -38 -48 -43 -42 -22 -38 -26 -11 -14 -1 -6 -18 -8 0 -16 -23 8 3 -21 26 7 4 12 3 20 16 9 18 5 11 -40 -13 -6 -13 -22 -26
12979 -26 -11 -41 -20 -5 -35 -15 -37 -46 -23 -51 -39 -28 -50 -43 -39 -36 -6 -37 -28 -33 -14 -16 -1 -2 26 -6 1 -6 10 17 11 9 -23 12 1 9 13
13016 13 10 18 -3 5 -10 -7 12 2 -3 -2 -6 -2 -31 -44 -27 -32 -39 -47 -34 -39 -30 -39 -44 -35 -44 -36 -13 -39 -8 -42 -8 2 -8 -3 -9 2 2 10 17 37 26
13057 26 14 20 6 18 23 16 13 11 2 17 -3 0 -4 12 -4 1 -22 -18 -17 -12 -29 -23 -24 -18 -6 -34 -24 -36 -48 -8 -41 -33 -45 -22 3 -50 -12 -31
13095 -31 10 -33 8 11 2 6 3 14 19 35 9 24 8 15 13 15 10 17 25 38 15 -2 9 -7 -9 13 -24 -12 -34 -36 -44 -26 -16 -23 -26 -25 -54 -23
13133 -23 -35 -32 -38 -37 -34 -30 -27 -20 -14 -16 17 13 -13 -6 26 21 11 16 15 33 25 15 23 28 31 18 10 6 -8 16 6 5 -9 -15 -15 -15 -12 -18 -22 -17 -23 -35 -23 -32 -38
13178c8jj4%PL1k2J5jK3j6KPNMlj4K2k2K8NqmkK3%qOJ4k9J6j9Pj3kJ2m0M0l8L2
13217El0J7lpj8J5j2j0j6J8j3J1K5j6Qj7J2j2K4Qj1L8k3RQoJ2NMk4L6m4K7Pjm
13253B2k2K4j4pJj6K9j4j1J1j5pPjoJ1k5K9l5Pnj5rOL9j6PQj3J2JLoJ4qQj9K4
13291aK0kKj0J9Ok4K3%Qj9j3Rj1J1k0qK0k2Kk2K2j2j2K3k1%jNpj3K4jl3K8Pl2
13328e5J1K2QKj2PJ0j6K3lJ5Pj1JJ0j5KJ2j2j6RK0Nj4LNj3jrjj8K6k9J1k5K4r
13365b6j8NmRK3j4j2L1m1jJ8JnL1j2Rj1RK2K0l9K5jj2PMJMJ3j8%j1J7j4KlK6k5
13403A0j1Nk3Oj1J1Kk5QRj2oJ4j6oK4KMnj5J5j8J5K6j8J2KMmK2J0l0J6j1j2K4
13439A8j7L2j2j7K4Lj6j1J0oj1j5J8k2K9k7nlLrrK5Mj3j5K0mlj2J5qoJ7j5J3J2
$$ plain form
13178 -38 -39 -53 -53 -46 -15 -37 -22 -23 0 -16 -14 -7 -2 2 -1 -15 7 -15 13 18 10 6 4 27 27 19 25 39 10 26 7 14 1 -1 11 -29 11 -27 5
13217 5 -25 -8 -11 -18 -36 -21 -33 -43 -59 -41 -54 -43 -18 -34 -26 -43 -31 -43 -19 -11 -22 16 -7 2 10 4 16 21 25 1 37 -7 20 27 26 22
13253 22 0 24 10 3 4 -12 17 3 -8 3 -12 -19 -12 -13 -19 -8 -33 -4 -39 -32 -37 -52 -61 -55 -16 -32 -25 -17 -30 -18 -17 -14 -20 -6 -14 -6 -25 -1
13291 -1 19 17 19 9 28 34 10 33 33 41 22 9 18 7 18 -2 -10 10 -12 -10 -32 -10 -22 -34 -11 -32 -32 -33 -28 -35 -48 -24 -25 -58 -30 -23 -55
13328 -55 -44 -22 -14 -12 -24 -17 -7 -23 0 -3 12 19 8 9 19 4 6 18 6 -10 -1 19 24 10 13 18 5 4 -5 -6 -24 2 -27 -16 -41 -17 -26
13365 -26 -44 -39 -43 -34 -11 -25 -37 -6 -47 -48 -30 -29 -34 -3 -15 -6 -17 -8 14 34 -5 20 19 7 14 18 19 23 36 18 18 7 24 10 12 9 35 10
13403 10 -1 4 -19 -13 -24 -13 -11 -36 -28 -19 -31 -37 -23 -39 -45 -21 -19 -15 -20 -35 -20 -38 -23 3 -15 -3 -1 3 -1 21 31 1 17 6 -6 18
13439 18 1 33 21 4 28 31 15 4 14 8 -3 -18 0 -22 7 -20 -25 -28 -25 -34 -43 -18 -14 -27 -42 -22 -26 -29 -41 -26 -34 -40 -23 -38 -25 -13
13475a3j2K8k3RL5l2K4j2J6LMj3kkKQj2rjQNMMjl2J7J3k0kqj1K6j2k5qM3k8j2
13513d1J2KKoPPk2lM0l0K1KJ5j7K1Nj6RL0j5j3J8n%j0Rk1J4mNqj8J4Jk9J3j0J1
13551a0k9L2j1J1l8lK9k2J1j9J0J0J6omMmKJ4oK2jj2mK5j2k0L3jj5K0QrkJ7j4
13587B2J6j0j9Qj3nkJJ6k1lJ2j4npkQj0k4L1kMqk8L2klk3K1K2j3L7qPllj7K9J8
13626C9l4oL5k1J6j5K5k0K2k0ooqQk5J4j8LoK6l6NJ7j5Rj0j0J6onJ8j0Kk1OL5
13662bk4J8j2PRJNPORmj2k7L2MoMK9l7J0J9orRk1Pj3mnnrj3J2r%l1L0MpRk4KJ7
13705c0j3j4QK7j9LjJ4L2j0j4kR%J6nJ2J6%j2j4J5j0J0j3K2Kj7%KkJ5j5j6joJ0
13742aqpj6J0j4onJ5lJ3mQk1QJ5k1QJ3%J6K6l4j1K4jJ6k2J5jLj5j2J5K8j7j5P
$$ plain form
13475 -13 -25 3 -20 -11 24 -8 16 4 20 23 27 14 12 10 12 20 8 -1 -2 6 11 15 19 18 -14 3 16 -4 -6 -14 -25 1 -11 -36 -44 -1 -29 -41
13513 -41 -29 -27 -25 -31 -24 -17 -39 -42 -2 -32 -11 -9 6 -11 10 15 -1 8 38 23 10 28 23 23 13 22 1 15 11 16 8 -10 4 5 -24 -11 -21 -10
13551 -10 -39 -7 -18 -7 -45 -48 -19 -41 -30 -49 -39 -29 -13 -19 -23 -19 -23 -21 -7 -13 9 8 -4 -8 17 5 -15 18 17 2 22 30 21 19 36 22
13587 22 38 28 9 17 4 -1 -3 -2 14 -7 -10 2 -12 -17 -24 -26 -18 -28 -52 -21 -23 -19 -27 -55 -23 -25 -28 -51 -30 -8 -21 16 8 15 12 9 -8 21 39
13626 39 5 -1 34 13 29 14 39 19 41 21 15 9 1 9 -16 -2 -20 -17 -23 3 -33 -28 -11 -26 -17 -27 -37 -21 -27 -32 -14 -24 -22 -43 -37 -2
13662 -2 -26 -8 -20 -13 -4 -3 2 9 15 24 20 8 -19 13 17 11 15 44 7 17 36 30 21 30 9 16 3 -1 -6 -11 -20 -33 -21 -30 -30 -61 -31 -27 -34 -25 -49 -47 -30
13705 -30 -43 -57 -49 -22 -41 -38 -39 -25 7 -3 -17 -19 -10 -10 6 1 13 29 29 17 3 18 8 18 5 27 29 12 12 14 12 27 12 -4 -5 -11 -1
13742 -1 -9 -16 -32 -22 -36 -42 -47 -32 -35 -22 -26 -18 -39 -31 -16 -37 -29 -16 -16 0 26 -8 -19 5 4 20 -2 13 12 15 0 -12 3 31 14 -1 6
13779Fjj2K2qj7K8j7mjj6Nj3l4K5J4jKJ4nl1J8j6RK7k1j7K1KJ4MRk1J8oL8j6k
13816A7MkJ2pqQmpO%Qk9L6k3OJ2j4j4jn%l4K0J3j9oOqJ4Mj8Mk3K5K2j3q%j5J3
13856b8J9j9K2K2ooNJ2j6J6j2K2OrrNNMj3k4K1j0Mmj1J0j6lJ%kok7PJ8j1J9m9
13894f3L4NK4l1K0k5L7j4J6j9rJ5OJ4l1L7j4kJ4j6L3Nj5kQj2MjoJ0kLj6Qj3pL3
13931B8l1%j2Rnj2j3KqJ7oj4J5j6J9RNk7J2K4qJ6PJk1J4oj3L4k4L5j9J1NQqj9
13968IRJ1l0L6lk4Lj5K8k2j5J2k1J1j3N%NrNpk6K8k0J8%LL4l9L0Jlj4K7jj4Mj5
14006a2K1L2k3j5J5jRnJ9mj8J9rk8mL1k2Qj0jpnJ6l5K2k1lRj8LMQJj0K0jj8K2
14044a1Nj3J4j7OJ9Nj0J4j4K5jj1OJ7LKk4J7Rj4kJ4J1j7m3PNkj3qKJ3j1MLNj8
$$ plain form
13779 6 5 -7 15 7 -10 18 1 -3 -4 -20 -15 -28 -62 -37 -23 -24 -22 -8 -13 -44 -26 -42 -33 -6 -27 -44 -23 -21 -7 -3 6 -15 3 -3 35 19 17
13816 17 21 19 31 24 16 24 20 13 19 19 27 -2 34 11 17 29 15 1 0 -5 -5 -39 -19 -6 -25 -31 -25 -33 -19 -15 -33 -29 -52 -27 -5 -18 -26 -26 -41 -28
13856 -28 -9 -28 -6 16 10 4 9 21 5 21 9 31 37 28 19 24 29 33 20 -4 17 7 11 7 -4 6 -10 -13 -12 -12 -14 -20 -47 -40 -22 -33 -14 -63
13894 -63 -29 -24 0 -31 -11 -36 1 -13 3 -16 -25 -10 -4 10 -21 16 2 0 14 -2 31 36 21 19 27 15 19 18 12 22 20 23 7 15 2 -5 28
13931 28 -3 -3 -15 -6 -11 -23 -36 -34 -42 -25 -31 -45 -30 -46 -27 -18 -13 -40 -28 -4 -12 4 11 12 -9 5 -1 -14 20 -4 31 12 23 28 36 28 9
13968 9 18 29 -1 35 32 8 11 -4 24 2 -13 -1 -22 -11 -24 -19 -19 -14 -23 -18 -25 -51 -23 -43 -25 -25 -22 12 -27 3 4 1 -13 14 13 -1 3 -12
14006 -12 9 41 18 3 18 17 26 21 40 36 18 37 28 0 -4 27 5 13 3 2 -5 -10 6 -29 -7 -28 -31 -22 -40 -37 -33 -25 -24 -34 -14 -15 -33 -11
14044 -11 -6 -19 -5 -22 -16 3 8 -2 12 -2 23 22 11 17 34 37 39 15 32 41 27 25 39 50 33 -10 -3 2 0 -13 -21 -19 -6 -17 -13 -10 -5 -23
14082b3NJ1j5j3J0K3k9K1MQjkOKLk4K7J2QPk9nK0JNk1J5k6K6%K7k6J1j4Ol0K2
14119B2k2LJ5n5L1j2jj6M2j2MMj8OnqJ1k6j3QM1j6k0K6NkJ9pRJ3j9K4j1lL%j0
14156A0K3j5nK3Mrjk9OL0l0J2j3k6OK7k3j0%Joj2K5j1nK1j5%LLj1K1Jj6J7%K0
14193A6KpLJK1J2l5J2kj1OoK2J1rj7POQj6ok9J1Ok5Njrl6N5k4Oj1pmK5J0j0rJ1
14233a8jJ0qJ8qRj1J0J0J5l4L9j9J3rJ4j1K8k0j0J4qj2%K%KrRj7oJ5j9Nmj1kP
14271a7j9K8l4J3KlLlL1j9Pj0rL0qLJ8QJ8k5Nj2J8NjpJ5j7%m%oJ4rlk2K0J4k3
14310AJ0Qj7j2J4j2JJ8l8J8qK2k7K8j4Kj0kJ1j6K6olJ3Lj6J1QL0l7QJ8oJ0K6j7
14346D5Nk1J9rlLLj8J1j0k0Jj3pJ9j5pLKJj2J6k1J2j3J0j2J8kJ5k0rK4Ol2N0j4
$$ plain form
14082 -23 -18 -7 -22 -35 -25 -2 -31 -10 -6 2 1 -1 5 7 10 -14 13 25 33 40 11 6 26 27 32 11 26 0 26 26 53 27 38 24 30 0 22
14119 22 0 3 18 -37 -6 -18 -19 -35 7 -5 -1 3 -15 -9 -14 -22 -11 -37 -50 -42 -1 -17 -37 -11 -6 -8 11 4 13 26 7 31 20 17 20 20 10
14156 10 33 18 13 36 40 31 30 1 7 37 7 19 6 -20 -14 13 -10 -20 -20 -19 -25 -37 -12 -23 -28 -7 -22 -22 -19 -16 -27 -6 -5 -21 -4 -4 16
14193 16 18 11 14 15 36 48 13 25 23 12 18 12 34 45 36 19 26 32 40 24 18 -11 0 6 -19 -14 -15 -24 -60 -5 -29 -23 -34 -41 -45 -20 -10 -20 -29 -18
14233 -18 -19 -9 -17 1 -7 2 -9 1 11 26 -8 31 12 25 16 30 19 47 27 17 31 23 11 11 13 13 15 6 15 -2 -8 7 -12 -7 -11 -22 -24 -17
14271 -17 -36 -8 -42 -29 -27 -30 -27 -30 1 -18 -11 -21 -30 0 -8 -5 13 21 39 14 19 7 25 30 29 22 37 20 20 16 16 10 24 15 12 -10 10 24 1
14310 1 11 19 2 -10 4 -8 -7 11 -27 -9 -17 5 -22 6 -8 -6 -16 -18 -7 -23 3 -3 -6 7 10 -6 5 13 43 6 14 32 26 36 62 45
14346 45 50 29 48 39 36 39 42 24 35 25 5 6 -7 -14 5 -10 -17 -14 -12 -11 -23 -7 -28 -16 -29 -19 -31 -13 -15 0 -20 -29 -5 1 -31 19 5
14383EJ8JpJQj0J6kJ5O%j1kpJ4mMj5j7J3k0lkL4m2J5rpj3lK4k9OMppK0k7J9QJ1
14424bj2j0JK6MpK6j5lK1j1k0K2QMj1K3k8J6J2k6J4Rj3j2j0J5Kj8oL1j8nk2K0
14459Eplk6J3qpJ2j0jJ8K4rk9j0M7j0lJ2jj3L0oj1jJ7j3NLLJMoJ5k8K4Qj5nj2
14498GoJ2rj3%j4j5L1nLk6J6J5l5K5kJ3rj7J1krJ0Oj5j1J8K7qlLK6j6J9j5J8k1
14535IJ0j3K8Kj6RQj1K1k9pPrpj3kJ5l6K0j6J2lrRMj3LL2l1OK5km1J4rJ5J7Rj1
14574cK2J0j6QLk2J0j8K6oMnQRj1lQkLk8J1Jrmmj6K9nqJ8k7Nj5jK3j4RMkLj0J3
14616bJ6l4K3j4KJ9JnJ3Pj5J6K7m6OqJ6Mk3K6kj1mPoj4K2j9J7k6j6Lj4K9lol3
14653d7K5j4lL3pmlPL1k5rJ7k3OK0ojJJ4j2J8pJ2rJ5OoJ1j3qJ5j4l6K8j1OMj0
$$ plain form
14383 5 23 24 17 18 26 16 32 30 45 51 51 40 38 31 45 41 45 30 13 26 6 3 1 35 -7 8 -1 -8 -21 -24 0 -29 -23 -19 -26 -33 -13 -40 -21 -13 -2
14424 -2 -14 -24 -23 3 7 0 26 11 8 29 18 -2 20 28 32 21 44 16 32 44 18 32 41 28 16 6 21 23 5 -1 30 12 7 -15 5
14459 5 -2 -5 -31 -18 -26 -33 -21 -31 -32 -14 10 1 -28 -38 9 -1 -4 8 7 -6 24 18 7 6 23 10 15 18 21 22 26 20 35 7 31 39 24 19 7
14498 7 1 13 4 -9 -9 -23 -38 -7 -12 -9 -35 -19 -4 -39 -14 -16 -3 -12 -29 -18 -20 -29 -19 -13 -28 -39 -21 6 -2 -5 -2 24 8 27 12 30 9
14535 9 19 6 34 36 20 29 37 26 47 18 11 18 9 2 -11 -13 2 -34 -14 -30 -18 -21 -30 -21 -17 -30 -27 5 -26 -20 5 3 -38 -24 -33 -18 -1 8 -3
14574 -3 19 29 13 21 24 2 12 -6 20 14 18 13 21 30 19 16 24 22 25 -3 8 9 0 -4 -8 -24 5 0 -8 10 -17 -12 -27 -28 -5 -19 -10 -6 -8 -5 -15 -2
14616 -2 14 -20 3 -11 -9 10 11 6 19 26 11 27 54 8 14 6 22 26 3 29 27 16 12 19 13 -1 21 2 19 -7 -23 -20 -34 -5 -8 -14 -47
14653 -47 -22 -36 -39 -6 -13 -17 -20 -13 18 -7 -16 1 -22 -16 4 -2 -3 -2 12 0 18 11 23 14 29 35 29 40 27 19 34 20 -16 12 1 7 11 1
14691AJ3l9J3oL4n3J5k2L3j1j5j1J1K1j2J6j0nNJ9k1O%%J1rJ9J5j3J8rL0j4J4
14725D4j9j0J4LK%qj2lJ2k9J9ooK5rj4Jl5J0L0l2j8J2K2k1MK9l9JJJ6lKJ8oKQ
14763EKjMQj7K3j9nK0Pm%RqLLj0Nj4K4l9lJ0j5pqN0l4Kjqj5J4rRj6QrkJ9rMK4
14806@j6J8j6J4RqJ0J0l4J2mPJ5j1L1j4Nj3RJ5k2J2Kk5mJ0LqJ2m6K8j0j0J3k5
14841c1J6jj1mj1J2lkmJ4NJ0Oj3mJ9k0J7P%j2K0J8lj0MnJ9JQj9nK3oj2kOj1k3
14880gJ7rLj4mMk1J0J9k1mK8k3OKKj1KRnoJ8qKQOJMRpJ8nk3MpJ9rPJ1N%mjj2n
14925HPj5K1l4J4oJj4JJj4Nj1K%JQJqK2j3Rj6KK9oj3K0kkJJ2mL0j3j7OJ6Nj1k2
14966AjJ1%J4omOjj8K2k2j1J1mj6j9MK0Kl1J4MK0pNj6J3qj7K1jPkQj6J6kmJ2J
$$ plain form
14691 1 14 -25 -12 -18 16 -37 -22 -44 -11 -22 -37 -48 -37 -16 -28 -12 -22 -27 -22 -3 -24 -18 -18 -18 -7 -16 3 18 5 23 14 44 30 44
14725 44 25 15 29 32 34 34 26 14 11 23 -6 13 7 1 26 17 3 4 -31 -21 9 -23 -41 -29 -7 -28 -24 5 -34 -33 -32 -16 -19 -17 1 -5 -3 5
14763 5 7 6 10 18 1 24 5 0 20 27 23 23 32 24 27 30 20 25 11 35 -4 -7 3 -12 -19 -27 23 -11 -9 -10 -18 -33 -19 -28 -19 -35 -27 -36 -38 -19 -28 -24 0
14806 0 -16 2 -14 0 9 1 11 21 -13 -1 -5 2 17 6 37 23 28 15 24 39 17 29 31 6 2 12 15 7 19 -27 1 -9 -19 -6 -31
14841 -31 -15 -16 -27 -31 -42 -30 -33 -35 -39 -25 -20 -10 -4 -17 -21 -2 -22 -5 2 2 -10 10 28 25 15 19 14 33 34 42 23 18 41 35 23 21 27 16 -7
14880 -7 10 1 4 -10 -14 -10 -31 -21 -2 -23 -27 1 -22 -16 -14 -12 -23 -21 -12 -17 -23 -5 -13 -11 -3 3 4 8 17 10 28 23 0 4 -3 16 7 14 25 30 30 26 25 13 8
14925 8 15 0 21 -13 1 -5 -4 -18 -17 -16 -30 -25 -36 -34 -34 -33 -25 -24 -32 -10 -23 -14 -30 -28 1 -5 -18 2 0 -2 -1 11 7 37 24 7 13 29 34 23 1
14966 1 0 11 11 25 19 15 21 20 2 24 2 -9 2 -2 -18 -37 -33 -13 -11 -42 -28 -24 -4 -11 -6 -22 -9 -17 -34 -13 -14 -7 -9 -1 -17 -1 -3 -7 5 6
15006FJ1lK3k0kL9l8Mj3J3Oj9J6j9%J1Lj7OJ2j6pj0k0K4oj5K0l1J7mJ3j8J5J5
15041dj7OJ3nk1K4nkROkNkmJ1K%K4k7J2jj3LJ5rj4mKLJ1qk0K5j8jJ5ojl8J7j3
15082c2J5rJ3J1k2PPj9L0k4pJ9jQJJ7j7j2J3K8k1J3Kj6K4k8J1J9j5JPj6K1Rj8
15117A9pj6J2n%Rk1Rpj6K5j8K0k5pjOjpmL6rMOqPL2j5j4Qq%J4nj7K7j5J4J2k0
15157A4pJ5joK3l0J3j5j8Rj0%J6q%oOnk7K6k0J4rpJj2J3mQ%%K2J4j1LLOj3j2K5
15197A0pJ1K0MpO%j9J9nj0j5J7pj4qk2L1j0J5lk7PJ8l2%J9k0nJ9NjJj8Oj1J5N
15235a3MjO%J4Mj0K9l7J1J0r%J9j6lJ4MJ5rqj0K1j2j0Kpk1rJ7Rj9Pj0kJ8l4K3
15273a3rQkj7QqKOLJ0pJ7lj7K9QmjkJ3%j9RnRJ2Oj9K0olNj8klJ4lOk3j3lJ2j1
$$ plain form
15006 6 17 14 37 17 15 54 16 20 7 20 26 7 23 4 4 15 18 1 7 19 3 -4 -14 -34 -10 -16 -31 -11 -42 -25 -29 -16 -34 -19 -4
15041 -4 -21 -15 -2 -7 -28 -4 -9 -11 -2 4 2 7 5 1 12 14 14 38 11 23 22 9 12 27 18 4 0 2 5 16 8 -12 13 -5 -6 9 3 2 -36 -19 -32
15082 -32 -17 -26 -13 -2 -24 -17 -10 -29 1 -23 -30 -11 -12 -4 -3 14 -3 -15 -2 26 5 18 20 4 28 0 11 30 15 16 23 7 28 37 19
15117 19 12 -4 8 3 3 12 -9 0 -7 -23 2 -16 4 -21 -28 -29 -23 -24 -31 -35 1 -8 -4 2 -6 1 33 18 4 12 4 4 18 13 -4 23 8 22 34 14
15157 14 7 22 21 15 38 8 21 6 -12 -3 -13 -13 3 -5 -5 -11 -5 -10 -37 -11 -31 -17 -26 -33 -32 -44 -31 -35 -27 -27 -27 -5 9 -2 1 4 10 -3 -15 10
15197 10 3 14 34 38 31 37 37 18 37 32 22 7 24 17 3 -5 -27 4 -6 9 6 -21 -14 4 -28 -28 -9 -29 -34 -15 -10 -11 -10 -28 -22 -33 -18 -13
15235 -13 -9 -10 -4 -4 10 14 4 33 -4 7 17 8 8 27 11 8 22 26 41 32 24 14 35 23 13 15 8 -13 -22 -5 4 -15 -8 -18 -20 -2 -36 -13
15273 -13 -22 -14 -16 -33 -25 -33 -31 -25 -22 -12 -19 -2 -5 -22 7 15 11 10 8 21 21 2 11 6 15 27 33 14 34 28 25 30 12 10 7 21 18 24 1 -12 -15 -3 -14
15316a4Jj1PkJ8k6NJ0k3J5nK2k3JQMOj2K6K1j2J4j2lK2k8oK8kk3MJ1j3J3Nj9j
15353FlJ0j6KJj6qJ0kK3l2KJ6qkj2NnJ8Nj3j0K9l2PK0j0J2Nk1K4qK0nmj0ojM4
15392C5k7J4oPj5K4knJ3jl0RJ1k2J1lk4K2j8k2J3Lj2jNKJ9Nl2MK4Jj5j4K9j1M
15429eqK5JRmj6OmK4j4K0LLk2Jj0K5l4M0k2oKmPmK2m5J5j1Kj5mj5jM1k9jQJ5j6
15469b1qJ7J4KrnK1J4j2ooOQLkJ8Pl2K1J2j4NJ0k8Oj3Pj6K3j8j0J9j9Pj5RKj8
15507b1K8j0j3kN%k5PPNoJ0mM0k9J1rJ7Nk0J1rK6MkJjJJlLpjOjLj6Qnj1%J6k2
15550bNj6J0kJ6qOj2Pj0k0J4kRPlRpj0lLL2k8J0Llmj3N4j0j9K5oj3K3Kj4jnKk
15591B4J1k7K5k5Kkk7L2k1oJ4Nj7LqJ2Lj4lJlJK6Ok2J7jJ5qMMK0k4K3l3J3Oj8
$$ plain form
15316 -14 -13 -24 -17 -19 -1 -27 -22 -12 -35 -20 -25 -3 -26 -25 -17 -13 -7 -19 7 28 16 30 18 15 37 9 3 31 29 6 10 21 8 21 26 7 6
15353 6 3 13 -3 -1 0 -16 -24 -14 -16 7 -25 -23 -7 -15 -17 -29 -24 -29 -11 -6 -19 -29 0 -32 -25 -5 -15 -3 2 -19 5 -3 17 12 8 -2 -8 -9 35
15392 35 8 22 16 23 8 32 30 25 38 37 7 16 27 5 16 13 -11 11 -7 -29 -16 -13 -25 -26 -21 -19 0 5 -27 -23 1 2 -13 -27 2 -9 -5
15429 -5 -13 12 13 22 18 2 8 4 28 14 34 37 40 18 19 9 34 0 40 18 12 14 10 17 13 35 -10 5 -6 -4 -19 -23 -38 -39 2 -27 -28 -20 -5 -21
15469 -21 -29 -12 2 4 -5 -10 11 25 13 7 1 7 15 18 16 34 41 9 30 42 28 33 43 15 21 8 15 -1 22 4 -6 13 -6 1 -14 -5 -3 -21
15507 -21 7 -3 -16 -18 -13 -13 -38 -31 -24 -19 -25 -15 -19 21 -8 3 -6 11 16 -4 7 -2 24 28 26 27 26 27 28 25 28 21 20 26 25 28 12 20 15 4 4 20 -2
15550 -2 3 -13 -3 -5 11 3 9 -3 4 -6 -26 -12 -14 -5 2 -1 8 1 -9 -12 -9 23 -5 5 8 5 1 -12 42 32 13 38 32 19 42 44 30 29 24 26 24
15591 24 35 8 33 8 10 8 -19 13 -8 -14 0 5 -12 -9 -17 -5 -2 -16 -19 -18 -21 -20 6 12 -10 7 6 21 13 17 21 41 17 40 7 20 26 8
15629HMNK4j4JJ2oj3Oj8L6Pm1nk3J1J0J2j1nj1j4%M1l0nmJ7jj2mmOPJJ1Okj5M3
15669C0kk6J7Nj7J7j4pK1JQp%j7QPJ4ok0j1Pnj6J1J0j2j2jK7k9J0j5NNj0jK1q
15707a2j1K3qJ7k8jPJ5j0%K7oPlKjK5j6KJK3k0k0PJ0Qj7j6QpJ5j6j2jLJ6l1J0
15745a0jLKMrJ1l9J2K5j0Nj4J4j6OK5KLOj3J3PkJ0jmJ7k9Pj2ONk3J6K1qmk1Pj3
15785bJ4j1jk4K6j5JnJJ1j2K5k3jj1LLk1M4k4Nj2K9m%RrK4J0k1J9MkllJ4j3%j4
15824A1J1pj0j0M3pm0M0k4J1jQj5j4Jl2K1Ol2K5j3LPL2j9JnJ2j9kRJ6Kpk0NkM1
15862B6k0QLqPJ3j2RrjnmJ3j3LMj9K1k0plK0kk3J5k0Rj3K0jlk9J8pJ0j4K9j0j
15901a6K6l5L7k7J2J8k0J5%J2roL6k4j0K6%Kj0j6J3j8Ql%J0nj2Jj3kj2J8j2J8
$$ plain form
15629 8 12 17 41 27 28 40 34 21 27 9 45 52 11 6 -17 -6 4 16 5 0 -11 -25 -25 16 -14 -19 -23 -6 -7 -19 -23 -27 -21 -14 -13 -2 4 2 -13 30
15669 30 28 2 19 24 7 24 10 3 24 25 33 26 26 9 17 24 38 32 12 1 8 3 -13 -2 8 -4 -16 -17 10 -19 -9 -24 -19 -14 -24 -25 -4 -12
15707 -12 -23 0 -8 9 -19 -20 -13 2 -8 -8 19 13 20 17 19 18 43 27 29 30 53 33 13 20 30 38 21 5 13 6 21 5 -7 -8 -5 11 -20 -10
15745 -10 -11 -8 -6 -2 -11 0 -39 -27 -2 -12 -7 -21 -7 -23 -17 8 10 13 19 6 19 26 24 34 33 29 46 17 24 12 18 23 0 16 37 29 25 4 11 -2
15785 -2 12 1 0 -24 2 -13 -12 -17 -16 -5 -17 8 -15 -16 -27 -24 -21 -42 2 -22 -17 -29 0 -4 -4 5 -4 20 30 9 28 32 30 27 24 38 25 25 11
15824 11 22 15 5 -5 38 31 -9 31 7 18 17 25 10 -4 -3 -35 -14 -8 -40 -15 -28 -25 -18 14 -5 -4 -9 3 -16 -18 -9 7 9 2 -18 -13 -15 26
15862 26 6 14 17 9 16 29 17 26 17 16 11 7 20 7 10 14 -5 16 -4 -11 -14 6 4 -19 -4 -24 -15 -28 -8 -9 -12 -41 -23 -30 -20 -34 -5 -15 -16
15901 -16 10 -25 12 -15 -3 15 -5 10 10 22 13 7 43 19 9 35 35 37 27 11 24 6 14 11 11 21 16 4 5 -8 -10 -22 -4 -16 2
15936Bk5J9j6lLj5J9j0K5j8lK0Kj6K4%k1MJ9K1qjk3J4LL0pl5J1NPkjjRNl7kJ3
15975A1k4J7J0k1rJ1oLMoPKoj6rM0l4LQnMNJ7j7K5pK1l6K7Oj2MMk1K4j2%J3j3
16014A2J2lOj9Mpj7K6mj2rjJ2rrJ1mkj7K1j9qK3rK3Ql5Jj5J9MK0Lj0PK1%ojk1
16054dJ9J7j5J6j4j4O%MJ5j2j5QJ4l2KKJoqJ9pj4J9joj1L0k3mK3rm2K5Rj3J6n
16092a0LORqqK4mj9L4j7J4l%J1mk3K6j5jJ0K0ok0NNKk7mNk8nJ7j4RJnkK2l4J4
16132b0OJ6j3oK0j9pqJ1kK2j5K4k9K8J3rJ7j8Jj1J4l1K1kLK0l0J8pMj0K5kjj7
16168Fkml1NK5kqnk2J7k3kK1J3l0K0%J1j6K4K6l8J8L2ml5K3PLNk9nKL9m2L0j7
16205A2NOm1K9j7J5k4J2Oj7K4Pl0J0k3RkrK4k1Qjlj8J5j2K1j2J0J3k3L1J1k1K0
$$ plain form
15936 2 -23 -4 -20 -23 -20 -35 -16 -26 -1 -19 -22 -2 0 -16 8 8 -13 -9 10 31 23 22 -1 13 16 46 39 4 15 20 27 25 24 23 32 37 0 -2 11
15975 11 -13 4 14 -7 -16 -5 -11 -8 -4 -10 -3 -1 -7 -23 -32 8 -26 -23 -15 -20 -16 -11 6 -11 14 7 28 -8 19 25 13 17 21 0 24 12 12 25 12
16014 12 24 21 27 8 12 5 -12 14 10 -2 -11 -12 0 -9 -18 -7 -11 -13 -30 -9 -28 -36 -13 -22 1 9 -26 -25 -40 -21 -17 3 6 -4 3 24 24 18 17 -4
16054 -4 15 32 17 33 19 5 11 11 15 30 18 3 11 25 -7 -5 -3 -2 -8 -16 3 -4 -18 1 0 -6 -17 13 -10 -14 9 0 -42 -17 -8 -21 -5 -10
16092 -10 -7 -1 8 0 -8 16 12 -7 27 10 24 21 21 32 28 5 31 16 15 25 45 39 19 24 29 31 4 0 5 -23 -28 -11 -25 -16 -15 -20 -22 0 -34 -20
16132 -20 -14 2 -11 -17 3 -16 -23 -31 -20 -22 0 -15 9 -20 8 21 12 29 11 12 1 15 -16 5 3 6 26 -4 14 7 11 1 26 24 23 6
16168 6 4 0 -31 -26 -1 -3 -11 -16 -38 -21 -44 -46 -25 -12 -42 -22 -22 -11 -27 -3 23 -15 3 35 31 -4 19 26 29 34 5 0 2 41 -1 29 12
16205 12 17 23 -18 11 -6 9 -15 -3 3 -14 10 17 -13 -3 -26 -17 -19 -28 -4 -25 -17 -18 -21 -39 -24 -36 -15 -27 -17 -4 -27 4 15 -6 14
16240A4Lj5KQPNMj4LNPk2K3nlJ0j1Noj2J6k6n%pJj1J3j5J6qMNj0J6nj7j2K8QJ1
16281A0Nl3OjK0qrRQqJ2j1L4pj1J9j7JjOM%Kj0ml6L5k1%qJ5ll3L8j0kKnJ3j6q
16322b3rJ1%oL1j9J8K%J0%j3lPK0l0K5k1L1plJ2k1qjK0pRj0NnRj8Qk5J9j2%kj1
16362a7J8j8OKqOj2OmPj4nK7Lmj9K2j3J1RR
$$ plain form
16240 14 17 2 4 12 19 24 28 14 17 22 29 7 30 25 22 32 21 26 20 8 24 -2 -7 -7 -14 -13 -24 -11 -26 -10 -18 -14 -9 -19 -3 -8 -25 -37 -9 -1 10
16281 10 15 -18 -12 -13 7 -1 -10 -1 7 -1 11 0 34 27 16 35 18 19 18 24 28 28 30 20 16 -20 15 -6 -6 -14 1 -2 -35 3 -7 -9 -7 -12 1 -15 -23
16322 -23 -32 -21 -21 -27 4 -15 3 5 5 15 15 2 -1 6 26 -4 21 0 31 24 21 33 12 4 3 23 16 25 15 20 15 24 6 14 -11 8 -4 -4 -6 -17
16362 -17 1 -17 -11 -9 -17 -11 -23 -17 -21 -14 -28 -33 -6 -3 -7 -26 -4 -17 -6 3 12
$$ [...]
16383I
##END NTUPLES=NMR FID
##END=
