##TITLE=abcd
##JCAMPDX= 6.0         $$ Bruker NMR JCAMP-DX V2.0
##DATA TYPE= NMR SPECTRUM
##DATA CLASS= NTUPLES
##ORIGIN= UXNMR, Bruker Analytische Messtechnik GmbH
##OWNER= root
$$ XWIN-NMR		Version 3.5
$$ Wed Sep  3 17:55:31 2025 Russian Standard Time (UT+4h)  servis@DPX200
##.OBSERVE FREQUENCY= 200.131235884673
##.OBSERVE NUCLEUS= ^1H
##.ACQUISITION MODE= SIMULTANEOUS
##.ACQUISITION SCHEME= undefined
##.AVERAGES= 32
##.DIGITISER RES= 18
##SPECTROMETER/DATA SYSTEM= spect
##.PULSE SEQUENCE= zg
##.SOLVENT NAME= CDCl3
##.SHIFT REFERENCE= (INTERNAL, CDCl3, 0, 16.4885)
##AUDIT TRAIL= $$ (NUMBER, WHEN, WHO, WHERE, WHAT)
$$ ##TITLE= Audit trail, XWIN-NMR		Version 3.5
$$ ##JCAMPDX= 5.01
$$ ##ORIGIN= Bruker BioSpin GmbH
$$ ##OWNER= servis
$$ F:\spectra/data/av/nmr/H1/1/pdata/1/auditp.txt
$$ ##AUDIT TRAIL=  $$ (NUMBER, WHEN, WHO, WHERE, WHAT)
(   1,<2025-09-03 17:55:00.28 +0400>,<servis>,<DPX200>,
      <created by zg, POWCHK disabled, PULCHK disabled
       configuration hash MD5:
       00 E9 B6 7A A2 85 ED C7 34 08 36 98 17 FE 4E 26
       data hash MD5: 32K
       43 33 40 0C 6C D5 0F 29 49 B7 8E BF D7 F8 E9 C3>)
(   2,<2025-09-03 17:55:01.89 +0400>,<servis>,<DPX200>,
      <Start of raw data processing
       efp BC_mod = 2 LB = 0.05 FT_mod = 6 PKNL = 1 PHC0 = -261.8114 PHC1 = -12.69845 SI = 16K 
       data hash MD5: 16K
       73 78 B0 1F 59 CD 1F 63 D2 50 39 22 6B EE B7 CA>)
$$ ##END=
$$ 
$$ hash MD5
$$ A5 AA 89 C0 E5 9E BF B6 DC 6D 5C 71 E8 D2 84 08
##$RELAX= 
##$RELAX= 
##$RELAX= 
##$RELAX= 
##$RELAX= 
##$RELAX= 
##$RELAX= 
##$RELAX= 
$$ Bruker specific parameters
$$ --------------------------
##$DU= <F:\spectra>
##$EXPNO= 1
##$NAME= <H1>
##$PROCNO= 1
##$TYPE= <nmr>
##$USER= <av>
##$AMP= (0..31)
100 100 100 100 100 100 100 100 100 100 100 100 100 100 100 100 100 100 
100 100 100 100 100 100 100 100 100 100 100 100 100 100 
##$AQSEQ= 0
##$AQ_mod= 1
##$AUNM= <au_zg>
##$AUTOPOS= <>
##$BF1= 200.13
##$BF2= 200.13
##$BF3= 200.13
##$BF4= 200.13
##$BF5= 500.13
##$BF6= 500.13
##$BF7= 500.13
##$BF8= 500.13
##$BYTORDA= 1
##$CFDGTYP= 0
##$CFRGTYP= 5
##$CHEMSTR= <none>
##$CNST= (0..31)
1 1 145 1 1 1 1 1 1 1 1 1 1 1 1 1 1 1 1 1 1 1 1 1 1 1 1 1 1 1 1 1 
##$CPDPRG= <>
##$CPDPRG1= <>
##$CPDPRG2= <>
##$CPDPRG3= <>
##$CPDPRG4= <mlev>
##$CPDPRG5= <mlev>
##$CPDPRG6= <mlev>
##$CPDPRG7= <mlev>
##$CPDPRG8= <mlev>
##$CPDPRGB= <>
##$CPDPRGT= <>
##$D= (0..31)
0 2 0 0 0 0 0 0 0 0.06 0 0 0 0 0 0 0.0002 0 0 0 0 0 0 0 0 0 0 0 0 0 0 
0 
##$DATE= 1756907699
##$DBL= (0..7)
120 120 120 120 120 120 120 120 
##$DBP= (0..7)
150 150 150 150 150 150 150 150 
##$DBP07= 0
##$DBPNAM0= <>
##$DBPNAM1= <>
##$DBPNAM2= <>
##$DBPNAM3= <>
##$DBPNAM4= <>
##$DBPNAM5= <>
##$DBPNAM6= <>
##$DBPNAM7= <>
##$DBPOAL= (0..7)
0.5 0.5 0.5 0.5 0.5 0.5 0.5 0.5 
##$DBPOFFS= (0..7)
0 0 0 0 0 0 0 0 
##$DE= 6
##$DECBNUC= <off>
##$DECIM= 32
##$DECNUC= <off>
##$DECSTAT= 4
##$DIGMOD= 1
##$DIGTYP= 9
##$DL= (0..7)
0 120 120 120 120 120 120 120 
##$DP= (0..7)
150 150 150 150 150 150 150 150 
##$DP07= 0
$$ [...]
##$SUBNAM4= <"">
##$SUBNAM5= <"">
##$SUBNAM6= <"">
##$SUBNAM7= <"">
##$SUBNAM8= <"">
##$SUBNAM9= <"">
##$SW= 20.6817932712277
##$SWIBOX= (0..15)
0 0 3 0 0 0 0 0 0 0 0 0 0 0 0 0 
##$SW_h= 4139.07284768212
##$TD= 32768
##$TD0= 1
##$TE= 0
##$TE2= 300
##$TE3= 300
##$TEG= 300
##$TL= (0..7)
0 120 120 120 120 120 120 120 
##$TP= (0..7)
150 150 150 150 150 150 150 150 
##$TP07= 0
##$TPNAME0= <>
##$TPNAME1= <>
##$TPNAME2= <>
##$TPNAME3= <>
##$TPNAME4= <>
##$TPNAME5= <>
##$TPNAME6= <>
##$TPNAME7= <>
##$TPOAL= (0..7)
0.5 0.5 0.5 0.5 0.5 0.5 0.5 0.5 
##$TPOFFS= (0..7)
0 0 0 0 0 0 0 0 
##$TUNHIN= 0
##$TUNHOUT= 0
##$TUNXOUT= 0
##$USERA1= <user>
##$USERA2= <user>
##$USERA3= <user>
##$USERA4= <user>
##$USERA5= <user>
##$V9= 5
##$VALIST= <valist>
##$VCLIST= <CCCCCCCCCCCCCCC>
##$VD= 0
##$VDLIST= <DDDDDDDDDDDDDDD>
##$VPLIST= <PPPPPPPPPPPPPPP>
##$VTLIST= <TTTTTTTTTTTTTTT>
##$WBST= 1024
##$WBSW= 30
##$XGAIN= (0..3)
0 0 0 0 
##$XL= 0
##$YL= 0
##$YMAX_a= 209228
##$YMIN_a= -176481
##$ZGOPTNS= <>
##$ZL1= 120
##$ZL2= 120
##$ZL3= 120
##$ZL4= 120
##$ABSF1= 0
##$ABSF2= 0
##$ABSG= 0
##$ABSL= 0
##$ALPHA= 0
##$AQORDER= 0
##$ASSFAC= 0
##$ASSFACI= 0
##$ASSFACX= 0
##$ASSWID= 0
##$AUNMP= <proc_1d>
##$AZFE= 0.1
##$AZFW= 0.1
##$BCFW= 0
##$BC_mod= 2
##$BYTORDP= 0
##$COROFFS= 0
##$CY= 18.4799938201904
##$DATMOD= 1
##$DC= 0
##$DFILT= <>
##$DTYPP= 0
##$F1P= 9.9274215381318
##$F2P= -0.165520771350173
##$FCOR= 1
##$FTSIZE= 16384
##$FT_mod= 6
##$GAMMA= 0
##$GB= 0
##$INTBC= 1
##$INTSCL= 4.127829e-11
##$ISEN= 128
##$LB= 0.05
##$LEV0= 0
##$LPBIN= 0
##$MAXI= 10000
##$MC2= 0
##$MEAN= 0
##$ME_mod= 0
##$MI= 50
##$NCOEF= 0
##$NC_proc= -8
##$NLEV= 6
##$NOISF1= 3.799351
##$NOISF2= 2.8
##$NSP= 0
##$NTH_PI= 0
##$NZP= 0
##$OFFSET= 16.48848
##$PC= 4
##$PHC0= -261.8114
##$PHC1= -12.69845
##$PH_mod= 1
##$PKNL= yes
##$PPARMOD= 0
##$PSCAL= 4
##$PSIGN= 0
##$REVERSE= no
##$SF= 200.130005582386
##$SI= 16384
##$SIGF1= 3
##$SIGF2= 2
##$SINO= 400
##$SIOLD= 16384
##$SREGLST= <1H.CDCl3>
##$SSB= 0
##$STSI= 16384
##$STSR= 0
##$SW_p= 4139.07284768211
##$SYMM= 0
##$S_DEV= 0
##$TDeff= 32768
##$TDoff= 0
##$TI= <>
##$TILT= no
##$TM1= 0
##$TM2= 0
##$TOPLEV= 0
##$USERP1= <user>
##$USERP2= <user>
##$USERP3= <user>
##$USERP4= <user>
##$USERP5= <user>
##$WDW= 1
##$XDIM= 16384
##$YMAX_p= 291595570
##$YMIN_p= -5573010
$$ End of Bruker specific parameters
$$ ---------------------------------
##NTUPLES= NMR SPECTRUM
##VAR_NAME=  FREQUENCY,     SPECTRUM/REAL,   SPECTRUM/IMAG
##SYMBOL=    X,             R,               I
##VAR_TYPE=  INDEPENDENT,   DEPENDENT,       DEPENDENT
##VAR_FORM=  AFFN,          ASDF,            ASDF
##VAR_DIM=   16384,         16384,           16384
##UNITS=     HZ,            ARBITRARY UNITS, ARBITRARY UNITS
##FACTOR=    0.252644378177508, 1,           1
##FIRST=     3299.83951724647, 0,            0
##LAST=      -839.233330435636, 0,           0
##MIN=       -839.233330435636, -5573010,    0
##MAX=       3299.83951724647, 291595570,    0
$$ Real data points
##PAGE= N=1
##DATA TABLE= (X++(R..R)), XYDATA
$$ [...]
5756I358260m82095J99486l86186O99941n24624M17593J6748j80113q37058Q61738
5746I143690n8013L20977q46508J186486q1402l90070N78485k04226L66967K04029
5736A0220415k40856l28416p3032j30271P21716j87786P60268j407941J240656
5727A0574753l12995L71549p6480J27350j182753R25522j51787P3253l0517L21243
5717A0639138k05121N10978N40472m8690q45474P6282J80889N83174P5622L55293
5707A1862563r9995o16355J1886P77848J29602n07930n05399J207496q27720L91485
5697A1823481R57118l71566L09994L4489L58964l23484j95538R70652n39434j44042
5687A2880634P23414J73130O64580K43079J54974j68495l0350m31204J6321M18524
$$ plain form
5756 9358260 8876165 9075651 8689465 9389406 8864782 9282375 9299123 9119010 8281952 9143690
5746 9143690 9085677 9406654 8560146 9746632 9665230 9275160 9853645 9649419 10016386 10220415
5736 10220415 9979559 9651143 9578111 9447840 10169556 9981770 10742038 9334097 10574753
5727 10574753 10261758 10633307 10556827 10684177 9501424 10426946 10275159 10348412 10317895 10639138
5717 10639138 10434017 10944995 11485467 11436777 10591303 10667585 10848474 11431648 11507270 11862563
5707 11862563 11762568 11146213 11158099 11935947 12065549 11557619 11052220 12259716 11431996 11823481
5697 11823481 12780599 12409033 12719027 12753516 13112480 12788996 12593458 13564110 13024676 12880634
5687 12880634 13604048 13777178 14441758 14684837 14839811 14671316 14640966 14209762 14226083 14644607
5677A4644607J23296n46227L25622J81357k18575n2823o03856Q60128j197467
5668A3516062R14567l47568l28065m09433O62967K99780j725106J317751k14949
5659A3686006n55605N80297q04704L26417q29893R24911J68937m93930j19518
5650A2882918M10452q12689N50209j28090P630m97095N68861m85835K50775k28453
5640A2518683m25377N03477l41509j91808Q75449n63234O35443m81889j95763
5631A2333472M09314K93848n23842L41733r41307P67730p976M0159o57834J178625
5621A3233922j405886O52591K36027j102392J034879L83035n31884K28395N33718
5612A3262405q3886j078080O77164m5604N15993p58220P0739m30690J237468q08649
$$ plain form
5677 14644607 14767903 14221676 14547298 14728655 14510080 14457257 13853401 14713529 13516062
5668 13516062 14430629 14083061 13754996 13345563 14008530 14308310 12583204 13900955 13686006
5659 13686006 13130401 13710698 12905994 13232411 12402518 13327429 13496366 13002436 12882918
5650 12882918 13293370 12480681 13030890 12902800 12910430 12413335 12982196 12496361 12747136 12518683
5640 12518683 12093306 12596783 12255274 12063466 12938915 12375681 13011124 12529235 12333472
5631 12333472 12742786 13036634 12512792 12854525 11913218 12680948 12672972 12713131 12055297 13233922
5621 13233922 11828036 12480627 12716654 11614262 12649141 13032176 12500292 12728687 13262405
5612 13262405 13178519 12100439 12777603 12731999 13247992 12489772 12560511 12129821 13367289 12558640
5602A2558640N07290J45916k65125K57551p98362J278995J76076n36315p24052
5593A2600614L13923Q30061j3753n16595J7049J20286P9286L10819j186544J088891
5583A3644037n6028J86954k42870J57479Q10950j232039Q57228p88447L94505
5574A3731769J63600Q3981K75619o05253l19198M57433j13989K89322N18065n66014
5564A3915335K6555n8038Q4203L37177r03293P47379P42993L06156p01637m13994
5554A4082836R37700n94336J7816N48474O8053M49938o51175j220422J166305
5545A4805189j31218J252360j39615q84769O92931r33956N69962o16986k70956
5536A4342942J371324r88532O95850j34166n44071r6403Q11358r34978N21273
$$ plain form
5602 12558640 13065930 13211846 12946721 13204272 12405910 13684905 13860981 13324666 12600614
5593 12600614 12914537 13744598 13730845 13214250 13231299 13351585 13430871 13741690 12555146 13644037
5583 13644037 13588009 13774963 13532093 13689572 14500522 13268483 14125711 13337264 13731769
5574 13731769 13895369 13979350 14254969 13649716 13330518 13787951 13673962 13963284 14481349 13915335
5564 13915335 13941890 13883852 13968055 14305232 13401939 14149318 14892311 15198467 14496830 14082836
5554 14082836 15020536 14426200 14444016 14992490 15060543 15510481 14859306 13638884 14805189
5545 14805189 14673971 15926331 15786716 14901947 15594878 14660922 15230884 14613898 14342942
5536 14342942 15714266 14725734 15421584 15287418 14743347 14646944 15458302 14523324 15044597
5527A5044597O08367j62357N12986N39130l11812m17294P6655n86135P76246k91634
5517A5788749k577J36026k97310J22610O094m33048J48791O39346k82549R64892
5507A6791024j411344J546860q15673P75890M47932k95978o86708n31373Q20403
5498A6641033j68125K27723o09714O14994M29302K88855m40158K64115m64906
5489A6783119Q03292j178607L69349J62732L72206Q0184o38169L44299o82176
5480A6416229Q65421J63845o05302K60659O32583j06782m5843l23568m27492Q86542
5470A7716292o56037R97816p17073N82447p80701K60212M95862j36630p4072m74156
5460A7213960m484O29594L48032k710j19016k84671J56430m47713M77376R05822
$$ plain form
5527 15044597 15652964 15490607 16003593 16542723 16230911 15813617 15890272 15304137 16080383 15788749
5517 15788749 15786172 15922198 15624888 15747498 15753592 15320544 15469335 16108681 15826132 16791024
5507 16791024 15379680 16926540 16110867 16886757 17334689 17038711 16352003 15820630 16641033
5498 16641033 16472908 16700631 16090917 16705911 17135213 17424068 16983910 17248025 16783119
5489 16783119 17586411 16407804 16777153 16939885 17312091 17392275 16754106 17098405 16416229
5480 16416229 17281650 17445495 16840193 17100852 17733435 17626653 17580810 17257242 16829750 17716292
5470 17716292 17060255 18058071 17340998 17923445 17142744 17402956 17898818 17762188 17688116 17213960
5460 17213960 17209476 17839070 18187102 18184392 18065376 17780705 17937135 17489422 17966798 18872620
5450A8872620j90992o48877J21550m04747J24027L81311n95745K52946P57537
5441A8669630l52058J35352n60773O32313l28857o98722M46128M29933L41045
5432A8713991K39507j5090n60507L5486K51405M82960j55186J1605l23372M82084
5422A9162883J09113O7247p93940N90704N83137j395731M16941j11581L33526
5413A8962299n65680K78131O93434j14560m13411l97348J96330J208192m88930
5404A9358457l79032j63516Q78009N11050n53754q30882L46937j50922N28434
5395A9544781L7336Q405J75660P707l3909j23025k44561J42770n1323P41913n77175
5384A9628579j82366L62060m58491K22402J46866M21337J51217j56734m02885
$$ plain form
5450 18872620 18681628 18032751 18154301 17749554 17873581 18254892 17659147 17912093 18669630
5441 18669630 18317572 18452924 17892151 18524464 18195607 17496885 17943013 18372946 18713991
5432 18713991 18953498 18938408 18377901 18413387 18664792 19147752 18992566 19004171 18680799 19162883
5422 19162883 19271996 19339243 18545303 19136007 19719144 18323413 18740354 18628773 18962299
5413 18962299 18396619 18674750 19368184 19253624 18840213 18442865 18639195 19847387 19358457
5404 19358457 18979425 18815909 19693918 20204968 19651214 18820332 19167269 19016347 19544781
5395 19544781 19582117 19590522 19766182 19773889 19739980 19616955 19372394 19515164 19463841 20205754 19628579
5384 19628579 19446213 19808273 19349782 19572184 19719050 20140387 20291604 20134870 19731985
5375A9731985j4627L0867N93585j070302N58316Q90010l41164l66141j06424n6564
5365A9849541o98028O54915Q36691p42197r4892J88867K72828L12310M65605o90790
5355B0354850q41004M44919Q25489j243845K19372L17662K7515L4078K15253O36527
5345B0990816j031355L18931O74478q68076J396754q94301J78804q68312J279230
5336B1176969p54388j57241Q72421p84678j49062j82474Q68867n75647N95113
5327B0909880q88833L63893P35480l94753p84182R27704M17817q36559J31146
5318B0581593j29941j61490L61063p4640n4158k44899N48725l28269p753k24611
5308B0265620Q54369p66924N3353n15647J50721P5355O65700j34490L94907j103178
$$ plain form
5375 19731985 19717358 19748225 20341810 19271508 19829824 20719834 20378670 20012529 19906105 19849541
5365 19849541 19151513 19806428 20643119 19900922 19806030 19994897 20267725 20580035 21045640 20354850
5355 20354850 19513846 19958765 20784254 19540409 19759781 20077443 20104958 20139036 20354289 20990816
5345 20990816 19959461 20278392 20952870 20084794 21481548 20587247 20766051 19897739 21176969
5336 21176969 20422581 20265340 21137761 20353083 20204021 20021547 20890414 20314767 20909880
5327 20909880 20021047 20384940 21120420 20725667 19941485 20869189 21287006 20450447 20581593
5318 20581593 20451652 20290162 20651225 20576585 20522427 20277528 20826253 20497984 20490231 20265620
5308 20265620 21119989 20353065 20406418 19890771 20041492 20116847 20782547 20648057 21042964 19939786
5298A9939786N62992L27642M9768j50248J55153p08741O1823K62447L67008m92633
5288B0374997j4362O18027k57198k9624P1704j57662K93008P3215J50492j15818
5278B1006779j8508p422l43893P0403J9725j23580L31181k00258J27823K84234
5268B1146484k07645p27782J013722o04459L11518R58815n31854K11067j477419
5259B0092447L36961k1038N101J078165p73918J109927m42238n22928J62845K64656
5249B1289980r09563J234954q64832P13440j44414N7603n08849N10807O61982
5240B2041108m38097K54259k5761j104431J89162N57243n4320k4984m75907L59043
5230B1277315N10625J0475K93576J03459j076015Q25626q08888Q64262o12481
$$ plain form
5298 19939786 20502778 20830420 20880188 20729940 20885093 20176352 20238175 20500622 20867630 20374997
5288 20374997 20360635 20978662 20721464 20691840 20763544 20605882 20898890 20972105 21122597 21006779
5278 21006779 20988271 20980849 20636956 20707359 20727084 20603504 20934685 20734427 20862250 21146484
5268 21146484 20938839 20211057 21224779 20620320 20931838 21890653 21358799 21569866 20092447
5259 20092447 20429408 20408370 20413471 21491636 20717718 21827645 21385407 20862479 21025324 21289980
5249 21289980 20380417 21615371 20750539 21463979 21319565 21377168 20868319 21379126 22041108
5240 22041108 21603011 21857270 21831509 20727078 20916240 21473483 21419163 21394179 20918272 21277315
5230 21277315 21787940 21798415 22091991 22195450 21119435 21945061 21136173 22000435 21387954
5221B1387954N13472k89885L84630j04858Q55234o87829o38467P48157M70333
5212B2638741m58705m13603K76202r6474L01489j2139j39205L08439k09038M91485
5202B2687192l74610L35340o19156J163828j39903m56355M65044o6478m8246k93903
5192B2652753O13381N6901J0680O29728k67909o26064J066015n75173O66484K58691
5182B4485487o10483J264429m05412r70007J337108n93236K97372o2947J28800
5173B4871111L81909J29155q3282j70153J28052M0970K95300j40784R97933m03392
5163B6046819L57305l7213l10830M70700M39621o34468R13740n57631l872R99211
5153B7683382J78103K40062r1518n20020K66467O46728l42196N06262K50386M8615
$$ plain form
5221 21387954 21901426 21611541 21996171 21891313 22746547 22058718 21420251 22168408 22638741
5212 22638741 22180036 21766433 22042635 21946161 22247650 22235511 22096306 22404745 22195707 22687192
5202 22687192 22312582 22647922 22028766 23192594 23052691 22596336 23061380 22994902 22946656 22652753
5192 22652753 23266134 23323035 23333715 23963443 23695534 23069470 24135485 23560312 24226796 24485487
5182 24485487 23875004 25139433 24734021 23764014 25101122 24507886 24805258 24742311 24871111
5173 24871111 25253020 25382175 25298893 25128740 25256792 25297762 25593062 25452278 26450211 26046819
5163 26046819 26404124 26366911 26056081 26526781 26966402 26331934 27245674 26688043 26684171 27683382
5153 27683382 27861485 28101547 28010029 27490009 27756476 28403204 28061008 28567270 28817656 28866271
5143B8866271m70220Q48300k81134J54033N66924p54060K20877J95261Q18527
5134C0164779m6869Q3407p4671L52645K48711L93575k89820R29205m74154J187995
5124C2474803J10944j565301M25007O54247K05489m65354K07934J172676P3866
5115C3294311j442989R96871J04528J96164Q09612m06648m43307K52741J32392
5106C3493675l90992P50591j36076j3002O14997m79130O56723O816N6719N25660
5096C5085981j51334L97397o62483O43261j86174k80114R3042N51580K42383M45757
5086C6179296q40263l75417O96483q740l10444P11071o55865L20490j46239K08232
5076C5778604n79987O29530n07853K0288L22249k67739J12654N5631Q3982l2490
$$ plain form
5143 28866271 28396051 29244351 28963217 29117250 29684174 28930114 29150991 29346252 30164779
5134 30164779 30117910 30201317 30126646 30479291 30728002 31121577 30831757 31760962 31286808 32474803
5124 32474803 32585747 31020446 31445453 32099700 32305189 31839835 32047769 33220445 33294311
5115 33294311 31851322 32848193 32952721 33148885 33958497 33551849 33108542 33361283 33493675
5106 33493675 33102683 33853274 33717198 33704196 34319193 33840063 34496786 34503602 34560321 35085981
5096 35085981 34934647 35332044 34669561 35312822 35126648 34846534 34939576 35491156 35733539 36179296
5086 36179296 35339033 34963616 35660099 35651359 35340915 36051986 35396121 35716611 35570372 35778604
5076 35778604 35198617 35828147 35320294 35340582 35662831 35395092 35507746 35563377 35647359 35614869
5066C5614869J44923k71108l20694p67250R19471L35235r29521n9050Q03625l92999
5056C5077501n27344O06895j05760l55197J12962k11752k24435M39572m08169
5047C4404273k56112l23047N53809j081412J95718L21511n16323n0135K23067
5038C3471349p67465k51681J47112n2386q54965k06715O64295j63634k58591L74605
5028C2101924q92023m21011k27359J00562J32557j110387J168045p95805l03399
5019B9753104P5190m08503j19427p61058L09100o09543L05259p91739N05743k28845
5009B8029281M48903k39683r95627m72620j4878P93806j018265k84429j107192
5000B5139296N71484k10236r2530k83989m07175O25291m37722n13143l29254J8069
$$ plain form
5066 35614869 35759792 35488684 35167990 34400740 35320211 35655446 34725925 34666875 35470500 35077501
5056 35077501 34550157 35157052 35051292 34696095 34809057 34597305 34372870 34812442 34404273
5047 34404273 34148161 33825114 34378923 33297511 33493229 33814740 33298417 33248282 33471349
5038 33471349 32703884 32452203 32599315 32546929 31691964 31485249 32149544 31985910 31727319 32101924
5028 32101924 31209901 30788890 30561531 30662093 30794650 29684263 30852308 30056503 29753104
5019 29753104 29828294 29419791 29300364 28539306 28848406 28238863 28544122 27752383 28258126 28029281
5009 28029281 28478184 28238501 27242874 26770254 26755376 27549182 26530917 26246488 25139296
5000 25139296 25710780 25500544 25408014 25124025 24716850 25342141 24904419 24391276 24062022 24080091
4990B4080091J9688m88885n4756L48701j237017M47525n89983q8439P00296r85692
4980B2151529J86322K10020r03989m9947K5050j164295Q92730Q53909l19623j071772
4970B0809934M55423p39834Q00985r14243P18935j077764O82899p74613L39363
4961B0301085k71327j18339L95329M07151l1107m44938l93139K46047J23064k02611
4951B0011215P5731n99038M73032J47520M20360o17883J14760l16571R90325j94324
4941B0505127K00213k7733n37076J093291L68673k58610L01458J38209Q1511O02092
4931B2467155L47815k90023P769m00490R05102j23874L92396q87754n0808Q28836
4921B3196124j51406K79219N73172j261184O93000J067438M4884N84090Q35379
$$ plain form
4990 24080091 24099779 23610894 23556138 23904839 22667822 23115347 22525364 22436925 23137221 22151529
4980 22151529 22337851 22547871 21643882 21593935 21618985 20454690 21347420 22201329 21881706 20809934
4970 20809934 21265357 20525523 21326508 20412265 21131200 20053436 20736335 19961722 20301085
4961 20301085 20029758 19911419 20306748 20713899 20682792 20237854 19844715 20090762 20213826 20011215
4951 20011215 20086946 19487908 19960940 20108460 20528820 19910937 20025697 19709126 20699451 20505127
4941 20505127 20705340 20677607 20140531 21233822 21602495 21343885 21645343 21783552 21865063 22467155
4931 22467155 22814970 22524947 22532716 22132226 23037328 22913454 23305850 22418096 22367288 23196124
4921 23196124 23044718 23323937 23897109 22635925 23328925 24396363 24441247 25025337 25860716
4912B5860716j50886J49978J795427P3554P75493N75009P56198R4405J79993J526198
4902C1636085O47628R37781J76113J276364j59960K03214j59459p14318J69388
4893C4012836p517J57294p385o19082J098374j76906J182741j046705O69942P65736
4883C6029328J674840Q01345P02061J078177J502352K125751J959608J129829
4875D7003291Q82317K364538J994375J992778K572546J729261K211314J935509
4867F2685929L249356K759824N076800M979760N399783N723634O233388N641938
4859A01750412L568461K026827r18635k023384k352632m601826j986665m900975
4851I0561583m762679m847854l824363k411925k785384j749825p94380K18906
$$ plain form
4912 25860716 25709830 25859808 27655235 27728789 28504282 29079291 29835489 29929894 30109887 31636085
4902 31636085 32283713 33221494 33397607 34673971 34514011 34717225 34557766 33843448 34012836
4893 34012836 34005319 34162613 34155228 33536146 34634520 34457614 35640355 34593650 35263592 36029328
4883 36029328 37704168 38505513 39207574 40285751 41788103 43913854 45873462 47003291
4875 47003291 47885608 50250146 52244521 54237299 56809845 58539106 60750420 62685929
4867 62685929 65935285 68695109 73771909 78751669 84151452 89875086 96108474 101750412
4859 101750412 105318873 107345700 106427065 104403681 102051049 97449223 95462558 90561583
4851 90561583 85798904 80951050 77126687 74714762 71929378 70179553 69385173 69604079
4843F9604079P62069O62631K236369K570233L269413L367546M614235N062321
4835I2148896M799844L592221K198389p98945k575968m319678m797979l621086
4827H6625694n993388n119499o316605o845914n429178m830330n233971j999038
4819D4857771l564238k859443j708674j914732j974131j543748k151144n10691
4811B8630970j687810j266276o71933l92384k321174J02165l49006r94138n5516
4802B0994898r83084k79993k07698j238109L23761Q2189j151891m56769q20133
4793A6263171R30150o56241l40401k4551q92190J14364l54773J98110q37823j81155
4783A4218661o13108O08076m18208O125k02864L29510j31922o60623M3741l58568
$$ plain form
4843 69604079 70366148 71028779 73265148 75835381 79104794 82472340 87086575 92148896
4835 92148896 96948740 100540961 102739350 101940405 99364437 95044759 90246780 86625694
4827 86625694 80632306 75512807 69196202 62350288 56921110 52090780 46856809 44857771
4819 44857771 41293533 38434090 36725416 34810684 32836553 31292805 29141661 28630970
4811 28630970 26943160 25676884 25004951 24612567 22291393 22393558 22044552 21050414 20994898
4802 20994898 20011814 19731821 19524123 18286014 18609775 18691964 17540073 17083304 16263171
4793 16263171 17193321 16537080 16196679 16172128 15279938 15394302 15039529 15237639 14399816 14218661
4783 14218661 13605553 14213629 13795421 13801546 13598682 13928192 13796270 13135647 13179388 12820820
4773A2820820L50443J7371q54419o88121M7881L99919L51787p94816N36079k13521
4763A1973423L1784O18579r07465n9147n16275P4113M42412l61030q25227K9306
4753A0500473P00673r3095M87365p81663M29241j210322N99704N45511m54275
4744A0723612j24707J82022K32087r17333O11308m1782N36999o46415K24417n85929
4734A0194279J102378j061300j061041J049890O3610q0596m77806l90192J63532
4725I502754R1075J19303J53868q85547P76099l92504k13266p40705L01958j40175
4715H572860K48312N87629j504854N63047L02509k16684j60510K56957m71041
4706H178225k00558L16149k90561l53172l2973p320O6801o10561J058615q69074
$$ plain form
4773 12820820 13171263 13188634 12334215 11646094 11693975 12093894 12445681 11650865 12186944 11973423
4763 11973423 12005207 12623786 11716321 11657174 11140899 11215012 11657424 11296394 10471167 10500473
4753 10500473 11201146 11108051 11595416 10813753 11242994 10032672 10632376 11177887 10723612
4744 10723612 10598905 10780927 11013014 10095681 10706989 10665207 11202206 10555791 10780208 10194279
4734 10194279 11296657 10235357 9174316 10224206 10287816 10207220 9729414 9339222 9502754
4725 9502754 9593829 9713132 9867000 8981453 9757552 9365048 9151782 8411077 8713035 8572860
4715 8572860 8821172 9408801 7903947 8466994 8769503 8552819 8392309 8649266 8178225
4706 8178225 7977667 8293816 8003255 7650083 7617110 7609790 7676591 7066030 8124645 7255571
4696G255571O05267o14825L6095K82043n29481M05488n09808N29424m66484r9149
4686F894141L50098K96092o20360k90586J09409k37612L61352o25550N91296O548
4676F834828J69850n86728N38254l65695n24015L32339j96453l12570J72204k2832
4666F039182O90304k04687q29429O97560l84707Q0082j32652K63909j108974P50425
4656E861013n62184L92735M49154m13206N96823r20286j40415K62480l10181Q26028
4646F041961j214730R23779j151210N26944L11822J38144m99473N87512k95635
4637E369114O16649j269677J53951M42800j144412O14337o22362J098867o64346
4628D594921k18564Q10155p70725J16839m39118K35319k09587P5387K33623J23902
$$ plain form
4696 7255571 7860838 7246013 7282108 7564151 7034670 7440158 6930350 7459774 6993290 6894141
4686 6894141 7244239 7540331 6919971 6629385 6738794 6501182 6862534 6236984 6828280 6834828
4676 6834828 7004678 6417950 6956204 6590509 6066494 6398833 6202380 5889810 6062014 6039182
4666 6039182 6729486 6524799 5695370 6392930 6008223 6088305 5955653 6219562 5110588 5861013
4656 5861013 5298829 5691564 6140718 5727512 6324335 5404049 5263634 5526114 5215933 6041961
4646 6041961 4827231 5751010 4599800 5126744 5438566 5576710 5077237 5664749 5369114
4637 5369114 5985763 4716086 4870037 5312837 4168425 4782762 4160400 5259267 4594921
4628 4594921 4376357 5186512 4415787 4532626 4093508 4328827 4119240 4194627 4428250 4552152
4618D552152K85254m93042L78698k50446j285425P72457l90917J88895k9003M33086
4608D161709L36589n9881n81168M26670J61253o70668N14874p55974J28089j62288
4598C499205L61184l69107J29644K57162j79568M1737K32638n9835N45172j99463
4588D258769n12605k1733k18172N58027n2957l59176j32342J295493j087900R39114
4578D666518q88511L54502n44346O8560k28250l68082P99626p2496n32702Q70614
4568D125433l03205n10260J234097p41352L86830m84414J180754q93247q8264
4559C906372r92016J550642j99127r79443O4382M42695M17898o46587P42913n08516
4549C799213o3901q50131J004614M05448r79023K88862o975o14473Q21956j95805
$$ plain form
4618 4552152 4837406 4344364 4723062 4472616 3187191 3959648 3568731 3757626 3728623 4161709
4608 4161709 4498298 4438417 3857249 4283919 4445172 3774504 4289378 3533404 3661493 3499205
4598 3499205 3860389 3491282 3620926 3878088 3698520 3740257 3972895 3913060 4458232 4258769
4588 4258769 3746164 3724431 3506259 4064286 4011329 3652153 3519811 4815304 3727404 4666518
4578 4666518 3778007 4132509 3588163 3656723 3428473 3060391 3860017 3787521 3254819 4125433
4568 4125433 3822228 3311968 4546065 3804713 4191543 3707129 4887883 3994636 3906372
4559 3906372 2914356 4464998 4265871 3286428 3350810 3793505 4211403 3564816 4307729 3799213
4549 3799213 3735312 2885181 3889795 4295243 3316220 3605082 3598107 2983634 3805590 3609785
4539C609785N65143n51760k84272m36369O11443L24486n63738P53871l55830j7565
4529C655194o78595J103987N3048p66725Q8127M5658m5389J47666q86986M69240
4519C185225M60034k23407J2021k95234J93518o0556l39847j19793O04395J095099
4509D511455j363635L75207j87685k36565J22896M46351k25790r2319l46713n91034
4499B412168Q19757O09672Q0257j222880N75881N48129q04840Q20010o21544O76329
4489C892939j494338P45319K31758M36273l66840j39537p0850O9286k42526O43854
4479C705338j156161J152371p88466J569819l19214q58732L77395K69270j31545
4470C820075j24620j83564O73814m68280K28746P6522K64375K67119j87654K72744
$$ plain form
4539 3609785 4174928 3623168 3338896 2902527 3513970 3838456 3274718 4028589 3672759 3655194
4529 3655194 2976599 4080586 4133634 3366909 3455036 3500694 3455305 3602971 2715985 3185225
4519 3185225 3645259 3421852 3433873 3138639 3332157 3271601 2931754 2811961 3416356 4511455
4509 4511455 3147820 3523027 3335342 3098777 3221673 3668024 3442234 3349915 3003202 2412168
4499 2412168 3231925 3841597 3921854 2698974 3274855 3822984 3018144 3838154 3216610 3892939
4489 3892939 2398601 3143920 3375678 3811951 3445111 3305574 3234724 3304010 3061484 3705338
4479 3705338 2549177 3701548 2913082 4482901 4163687 3304955 3682350 3951620 3820075
4470 3820075 3695455 3511891 4185705 3717425 3946171 4022693 4287068 4554187 4366533 4639277
4460D639277l22124m49288M68544k81617J15493M07555J60725J72746k12830n38203
4450D160278N79532j51402O9185l12377M61544p1418j58517K79826M18578P89344
4440F064573p54925j2896m93750O68213K64613o37716L79212m28840K51585L40385
4430E640454l00678l96801p46045M93178Q21367o677o67409k62383m14739M18996
4420D579263M82267R8443l73214P5359P69301q14226Q60559j65084L68503p93906
4410E087265l70073J07842Q5176J30043m62890P46517q03121m8537k01461Q66677
4400E137438k04054m39321J09958o12961J005342p44941J05984K80233o47067
4391C990611p0111J370690l40566r29781m75933J132093l92164R8423L10182n39440
$$ plain form
4460 4639277 4317153 3867865 4336409 4054792 4170285 4577840 4738565 4911311 4698481 4160278
4450 4160278 4739810 4588408 4657593 4345216 4806760 4735342 4576825 4856651 5275229 6064573
4440 6064573 5309648 5296752 4803002 5471215 5735828 5098112 5477324 5048484 5300069 5640454
4430 5640454 5339776 4942975 4196930 4690108 5511475 5504798 4837389 4575006 4160267 4579263
4420 4579263 5061530 5159973 4786759 4862118 5631419 4817193 5677752 5512668 5881171 5087265
4410 5087265 4717192 4825034 4910210 5040253 4577363 5323880 4520759 4472222 4270761 5137438
4400 5137438 4933384 4494063 4604021 3991060 4996402 4251461 4357445 4637678 3990611
4391 3990611 3920500 5291190 4950624 4020843 3544910 4677003 4284839 4383262 4693444 4154004
4381D154004m52963k63741J212601p53958L37036P5938J97076p93368J128380
4372D841005k96169M00711m12687l34039M08628m3401j064524J076736j044017
4363C532243P42635k28334n58638K73480L26110j033734R29217j01110N9569k1769
4353C919669j21729q0377l0081K42001N3939k53973L12071Q1631k77136J338118
4343E184133q41254O9705j20835m1386l91774O87124l91937K48522p11904N42267
4333D232661j97303J39912k11358q8412J07567m89164O52147k24675K38181k54365
4323C905191R1004p79920L86426P43065k02506m32922J018631n4928o95005K94661
4313D273697M21441q20323O665K58709k14095J39306j85635k33651k43882q1825
$$ plain form
4381 4154004 3701041 3437300 4649901 3895943 4232979 4308917 4505993 3712625 4841005
4372 4841005 4544836 4945547 4532860 4198821 4607449 4564048 3499524 4576260 3532243
4363 3532243 4274878 4046544 3487906 3761386 4087496 3053762 3982979 3881869 3941438 3919669
4353 3919669 3797940 3717563 3687482 3929483 3983422 3729449 4041520 4123151 3846015 5184133
4343 5184133 4342879 4412584 4291749 4250363 3858589 4545713 4153776 4402298 3690394 4232661
4333 4232661 4035358 4175270 3963912 3875500 3983067 3493903 4146050 3921375 4159556 3905191
4323 3905191 3996195 3216275 3602701 4345766 4143260 3710338 4728969 4674041 3979036 4273697
4313 4273697 4695138 3874815 3881480 4140189 3926094 4065400 3879765 3646114 3402232 3320407
4303C320407R07638l80176j29530r1877j60293Q94416n58060O25173J19803p45263
4293C802238L424j274048J492348m45943k66895R82083p60459R80051l12447o37970
4283C562382K08249m99186J402075l66611j058077O40624n8981J95865k23505
4274C802835k57365R51952j84361L87245l53631P7299l62376m90904m72862O41204
4264C739036K42369J11226N99632p04650L97196J54731k58699M30693j72890P27589
4254E266233j219149m8684Q21718o84462n009r9446J127199j504249O45824P62243
4244E062218l81840j54201l89577K30712M35433J35902l6355l36537K85922j39797
4234D711880r2988J63571j40192k76235O09960M72774k01513j57068l2416j34826
$$ plain form
4303 3320407 4228045 3847869 3718339 3626462 3466169 4360585 3802525 4427698 4547501 3802238
4293 3802238 3805662 2531614 4023962 3578019 3311124 4293207 3532748 4512799 4200352 3562382
4283 3562382 3770631 3271445 4673520 4306909 3248832 3889456 3830475 4026340 3802835
4274 3802835 3545470 4497422 4313061 4700306 4346675 4423974 4061598 3570694 3097832 3739036
4264 3739036 3981405 4092631 4692263 3987613 4384809 4539540 4280841 4711534 4538644 5266233
4254 5266233 4047084 3998400 4820118 4135656 4130647 4031201 5158400 3654151 4299975 5062218
4244 5062218 4680378 4526177 4136600 4367312 4802745 4938647 4902292 4565755 4851677 4711880
4234 4711880 4618892 4782463 4642271 4366036 4975996 5448770 5247257 5090189 5057773 4922947
4224D922947m92423N23233L38723L41845j59801m28105J21994l48421J47760K61213
4214E228965k10972Q98196L5768l25445j113625J080208O37273m23734L50252
4205F156886j185696J384884L53405r44179L87065l10757L8244m29531P15791
4196F166112J23137J98507L78408r1426k82347O02816J32091n30962n99984K47229
4186F343581N69664j61004M9390R68107j214113k25897J52057O37782R46200q85690
4176G180077j55944M34578k65212p50153Q39683l38913J159009j270654j43785
4167F688686J099165N708P751k08668j07629l96850K98704P02117r28369J083817
4157H244432k74233P94440m67657q30934M92431m84689L66664K17910l14106L10853
$$ plain form
4224 4922947 4430524 4953757 5292480 5634325 5474524 5046419 5168413 4819992 4967752 5228965
4214 5228965 5017993 5916189 5951957 5626512 4512887 5593095 6230368 5806634 6156886
4205 6156886 4971190 6356074 6709479 5765300 6152365 5841608 5879852 5450321 6166112
4196 6166112 6289249 6487756 6866164 6774738 6492391 7095207 7227298 6696336 6096352 6343581
4186 6343581 6913245 6752241 6801631 7769738 6555625 6329728 6481785 7119567 8065767 7180077
4176 7180077 7024133 7458711 7193499 6443346 7283029 6944116 8103125 6832471 6688686
4167 6688686 7787851 7793559 7801310 7592642 7485013 7088163 7386867 8088984 7160615 8244432
4157 8244432 7970199 8764639 8296982 7466048 7958479 7473790 7840454 8058364 7744258 8055111
4147H055111O0580J054166n83711M17071l00892o05402J096252j374254Q0830
4138G899751J80636O07567m8588j055578P64949k31128J051731l89463m71602
4129H308275j82843k10252J359949m11824K13270m85264N2755J03464L09376o51453
4119H405453n5379K43156J56885K02857k81753o07817Q6691P06079l23911j084789
4109G447472R45807o48490K24986M05687r03855J046173j190258N57477l70375
4100G514624j71045l53565O45545o9946k0846K30265m83495M49955l05376Q86598
4090H322714n87288m5027j6965k4657p03326Q73944L88454j265141N06520k71220
4080G178008N66207m85017m50560O88795m55023L14610k92108J18094Q31235j108653
$$ plain form
4147 8055111 8115691 9169857 8586146 9003217 8702325 8096923 9193175 7818921 7899751
4138 7899751 8080387 8687954 8639366 7583788 8348737 8117609 9169340 8779877 8308275
4129 8308275 8125432 7915180 9275129 8863305 9076575 8591311 8644066 8747530 9056906 8405453
4119 8405453 8350074 8593230 8750115 8952972 8671219 8063402 8150093 8856172 8532261 7447472
4109 7447472 8393279 7744789 7969775 8375462 7471607 8517780 7327522 7884999 7514624
4100 7514624 7343579 6990014 7635559 7565613 7544767 7775032 7291537 7741492 7436116 8322714
4090 8322714 7735426 7690399 7673434 7648777 6945451 7819395 8207849 6942708 7449228 7178008
4080 7178008 7744215 7259198 6808638 7497433 7042410 7357020 7064912 7183006 8014241 6905588
4070F905588l32011L78186K18701L28957j95597K00194l75238K87655o36964R07668
4060G687139J04812r47801R94228j096148J27646J113273j379335j22336P18459
4051G199937L5903L11403j202249O81282m53376K34810O42294j40948l57302j50165
4041F801589l97166K82868j34548M7098K3229K73559j36501N15021j49460R52303
4031H077992j281101O21377l52353N68391k70290L32741k81128l36767L29882
4022G408744Q540L5814k82880N0256O89551m37854J09766J063541m14960N0073
4012H280591n29355l61358J13627M60876M07047p19223K34598R38781J07486m98780
4002H434290k36918p0739M2826K05734j14762Q06774p28644L20935l66683M30954
$$ plain form
4070 6905588 6573577 6951763 7170464 7499421 7303824 7504018 7128780 7416435 6779471 7687139
4060 7687139 7791951 6844150 7838378 6742230 6869876 7983149 6603814 6481478 7199937
4051 7199937 7235840 7547243 6344994 7026276 6572900 6807710 7450004 7309056 6951754 6801589
4041 6801589 6404423 6687291 6552743 6599841 6623070 6896629 6760128 7275149 7125689 8077992
4031 8077992 6796891 7418268 7065915 7634306 7364016 7696757 7415629 7078862 7408744
4022 7408744 7417284 7453098 7170218 7220474 7910025 7472171 7581937 8645478 8230518 8280591
4012 8280591 7751236 7389878 7503505 7964381 8371428 7652205 7886803 8825584 8933070 8434290
4002 8434290 8197372 8126633 8169459 8375193 8260431 9067205 8338561 8659496 8292813 8723767
3992H723767L13863R8887j42729o84856R58572N05687j58891K10125j40548k84687
3982I399190N25122m82382P61178m16376n43907M97668O68956P47467O8882r69640
3972A0256158R30038j97329O47417J78234o4334k21495R40534n60980m9539O86347
3962A2545051r38077J139599n74815O72585j1478Q02284m79516O5993L19396O77387
3952A4218409p1538P72070p85121m01785J365009M52459p00189J009824L26466
3943A6185604M441j63018M36219j43643Q06111K0633J171322n81886L89416K01467
3933A8326666J55950O96244p8342N57653N27268L71746m983J140070L60972L21212
3923B2374456o53270J128204K56517K81380R02172L9635K30901J100542L33584
$$ plain form
3992 8723767 9037630 9136517 8993788 8308932 9267504 9773191 9614300 9824425 9683877 9399190
3982 9399190 9924312 9441930 10203108 9786732 9242825 9740493 10409449 11156916 11225798 10256158
3972 10256158 11186196 10988867 11636284 11814518 11750184 11528689 12469223 11908243 11858704 12545051
3962 12545051 11606974 12746573 12171758 12844343 12832865 13635149 13155633 13221626 13541022 14218409
3952 14218409 14146871 14918941 14133820 13732035 15097044 15549503 14849314 15859138 16185604
3943 16185604 16190045 16027027 16463246 16319603 17125714 17146347 18317669 17735783 18125199 18326666
3933 18326666 18482616 19178860 19100518 19658171 20185439 20557185 20552202 21692272 22053244 22374456
3923 22374456 21721186 22849390 23105907 23387287 24289459 24329094 24559995 25660537 25994121
3914B5994121m3175P4955J045535J129013k44058J433258P55841k16831K10818
3905C0139477J970618O61157j6058J050660R67902n6025J810940Q71447Q87314
3896C8287432J262524J505341J414488J284062J399097O55392J731729J078840
3888D8618905J545595R76847n72188J917721N63683K047655N44170N14531J067157
3879E7224076K88299M12867L77049p88290R81055l31023J96189O1464o18207k36731
3869E7566748j58241N51099q58108O42432N68852q25506j18766J161496N5485
3860E8585491J192553R7437M03453J393898J116909Q35020J380819J309904N99050
3851F6914534K224018J319899J902499R00886J889355J393913J952158J627672
$$ plain form
3914 25994121 25950946 26025901 27071436 28200449 27956391 29389649 30145490 29928659 30139477
3905 30139477 32110095 32771252 32755194 33805854 34773756 34717731 36528671 37400118 38287432
3896 38287432 39549956 41055297 42469785 43753847 45152944 45808336 47540065 48618905
3888 48618905 50164500 51141347 50569159 52486880 53050563 55098218 55642388 56156919 57224076
3879 57224076 57512375 57925242 58302291 57514001 58495056 58164033 58360222 58421686 57803479 57566748
3869 57566748 57408507 57959606 57101498 57743930 58312782 57487276 57368510 58530006 58585491
3860 58585491 59778044 59875481 60278934 61672832 62789741 63624761 65005580 66315484 66914534
3851 66914534 69138552 70458451 72360950 73261836 75151191 76545104 78497262 80124934
3843H0124934J371365K165482J509328J354917J195688J388860J172190J099592
3835I1382356J117522N45198J183834J186871M73968L46714m57549J110107J096
3826I6890117K34409P78024O77967q57205M62151n02858L36017L62108K79571
3817I8660301M3779Q14156L12084J117570N45678J108954R01292L0349L75693
3808A03909856J480483J719233j55639N58721O12797J25269J42992l02573J42262
3799A08233401N49088j650161o10628j15012k48568q70228R47055m0133j00763
3790A06094051P66855J721477L62941J656396J688011J960496J225277K627290
3782A18102794L069648J845299K680473K739868K437111K890170J836450K375666
$$ plain form
3843 80124934 81496299 83661781 85171109 86526026 87721714 89110574 90282764 91382356
3835 91382356 92499878 93045076 94228910 95415781 95889749 96236463 95778914 96889021 96890117
3826 96890117 97124526 97902550 98580517 97723312 98185463 97682605 98018622 98380730 98660301
3817 98660301 98704080 99518236 99830320 100947890 101493568 102602522 103503814 103534163 103909856
3808 103909856 105390339 107109572 106953933 107512654 108125451 108250720 108393712 108091139 108233401
3799 108233401 108782489 107132328 106521700 106406688 106158120 105287892 106234947 106194814 106094051
3790 106094051 106860906 108582383 108945324 110601720 112289731 114250227 115475504 118102794
3782 118102794 121172442 123017741 125698214 128438082 130875193 133765363 135601813 137977479
3774A37977479K044215R21879M63454r92859n7761k109178k431565l249744k733808
3765A29832112k818066k928164k841432k657570p83651l467804k382950q29647
3757A11122828j037100p46917J57421n00591J114344L42728Q07810J374281J111287
3748A13746091K395120J416503J104257K293102K339026O59194O26783J611653
3740A26191729k91424P61635r89549K52975j543427l25557j378894j460719j039070
3731A20177699m56365j584610j155525o90882K14136P2487m24044m49120M28746
3722A16132522O88777n23001n80382O4030J096856j247788o74979m32634j278401
3713A13245000j604593n96500o79588k135889j645988k095159j703858j829280
$$ plain form
3774 137977479 140021694 140943573 141407027 140414168 140356407 138247229 135815664 132565920 129832112
3765 129832112 127014046 124085882 121244450 118586880 117803229 114335425 111952475 111122828
3757 111122828 110085728 109338811 109496232 108995641 110109985 110452713 111260523 112634804 113746091
3748 113746091 116141211 117557714 118661971 120955073 123294099 123953293 124580076 126191729
3740 126191729 125900305 126661940 125672391 125925366 124381939 124056382 122677488 121216769 120177699
3731 120177699 119721334 118136724 116981199 116290317 116504453 116576940 116152896 115703776 116132522
3722 116132522 116821299 116298298 115717916 115781946 116878802 115631014 114956035 114523401 113245000
3713 113245000 111640407 111043907 110364319 108228430 106582442 104487283 102783425 100954145
3705A00954145k118372k616506j066388j276409k849589j301375r60967j330256
3697H7434283l3489k771855m30274j201921k135254j91639j767401j840210r05963
3688G6156277j876154j942519j498738r15882k135857j612545j747943r69285
3680F3457354k353268j627688n98664j833182r63639j104786m96395k402411n0389
3671E2026932j190154j370337K00539j196513j078665m50398r25113J5835p37275
3662D5294851O44961j414129P9187l70888K12166q96383q28833M32042l36416
3653D2816558n60613N0343l37958j26418r12916J427074r29153J12528N2727n68347
3643D1023825M86042P7575p38406K9381q37755K20026j09399N34203r09606O51684
$$ plain form
3705 100954145 98835773 96219267 95152879 93876470 91026881 89725506 88764539 87434283
3697 87434283 87400794 84628939 84198665 82996744 80861490 80669851 78902450 77062240 76156277
3688 76156277 74280123 72337604 70838866 69922984 67787127 66174582 64426639 63457354
3680 63457354 61104086 59476398 58877734 57044552 56080913 54976127 54479732 52077321 52026932
3671 52026932 50836778 49466441 49666980 48470467 47391802 46941404 46016291 46032126 45294851
3662 45294851 45939812 44525683 44604870 44233982 44446148 43549765 42720932 43152974 42816558
3653 42816558 42255945 42306288 41968330 41841912 40928996 42356070 41426917 41539445 41592172 41023825
3643 41023825 41509867 41587442 40849036 40878417 40040662 40260688 40151289 40685492 39775886 40427570
3633D0427570p7499J41251k52920o1951j01722k55617K61851L73559q02022k83422
3623C9369078J234010m54085j34971M6248l09922P34694Q09217j210660Q23149
3614D0906758q99767P71264q13357R80348m33679K35564M52208o57411R6526k80387
3604D0358067J55463J67369l0078K42773r78859J53618n47392R44739m60852P57353
3594D0762201k3841r74526J022881j20303j75500M47400L68509l95742k84089
3585D0626990Q6781L32139l39206N5904K57303o50515J628683r4943j004454M7663
3575D0946345L77967l77997n1016j8415l92955O0445m42262L03693j105840R52346
3565D0252311p31708q30118P92153n11150M8936L35011r47067N56516o3195N38954
$$ plain form
3633 40427570 40350071 40491322 40238402 40176451 40074729 39819112 40080963 40454522 39652500 39369078
3623 39369078 40603088 40149003 40014032 40060280 39750358 40485052 41294269 40083609 40906758
3614 40906758 40006991 40778255 39964898 40945246 40511567 40747131 41199339 40541928 40638454 40358067
3604 40358067 40513530 40680899 40650821 40893594 39914735 40068353 39520961 40465700 40004848 40762201
3594 40762201 40738360 39763834 40786715 40666412 40490912 40938312 41306821 40911079 40626990
3585 40626990 40713771 41045910 40706704 40762608 41019911 40369396 41998079 41903136 40898682 40946345
3575 40946345 41324312 40946315 40895299 40876884 40483929 40544374 40102112 40405805 39299965 40252311
3565 40252311 39520603 38690485 39482638 38971488 39020424 39355435 38408368 38964884 38901689 39440643
3555C9440643M83881m53049K05045O43402q25183R097j079182J167888j29189
3546C9463353M2734o4977k92078O65010O5372l7370j07587p11514P78277m97934
3536C9303286O31529m17218N16727m60398M73604P2236J48863l06827Q49855M24009
3526D1235666m6725q47172K174431n18578N17484M92855Q77680M90878J74308
3517D4550827M30011L49094N28020J252548P56960N06839J49632J443431O21667
3508E0589029J334559P47076L77361J070865J229291P23405J850547J250432J667133
3499F0839698J508501J190251J480151P45142J024949L73667J09361N17988j95595
3490F7594113l14254J262631o43536J71270m92023J050067o42763O90167p46984
$$ plain form
3555 39440643 39924524 39471475 39676520 40319922 39494739 39503836 38424654 39592542 39463353
3546 39463353 39506087 39441110 39149032 39814042 39879414 39842044 39734457 39022943 39801220 39303286
3536 39303286 39934815 39517597 40034324 39573926 40047530 40119766 40268629 39961802 40811657 41235666
3526 41235666 41188941 40341769 42516200 41997622 42515106 43007961 43885641 44376519 44550827
3517 44550827 44980838 45329932 45857952 47110500 47867460 48374299 48523931 49967362 50589029
3508 50589029 51923588 52670664 53048025 54118890 55348181 56071586 57922133 59172565 60839698
3499 60839698 62348199 63538450 65018601 65763743 66788692 67162359 67271720 67789708 67594113
3490 67594113 67279859 68542490 67898954 68070224 67578201 68628268 67985505 68675672 67928688
3481F7928688K004901J32412l60378l91581O42318O10467J18172R1514o65400
3472G0111113M74067M39642r82807r16604n61152L32208K39198k164276J40399
3463F7111788r60666p90706q80894j162813m65772j539006J34151j922938m97379
3454E9025765j271261r72846j387694j322660j136623j003908j443014J20002
3446E0607761l083319j48702q78299j681157j601230r42124j586352p30220j23501
3437C9832857k500512l45860l81085j164549j439697P4804j495105r96928n01695
3428C1082230o01308j651025O8441n42192j265211k62970J45929j082609m24566
3419B5466719m71010n29448j29502k83432k80242o23655j02760p38919l23382
$$ plain form
3481 67928688 69933589 70066001 69705623 69314042 69956360 70566827 70684999 70776513 70111113
3472 70111113 70585180 71024822 70042015 69125411 68564259 68896467 69135665 66971389 67111788
3463 67111788 66151122 65360416 64479522 63316709 62850937 61311931 61446082 59523144 59025765
3454 59025765 57754504 56781658 55393964 54071304 52934681 51930773 50487759 50607761
3446 50607761 47524442 47375740 46497441 44816284 43215054 42272930 40686578 39956358 39832857
3437 39832857 37332345 36986485 36605400 35440851 34001154 34075958 32580853 31583925 31082230
3428 31082230 30480922 28829897 28898338 28356146 27090935 26827965 26973894 25891285 25466719
3419 25466719 24995709 24466261 24336759 24053327 23773085 23149430 23046670 22307751 21984369
3410B1984369j6864m13176o95743J83107q19052k9124o88695P80447n47099m01431
3400A9336739l14133l85328k13571j36167J32650j027082K97429o99495L44889
3391A7335931J66895k48833m38755M55455k64611j60823O2826n76323j88946R02726
3381A7045542n69208j75698k89902P1184j0567r0130l78507j65328o44249J64951
3371A4958088l45313M04726J04783m17955J17504l89940M54167k13767l06431
3362A4365862k61294j41348O27123j88732j28635J84429K04363m6777l54703Q10074
3352A5070362j127869N86639M8505J31647J7940p3611j24151l8932M02618p59490
3342A4133658m5015Q7582R54338n58187K01175K5073P290N02499j18592J9067
$$ plain form
3410 21984369 21967505 21554329 20858586 21041693 20222641 20193517 19504822 20285269 19738170 19336739
3400 19336739 19022606 18637278 18423707 18287540 18420190 17393108 17690537 16991042 17335931
3391 17335931 17502826 17253993 16815238 17270693 17006082 16845259 16908085 16331762 16142816 17045542
3381 17045542 16476334 16300636 16010734 16081918 16071351 15981221 15602714 15437386 14793137 14958088
3371 14958088 14612775 15017501 15122284 14704329 14821833 14431893 14886060 14672293 14365862
3362 14365862 14104568 13963220 14590343 14401611 14272976 14457405 14661768 14614991 14260288 15070362
3352 15070362 13942493 14529132 14577637 14709284 14727224 14653613 14529462 14490530 14893148 14133658
3342 14133658 14088643 14176225 15130563 14572376 14773551 14798624 14805914 15308413 15189821 15208888
3332A5208888m03299J345978q79625N7234K87317p46298N45596J77042L68604
3323A5961437n17417R52511q08749P62145m27019j43566J16937l38901K74624
3314A5832002K14899j165475L3977K11704m07582K97412j35716K19667L98850
3305A5499738n15152q8582l52295j3078P89909n06555P3532m32395M38726N13265
3295A5407113j874232O84308J84338k20146j513158Q66733R2356j326541O79183
3286A2979954N2901m79272L34486j207603O71320l31404P81273r27913p56016
3277A1117726Q00940q7930l718l95915l63165L77161r8791K14600M4588k64442
3267A1341054R5292m46897K39701l42092N13621j31366k08549m00486J173212
$$ plain form
3332 15208888 14805589 16151567 15271942 15329176 15616493 14870195 15415791 15592833 15961437
3323 15961437 15444020 16396531 15587782 16349927 15922908 15779342 15896279 15557378 15832002
3314 15832002 16046901 14881426 14915403 15127107 14719525 15016937 14881221 15100888 15499738
3305 15499738 14984586 14896004 14543709 14530631 15320540 14813985 14887517 14455122 14893848 15407113
3295 15407113 13532881 14217189 14401527 14181381 12668223 13534956 13627312 12300771 12979954
3286 12979954 13032855 12553583 12888069 11680466 12351786 12020382 12801655 11873742 11117726
3277 11117726 11918666 11830736 11827018 11431103 11067938 11445099 11346308 11560908 11605496 11341054
3267 11341054 11436346 10989449 11229150 10887058 11400679 11269313 11060764 10660278 11833490
3258A1833490k01391k88980N43836K89543j041984K64658L0271O52497r976K41141
3248A2313105m16605R5720j6500M45033p18830L41026N19320r7068m34195K41858
3238A2272864l58092L12963M08075r42269Q46559J42063n2404J47262K83380L57706
3228A3418107n94432M18996P15909q73478j44873L81208J208679l78412j69950
3219A3981754M77136P09291p6229o29940J413847j422794L87077J056617j010669
3210A4886090J021049L55372j74544K11037L53209P1837Q32229K54072Q1995r01499
3200A6990847L53968J15561J092156r48269J107537m08501o9204J5514O65082
3191A8914691N73392k22942P95340j82479L77442N30661j37184J958731j167353
$$ plain form
3258 11833490 11632099 11343119 11886955 12176498 11134514 11399172 11429443 12081940 12071964 12313105
3248 12313105 11896500 11992220 11975720 12420753 11701923 12042949 12562269 12465201 12031006 12272864
3238 12272864 11914772 12227735 12635810 11693541 12540100 12682163 12629759 12777021 13060401 13418107
3228 13418107 12823675 13242671 13958580 13085102 12940229 13321437 14530116 14151704 13981754
3219 13981754 14458890 15168181 15091952 14462012 15875859 14453065 14840142 15896759 14886090
3210 14886090 15907139 16262511 16087967 16299004 16652213 16724050 17556279 17810351 17892346 16990847
3200 16990847 17344815 17460376 18552532 17604263 18711800 18303299 18234095 18249609 18914691
3191 18914691 19488083 19265141 20060481 19878002 20255444 20786105 20648921 22607652 21440299
3182B1440299M92024K98064J863347j90816K63182N06681N61047O25937N13972
3173B6373737J421629q99467J250143J226571J21469N51740n72145R30575J15445
3164C0519697k56222O21879k46286P73089M85402J097264J39551J168907M5201
3155C4348482Q60531O33197J232441p90078K080288L63701R26393L76967J466253
3146D1498175J244658P02074J043959J431025J933361J175216J255218J752958
3138E2036644K563408L109405K958739L326332K843595L555868K600382J805182
3130G4799555K558647k53574j438467j352643n45998Q23470L77058j383086r81079
3121G2603883k1821k36423J615041m50057M94075J277129j005J244406m34178
$$ plain form
3182 21440299 21932323 22230387 24093734 23902918 24166100 24672781 25233828 25859765 26373737
3173 26373737 27795366 26895899 28146042 29372613 29494082 30045822 29473677 30404252 30519697
3164 30519697 30263475 30885354 30639068 31412157 31897559 32994823 33134374 34303281 34348482
3155 34348482 35209013 35842210 37074651 36284573 38364861 38728562 39654955 40031922 41498175
3146 41498175 42742833 43444907 44488866 45919891 47853252 49028468 50283686 52036644
3138 52036644 54600052 57709457 60668196 63994528 66838123 70393991 72994373 74799555
3130 74799555 77358202 77104628 75666161 74313518 73767520 74590990 74968048 73584962 72603883
3121 72603883 72582062 72345639 73960680 73510623 74004698 75281827 75280822 76525228 76091050
3112G6091050K00346J667870l13962k01165J703049N1482L89270p63026K278949
3103H1103863L40240J066123J856154J443550J454875J828860J663084R12108
3095I1668857K708347K140122J985619K473246J627193L149684K852144L173771
3087A11778983L184540K914369M431558K295739K788545N71584r65688r86465
3079A26013165J10043j713873p52230k08644o52906j099026r83865m61792L83950
3070A20634822J87616r35584J251940Q87625J377563J069245J383704K076785
3062A27933716K606469L781770M498097M264131M804960O133295O562432R116182
3054A69701052P977549J0209602J0933332J3169028J4614094J6441027J7923658
$$ plain form
3112 76091050 76291396 77959266 77645304 77444139 79147188 79198670 79587940 78824914 81103863
3103 81103863 81444103 82510226 84366380 85809930 87264805 89093665 90756749 91668857
3095 91668857 94377204 96517326 98502945 100976191 102603384 105753068 108605212 111778983
3087 111778983 114963523 117877892 122309450 124605189 127393734 127965318 126999630 126013165
3079 126013165 126123208 124409335 123657105 123448461 122795555 121696529 120712664 120250872 120634822
3070 120634822 120822438 119886854 121138794 122026419 123403982 124473227 125856931 127933716
3062 127933716 130540185 134321955 138820052 143084183 147889143 154022438 160584870 169701052
3054 169701052 177678601 187888203 198821535 211990563 226604657 243045684 260969342
3047B60969342J5047160J2772185K806883q299378j3441260j2582504j1511921
3040B45760507j4090820j6426492j8469374j7129932j4347182j3445071r666507
3033A42185129q562749o186728n392695m341312l158400l532270k950072k663673
3025A05397230k224928j734581k383326l201003l092018j911820k831125k753299
3017H5265130k707748l644941k552374k313608l021427k679870j849983k439160
3009F4056019k575444j300574j811945j304774j793642j154760r56432j418604
3001E1739844j6114o63379j327278p67117m15923m35089r94900l98588j24104
2992D6597352n90460j555682k30214j67572k01880q64095K96224j365011n08336
$$ plain form
3047 260969342 276016502 288788687 291595570 283296192 269854932 257272428 245760507
3040 245760507 231669687 215243195 196773821 179643889 165296707 151851636 142185129
3033 142185129 133622380 127435652 122042957 117701645 114543245 111010975 108060903 105397230
3025 105397230 103172302 101437721 99054395 95853392 92761374 90849554 88018429 85265130
3017 85265130 82557382 78912441 76360067 74046459 71025032 68345162 66495179 64056019
3009 64056019 61480575 60180001 58368056 57063282 55269640 54114880 53158448 51739844
3001 51739844 51723730 51060351 49733073 48965956 48550033 48114944 47120044 46721456 46597352
2992 46597352 46006892 44451210 44220996 44053424 43851544 42987449 43283673 41918662 41410326
2983D1410326m72828q92209k74534p71754m73952n72090q01090M97607m40858
2974C7208618j67522j25214o45890k30389J67153P0851j44555n324K20401k84592
2964C6063537M57784k54922O27181P0519Q00067K1113k36733Q70550O4146L12191
2954C8795433P21196Q71199L00235O97012l00543R97318L51949K44308O58889
2945D3336996Q69841O06305P56271M79790P29935J308319L65158N29261J450581
2936E0432457R26012J816424O47426P44623J233894J943832P50481J438503J474304
2927F1407956J714427N87369K762413J182430K707231J332097K473172J373977
2919G5541072J985782K744010J781678L135543K045153K190489J752973J735193
$$ plain form
2983 41410326 40937498 40045289 39770755 38999001 38525049 37952959 37151869 37649476 37208618
2974 37208618 37041096 36915882 36269992 36039603 36206756 36277607 36133052 36127728 36348129 36063537
2964 36063537 36521321 36266399 36893580 36964099 37764166 37785279 37548546 38419096 38483242 38795433
2954 38795433 39516629 40387828 40688063 41385075 41084532 42081850 42433799 42678107 43336996
2945 43336996 44206837 44813142 45569413 46049203 46779138 48087457 48452615 48981876 50432457
2936 50432457 51358469 53174893 53822319 54566942 55800836 57744668 58495149 59933652 61407956
2927 61407956 63122383 63709752 66472165 67654595 70361826 71693923 74167095 75541072
2919 75541072 77526854 80270864 82052542 85188085 87233238 89423727 91176700 92911893
2911I2911893K271413J881911J079659K554629J182449J191892J833835J298773
2903A06206454J387921J664590J278952J137031O96234O55464O63011M52114Q76081
2894A15017852l11184J107564l07393K94529n43599J153686J79249L30679L96937
2885A17318320O59131K47592K106379l02026J864642J972954N20755J693250K594710
2876A28675707K622703J243780K432239J831511L058662J714343K193543M308868
2868A48081356L194969K073099K859252L197230K605405K721970L817427K792906
2860A71343614L231452L221470L929087K602646K142152K740136K606092J631298
2852A93447947J274792K609014J9752L46885R761p5296n35114n29149k45438j404325
$$ plain form
2911 92911893 95183306 97065217 98144876 100699505 101881954 103073846 104907681 106206454
2903 106206454 107594375 109258965 110537917 111674948 112371182 113026646 113689657 114141771 115017852
2894 115017852 114706668 115814232 115506839 115801368 115257769 116411455 116590704 116921383 117318320
2885 117318320 117977451 118225043 120331422 120029396 121894038 123866992 124387747 126080997 128675707
2876 128675707 131298410 132542190 134974429 136805940 139864602 141578945 143772488 148081356
2868 148081356 151276325 153349424 156208676 159405906 162011311 164733281 168550708 171343614
2860 171343614 174575066 177796536 181725623 184328269 186470421 189210557 191816649 193447947
2852 193447947 194722739 197331753 197351505 197698390 197708151 197632855 197097741 196568592 196323154 194918829
2842A94918829j554969k179422k002570j858347j862393l776710l004076k256407
2834A76423935l989771m201821l855376l173266l675167l108566m405876l338906
2826A46675186m134250m665535m079241l644600m603764n368805l632957m186794
2818A12359240m689978l385395m180164k212703l359923k603038l462711k548217
2810H5917111j801357k354828l053568j618816k264793l333426k452057j474270
2802F7563996j646415k661583q84260k472313j268034j345948k566033j011953
2794E3707457r28955k072123j384108j010571j223295o73555n25680j037397p54726
2785D4097047m91521j666343k95065n01503j228533j446796p08858k62296r22450
$$ plain form
2842 194918829 193363860 191184438 189181868 187323521 185461128 181684418 178680342 176423935
2834 176423935 172434164 168232343 164376967 161203701 157528534 154419968 150014092 146675186
2826 146675186 142540936 137875401 133796160 130151560 125547796 120178991 116546034 112359240
2818 112359240 107669262 104283867 100103703 97891000 94531077 91928039 88465328 85917111
2810 85917111 84115754 81760926 78707358 77088542 74823749 71490323 69038266 67563996
2802 67563996 65917581 63255998 62371738 59899425 58631391 57285443 54719410 53707457
2794 53707457 52778502 50706379 49322271 48311700 47088405 46414850 45889170 44851773 44097047
2785 44097047 43605526 41939183 41644118 41142615 39914082 38467286 37758428 37496132 36573682
2776C6573682j40046j160234l98034j432543J0948j284660J34273j372408R425
2767C0940403k87485j210931o56086r45521l63287N41965j538161N05505k71876
2758B6714526r80257o41986N39526o42679q38267J77277j088622K37346p9178
2749B3397686k43096o41192K01338j02859p12878P775q991m92421m85595k0382
2739B0899385k14928r80055M75115J16867J91335j265841m31824N22485j185675
2730A8126864j03688k87478N07128r24500J83131r44967l2153K41187M88590j791703
2720A5462411O55561n79762M2137l19623l19271N38840j584950J275016q28494
2711A4341865j05762k89342J48599K95270q10564M50878n28032n8278p51553J210853
$$ plain form
2776 36573682 36433636 35273402 34875368 33442825 33453773 32169113 32303386 30930978 30940403
2767 30940403 30652918 29441987 28785901 27840380 27477093 28019058 26480897 26986402 26714526
2758 26714526 25734269 25092283 25631809 24989130 24150863 24328140 23239518 23476864 23397686
2749 23397686 23154590 22513398 22714736 22611877 21898999 21906774 21897783 21405362 20919767 20899385
2739 20899385 20684457 19704402 20179517 20296384 20487719 19221878 18790054 19312539 18126864
2730 18126864 18023176 17735698 18242826 17318326 17501457 16556490 16524337 16765524 17254114 15462411
2720 15462411 16117972 15538210 15580347 15260724 14941453 15480293 13895343 15170359 14341865
2711 14341865 14236103 13946761 14095360 14390630 13580066 14030944 13502912 13444634 12693081 13903934
2701A3903934p04839M17860o73399M6159J94431M9046P8424r56419N87615m72413
2691A2470399l37289Q35937M25593r44325L3168N51767n73718J98873j82898r7151
2681A2380356O33365k7374o18727O3223m37858M59060K73711l00585O50846p66818
2671A2309199P13072p27692P01804N14637o51667O70754j08227k66502P23868
2662A3879246k29299N49797m49891N80199l5838K07234N67153j100990P86743
2653A4754354K10033J54278L23626J56253k76532L38987O2920L26505K21585M05581
2643A6677590J13229k27024K85565Q16848L69770K67697O17713Q16980m69042
2634A9269326R82183J400R61610J489118k98436K36129J654787O54057J473259
$$ plain form
2701 13903934 13199095 13616955 12943556 12989715 13184146 13233192 13311616 12355197 12942812 12470399
2691 12470399 12133110 12969047 13394640 12450315 12483483 13035250 12461532 12660405 12477507 12380356
2681 12380356 13013721 12986347 12367620 12430843 11992985 12452045 12725756 12425171 13076017 12309199
2671 12309199 13022271 12294579 12996383 13511020 12859353 13530107 13421880 13155378 13879246
2662 13879246 13649947 14199744 13749853 14330052 14294214 14501448 15068601 13967611 14754354
2653 14754354 14964387 15118665 15442291 15598544 15322012 15660999 15723919 16050424 16272009 16677590
2643 16677590 16790819 16563795 16849360 17666208 18035978 18303675 18921388 19738368 19269326
2634 19269326 20251509 20252909 21214519 22703637 22405201 22641330 24296117 24950174 26423433
2625B6423433j33249L34421J082839K09286N35781m9057J085724r87997k27293
2616B8273888J060134j53708O29976M57236Q50387J48809K69971N03043j391397
2607C0648339J698623n10423K22641M68m16513n18359m76929N87472q88027m78812
2597B9868480J86055j084303N82872j236660J162986J80039M33227O16561l3713
2588C0675544M70455J484556N59268k16978J962120J236403J471177J134049J267348
2579D0043942Q23233J580542J249607J881102K37463P22045K79512M36102O92174
2570D7945722L23136J10730k000P95590n53675M49920r1624M15211k35450R00294
2560E0057854o69054p39555m54992p65994q18789q31912m29791q48733j384059
$$ plain form
2625 26423433 26290184 26624605 27707444 27916730 28452511 28403454 29489178 28501181 28273888
2616 28273888 29334022 29180314 29810290 30267526 31117913 31266722 31536693 32039736 30648339
2607 30648339 32346962 31836539 32059180 32059648 31643135 31124776 30647847 31235319 30347292 29868480
2597 29868480 30054535 28970232 29553104 28316444 29479430 29659469 30092696 30709257 30675544
2588 30675544 31145999 32630555 33189823 32972845 34934965 36171368 37642545 38776594 40043942
2579 40043942 40867175 42447717 43697324 45578426 45815889 46537934 46817446 47253548 47945722
2570 47945722 48268858 48379588 48377588 49173178 48619503 49069423 48977799 49393010 49157560 50057854
2560 50057854 49388800 48649245 48194253 47428259 46609470 45777558 45347767 44499034 43114975
2551D3114975j472975r80901j495001q46216j029783r60442j836667n9076q53766
2542C3580148L1535m92883n07905O33065l04374P0354M05613M75827N74818Q07915
2532C5274113J60052J764423j02131J768590J684563o57966L46396J262188o2102
2523D1438126O30172l81148K53002p61988l5254L14235p07187l78943m70208M87527
2513D0388334n63428J042045q75531n01414R7329n24551r529j638566q075j992825
2503C5413789n43435j569172m37110k398119p12525l01014j398783j323297j082504
2494B5647830p04027n97523l11489p20823r7526j61631p62732m36580k13121L82006
2484B2024384l9445k99685R6873M20377N15075N83944m50409O1506K74199L01417
$$ plain form
2551 43114975 41642000 40661099 39166098 38319882 37290099 36329657 34492990 34433914 33580148
2542 33580148 33611683 33118800 32610895 33243960 32939586 33009940 33415553 33891380 34466198 35274113
2532 35274113 35434165 37198588 37096457 38865047 40549610 39891644 40238040 41500228 41438126
2523 41438126 42068298 41687150 41940152 41178164 41142910 41457145 40749958 40371015 39900807 40388334
2513 40388334 39824906 40866951 39991420 39490006 39587335 39062784 39053255 37414689 37406614 35413789
2503 35413789 34870354 33301182 32864072 30465953 29753428 29452414 28053631 26730334 25647830
2494 25647830 24943803 24346280 24034791 23313968 23216442 23054811 22292079 21855499 21642378 22024384
2484 22024384 21984939 21685254 21782127 22202504 22717579 23301523 22851114 22912620 23186819 23488236
2474B3488236l07486J55955k24772M35429j268546P47775k6377m59574j59096
2465B2381544l38938P146M29632k02296n37792n50659O45791o30780j63306q3377
2455B0956965m49980j036224O27260m68529l50060K92100j722177Q00810l46826
2446A8303339R4316K84496m79814j26810M29183J48152N9427Q87588k50405K98658
2436A9648130n28341j124265M04563n33477m41204k00300m69179J80504o38584
2427A6297847R87304j039950m58056M41505L20924n9574m4726k80749J412322
2418A7576847O398M56394P30916M78719k28137M17061P63611P65094K73546J419081
2408B2659530J298547Q23678Q42939K675926K152717L246167M096944L211867
$$ plain form
2474 23488236 23180750 23336705 23111933 23547362 22278816 23026591 23000214 22540640 22381544
2465 22381544 22042606 22049752 22479384 22277088 21739296 21188637 21834428 21203648 21040342 20956965
2455 20956965 20506985 19470761 20098021 19629492 19279432 19571532 17849355 18650165 18303339
2446 18303339 18397655 18682151 18202337 18075527 18504710 18652862 18712289 19599877 19349472 19648130
2436 19648130 19119789 17995524 18400087 17866610 17425406 17225106 16755927 16936431 16297847
2427 16297847 17285151 16245201 15787145 16228650 16549574 16490000 16445274 16164525 17576847
2418 17576847 17583245 18039639 18770555 19249274 19021137 19438198 20201809 20966903 21240449 22659530
2408 22659530 23958077 24781755 25624694 28300620 30453337 33699504 37796448 41008315
2400D1008315K725609K732548k302288j871271k092130q40377j532437k040931
2392C5787038l384931k837110l294171j125934l546631j258929q75958j367029
2384A8096345n94274r87633k047955M61576j314967r07040O1183N0425j50284
2375A2667376q93167l4247j034750r19162P21216q119L49735q43185j94716P17916
2365A0528897p42693J214300q79134K01182n39954k7403o49245O47372l12734
2356I440588k53208l00570J72060r48142M72364k17081M56920p67560O63265j146659
2346G571977O20081J07850j92798p14086O34488l47038O52776M20659J02785l59864
2336H496830L00161K30047J07421M82546j91614M07827l5171L20324M15822J012232
$$ plain form
2400 41008315 43733924 46466472 44164184 42292913 40200783 39360406 37827969 35787038
2392 35787038 32402107 29564997 26270826 25144892 21598261 20339332 19463374 18096345
2384 18096345 17502071 16514438 14466483 14928059 13613092 12706052 12767235 12817660 12667376
2375 12667376 11774209 11739962 10705212 9786050 10507266 10499147 10848882 10005697 9810981 10528897
2365 10528897 9786204 11000504 10121370 10322552 9782598 9755195 9105950 9753322 9440588
2356 9440588 9187380 8886810 9058870 8110728 8583092 8366011 8822931 8055371 8718636 7571977
2346 7571977 8192058 8299908 8107110 7393024 8027512 7680474 8333250 8753909 8856694 8496830
2336 8496830 8796991 9027038 9134459 9617005 9425391 9833218 9798047 10118371 10534193 11546425
2326A1546425q03001J249454Q37100k05110P57033k20935o47704M7218m25115
2317A2135365m10382p68509m89661j13266j342288N23757p05722m25671p5748
2308H327875k46752k74966P16238M16103r9064M34107k09236J454550J42668N21121
2298A1182644J159198o91367j874333J00635K11569j020314o93512m67011q05641
2289G101868M38270j536772p77252J58023o53823O2868j052659P50372k84469
2280D206426o72514j025504Q71411N7215j05296l04848p84380J020264m96462
2271B766312j83329L1091J96123o25701M1317L18535k98480m80706M26801l51035
2261A840928J140885j292012Q90292n00661j67286L68025l43322k09908L99447
$$ plain form
2326 11546425 10743424 11992878 12829978 12624868 13381901 13160966 12513262 12560480 12135365
2317 12135365 11724983 10956474 10466813 10353547 9011259 9535016 8829294 8403623 8327875
2308 8327875 8081123 7806157 8522395 8938498 8839434 9273541 9064305 10518855 10661523 11182644
2298 11182644 12341842 11650475 9776142 9876777 10088346 9068032 8374520 7907509 7101868
2289 7101868 7540138 6003366 5226114 5384137 4730314 4793182 3740523 4490895 4206426
2280 4206426 3533912 2508408 3379819 3437034 3331738 3026890 2242510 3262774 2766312
2271 2766312 2582983 2614074 2810197 2184496 2225813 2544348 2245868 1765162 2191963 1840928
2261 1840928 2981813 1689801 2580093 2079432 1912146 2280171 1936849 1726941 2126388
2252B126388m13828m57041l05934Q53293j15594l85310N03036K04310j91893l99876
2242A417551j63807m32689M61496L56923j05784K12347P0947j04663K6q7830p14256
2231I10261N82404K07383m03102N79752r33640J468345j323169L1212k23615k3810
2221H72021n50253L87117P54670l85702n11201J093276r35021K11465o8156J94810
2211A063026j14016N56121m29292j93745O26870q96122j16709P77544M60719n6211
2201A678185o04473k78757N75860j07132j60583m60758K72561M38567j99746J11858
2191A265582P11617q06036p40972O3219K41831j33970L45045L35127p58843L79949
2181I02549P32769l89827N96309j237065J1277M10273k40458n42548L68663n960
$$ plain form
2252 2126388 1712560 1255519 949585 1802878 1687284 1301974 1805010 2009320 1817427 1417551
2242 1417551 1253744 821055 1282551 1639474 1533690 1746037 1816984 1712321 1712347 1624517 910261
2231 910261 1492665 1700048 1296946 1876698 943058 2411403 1088234 1119446 895831 872021
2221 872021 321768 708885 1463555 1077853 566652 1659928 724907 936372 868216 1063026
2211 1063026 949010 1505131 1075839 882094 1508964 612842 496133 1273677 1734396 1678185
2201 1678185 1073712 794955 1370815 1263683 1103100 642342 914903 1353470 1153724 1265582
2191 1265582 1977199 1171163 430191 493410 735241 601271 946316 1281443 522600 902549
2181 902549 1635318 1245491 1841800 604735 616012 1026285 785827 243279 611942 605982
2171F05982J69460K71273j46068j17167k40571J24082L57515K7413j99154Q13929
2161A666694k93792j12463m64914O06325J28530r20874k64485L63545N01794J71956
2151A382316m6102j86386l97286M01204m08881J029139l46836k74822P89630m22114
2141A519862o4207l12147K59893l46109J0006P65076j083943Q07093k4672L8204
2131A569056n35962M19738j64808N899n90761L08597K68250m07141K83800L69600
2121A526268o3971q34640Q44987K69572j94746p33984O29961j29317M06407l81200
2111A339337M82871J739k13093J55304M6102o96804L21240O30584n01556K00732
2101A766456k91390L55192j16084p617L25995j14206l63199q8449M72551q10727
$$ plain form
2171 605982 775442 1046715 900647 783480 542909 666991 1024506 1051919 852765 1666694
2161 1666694 1372902 1260439 795525 1401850 1530380 609506 345021 708566 1210360 1382316
2151 1382316 1336214 1149828 752542 1153746 744865 1774004 1427168 1152346 1941976 1519862
2141 1519862 1455655 1143508 1403401 1057292 1067298 1832374 748431 1555524 1530852 1569056
2131 1569056 1033094 1452832 1288024 1293923 703162 1011759 1280009 872868 1156668 1526268
2121 1526268 1462297 627657 1472644 1742216 1547470 813486 1443447 1314130 1720537 1339337
2111 1339337 1822208 1823947 1610854 1766158 1812260 1115456 1436696 2067280 1565724 1766456
2101 1766456 1475066 1830258 1714174 1706557 2032552 1918346 1555147 1466698 1939249 1128522
2091A128522K13906L04397l49367K74432l4868K32861k96630K58202l45224L59980
2081A746211p61232M51277r8994J0410J39699m780M7613O09399j68344k92801
2071A678458o25884K22967n03801N59422l70704r6806n18930N74934q14792J347081
2061A451945j23447m24221j50913j125771J489973l20400r0518J95967k54327
2052F48288K97847J32858j80078j457362J22937j98736J035962J64410M08332
2043I74458j62709p18311P0601R41739q44252l16206n4835L766M26858o15602
2033b94493M34197l51376O57880j27901q6073L8238K69609k67991L04634p39997
2023a63273j12005M27005l26548J34943j44064N25027m4790j3938M26774m17596
$$ plain form
2091 1128522 1342428 1646825 1297458 1571890 1537022 1769883 1473253 1731455 1386231 1746211
2081 1746211 984979 1436256 1337262 1347672 1487371 1482591 1530204 2139603 1971259 1678458
2071 1678458 1052574 1275541 771740 1331162 960458 863652 344722 919656 104864 1451945
2061 1451945 1328498 904277 753364 -372407 1117566 797166 706648 902615 648288
2052 648288 946135 1078993 898915 -558447 -435510 -634246 401716 566126 974458
2043 974458 811749 93438 164039 1105778 261526 -54680 -109515 -105749 321109 -294493
2033 -294493 139704 -211672 446208 318307 232234 270472 540081 272090 576724 -163273
2023 -163273 -275278 151727 -174821 -39878 -183942 341085 296295 282357 709131 291535
2013B91535n5387j46207j99638K75769J92157k46268M8050p07145P48855p1152
2003A30569l69953K47421j77575N49132m78763K7180m25522M77534K18218k33788
1993c5547l71228M27169M70264j253712J001960K39661J53861o95022k13349J92659
1983h3284m28235J118657m70841j34909k99317N03855Q4724r07582J210248m54391
1973A38925p3583J28089l74831k12640M42009J17190m87859n84480J974231o39258
1963D27793o93469j53750J219574o97879n21945K76970L04011j93488p20077J051285
1953B99025n0745r61779L56948K99034j66207k63503N62835J2142j40757n15327
1943e68334O63086j22116n79235Q16453m55452o74283J23630J003198J42446n39332
$$ plain form
2013 291535 236148 89941 -109697 166072 358229 111961 160011 -547134 201721 130569
2003 130569 -239384 8037 -169538 379594 -99169 -71989 -497511 -19977 198241 -35547
1993 -35547 -406775 20394 490658 -763054 238906 478567 632428 -62594 -275943 -83284
1983 -83284 -511519 607138 136297 1388 -297929 205926 290650 -616932 593316 138925
1973 138925 65342 193431 -181400 -394040 47969 165159 -322700 -907180 1067051 427793
1963 427793 -265676 -419426 800148 102269 -419676 -142706 161305 -32183 -752260 299025
1953 299025 248280 -713499 -356551 -57517 -223724 -487227 75608 87750 -53007 -568334
1943 -568334 94752 -27364 -606599 209854 -245598 -919881 -796251 206947 349393 -189939
1933a89939m21034N89908k88504r0820R5825N95665o07900j38124k01154N52517
1923a03560l99061P22603n1521l28968J66410L14115p8015m37927P7623p5245
1913a93546M95472j72604l97721r3481M00646l36064K50114l16830K6938P6416
1903b60660K9933N91609l44540o43224J02533J77608L25845J64619n13152M77709
1893A08280o21680Q66041l31282n29456J103899p33344L78751l50170M01297o94954
1883d02618R8416M40265J06614J39259j47643O23788j161151P15009l33277J87751
1873B66413q27689M26064m69734J051365j93238J66167j3699j259658J198215
1864C44206m32581K40485j6563p4724j31222j75050R88225q31073l95455K63120
$$ plain form
1933 -189939 -610973 -21065 -309569 -400389 -304564 291101 -316799 -454923 -656077 -103560
1923 -103560 -502621 219982 168461 -160507 5903 320018 242003 -195924 -118301 -193546
1913 -193546 301926 129322 -268399 -361880 38766 -297298 -47184 -364014 -337076 -260660
1903 -260660 -230727 360882 16342 -626882 -524349 -346741 -20896 143723 -369429 108280
1893 108280 -513400 352641 21359 -508097 595802 -137542 241209 -108961 292336 -402618
1883 -402618 -304202 136063 242677 381936 234293 858081 -303070 411939 78662 266413
1873 266413 -561276 -135212 -604946 446419 253181 419348 405649 -854009 344206
1864 344206 -88375 152110 135547 60823 -70399 -245449 742776 -88297 -483752 -220632
1854b20632K10900j62162J74800j31779L87269n27822K07212n67466P43781q05698
1844f91597N97838n06829J15508j2901Q31375p13088j93756p812L4938M48506
1834i7818p41046J095213j65675j87146R3634j048146P23636J26542J34890l2130
1824i8046L53294l47659N5000j0775n4175L28352o2659j05040k98540m27029P42886
1813G5609m82825K97375L28067k09545j28336M54212o5040p35868Q25161o31957
1803b73147j12736j5311P69944j081726k70547J124656n77733L08066k21567m5200
1793c95301J23367J258539q69785n09572L13247Q5245K72235k62984N44811p36617
1783a76815L05661k8624l8753k66153K22500n81278J103369N7879p79400k24323
$$ plain form
1854 -220632 -9732 -171894 2906 -128873 258396 -269426 -62214 -629680 114101 -691597
1844 -691597 -93759 -600588 -485080 -497981 333394 -379694 -573450 -581262 -546324 -97818
1834 -97818 -838864 256349 90674 -96472 -2838 -1050984 -327348 -200806 -65916 -98046
1824 -98046 255248 -92411 -37411 -48186 -102361 225991 163332 58292 -240248 -667277 75609
1813 75609 -407216 -109841 218226 8681 -119655 334557 269517 -466351 358810 -273147
1803 -273147 -385883 -401194 368750 -712976 -983523 141133 -436600 -128534 -350101 -395301
1793 -395301 -271934 986605 116820 -392752 -79505 5740 277975 14991 559802 -176815
1783 -176815 128846 100222 61469 -204684 17816 -563462 539907 597786 -181614 -405937
1773d05937J92567Q80846m75463n25340O96108m06578j97188o67046O97333j27194
1763c37892L05055k50567N65083L37817n55870L77309n22347Q46182j144366Q9094
1753b90502J27919j2849L00718l9731r14915L27266Q9667J17416j53659r3979
1743e42649M25028P9703J88983k79097k1829j00021J76505O31781l58278p19822
1733e19696O00384K57900q32432N21311j31346l0453j05440L24532l35740r61825
1723a212805J493094l95161J77110n09585O46245K10888o61454J42306J35327
1714B5965n31860O75148m60923K89329P01782k15963j287389P93382K08600j89081
1704H990Q625K29352P6494j133822N82079o21515J141046M29422j230658J82051
$$ plain form
1773 -405937 -213370 667476 192013 -333327 362781 -43797 -240985 -908031 -210698 -337892
1763 -337892 -32837 -283404 281679 619496 63626 440935 -81412 764770 -379596 -290502
1753 -290502 -162583 -175432 125286 85555 -829360 -502094 -412427 -295011 -448670 -542649
1743 -542649 -117621 -37918 151065 -128032 -149861 -249882 -73377 558404 200126 -519696
1733 -519696 80688 338588 -493844 27467 -103879 -134332 -239772 84760 -250980 -1212805
1723 -1212805 280289 -114872 62238 -447347 198898 409786 -251668 -109362 25965
1714 25965 -505895 169253 -291670 -2341 699441 483478 -803911 -10529 198071 8990
1704 8990 17615 246967 323461 -810361 -228282 -849797 291249 720671 -509987 -327936
1694c27936N55156j4679m30921O3986L47431p26164N73519M46854p91750L93058
1684H8554k13111m5012P3233j27139L50553m89390Q86749j067167M96287K64376
1674B17933j46938j35302L19381l82761k7090O54280o29150j02876K26830m86867
1664d92560R97885q9475o77292N13745j97772R57205p57121j65247K30597K12982
1654E32947K5382n02747M89828j29077K6079K2659M3279q37454J014950j187284
1644e01438J008679k56531M49104o05524K11972K80352p37021Q20727m08371L07627
1634E69576p6701j23388R13585q44522j97053K85273p42170O45047R8256l68098
1624A59805O35461l71512l25296m70756M29832r55322O18528P90882K2935j12218
$$ plain form
1694 -327936 227220 212541 -218380 -154394 193037 -533127 40392 487246 -304504 88554
1684 88554 -124557 -169569 -96336 -223475 127078 -362312 524437 -542730 -46443 217933
1674 217933 70995 -64307 255074 -127687 -154777 499503 -129647 -232523 -5693 -492560
1664 -492560 505325 415850 -261442 252303 54531 1011736 254615 89368 319965 532947
1654 532947 558329 55582 545410 416333 442412 465071 508350 -329104 685846 -501438
1644 -501438 507241 250710 699814 94290 306262 586614 -150407 670320 261949 569576
1634 569576 492875 369487 1283072 438550 241497 526770 -215400 429647 527903 159805
1624 159805 795266 423754 98458 -372298 57534 -897788 -279260 511622 534557 422339
1614D22339o68270N0203P47137l13321R657K51875m42268O53684Q3513r94806
1604b00257P47525m87161l44492Q83685j009328M49886L26103o24634O43346L24230
1594G08903k33889M31283k15164O3108j354615O83652M10367K07953l82701L08118
1584F27015L6661m3739j71089k83234K14640o7229N6221Q4006L40596l30854l52981
1573A10013L23929j81194J50542j12676j60370N52042j61313J86666o46692M99482
1563E60429L58707l01984l53035L82601q14454J050634m37075N70969l02646n75681
1553A38465Q40571l07114k95716N61272j76802l55805L10377j35084k14136M00307
1543G66335l06035q7101q3338O10074j0223k8050q4597P74703j590050Q48114
$$ plain form
1614 422339 -245931 -195728 551409 238088 247745 499620 57352 711036 794549 -200257
1604 -200257 547268 60107 -284385 599300 -410028 39858 365961 -258673 384673 708903
1594 708903 475014 906297 691133 754241 -600374 83278 493645 701598 318897 627015
1584 627015 663676 619937 448848 165614 380254 313025 369246 453252 793848 462994 110013
1573 110013 433942 252748 403290 290614 130244 682286 520973 707639 60947 560429
1563 560429 919136 617152 264117 646718 -167736 882898 445823 1016792 714146 138465
1553 138465 979036 671922 376206 937478 760676 404871 715248 580164 366028 766335
1543 766335 460300 373199 289861 899935 889712 861662 777065 1551768 -38282 809832
1533H09832M06808r40916P00469K18919l34686L84876n18231m10207M87802J67490
1523I72156j06269P62771q63688Q57100q55776R6236L95905k06721K21617R00313
1513B173644j483416N72308L00485l9080J57693m16765p2744L76546J22037L76457
1503B067165l69938K12634M00530p67390J219653K326m03777n1271n803N88796
1493B892925m79651J32273n58265P75437m30574R12618l05404P6586l18218L09065
1483C006792M77806N87119n09681L48047l37767J085790L8534Q95210j303403
1474D288447J44684k08726n310R36511k63053k60833J168630n63923K60727m5265
1464E451889J44181o44152N95152R5093K89318K6317j34192L53101j8673L1458
$$ plain form
1533 809832 1216640 275724 976193 1195112 860426 1245302 727071 316864 804666 972156
1523 972156 865887 1628658 764970 1622070 766294 862530 1258435 1051714 1273331 2173644
1513 2173644 690228 1262536 1563021 1523941 1681634 1264869 1192125 1568671 1690708 2067165
1503 2067165 1697227 1909861 2310391 1543001 2762654 2764980 2361203 2309932 2304129 2892925
1493 2892925 2413274 2545547 1987282 2762719 2332145 3244763 2939359 3015945 2697727 3006792
1483 3006792 3484598 4071717 3562036 3910083 3572316 4658106 4696640 5591850 4288447
1474 4288447 4433131 4224405 4219095 5155606 4892553 4631720 5800350 5236427 5497154 5451889
1464 5451889 5596070 4951918 5547070 5642163 5931481 5957798 5823606 6176707 6158034 6189492
1454F189492R53240j11720Q85881o71602R62210P15309r874L77130J462689J178199
1444A1930954M44008J892662j582631j032685m52836o10790m20952k61527r0833
1435I815370M67423q40230J51766l81373J175092R1308q29627O57218j6662L46682
1425A0636967k03312J014367K18631R63757Q26425O51341J244693J191493K79737
1416A6824099K105711L96633K015138K498918J453889K939440L109722M013412
1408C5356962N845376Q602820R378225Q564162J1300266J735672j2617161p895064
1400F0271258l919491L03981n69266p821305j0083077o758023n047843l846253
1392B2529981k145956k408207j638384j521922j842525m77373j012396q75940
$$ plain form
1454 6189492 7142732 7031012 7916893 7245291 8207501 8922810 8912936 9290066 10752755 11930954
1444 11930954 12374962 14267624 12684993 11652308 11199472 10588682 10167730 9906203 9815370
1435 9815370 10282793 9442563 9594329 9212956 10388048 10479356 9649729 10306947 10290285 10636967
1425 10636967 10433655 11448022 11666653 12630410 13456835 14108176 15352869 16544362 16824099
1416 16824099 18929810 19326443 21341581 23840499 25294388 28233828 31343550 35356962
1408 35356962 41202338 49805158 59183383 67747545 79047811 80783483 68166322 60271258
1400 60271258 56351767 56655748 56086482 48265177 38182100 31424077 26376234 22529981
1392 22529981 20384025 17975818 16337434 14815512 12972987 12495614 11483218 10607278
1384A0607278p70758r12122o49792l14010r31422p72473n87848n55162P24740
1375E838431j096339m94932J20682m40903l51892n5547p76877Q99351j202683
1366B439291J59416o21819J210975n66847j24113r33071m0042P19531k64882n77495
1356A400944M71904m66532M89780K21482r55959J51715j84355L26507J87672J70564
1346A813722l18486k12220Q5029q19008J10500N99133j22368N08916n78698K47461
1336A313981L92665j210608o89214J715911j13773q00335M41341o25633j27075
1327B97260Q58244j146731L25717J54941l00366J040844o99258K46468j75350
1318F01769k68700k32642J42781j9366k17269L32148o13662P85179m29621N20874
$$ plain form
1384 10607278 9836520 8924398 8274606 7960596 7029174 6256701 5668853 5113691 5838431
1375 5838431 4742092 4247160 4367842 3926939 3575047 3519500 2742623 3641974 2439291
1366 2439291 2598707 1976888 3187863 2621016 2496903 1563832 1523790 2243321 1978439 1400944
1356 1400944 1872848 1406316 1896096 2117578 1161619 1313334 1128979 1455486 1643158 1813722
1346 1813722 1495236 1283016 1368045 549037 659537 1258670 1136302 1645218 1066520 1313981
1336 1313981 1706646 496038 -193176 1522735 1408962 608627 1049968 424335 297260
1327 297260 1155504 8773 334490 489431 189065 1229909 530651 777119 601769
1318 601769 333069 100427 243208 223842 6573 338721 -274941 510238 80617 601491
1308F01491m24005M2285o2542M63509o4689K6060l34294m32807L41596k24546
1298f7942N65657l87905q1020l6816L5272M30350l51729J61564o54308Q59073
1288D72196k72807O99641q14728J96039n5241O29938m45326r52575L08759n64833
1278g98937J263473O28254j441637Q59447p92402M40165l66623J373277j263457
1269i8440j4814L8236j007347N00466M05289M0213j418603J754427j387876J076909
1259a11540l13758J52246Q96079k39355q26411K44876p3768M02653m36322M90737
1249A85437M69754k34430j107130L66556n18057N57560q0074K56269L42970k08082
1239C0773o6187L12609n24055q03739J515972j349606M01255k19001N39807n99570
$$ plain form
1308 601491 177486 219771 157229 620738 556049 582109 247815 -184992 156604 -67942
1298 -67942 497715 109810 28790 -8026 27246 457596 105867 267431 -386877 472196
1288 472196 199389 899030 84302 280341 225100 855038 409712 -542863 -234104 -798937
1278 -798937 464536 1092790 -348847 510600 -281802 158363 -208260 1165017 -98440
1269 -98440 -113254 -75018 -1082365 -581899 -176610 -136397 -1555000 199427 -1188449 -111540
1259 -111540 -425298 -273052 623027 383672 -442739 -197863 -271631 131022 -305300 185437
1249 185437 655191 420761 -686369 -319813 -837870 -280310 -360384 -104115 238855 30773
1239 30773 -35414 277195 -246860 -1050599 465373 -884233 -482978 -701979 -162172 -761742
1229g61742K26876J252240j376179L62816L57522j74218m22029M69741q46194
1220i11167J159185m34583m73966N75595k98382k31377O6977M0574N21629p44035
1210g29550L98735q8587M03671m71710M89609J51660o80584J13199l56488N37164
1200b32881j25300N38007j91882n82287K36275k14350L47526m15961J52740J31575
1190c56538j23714N0502l66740M12198P0459M37917p10883J95269K31387o0495
1180b20638L16728r13179p5919Q43288M03432n84480N36324J05926k65590m59107
1170c13215M78697m02454L29833M66728o57931J073196p29563p05641L24953J57063
1160B1666Q02526j227297m71359N56251l18668N3718l63108R46778k00245N16180
$$ plain form
1229 -761742 -534866 717374 -658805 -295989 61533 -112685 -534714 -64973 -911167
1220 -911167 248018 -186565 -660531 -84936 -383318 -614695 -547718 -507144 14485 -729550
1210 -729550 -330815 -419402 -15731 -487441 2168 153828 -526756 -413557 -770045 -232881
1200 -232881 -358181 179826 -12056 -594343 -358068 -572418 -224892 -640853 -488113 -356538
1190 -356538 -480252 -429750 -796490 -384292 -313833 124084 -586799 -391530 -160143 -220638
1180 -220638 96090 -817089 -893008 -49720 353712 -230768 305556 411482 145892 -313215
1170 -313215 165482 -236972 92861 559589 -98342 974854 245291 -460350 -135397 21666
1160 21666 824192 -403105 -874464 -318213 -636881 -583163 -946271 507 -199738 316442
1150C16442k70020m68198K3672L07577p91733l06152R67103K81240l03094l92923
1140f36086K20140p23381N06873j22587N84231J69497l01575r07575J474609r45903
1130f81757O69861n34915P06674p9138J89619K19096r77304M2682o24616L39244
1120g30554P52881n66388L48077j68060k26433K52986N31965o37590N26781o28942
1110e45277n39063L72119L17693K24518o95313P51341n69722N81707l43732q67148
1100a312877J076837J05052P1600n15775K93587j81163J240977n75156j085772
1091h82690O58791R3187P3155j77892L8088N5816R0166j73754n12568P8854Q17792
1080A58945q66873P14316r10724O14826p21148J253058j253937R48712l33686
$$ plain form
1150 316442 46422 -421776 -398104 -90527 -882260 -1188412 -221309 59931 -243163 -636086
1140 -636086 -415946 -1139327 -632454 -755041 -170810 -1313 -302888 -1210463 264146 -681757
1130 -681757 -11896 -546811 159863 80725 270344 489440 -487864 -445182 -1069798 -730554
1120 -730554 22327 -544061 -195984 -364044 -590477 -337491 194474 -443116 83665 -545277
1110 -545277 -1084340 -712221 -394528 -170010 -865323 -113982 -683704 -101997 -445729 -1312877
1100 -1312877 -236040 -130988 -59388 -575163 -281576 -462739 778238 203082 -882690
1091 -882690 -223899 -130712 -57557 -235449 -197361 -141545 -51379 -225133 -737701 -658847 158945
1080 158945 -707928 6388 -904336 -289510 -1010658 242400 -1011537 -62825 -396511
1071c96511r7263J74191k66839R8181Q0660m40277N49039k60637Q79836j376736
1061a056356P70708j94688r59762J239824n75228j57214j0379O56184n34551L10899
1051e10563M28061l53844L53264r03680k9741O7711Q6443m63K62850J09594L59047
1040a31321p70003J44844k28208L47937O1478M97690l94591j07316l15433P95552
1030i9371j068732k49689O78498K00875K96172M31694n98204m98540J13499K59689
1020e34109k69230M19136l2207P97155j181364J76283K38576l27241J56384O17581
1010F0964n78655j01390k95170O5854P10097N7950N686m38911N23088n97555n35711
999a123753J099519J1933p76357K72839P37993n88403k68840N73115K73482j60364
$$ plain form
1071 -396511 -493774 -319583 -586422 -488241 -407581 -847858 -298819 -559456 320380 -1056356
1061 -1056356 -285648 -480336 -1440098 -200274 -775502 -932716 -943095 -286911 -821462 -510563
1051 -510563 -82502 -436346 -83082 -986762 -1016503 -948792 -862349 -862812 -599962 -490368 -131321
1040 -131321 -901324 -756480 -984688 -636751 -575273 -77583 -472174 -579490 -894923 -99371
1030 -99371 -1168103 -1417792 -739294 -538419 -242247 189447 -408757 -907297 -793798 -534109
1020 -534109 -803339 -384203 -416410 380745 -800619 -624336 -385760 -713001 -556617 60964
1010 60964 -517691 -619081 -914251 -848397 -138300 -80350 -74664 -513575 9513 -588042 -1123753
999 -1123753 -24234 -12301 -788658 -515819 222174 -366229 -635069 -61954 211528 51164
989E1164k72366j008403J525993k96663m55003N21281j025476J132194l52270
980a79549J30761o17541K15470O30151p29009q55785K63220P9258O67322R4608
970c01094k13519j59613m25934J049140n69558Q19943j264537O25281o80892N65159
960e55624L85264k77171k88990M14030k98959M71309n48547J48693O31584j10025
950b8436P9682n02897j08267k0678O00048L34386j729318J007283K44518q0647
940b04326j17271M19328n43529R75345j290006o5634J58494L06123J23021N06643
930B68188q95053M04446k95493J36122O4112j54401n59814M44597K51826J27084
920b08386l56972o3208r180N0270Q65893j367909K76060R91852q58034M23369
$$ plain form
989 51164 -221202 -1229605 296388 -275 -455278 66003 -959473 172721 -179549
980 -179549 -48788 -666329 -450859 179292 -549717 -1405502 -1142282 -1063024 -395702 -301094
970 -301094 -514613 -674226 -1100160 -51020 -620578 199365 -1065172 -439891 -1120783 -555624
960 -555624 -170360 -447531 -736521 -322491 -621450 -150141 -698688 -549995 81589 -28436
950 -28436 51246 -451651 -559918 -580596 19452 353838 -1375480 -368197 -123679 -204326
940 -204326 -321597 97731 -445798 529547 -760459 -826093 -667599 -361476 -238455 268188
930 268188 -626865 -222419 -517912 -381790 -317678 -472079 -1031893 -587296 -335470 -208386
920 -208386 -565358 -628566 -637746 -587476 278417 -1089492 -813432 178420 -679614 -256245
910b56245m02638L09371k6520o50708O17241j36335o71293O42080j22479J86170
900e11356M5932p78907L59744P49215o73304R37208n62608j22255Q9679o710l011
889d76373m08314R80038o05253q2234J26282K67858J46943m66632l2455m01974
879i52114Q10074l17362Q04676r28537k1657O06419o95507k65167O75323m26836
869g10688N871R8317n90579R29471n07563Q60429q07079K13859j88057k124Q08642
858A10499J03172j129624J901N05859k12820l57863Q97002m86357k18544j42043
848i28818L29092l26052J81923l823j80350J020893n41316J0158M10275m03743
838d31761r9140Q63253j392314J460281p29954o98889K65919N21797l56711M79967
$$ plain form
910 -256245 -658883 -349512 -376032 -1026740 -409499 -545834 -1217127 -575047 -697526 -511356
900 -511356 -465424 -1244331 -884587 -135372 -808676 128532 -434076 -556331 -466652 -473362 -476373
889 -476373 -884687 95351 -509902 -592136 -465854 -197996 -51053 -517685 -550140 -952114
879 -952114 -142040 -459402 345274 -583263 -604920 1499 -694008 -959175 -283852 -710688
869 -710688 -704817 -606500 -1197079 -267608 -775171 85258 -721821 -507962 -696019 -698143 110499
858 110499 213671 -915953 -914052 -408193 -621013 -978876 -81874 -568231 -786775 -928818
848 -928818 -599726 -925778 -743855 -747678 -928028 92865 -448451 -438293 -28018 -431761
838 -431761 -530901 332352 -1059962 400319 -329635 -1028524 -762605 -240808 -597519 -117552
828a17552J91252r20049k61414K41336R62743k39537p62616M71869o24426J697190
818F38796j301052K36775K40146J50422n30037j2678P00420m3164m56420L03575
808g3217l71558m755L85221K05025p28003j02376P71150k42256j1895K2791J96415
797D6542l43810m68443Q64485o89904Q03931o71881o17174O03491m85352M58302
787d99813k36405J68365l0997j15942O98175n15485l68656N88437L44573k73620
777b41368M50609j027352L08399n59396P73791L57514m40907k14751R0745K22192
767b80524n75507K45113O14961l14360L59660M88693p63430p32709N23915J65382
757b68806k47849L65927n27328N22057k17888m15105M8491l94393R56507j167752
$$ plain form
828 -117552 73700 -846349 -1107763 -866427 96316 -143221 -905837 -433968 -1058394 638796
818 638796 -662256 -425481 -185335 -34913 -564950 -577628 122792 79628 -376792 -73217
808 -73217 -444775 -449530 -64309 140716 -587287 -689663 81487 -160769 -172664 -149873 46542
797 46542 -297268 -765711 98774 -591130 212801 -459080 -1076254 -472763 -958115 -499813
787 -499813 -736218 -567853 -598850 -714792 -16617 -532102 -900758 -312321 32252 -241368
777 -241368 209241 -818111 -509712 -1069108 -295317 62197 -378710 -593461 -502716 -280524
767 -280524 -856031 -610918 4043 -310317 49343 538036 -225394 -958103 -434188 -268806
757 -268806 -516655 -150728 -678056 -155999 -373887 -788992 -740501 -1134894 -178387 -1346139
747a346139J165835o12483M50538j50613L7605l19233L24533L57972k64068o22329
737i78382J19580K91152N10171n22080K02115R3351k65449j34850J253039j037035
727d68388m85680N52644j40340m88739N89494n63866O88713l92855j92031l00466
717a201514J020003m50479n71002O82037m55056J89751J098154n56195o38145
708h82446N97371k46563Q89235m50781n90394M19530N09900j55020r29988O03213
698b35943l18449O05329J1535r58486P05350q04409Q83858j407832J044949J43757
688c30341j41442L02521o15513N04980n81422O11708r10164K0297N98548K60928
678b79900k16925q9947K96704m97860j56831M94888M36492K41220o48366P11242
$$ plain form
747 -1346139 -180304 -792787 -342249 -492862 -455257 -774490 -449957 -91985 -356053 -978382
737 -978382 -858802 -567650 -57479 -579559 -377444 -284093 -549542 -684392 568647 -468388
727 -468388 -954068 -401424 -541764 -1030503 -441009 -1004875 -316162 -709017 -901048 -1201514
717 -1201514 -181511 -631990 -1202992 -520955 -976011 -786260 311894 -244301 -882446
708 -882446 -285075 -531638 357597 -93184 -683578 -264048 245852 90832 -839156 -235943
698 -235943 -554392 50937 62472 -896014 -190664 -995073 -111215 -1519047 -474098 -330341
688 -330341 -471783 -169262 -784775 -279795 -861217 -249509 -1159673 -1139376 -540828 -279900
678 -279900 -496825 -586772 -290068 -787928 -944759 -449871 -13379 227841 -420525 290717
668B90717j102223J70833M35926o99486N96050M4216L71332j37959j65355o73401
658h69350K22177L24168k78312p37396N61066K88803k45569R90304q33384N65465
648a2028n09839N93860p33226K52761k31238K58705Q14020j081356O63134o20020
638f05227R97444p61703r8699K40806o70549K69701O96236k13181k33118K50581
628a27709l30099P03333q06867m7468Q50388j45162p87834l43146Q12836k91666
618e13394R1937M4327j09734K07769L05875m17974K48794K0189l93578j14761
608f30550L08379k28061m848K75265o84804J29841J95884P3409L89768l48949
598e24666k15618P44925j103357L71807M72473l58191O15344m66977J15612R8534
$$ plain form
668 290717 -811506 -640673 -204747 -904233 -308183 -263967 107365 -30594 -195949 -869350
658 -869350 -647173 -323005 -601317 -1338713 -777647 -488844 -734413 255891 -577493 -12028
648 -12028 -521867 71993 -661233 -408472 -639710 -381005 433015 -648341 14793 -605227
638 -605227 392217 -369486 -468185 -227379 -897928 -628227 68009 -145172 -378290 -127709
628 -127709 -457808 245525 -561342 -608810 241578 96416 -691418 -1034564 -221728 -513394
618 -513394 -421457 -377130 -486864 -279095 26780 -391194 -142400 -122211 -515789 -630550
608 -630550 -322171 -550232 -555080 -279815 -964619 -834778 -638894 -565485 -175717 -524666
598 -524666 -740284 4641 -1098716 -726909 -254436 -612627 2717 -464260 -348648 -250114
588b50114j13859k29707N26206n41305n56626M30491r5838M6496L20253l70213
578h34216L53641r23107O05045j91689N79407J94725o14829M88172l80653l24717
568a048221M58581L04697k69630J86650o1731m4741l53746N13595n17077Q48098
558A6475n09648P45703r26143O5638M81767k56837P5414j24844r834l37330L77290
547d02349K25878o7033n25158J36227k45306j69508j7664L2268P11999m90979
537h11625K15277K15878j67616n8010Q44246o12090k21661l05636J37289Q96208
527A32260j219218L67787J17089K29272m59224l25757J011747l65196j3784J7440
517e07584M59930l09880L30384l59611K8835k4642j152932J165841K40350m29098
$$ plain form
588 -250114 -363973 -593680 -67474 -608779 -1165405 -734914 -830752 -784256 -464003 -834216
578 -834216 -480575 -1403682 -798637 -990326 -410919 -216194 -831023 -342851 -723504 -1048221
568 -1048221 -589640 -284943 -554573 -367923 -429654 -474395 -828141 -314546 -831623 16475
558 16475 -493173 252530 -673613 -607975 -126208 -383045 -307631 -432475 -442309 -779639 -402349
547 -402349 -176471 -243504 -768662 -632435 -877741 -1047249 -1064913 -1032645 -320646 -811625
537 -811625 -596348 -380470 -548086 -606096 238150 -373940 -595601 -901237 -763948 132260
527 132260 -1086958 -719171 -602082 -372810 -832034 -1157791 -146044 -511240 -525024 -507584
517 -507584 -47654 -357534 -27150 -386761 -357926 -382568 -1535500 -369659 -129309 -558407
507e58407L0740O73667k95860m91736j0815P38708k88327j01123k48643K17802
497c33994m57661J110917n27958P869m72028P37765q38921N75636m4680K30165
487a2890J42627l81329K55617j70609l93597j2280j14160L81643j89253o62570
477a156801Q87480l96943J16868J99097l47811M24143n94923O08127j28577j38253
467e27593K08619k05218P93807M1680j235390Q06528m02088n86225J406999q87359
457e86240k81867K50815N7330l98151P6396K82066J95742M13792L23487J6093
447C49463j047019j23961M47057Q11352n03645p25539J33197P149M47492L68478
437A64024l99950k36580M11150p15631l08143Q01461l12892K1264l50307L00072
$$ plain form
507 -558407 -527667 146000 -149860 -641596 -652411 86297 -202030 -303153 -551796 -333994
497 -333994 -791655 319262 -208696 -200827 -672855 64910 -774011 -198375 -243055 -12890
487 -12890 129737 -251592 4025 -166584 -560181 -572461 -686621 -304978 -494231 -1156801
477 -1156801 -269321 -666264 -549396 -350299 -698110 -273967 -868890 -260763 -389340 -527593
467 -527593 -318974 -524192 269615 311295 -924095 -117567 -519655 -1105880 301119 -586240
457 -586240 -868107 -617292 -559962 -958113 -881717 -599651 -403909 9883 333370 349463
447 349463 -697556 -821517 -374460 436892 -66753 -792292 -659095 -651946 -204454 164024
437 164024 -235926 -472506 -61356 -776987 -1085130 -283669 -596561 -575297 -925604 -625532
427f25532M75082K1110j30359j378782J098783M6713j020040Q99851J65341O02782
417A54949o48081N29696m36736K68592q40791K18621Q91729j006859N56712j81414
407d93582N17672r57698p3660R53332j01846p55048K81196M95823q4391N00317
397B82115j237014Q96166L2548m64949O23553K59755p62654N04882r31382O08701
387a88279n72437j38342J34824N78013K36188p36757J16611O85936j364486K69559
377i79170M38739K73829L04734q20692L01954k78395M60694P4243l30974k58917
367h13955M3588Q15149q28239N31642l1875n90463Q60861j186830N08754l49789
357a041157R77536j038262M73950k05319P19759j38915l96801J33021Q3192o28644
$$ plain form
427 -625532 -150450 -129340 -259699 -1638481 -539698 -492985 -1513025 -613174 -447833 154949
417 154949 -493132 36564 -400172 -131580 -972371 -753750 137979 -868880 -312168 -493582
407 -493582 24090 -933608 -1007268 -53936 -155782 -910830 -629634 -133811 -218202 282115
397 282115 -954899 -58733 -26185 -491134 132419 392174 -370480 134402 -796980 -188279
387 -188279 -760716 -899058 -764234 -186221 49967 -686790 -570179 115757 -1248729 -979170
377 -979170 -540431 -266602 38132 -782560 -480606 -759001 -298307 -224064 -555038 -813955
367 -813955 -770367 44782 -783457 -251815 -283690 -874153 -13292 -1200122 -691368 -1041157
357 -1041157 -63621 -1101883 -627933 -833252 -113493 -252408 -649209 -516188 -432996 -1061640
347a061640L11992n5481J22528O25755O0174j034323M62315O0226J18420L23476
337f6558j72303J5210m17964j64510N71946r1637k77829O00485j169341O34141
327e38360O51965p51418j16079L97597k37414J82117q02291J284953o12083L5720
317e05293L20334K34072r108p42541J036494j067124o07511J497836q50815L82634
307c11022o01534N19192n44979P3404O45188q04422J322630j230088J055804K70164
297C94337J6852l59306r55820K64115j52751k97155M10732O73577k79911k40965
287e26295o34056J328154q10989O38783n14693l17844M17718L07597o14491O65932
277f0184j94647j63929q76058M88969N21458R4361m4832O6163l94355M494k60001
$$ plain form
347 -1061640 -749648 -805129 -682601 -56846 3328 -1030995 -568680 -508454 -390034 -66558
337 -66558 -238861 -223651 -641615 -806125 -234179 -325816 -603645 -3160 -1172501 -538360
327 -538360 113605 -637813 -753892 -356295 -593709 -411592 -1213883 71070 -541013 -505293
317 -505293 -184959 49113 40005 -702536 333958 -733166 -1340677 157159 -693656 -311022
307 -311022 -912556 -393364 -938343 -864939 -219751 -1024173 298457 -931631 124173 394337
297 394337 411189 51883 -903937 -639822 -792573 -1089728 -678996 -5419 -285330 -526295
287 -526295 -1160351 167803 -643186 -4403 -519096 -836940 -419222 -111625 -726116 -60184
277 -60184 -254831 -418760 -1294818 -805849 -284391 -190030 -234862 -168699 -563054 -558560 -818561
266h18561K03873N51169r86740k177N80193J01467J05633m50451O2801k89482
$$ plain form
266 -818561 -614688 -63519 -1050259 -1052436 -472243 -370776 -265143 -715594 -652793 -942275
$$ [...]
##END NTUPLES=NMR SPECTRUM
##END=
