##TITLE=abcd
##JCAMPDX= 6.0         $$ Bruker NMR JCAMP-DX V2.0
##DATA TYPE= NMR SPECTRUM
##DATA CLASS= NTUPLES
##ORIGIN= UXNMR, Bruker Analytische Messtechnik GmbH
##OWNER= root
$$ XWIN-NMR		Version 3.5
$$ Mon Jul 27 17:45:56 2026 Russian Standard Time (UT+4h)  servis@DPX200
##.OBSERVE FREQUENCY= 200.131235884673
##.OBSERVE NUCLEUS= ^1H
##.ACQUISITION MODE= SIMULTANEOUS
##.ACQUISITION SCHEME= undefined
##.AVERAGES= 32
##.DIGITISER RES= 18
##SPECTROMETER/DATA SYSTEM= spect
##.PULSE SEQUENCE= zg
##.SOLVENT NAME= MeOD
##.SHIFT REFERENCE= (INTERNAL, MeOD, 0, 16.4885)
##AUDIT TRAIL= $$ (NUMBER, WHEN, WHO, WHERE, WHAT)
$$ ##TITLE= Audit trail, XWIN-NMR		Version 3.5
$$ ##JCAMPDX= 5.01
$$ ##ORIGIN= Bruker BioSpin GmbH
$$ ##OWNER= servis
$$ F:\spectra/data/av/nmr/H1/1/pdata/1/auditp.txt
$$ ##AUDIT TRAIL=  $$ (NUMBER, WHEN, WHO, WHERE, WHAT)
(   1,<2026-07-27 17:42:30.04 +0400>,<servis>,<DPX200>,
      <created by zg, POWCHK disabled, PULCHK disabled
       configuration hash MD5:
       00 E9 B6 7A A2 85 ED C7 34 08 36 98 17 FE 4E 26
       data hash MD5: 32K
       41 D3 71 8E 98 6B 9B 4F 7B 6F A2 BA B1 CA 33 2C>)
(   2,<2026-07-27 17:45:04.15 +0400>,<servis>,<DPX200>,
      <Start of raw data processing
       efp BC_mod = 2 LB = 0.05 FT_mod = 6 PKNL = 1 PHC0 = -413.7321 PHC1 = 3.101563 SI = 16K 
       data hash MD5: 16K
       92 A5 26 D6 31 7F FD 03 70 E5 77 D9 ED 39 B4 83>)
(   3,<2026-07-27 17:45:19.93 +0400>,<servis>,<DPX200>,
      <pk PHC0 = -3.6 PHC1 = 0 
       data hash MD5: 16K
       8E D6 49 55 3D 6F A1 8B 91 D8 6E 03 93 43 5F BE>)
$$ ##END=
$$ 
$$ hash MD5
$$ 48 A8 B4 A9 94 14 36 B1 1D 1B 13 7F 3D 33 BC D8
##$RELAX= 
##$RELAX= 
##$RELAX= 
##$RELAX= 
##$RELAX= 
##$RELAX= 
##$RELAX= 
##$RELAX= 
$$ Bruker specific parameters
$$ --------------------------
##$DU= <F:\spectra>
##$EXPNO= 1
##$NAME= <H1>
##$PROCNO= 1
##$TYPE= <nmr>
##$USER= <av>
##$AMP= (0..31)
100 100 100 100 100 100 100 100 100 100 100 100 100 100 100 100 100 100 
100 100 100 100 100 100 100 100 100 100 100 100 100 100 
##$AQSEQ= 0
##$AQ_mod= 1
##$AUNM= <au_zg>
##$AUTOPOS= <>
##$BF1= 200.13
##$BF2= 200.13
##$BF3= 200.13
##$BF4= 200.13
##$BF5= 500.13
##$BF6= 500.13
##$BF7= 500.13
##$BF8= 500.13
##$BYTORDA= 1
##$CFDGTYP= 0
##$CFRGTYP= 5
##$CHEMSTR= <none>
##$CNST= (0..31)
1 1 145 1 1 1 1 1 1 1 1 1 1 1 1 1 1 1 1 1 1 1 1 1 1 1 1 1 1 1 1 1 
##$CPDPRG= <>
##$CPDPRG1= <>
##$CPDPRG2= <>
##$CPDPRG3= <>
##$CPDPRG4= <mlev>
##$CPDPRG5= <mlev>
##$CPDPRG6= <mlev>
##$CPDPRG7= <mlev>
##$CPDPRG8= <mlev>
##$CPDPRGB= <>
##$CPDPRGT= <>
##$D= (0..31)
0 2 0 0 0 0 0 0 0 0.06 0 0 0 0 0 0 0.0002 0 0 0 0 0 0 0 0 0 0 0 0 0 0 
0 
##$DATE= 1785159749
##$DBL= (0..7)
120 120 120 120 120 120 120 120 
##$DBP= (0..7)
150 150 150 150 150 150 150 150 
##$DBP07= 0
##$DBPNAM0= <>
##$DBPNAM1= <>
##$DBPNAM2= <>
##$DBPNAM3= <>
##$DBPNAM4= <>
##$DBPNAM5= <>
##$DBPNAM6= <>
##$DBPNAM7= <>
##$DBPOAL= (0..7)
0.5 0.5 0.5 0.5 0.5 0.5 0.5 0.5 
##$DBPOFFS= (0..7)
0 0 0 0 0 0 0 0 
##$DE= 6
##$DECBNUC= <off>
##$DECIM= 32
$$ [...]
##$SUBNAM4= <"">
##$SUBNAM5= <"">
##$SUBNAM6= <"">
##$SUBNAM7= <"">
##$SUBNAM8= <"">
##$SUBNAM9= <"">
##$SW= 20.6817932712277
##$SWIBOX= (0..15)
0 0 3 0 0 0 0 0 0 0 0 0 0 0 0 0 
##$SW_h= 4139.07284768212
##$TD= 32768
##$TD0= 1
##$TE= 0
##$TE2= 300
##$TE3= 300
##$TEG= 300
##$TL= (0..7)
0 120 120 120 120 120 120 120 
##$TP= (0..7)
150 150 150 150 150 150 150 150 
##$TP07= 0
##$TPNAME0= <>
##$TPNAME1= <>
##$TPNAME2= <>
##$TPNAME3= <>
##$TPNAME4= <>
##$TPNAME5= <>
##$TPNAME6= <>
##$TPNAME7= <>
##$TPOAL= (0..7)
0.5 0.5 0.5 0.5 0.5 0.5 0.5 0.5 
##$TPOFFS= (0..7)
0 0 0 0 0 0 0 0 
##$TUNHIN= 0
##$TUNHOUT= 0
##$TUNXOUT= 0
##$USERA1= <user>
##$USERA2= <user>
##$USERA3= <user>
##$USERA4= <user>
##$USERA5= <user>
##$V9= 5
##$VALIST= <valist>
##$VCLIST= <CCCCCCCCCCCCCCC>
##$VD= 0
##$VDLIST= <DDDDDDDDDDDDDDD>
##$VPLIST= <PPPPPPPPPPPPPPP>
##$VTLIST= <TTTTTTTTTTTTTTT>
##$WBST= 1024
##$WBSW= 30
##$XGAIN= (0..3)
0 0 0 0 
##$XL= 0
##$YL= 0
##$YMAX_a= 1568067
##$YMIN_a= -1824452
##$ZGOPTNS= <>
##$ZL1= 120
##$ZL2= 120
##$ZL3= 120
##$ZL4= 120
##$ABSF1= 0
##$ABSF2= 0
##$ABSG= 0
##$ABSL= 0
##$ALPHA= 0
##$AQORDER= 0
##$ASSFAC= 0
##$ASSFACI= 0
##$ASSFACX= 0
##$ASSWID= 0
##$AUNMP= <proc_1d>
##$AZFE= 0.1
##$AZFW= 0.1
##$BCFW= 0
##$BC_mod= 2
##$BYTORDP= 0
##$COROFFS= 0
##$CY= 18.4799938201904
##$DATMOD= 1
##$DC= 0
##$DFILT= <>
##$DTYPP= 0
##$F1P= 9.9274215381318
##$F2P= -0.165520771350173
##$FCOR= 1
##$FTSIZE= 16384
##$FT_mod= 6
##$GAMMA= 0
##$GB= 0
##$INTBC= 1
##$INTSCL= 4.127829e-11
##$ISEN= 128
##$LB= 0.05
##$LEV0= 0
##$LPBIN= 0
##$MAXI= 10000
##$MC2= 0
##$MEAN= 0
##$ME_mod= 0
##$MI= 50
##$NCOEF= 0
##$NC_proc= -1
##$NLEV= 6
##$NOISF1= 3.799351
##$NOISF2= 2.8
##$NSP= 0
##$NTH_PI= 0
##$NZP= 0
##$OFFSET= 16.48848
##$PC= 4
##$PHC0= -417.3321
##$PHC1= 3.101563
##$PH_mod= 1
##$PKNL= yes
##$PPARMOD= 0
##$PSCAL= 4
##$PSIGN= 0
##$REVERSE= no
##$SF= 200.130005582386
##$SI= 16384
##$SIGF1= 3
##$SIGF2= 2
##$SINO= 400
##$SIOLD= 16384
##$SREGLST= <1H.CDCl3>
##$SSB= 0
##$STSI= 16384
##$STSR= 0
##$SW_p= 4139.07284768211
##$SYMM= 0
##$S_DEV= 0
##$TDeff= 32768
##$TDoff= 0
##$TI= <>
##$TILT= no
##$TM1= 0
##$TM2= 0
##$TOPLEV= 0
##$USERP1= <user>
##$USERP2= <user>
##$USERP3= <user>
##$USERP4= <user>
##$USERP5= <user>
##$WDW= 1
##$XDIM= 16384
##$YMAX_p= 399449359
##$YMIN_p= -70383
$$ End of Bruker specific parameters
$$ ---------------------------------
##NTUPLES= NMR SPECTRUM
##VAR_NAME=  FREQUENCY,     SPECTRUM/REAL,   SPECTRUM/IMAG
##SYMBOL=    X,             R,               I
##VAR_TYPE=  INDEPENDENT,   DEPENDENT,       DEPENDENT
##VAR_FORM=  AFFN,          ASDF,            ASDF
##VAR_DIM=   16384,         16384,           16384
##UNITS=     HZ,            ARBITRARY UNITS, ARBITRARY UNITS
##FACTOR=    0.252644378177508, 1,           1
##FIRST=     3299.83951724647, 0,            0
##LAST=      -839.233330435636, 0,           0
##MIN=       -839.233330435636, -70383,      0
##MAX=       3299.83951724647, 399449359,    0
$$ Real data points
##PAGE= N=1
##DATA TABLE= (X++(R..R)), XYDATA
$$ [...]
13872 -39866 -32831 -53313 -44211 -40920 -41321 -42475 -47809 -43655 -48180 -40840 -41795 -27874 -38840 -38040
13858 -38040 -43012 -46455 -39047 -35660 -41291 -38313 -45993 -45014 -44041 -39511 -37735 -44006 -39184 -42775 -44934
13843 -44934 -44085 -43645 -36299 -40504 -43616 -38550 -32659 -45775 -44490 -37931 -43412 -41103 -41494 -37680 -38151
13828 -38151 -41739 -43127 -33284 -41595 -44967 -38425 -31147 -44982 -39688 -46803 -40055 -45127 -34565 -35589
13814 -35589 -34162 -38315 -39746 -43340 -37488 -34037 -41600 -35005 -40146 -46000 -35970 -41863 -36142 -41636
13800 -41636 -44102 -48050 -38154 -35801 -36222 -39354 -42425 -45685 -40859 -30647 -37212 -33584 -43298 -38733
13786 -38733 -47946 -42627 -34463 -37146 -39079 -35809 -44929 -48529 -44838 -39390 -40006 -45614 -42128 -42073 -33442
13771 -33442 -45180 -34866 -39647 -34753 -38087 -39123 -39656 -45214 -29544 -46361 -41890 -43246 -37432 -36158
13757 -36158 -41254 -33700 -32820 -42256 -42539 -43384 -29380 -46467 -34624 -35013 -45218 -40845 -33040 -33382 -32970
13742 -32970 -35440 -32903 -39604 -41847 -36985 -30757 -33769 -38853 -38137 -46837 -40523 -40146 -32306 -39075 -43882
13727 -43882 -42354 -37443 -37188 -32402 -43312 -38247 -41099 -33406 -34273 -40463 -35683 -35389 -38965 -37136 -35554
13712 -35554 -38409 -30659 -29719 -32188 -35764 -35973 -39224 -35281 -32831 -33559 -42537 -35485 -31810 -45640 -27802
13697 -27802 -29843 -39678 -31309 -39890 -29811 -38551 -29693 -40044 -41880 -36287 -29444 -41409 -32530 -32943
13683 -32943 -41404 -41376 -36839 -36752 -42659 -43602 -41752 -41102 -37372 -38768 -36983 -38441 -39790 -29025 -29671 -30561
13667 -30561 -32434 -35308 -40242 -32020 -42357 -35199 -31223 -33566 -40077 -27796 -40210 -34274 -33450 -18183
13653 -18183 -36517 -35803 -34795 -35578 -32476 -25266 -29557 -35609 -40003 -28706 -35071 -33304 -30121 -31408
13639 -31408 -29399 -33135 -30073 -37551 -25518 -31873 -25656 -38131 -37779 -35374 -35400 -31415 -31243 -31622 -36964
13624 -36964 -32577 -38937 -26182 -28781 -25534 -29434 -34879 -37485 -34474 -20154 -23382 -35923 -28409 -31374
13610 -31374 -23911 -28045 -26137 -25178 -34481 -26855 -25679 -25581 -22083 -25978 -20333 -30416 -24843 -27727 -21144
13595 -21144 -14097 -17808 -22680 -21853 -15659 -28919 -25126 -28700 -15883 -17543 -26162 -17702 -22371 -23609
13581 -23609 -21246 -26501 -21101 -23460 -14783 -14395 -23218 -21850 -22333 -11959 -14378 -21388 -14709 -20410 -16206
13566 -16206 -16476 -10378 -7682 -8906 -11028 -12437 -17503 -15490 -15158 -10164 -4949 -8784 -4652 -6597 -6555
13551 -6555 -5706 3003 -718 -2161 -5176 -4965 1409 8817 1756 600 -3606 3672 2704 7477 13252
13536 13252 11095 7927 9034 6996 11755 16660 14868 17139 17838 12422 5849 8124 14285 19451 16629
13521 16629 22860 22130 16931 18842 33037 15000 23595 22583 32251 18500 26743 23504 26395 19733
13507 19733 22580 29713 31569 28036 28781 32501 28739 28108 23199 37725 34425 34973 29123 27189 27727
13492 27727 14406 25910 28808 27157 32812 26490 29824 20651 21118 23191 34966 23586 22402 16111
13478 16111 14202 16759 15802 19967 12699 19188 9935 15127 9996 10273 11521 9107 12862 6329 12321
13463 12321 5533 10464 7782 -4049 1645 330 8894 -2602 1633 -1150 -6775 -4739 -12593 1132
13449 1132 -4513 -6331 -9706 -4761 -12099 -4682 -6913 -5624 -10809 -4858 -18184 -7043 -14765 -12659
13435 -12659 -8064 -11821 -7299 -13626 -17109 -11025 -17185 -11192 -12403 -12727 -15585 -20511 -17366 -17888 -20166
13420 -20166 -21720 -16106 -18621 -18982 -22149 -11359 -17658 -23982 -24539 -25040 -21743 -18379 -23567 -22287 -32363
13405 -32363 -33539 -19564 -29993 -24665 -22852 -32673 -29841 -32111 -32023 -31464 -24547 -19361 -28731 -25776 -27958
13390 -27958 -35245 -19536 -32377 -20569 -22343 -28421 -23076 -29028 -24310 -33907 -21742 -24102 -29353
13377 -29353 -27498 -26223 -36164 -24656 -31507 -20621 -30313 -28317 -37452 -27246 -29547 -26310 -32085 -37189
13363 -37189 -29362 -34893 -36232 -38579 -29505 -35637 -36163 -33168 -34980 -29300 -30267 -33933 -34948 -26404 -42489
13348 -42489 -35616 -30879 -38141 -30108 -31966 -33368 -41525 -38956 -42871 -38998 -34253 -37123 -36125 -34741 -30284
13333 -30284 -33752 -31861 -34917 -43889 -45748 -35854 -34812 -35760 -41909 -32795 -37904 -41185 -33738 -35164 -28675
13318 -28675 -39198 -39448 -40741 -38181 -35127 -23063 -34598 -31204 -41536 -39684 -34466 -37031 -44435 -38392
13304 -38392 -40065 -42444 -41584 -38093 -42469 -40760 -39597 -38814 -38149 -34969 -32645 -38047 -24473 -34908 -41269
13289 -41269 -37197 -28978 -29542 -40443 -29037 -34845 -45035 -41750 -34207 -31309 -31062 -39334 -38576 -40282
13275 -40282 -46839 -34884 -27113 -24798 -35610 -42384 -44073 -39575 -31302 -42063 -35685 -40988 -40233 -48745
13261 -48745 -43572 -40370 -39739 -43698 -45532 -42284 -43176 -49965 -40742 -36161 -39959 -44695 -45981 -43990 -51420
13246 -51420 -34850 -29993 -37701 -43697 -47234 -45016 -42458 -43219 -41267 -38793 -42961 -47819 -47396 -29694
13232 -29694 -36484 -41463 -41484 -41985 -40932 -40474 -31068 -27307 -41754 -45147 -40003 -47019 -40397 -40468 -46510 -46562
13216 -46562 -52878 -41496 -39161 -43636 -41494 -39926 -36692 -39461 -48621 -43529 -41112 -35770 -42451 -46941
13202 -46941 -41840 -45988 -48146 -42796 -47511 -40526 -44007 -42353 -42437 -38305 -41200 -35085 -46578 -44727 -46906
13187 -46906 -41646 -40182 -40107 -47750 -40314 -40639 -45346 -40926 -41176 -39262 -45006 -43034 -38437 -36354 -45930
13172 -45930 -33152 -32460 -33317 -40575 -38762 -37132 -41538 -34639 -47870 -40169 -44780 -40948 -35865 -53403
13158 -53403 -42808 -39682 -47778 -38608 -39572 -44612 -35611 -46216 -44851 -42332 -40965 -44160 -47171 -36685
13144 -36685 -40291 -45418 -40862 -38410 -37151 -37779 -37527 -41570 -45359 -48078 -32286 -46850 -35961 -37316
13130 -37316 -47197 -39672 -43639 -38015 -39954 -42658 -35197 -47016 -42945 -41110 -47328 -32376 -46139 -45143
13116 -45143 -39799 -37624 -40047 -38568 -37915 -28511 -42925 -38785 -40226 -38944 -33991 -33529 -42174 -44315 -41302
13101 -41302 -43754 -42830 -44512 -41050 -42217 -42046 -38344 -41409 -44098 -38237 -43299 -43022 -37067 -38864 -38791 -39557
13085 -39557 -36482 -45569 -47904 -35699 -46555 -36820 -44767 -46630 -49391 -44592 -38486 -39646 -38381 -37568
13071 -37568 -35054 -43204 -43465 -41619 -38228 -35431 -38205 -42136 -38707 -35775 -28757 -45754 -27144 -39894
13057 -39894 -42899 -31676 -39528 -40452 -36627 -33987 -35793 -45986 -41182 -42753 -38254 -35178 -46256 -37696
13043 -37696 -35696 -42238 -45583 -49959 -44979 -42018 -44354 -45257 -45461 -45778 -41366 -39988 -41740 -43452 -44749
13028 -44749 -40036 -45421 -38952 -36674 -44307 -41123 -43037 -44349 -36888 -50146 -40000 -41743 -49787 -43288
13014 -43288 -43828 -38087 -35691 -37672 -36576 -51526 -44451 -38542 -41280 -40912 -39765 -39112 -36750 -36463 -33485
12999 -33485 -45445 -36381 -43143 -40808 -41889 -41378 -43420 -49211 -46908 -48503 -41231 -38313 -36671 -39939
12985 -39939 -46933 -39957 -44578 -43747 -34332 -34132 -48544 -46100 -53352 -49809 -54497 -50448 -43257 -43958 -48213
12970 -48213 -51969 -40751 -36976 -35479 -43738 -41593 -50081 -45457 -40376 -38459 -44218 -50621 -44596 -45320
12956 -45320 -46666 -37139 -42727 -44760 -41040 -46921 -45539 -41093 -42936 -36662 -51250 -36868 -42866 -42005
12942 -42005 -49040 -40826 -39342 -41833 -39783 -48846 -53913 -43033 -44732 -38962 -47017 -48336 -48674 -44429
12928 -44429 -41588 -38167 -38409 -47477 -36184 -43289 -32636 -38807 -48504 -52038 -46858 -49482 -42266 -45535
12914 -45535 -42260 -43506 -41139 -50137 -44222 -31676 -43500 -41155 -41891 -43433 -45266 -39745 -40660 -43647
12900 -43647 -47993 -40224 -43084 -53693 -51576 -44772 -47024 -51210 -38296 -35644 -45092 -40005 -49361 -40839
12886 -40839 -40530 -44206 -42785 -45691 -41561 -51637 -34936 -40301 -48722 -47237 -43367 -55755 -44844 -46509
12872 -46509 -42693 -46189 -46724 -45469 -45502 -39138 -37995 -49076 -32957 -42868 -40800 -40798 -46560 -44745 -43729
12857 -43729 -50248 -46559 -51463 -46348 -46250 -41817 -44472 -44352 -40467 -38925 -49231 -33483 -38145 -44918 -39498
12842 -39498 -35129 -42058 -38745 -40953 -45516 -46946 -39013 -45928 -46563 -38526 -47725 -40996 -47110 -40700 -43530
12827 -43530 -45512 -45263 -48559 -44143 -48682 -43759 -47348 -37789 -41409 -43256 -50527 -42826 -41667 -44376 -41578
12812 -41578 -40434 -45329 -40162 -47466 -38603 -42743 -41812 -39035 -37588 -47210 -36735 -29439 -40757 -40266
12798 -40266 -41950 -44681 -44389 -47985 -39778 -42043 -45582 -38430 -48688 -35523 -47788 -40705 -43386 -36363
12784 -36363 -42423 -38626 -40974 -30806 -45205 -39697 -39881 -49174 -40329 -38474 -42569 -47761 -38599 -37336
12770 -37336 -49767 -45240 -42520 -48468 -43477 -47054 -43996 -49921 -42446 -45528 -43761 -45856 -44118 -34966
12756 -34966 -46772 -41209 -47928 -46821 -37026 -48953 -43019 -47849 -42109 -48025 -44311 -41664 -44149 -35863
12742 -35863 -37228 -36935 -37344 -35790 -45368 -41232 -40602 -44744 -37991 -30763 -39902 -38017 -44137 -44294 -44293 -44544
12726 -44544 -39489 -30947 -42545 -35755 -36505 -48215 -44710 -31486 -38962 -38963 -43896 -35624 -40420 -36361 -39192
12711 -39192 -42751 -43580 -51376 -47349 -42986 -44522 -55795 -35175 -53073 -42614 -42466 -35434 -36484 -40319
12697 -40319 -44956 -42345 -41644 -39643 -39180 -37839 -43819 -48442 -45380 -47508 -40289 -49285 -42932 -40194 -33889
12682 -33889 -38678 -32440 -35645 -45407 -43000 -44618 -39026 -40345 -51898 -42347 -50127 -46527 -44539 -39960
12668 -39960 -42767 -51017 -42260 -41371 -46233 -43823 -36381 -30638 -45798 -47800 -48492 -47596 -46605 -37682 -42383
12653 -42383 -44292 -46423 -46894 -49576 -44236 -33125 -47613 -52777 -49315 -47115 -44025 -47759 -45671 -44490
12639 -44490 -48013 -39135 -39573 -38212 -47994 -42356 -50976 -42864 -37882 -41890 -32855 -48749 -46725 -51437
12625 -51437 -44765 -47154 -41284 -45340 -46958 -48861 -40831 -47501 -39276 -44015 -40710 -44560 -44314 -37833 -43858
12610 -43858 -39653 -42751 -41448 -48490 -42794 -49335 -34578 -44013 -31533 -49839 -43779 -43705 -34276 -43181
12596 -43181 -33773 -36018 -41581 -45152 -37483 -41531 -48277 -48804 -45057 -51407 -51384 -36947 -44915 -41297 -52346
12581 -52346 -40729 -43409 -49535 -39841 -50449 -44774 -45961 -46207 -36285 -49256 -42516 -40439 -52113 -54145
12567 -54145 -43834 -36383 -40700 -46740 -46258 -48390 -41903 -38078 -47004 -42352 -31842 -44910 -48809 -47134
12553 -47134 -35655 -41054 -45323 -46081 -44750 -55144 -40238 -45795 -46944 -48175 -46772 -47100 -49722 -47603
12539 -47603 -40030 -40949 -47531 -45969 -47016 -42841 -51660 -32049 -43803 -42380 -35617 -38315 -44913 -44307
12525 -44307 -50226 -40345 -48348 -36886 -41295 -39811 -47909 -47863 -36660 -52000 -39888 -47221 -31783 -40678
12511 -40678 -43707 -40758 -43827 -40444 -43007 -43896 -42558 -48205 -40794 -44422 -47707 -51037 -39960 -44830
12497 -44830 -45615 -40102 -47512 -45807 -43236 -45043 -42245 -25213 -33680 -40193 -40259 -44464 -44686 -43155 -42883
12482 -42883 -35470 -38721 -45066 -40918 -41259 -46851 -42038 -34392 -50840 -39521 -38130 -37941 -34572 -36680
12468 -36680 -46994 -47121 -42958 -43172 -34452 -40545 -38268 -47619 -46848 -47091 -46870 -40235 -39499 -40387 -50058 -35381
12452 -35381 -43436 -49214 -37776 -47215 -51748 -44107 -39241 -46488 -48027 -39505 -54610 -40755 -39623 -35078
12438 -35078 -36869 -50885 -42450 -47411 -44732 -36924 -45624 -37837 -39601 -43628 -47274 -40063 -47233 -45070
12424 -45070 -41220 -28097 -37702 -44079 -35154 -36519 -37310 -43490 -34232 -36638 -39506 -40599 -43647 -38391
12410 -38391 -36516 -41460 -42183 -37148 -37167 -45098 -32774 -40799 -47157 -35411 -34069 -41610 -47141 -33469
12396 -33469 -33143 -39824 -29508 -42016 -47881 -51264 -35478 -44109 -36240 -41544 -50084 -51328 -45346 -40811
12382 -40811 -41703 -37425 -39869 -43151 -43619 -38206 -35361 -37721 -42135 -42487 -46266 -40882 -37118 -33621 -42020
12367 -42020 -47953 -48039 -41932 -42611 -39826 -46234 -39883 -41904 -40527 -38061 -32002 -34952 -42734 -47261 -45994
12352 -45994 -40679 -41901 -41548 -47623 -40627 -50041 -48102 -48010 -40606 -52673 -40673 -48008 -41155 -46629 -39427
12337 -39427 -41917 -49251 -51359 -38446 -43386 -44088 -48003 -48125 -54395 -38982 -38553 -46099 -48021 -46743 -44965
12322 -44965 -45921 -47132 -41155 -43368 -45923 -39402 -44477 -40053 -46752 -44467 -37018 -41279 -47032 -43405 -36882
12307 -36882 -48217 -36815 -41621 -48309 -46027 -43616 -42759 -35230 -33480 -44913 -50703 -40142 -40818 -40070
12293 -40070 -48139 -39804 -42257 -48149 -35749 -43431 -46245 -45405 -40881 -41430 -58925 -45329 -32668 -43057
12279 -43057 -44660 -46215 -38778 -41349 -43808 -44325 -39677 -30088 -44809 -45429 -42521 -47278 -51719 -43015 -41254
12264 -41254 -52481 -44552 -50460 -42096 -46216 -43768 -46792 -38198 -43052 -39486 -42857 -36519 -40422 -50308
12250 -50308 -50476 -41082 -45478 -37045 -40245 -40228 -52119 -52461 -44604 -52424 -49538 -41629 -47398 -44953 -47289
12235 -47289 -45194 -40386 -37966 -35647 -36832 -43316 -45620 -39508 -43472 -38605 -49924 -50735 -44535 -43630 -49455
12220 -49455 -48683 -48574 -40911 -41260 -38729 -44654 -43649 -45133 -44958 -40369 -45730 -41478 -48404 -42321 -50005
12205 -50005 -46651 -47956 -41426 -42026 -41232 -50433 -48071 -46138 -42605 -44877 -45884 -43271 -46434 -46114 -41631
12190 -41631 -45316 -31046 -43202 -44902 -36110 -50006 -47456 -47500 -43014 -52301 -41192 -50585 -41516 -35247
12176 -35247 -34866 -36528 -40600 -48501 -40710 -44657 -30719 -46012 -48772 -43774 -38233 -47462 -42578 -33106
12162 -33106 -37434 -35552 -43323 -41810 -34559 -41827 -47962 -43652 -44464 -40345 -44489 -39037 -41943 -42430 -39754
12147 -39754 -41222 -45724 -41822 -43812 -41338 -43054 -47865 -42525 -42730 -40631 -38437 -40976 -38638 -37469 -44201
12132 -44201 -41583 -36803 -54438 -49085 -43430 -48872 -40579 -49358 -39321 -35872 -47122 -49674 -52515 -46551
12118 -46551 -42711 -36547 -41882 -49589 -45593 -47303 -43161 -46979 -45577 -44818 -41995 -37698 -44228 -34891 -33816
12103 -33816 -36086 -45912 -42133 -26507 -32588 -33641 -31596 -36474 -37418 -47032 -28556 -40687 -39699 -47839
12089 -47839 -40142 -53436 -46681 -50492 -38080 -44815 -42036 -42733 -49973 -48955 -36139 -42504 -47517 -41659
12075 -41659 -46543 -50304 -50251 -48156 -43429 -41534 -39015 -34010 -44088 -35483 -45878 -35276 -37939 -42414
12061 -42414 -41297 -40889 -41952 -36477 -42555 -31699 -34453 -37981 -48664 -35759 -41182 -35141 -42795 -50563
12047 -50563 -44969 -53857 -37205 -45022 -36099 -47095 -42110 -36969 -47231 -43775 -33004 -41572 -41203 -42520
12033 -42520 -32738 -43037 -44831 -46404 -32366 -47507 -35743 -35862 -44737 -47464 -41753 -45586 -48632 -49641
12019 -49641 -48853 -46839 -47791 -46298 -47896 -45868 -48576 -44858 -53401 -45797 -45642 -52127 -51934 -42820 -49164
12004 -49164 -47355 -39595 -50696 -41836 -49488 -42679 -42960 -42214 -40182 -45724 -48145 -48265 -46909 -39411 -41889
11989 -41889 -43074 -52566 -45383 -48825 -47766 -42587 -42278 -50095 -44154 -49500 -40565 -47864 -40751 -43802 -49876
11974 -49876 -51595 -35355 -45450 -46172 -38064 -39546 -48849 -48478 -47333 -31894 -47450 -40619 -36740 -43701
11960 -43701 -52030 -42216 -38226 -49315 -39761 -44558 -40697 -54437 -43014 -41680 -39326 -38641 -43672 -39415
11946 -39415 -43493 -40032 -39934 -38102 -50529 -44888 -49924 -39188 -45814 -41522 -45166 -34915 -49393 -40870
11932 -40870 -44804 -34458 -50235 -38692 -48607 -45246 -44883 -43766 -38185 -37629 -44605 -41532 -39530 -43061
11918 -43061 -42852 -49176 -47086 -46505 -38811 -43454 -50421 -56374 -40890 -45759 -44843 -44275 -39815 -52960 -41539
11903 -41539 -38712 -35897 -43524 -49168 -48799 -47269 -44411 -44025 -42474 -53936 -51910 -48774 -42472 -52469 -44426
11888 -44426 -40390 -45555 -50838 -37557 -49669 -48436 -41086 -52736 -48539 -44430 -44094 -49401 -40586 -44968
11874 -44968 -40763 -44663 -51004 -43910 -51794 -56841 -46624 -38709 -47989 -40967 -48280 -39209 -48460 -42978
11860 -42978 -42560 -49337 -54508 -40479 -41421 -49998 -41310 -36520 -43810 -48669 -36845 -39633 -37469 -38748
11846 -38748 -39395 -39549 -35861 -40492 -30462 -47577 -32987 -48091 -38831 -48485 -42059 -41394 -39320 -42632
11832 -42632 -34626 -40050 -45177 -43072 -42174 -35461 -45728 -34231 -42822 -42433 -40441 -43503 -35501 -39264
11818 -39264 -49249 -44593 -54556 -42917 -37385 -33685 -34031 -49844 -47647 -44632 -44339 -48351 -37745 -46738
11804 -46738 -44005 -49039 -41222 -34894 -45599 -46616 -41193 -49835 -43312 -46322 -47723 -47028 -49239 -43647
11790 -43647 -53192 -44926 -46816 -48069 -41825 -43009 -47969 -38641 -40801 -44087 -42624 -42494 -46000 -46669 -47024
11775 -47024 -47030 -47918 -39115 -33550 -42064 -42223 -41684 -45384 -42960 -37841 -38451 -51090 -41507 -38233 -45078 -41753
11759 -41753 -39312 -48851 -41416 -45452 -39743 -48185 -43083 -46660 -37856 -42383 -43793 -38310 -52865 -45709
11745 -45709 -38062 -39624 -39077 -39596 -36695 -39386 -41370 -45176 -41263 -35329 -47709 -41887 -43153 -40332 -31110
11730 -31110 -35681 -45398 -40709 -43237 -34090 -43680 -42654 -40895 -41513 -46747 -33804 -42580 -41011 -40041 -39381
11715 -39381 -41738 -45246 -42149 -39514 -48217 -40082 -41105 -45378 -48888 -47659 -51325 -38767 -40814 -47108
11701 -47108 -38396 -42544 -37518 -33267 -38327 -34929 -45854 -44199 -43831 -41080 -35750 -48176 -49821 -50659
11687 -50659 -39666 -45986 -38062 -41934 -41562 -46123 -41631 -38988 -48990 -35488 -42875 -46040 -36807 -45407
11673 -45407 -40639 -39970 -34010 -45658 -53951 -43919 -47666 -45143 -48533 -48515 -48881 -58060 -45692 -43589 -39222
11658 -39222 -30239 -44767 -45887 -50908 -44982 -44591 -42689 -41066 -50722 -53700 -45690 -44250 -40454 -44612
11644 -44612 -44514 -47249 -51143 -47214 -40143 -42342 -40987 -45480 -44621 -38957 -40513 -33882 -35444 -37771 -55669
11629 -55669 -43433 -43108 -41542 -53349 -41830 -47699 -47894 -33885 -41296 -42929 -43950 -38135 -46593 -52143
11615 -52143 -30689 -36890 -46892 -41780 -39582 -42950 -38303 -35062 -43186 -50249 -46725 -53436 -42214 -39669
11601 -39669 -47556 -45865 -49278 -43948 -44396 -41162 -36038 -42388 -45272 -38345 -44575 -43235 -46814 -45518 -52213
11586 -52213 -52207 -37287 -44686 -43382 -53489 -44729 -50244 -45356 -48074 -46264 -49719 -44091 -45362 -36960 -44728
11571 -44728 -41032 -48230 -44505 -47679 -51125 -46721 -44060 -36424 -57751 -37252 -43752 -43146 -41615 -44277
11557 -44277 -46003 -45248 -39006 -40992 -42870 -31796 -40101 -40537 -44561 -43531 -46650 -47332 -39796 -47956 -45540
11542 -45540 -45128 -42031 -49933 -48420 -48773 -45597 -41553 -44407 -43073 -45684 -48215 -52525 -48575 -48029 -43388
11527 -43388 -47996 -39069 -47806 -43462 -45112 -39276 -42551 -39229 -43665 -47429 -49817 -38702 -41859 -42605
11513 -42605 -47509 -45416 -42437 -40412 -35324 -47198 -39523 -51232 -50047 -44731 -35867 -29681 -35524 -45696
11499 -45696 -44085 -43833 -39380 -35329 -36015 -42636 -47405 -41890 -38950 -44934 -44336 -37115 -49033 -39593 -33393
11484 -33393 -38108 -40601 -47001 -46758 -48184 -37758 -36748 -43564 -44581 -46095 -45121 -39251 -51468 -37976
11470 -37976 -40507 -48467 -49725 -46081 -50204 -46667 -47063 -48075 -48279 -44465 -42871 -49234 -42663 -45795 -47711
11455 -47711 -44761 -40877 -44751 -29210 -39230 -43872 -49520 -42377 -44042 -37527 -39732 -41836 -45467 -44277
11441 -44277 -44962 -46629 -31895 -40955 -44928 -45011 -40478 -47683 -43358 -43033 -38085 -45899 -46019 -40772 -31906
11426 -31906 -38764 -40418 -44334 -50796 -44346 -35302 -34218 -45173 -46579 -42768 -39747 -42907 -35856 -36009
11412 -36009 -42263 -48622 -37912 -41583 -38052 -41135 -38255 -38375 -44037 -43952 -37278 -32231 -44926 -44428 -51020
11397 -51020 -42309 -43109 -37644 -46265 -48562 -43597 -39462 -38612 -45375 -42461 -47279 -38497 -44046 -48277 -35394
11382 -35394 -43746 -46794 -47535 -41887 -43608 -41777 -40404 -45158 -39658 -45003 -41047 -38963 -41695 -39030 -46016
11367 -46016 -37225 -49763 -50475 -39950 -51728 -37928 -46589 -40885 -40134 -39533 -44455 -37676 -45016 -43037
11353 -43037 -45525 -42995 -39964 -35562 -45666 -48589 -41930 -47170 -43061 -38765 -45591 -38448 -53512 -49789
11339 -49789 -47077 -43250 -36829 -48572 -41789 -44118 -43191 -44367 -39023 -48449 -50977 -48678 -42373 -51904
11325 -51904 -40457 -51593 -44562 -50887 -39170 -44366 -41331 -37101 -44789 -42322 -46449 -41286 -43848 -44509
11311 -44509 -43029 -49967 -45715 -48027 -43035 -41150 -45540 -35732 -42744 -39082 -48977 -45545 -48699 -36358
11297 -36358 -37033 -39316 -32134 -39439 -46029 -46192 -38060 -46856 -43870 -48342 -47246 -46189 -40130 -43006 -44320
11282 -44320 -45708 -38957 -44447 -27050 -34892 -37109 -46562 -41338 -50277 -41310 -39817 -42209 -38227 -40305
11268 -40305 -43989 -47587 -46851 -40814 -45327 -44809 -39102 -39990 -38067 -43966 -44317 -44197 -44968 -41851 -50388 -51351
11252 -51351 -49228 -45879 -44789 -39238 -36908 -50342 -47080 -43541 -47419 -52514 -40421 -48334 -45760 -37672
11238 -37672 -38819 -39581 -36109 -42877 -46930 -47308 -39823 -43578 -44768 -40579 -48473 -52130 -37075 -43459 -47987
11223 -47987 -39721 -34458 -36295 -47979 -35109 -48747 -52747 -44350 -40845 -50572 -43341 -42004 -42406 -47887
11209 -47887 -37001 -33435 -45777 -47057 -45088 -48413 -42791 -36304 -49409 -45909 -40825 -42415 -36924 -39912
11195 -39912 -33976 -47013 -41273 -45571 -40135 -30484 -39889 -43140 -43615 -53227 -45299 -41921 -38268 -41283
11181 -41283 -43192 -43450 -36252 -39003 -40402 -41561 -42198 -45428 -44742 -44028 -50955 -42801 -40911 -41360 -39759 -39796
11165 -39796 -38359 -40719 -42749 -40185 -41918 -38221 -39132 -50970 -45723 -28365 -34646 -35616 -41241 -45411
11151 -45411 -43899 -42947 -46286 -44220 -41345 -38596 -47386 -42343 -43664 -43110 -35832 -28324 -37006 -35436 -42236
11136 -42236 -34599 -43039 -35129 -43259 -40587 -42076 -38742 -39812 -40195 -34200 -38137 -41298 -40806 -42034 -43966
11121 -43966 -39007 -40068 -44917 -38022 -37809 -42744 -47595 -40776 -37434 -47587 -49442 -52732 -48703 -51005
11107 -51005 -46050 -47290 -52261 -48671 -34601 -40063 -47088 -35917 -43213 -31914 -41444 -38958 -43587 -39167
11093 -39167 -46159 -44539 -38302 -39486 -45327 -45489 -41093 -45470 -40844 -41349 -37470 -41706 -35750 -42786 -35508
11078 -35508 -30966 -35264 -34907 -36439 -35954 -34448 -36339 -28484 -41114 -36360 -40459 -39130 -40223 -35354 -28977
11063 -28977 -49042 -35784 -44738 -30615 -38557 -23092 -34691 -36380 -47413 -43233 -35839 -28880 -38716
11050 -38716 -38899 -50964 -46521 -38027 -33142 -34890 -39845 -35676 -48154 -33218 -36343 -32388 -41624 -38598
11036 -38598 -42912 -32142 -33282 -42810 -31429 -35898 -42108 -47871 -48052 -32263 -34418 -34226 -37401 -40331
11022 -40331 -36856 -31173 -25624 -28720 -29838 -41974 -36757 -34835 -42035 -36620 -33065 -37540 -50881 -36338
11008 -36338 -33795 -40562 -36264 -45077 -47139 -43370 -44461 -40268 -48120 -41465 -48018 -33977 -38469 -38741
10994 -38741 -37846 -33952 -38677 -49246 -37693 -47107 -38476 -44815 -41487 -31478 -37967 -46649 -37586 -42854
10980 -42854 -50302 -34920 -33466 -39104 -41068 -44606 -39547 -39521 -38634 -42034 -45438 -38834 -47733 -36627 -46115
10965 -46115 -44426 -46255 -36918 -39513 -43759 -49048 -34538 -36518 -41674 -41362 -36625 -35047 -38875 -38677 -45065
10950 -45065 -40796 -36815 -42970 -44872 -37418 -40759 -40114 -40561 -37142 -41052 -37359 -38820 -44253 -34036 -26562
10935 -26562 -45039 -29315 -45962 -40391 -38116 -30301 -43548 -44987 -40261 -35228 -35968 -39320 -34332 -37484
10921 -37484 -40104 -41405 -35333 -36969 -34437 -50124 -44664 -38604 -40000 -36821 -36360 -39467 -35673 -41175
10907 -41175 -44672 -37526 -47814 -52067 -40574 -44468 -44659 -38390 -33254 -43335 -31632 -39524 -46443 -39563
10893 -39563 -40590 -44997 -39929 -47226 -46937 -44210 -48712 -42350 -42855 -43844 -41556 -47843 -45680 -37071 -38555
10878 -38555 -39500 -37149 -37889 -39018 -34678 -30697 -30876 -39608 -37455 -41826 -44654 -36428 -36684 -36900 -36929 -34752
10862 -34752 -32949 -34321 -29781 -32345 -29657 -34556 -39507 -37010 -27611 -26250 -34726 -34804 -33838 -29803 -35493
10847 -35493 -29915 -34045 -36290 -34411 -29539 -30625 -25814 -26561 -29449 -34359 -33727 -36723 -25819 -33380 -34383
10832 -34383 -30598 -38622 -32512 -36849 -37588 -38922 -22296 -38713 -33838 -29227 -39118 -34198 -33781 -35394
10818 -35394 -28347 -22791 -31805 -34194 -25898 -37472 -33731 -29195 -30594 -30293 -25674 -28177 -28881 -23401 -22632
10803 -22632 -17913 -34309 -20857 -29166 -25523 -32005 -22704 -34783 -36539 -35183 -28034 -28333 -31979 -35584
10789 -35584 -35673 -24591 -32319 -34404 -33428 -25654 -31576 -28542 -30395 -22074 -30629 -23880 -22364 -25917 -23021
10774 -23021 -18958 -28093 -27308 -41634 -27875 -35716 -20225 -19557 -28576 -22048 -22225 -29469 -33141 -22875
10760 -22875 -25564 -27487 -16018 -26431 -27267 -29073 -22785 -19870 -27624 -27484 -32862 -21235 -26256 -26177 -24092
10745 -24092 -21342 -21201 -29018 -20457 -10297 -18280 -19229 -23419 -18606 -17766 -12489 -21512 -19379 -23505 -21677
10730 -21677 -29569 -25332 -21429 -19976 -17384 -19372 -21382 -20636 -15996 -10256 -12997 -17206 -13847 -17298 -15172
10715 -15172 -13068 -16588 -21068 -13639 -28580 -15029 -10273 -17519 -13234 -13193 -22100 -25143 -14104 -140
10701 -140 -15360 -21338 -19425 -19287 -21940 -22382 -9113 -20046 -17689 -21303 -16793 -25603 -14368 -15591
10687 -15591 -22615 -18934 -20160 -17723 -14976 -16462 -20203 -21221 -20052 -15254 -19985 -29170 -28005 -25917
10673 -25917 -26158 -29923 -21318 -20630 -26376 -18296 -18530 -22242 -21241 -18461 -22123 -26421 -22894 -14248 -14007
10658 -14007 -22863 -23900 -22169 -27283 -16035 -20943 -21549 -22218 -21444 -23210 -16798 -12257 -15818 -16195 -20042
10643 -20042 -19818 -19925 -28607 -12319 -18622 -14996 -22637 -18515 -20532 -29068 -21987 -22702 -15825 -25508 -21506
10628 -21506 -28156 -15085 -19708 -12642 -26789 -22200 -26182 -29512 -22552 -12444 -20419 -25714 -26736 -26290
10614 -26290 -26453 -26918 -25711 -31227 -30340 -29263 -20489 -19125 -25327 -24448 -31034 -21454 -26561 -24113 -24409 -33108
10598 -33108 -24335 -25350 -27320 -25509 -31379 -25300 -29369 -27386 -33748 -29704 -28268 -21151 -20066 -28070
10584 -28070 -30431 -19919 -23545 -31136 -23151 -29112 -37884 -27799 -29418 -38962 -27065 -26110 -22978 -34560
10570 -34560 -29374 -32613 -34579 -26513 -25364 -28580 -30655 -33271 -35132 -28680 -19479 -23725 -32017 -24426
10556 -24426 -38285 -39327 -29915 -33293 -39949 -23385 -33878 -26235 -24172 -32039 -35932 -33085 -26382 -30654
10542 -30654 -30482 -29385 -28177 -31568 -26951 -23713 -28981 -37848 -35904 -32185 -43680 -33461 -34751 -36790
10528 -36790 -42642 -37426 -32876 -26231 -31810 -38044 -28874 -30245 -24374 -37912 -29431 -30559 -34002 -39798
10514 -39798 -35299 -37979 -41195 -38404 -36877 -41401 -44931 -34178 -39690 -36325 -35396 -34867 -29452 -28727 -32015
10499 -32015 -22767 -27558 -25002 -28326 -24709 -28341 -29612 -27119 -28549 -39714 -35478 -35871 -37071 -32877
10485 -32877 -35747 -30732 -36370 -28723 -39053 -44044 -26254 -23027 -34329 -26107 -39747 -41193 -32852
10472 -32852 -29973 -36934 -37551 -31259 -40915 -41402 -37138 -36184 -34608 -37944 -42054 -34951 -34385 -36386 -39461
10457 -39461 -34944 -34194 -32760 -33316 -36030 -45448 -38412 -40514 -34064 -28818 -41626 -37586 -38213 -32207 -35450
10442 -35450 -29271 -31802 -34926 -31693 -35230 -33067 -33518 -29702 -33377 -36144 -37160 -40837 -35731 -39258 -35886
10427 -35886 -40019 -41453 -38882 -44933 -37918 -40539 -35281 -31018 -26648 -44529 -35892 -37027 -38567 -29257
10413 -29257 -41581 -50213 -35815 -45957 -41749 -42348 -37601 -40360 -41859 -32438 -45616 -32845 -35199
10400 -35199 -28397 -40309 -37311 -34711 -32581 -35849 -33955 -40713 -39424 -40380 -38816 -47795 -37278 -36304
10386 -36304 -37064 -38485 -37863 -31350 -37234 -31325 -38360 -39357 -35067 -28643 -32755 -36891 -37567 -34598 -34048 -38671
10370 -38671 -31773 -41951 -39934 -36078 -37079 -35949 -38616 -34646 -39056 -36928 -30536 -32476 -36179 -27011
10356 -27011 -34814 -36907 -39730 -39943 -36680 -46092 -43230 -35764 -41764 -43852 -42878 -44866 -38378 -42792 -39259
10341 -39259 -40532 -34185 -35927 -34559 -38831 -44085 -39585 -39107 -45069 -40075 -42686 -48464 -43422 -35969 -41818
10326 -41818 -42668 -38430 -37786 -43154 -42180 -38182 -36980 -39189 -38022 -39288 -38858 -42826 -41215 -36568 -38335
10311 -38335 -41268 -46405 -40255 -43141 -35422 -40228 -41416 -44511 -45145 -34531 -41229 -40826 -33926 -48282
10297 -48282 -40681 -45811 -38357 -42997 -35934 -39646 -40055 -41076 -39447 -35578 -34497 -32213 -41537 -39875 -46676
10282 -46676 -43656 -44557 -38000 -37835 -40278 -40418 -39699 -44876 -34096 -44283 -38557 -45300 -40828 -39431 -39435 -49339
10266 -49339 -37042 -36968 -49458 -45209 -38516 -42949 -40686 -36219 -49100 -44325 -44736 -41554 -44630 -30697
10252 -30697 -41721 -43823 -46119 -40737 -43295 -37052 -32157 -51324 -42010 -45417 -44449 -42793 -42989 -41396
10238 -41396 -46876 -36900 -35589 -39941 -31172 -38398 -36915 -44048 -37718 -46427 -40001 -29256 -40538 -45381
10224 -45381 -44495 -39096 -41187 -38505 -39492 -41949 -43010 -41613 -42479 -41149 -43826 -46847 -36186 -49074 -46367
10209 -46367 -42594 -50343 -43722 -42956 -50355 -42868 -43029 -41849 -44277 -34266 -43696 -48646 -41563 -35303 -47841
10194 -47841 -47216 -39457 -47881 -40523 -32370 -42509 -36326 -39507 -45633 -42825 -40099 -40826 -47163 -34470
10180 -34470 -41434 -32875 -36784 -35552 -44438 -47601 -35625 -35367 -43202 -44655 -42883 -43549 -31880 -38796
10166 -38796 -39399 -33286 -28965 -40574 -31726 -34260 -38470 -39317 -32099 -42214 -36296 -42579 -33899 -39230
10152 -39230 -38432 -37732 -33565 -39738 -41050 -40789 -44484 -41003 -37136 -50701 -35836 -33592 -33114 -46436 -42702
10137 -42702 -43829 -36282 -37644 -35806 -40406 -46689 -41910 -42670 -40331 -42436 -42394 -43485 -40387 -36322 -47734
10122 -47734 -34575 -38637 -40148 -46088 -41181 -33255 -39298 -42608 -35372 -42761 -45897 -41793 -36953 -36040
10108 -36040 -45307 -41398 -46532 -52755 -51645 -41614 -37420 -42039 -46030 -41003 -42175 -43147 -33104 -36088
10094 -36088 -39700 -40916 -34857 -35701 -42396 -40438 -42570 -46502 -42273 -47639 -48700 -37201 -42732 -44824
10080 -44824 -41854 -41494 -37573 -34843 -37809 -35979 -36472 -28868 -41734 -34824 -37863 -37082 -39468 -35569 -40281
10065 -40281 -38410 -39464 -43061 -42365 -41894 -34124 -36303 -33016 -24927 -39895 -44466 -36811 -34974 -39033 -37248
10050 -37248 -40227 -44758 -41986 -40255 -35850 -41251 -43461 -40564 -37200 -46994 -42329 -34621 -46626 -43898
10036 -43898 -38558 -42175 -44257 -38303 -42839 -37536 -42248 -47508 -37442 -44264 -41885 -45961 -43509 -39256
10022 -39256 -47693 -40556 -33326 -41253 -38908 -40069 -35452 -36286 -32500 -37693 -41577 -34940 -35160 -30445 -36670
10007 -36670 -32616 -43651 -42416 -49397 -37105 -40911 -40538 -47805 -44491 -50594 -37633 -43619 -37367 -46479
9993 -46479 -46700 -36269 -42334 -39691 -38493 -44159 -44695 -41993 -48594 -47874 -43104 -53146 -49146 -44569 -46066
9978 -46066 -52289 -39736 -37486 -46409 -48041 -46175 -37957 -46592 -40211 -46003 -47030 -44216 -46256 -46846 -47531
9963 -47531 -44264 -43136 -47316 -48153 -46370 -44246 -37041 -43252 -44147 -39903 -39773 -40025 -43183 -35857 -30837 -34204
9947 -34204 -37495 -41480 -46607 -36540 -36532 -38998 -41407 -44032 -37164 -33180 -38083 -38548 -37028 -36188 -31561 -40650
9931 -40650 -35549 -37313 -37743 -39051 -38414 -42541 -44545 -34719 -35383 -37763 -40338 -40062 -39948 -41289 -43958 -32987
9915 -32987 -40020 -39607 -42219 -52229 -48588 -40044 -28865 -38715 -35521 -37307 -44035 -36744 -50419 -36854
9901 -36854 -29155 -39497 -37770 -29276 -41478 -35795 -39194 -41705 -33920 -45533 -44437 -48595 -39616 -42311
9887 -42311 -40554 -40045 -39079 -50653 -38359 -40587 -35549 -44719 -41738 -49663 -35306 -28609 -31904 -36156
9873 -36156 -46387 -35775 -42732 -45478 -47464 -53010 -63703 -58415 -70383 -67385 -54979 -51737 -58269
9860 -58269 -38212 -23409 -32240 -34209 -21469 -27174 -35117 -40545 -59785 -69999 -52867 -33291 -34363
9847 -34363 -30927 -33457 -33359 -50149 -40885 -30343 -39656 -48432 -38611 -33883 -29737 -34658 -34204 -39067 -39480
9832 -39480 -41013 -39610 -37235 -36093 -35318 -44945 -31791 -35823 -42601 -40203 -35418 -43159 -51781 -38622
9818 -38622 -37393 -34614 -32920 -41100 -30463 -32935 -45146 -35677 -32572 -40829 -36365 -30711 -32727 -32348
9804 -32348 -27255 -30106 -44790 -39231 -30114 -36660 -36943 -32027 -43306 -40404 -32891 -37157 -43710 -47824
9790 -47824 -40315 -43917 -37567 -34119 -43270 -37319 -39892 -42389 -29998 -39431 -39367 -36652 -47017 -39860 -35988
9775 -35988 -33067 -41140 -41650 -43005 -46629 -42951 -38736 -44876 -33236 -49210 -41132 -42330 -46035 -34552
9761 -34552 -27527 -29544 -47866 -34012 -32637 -35953 -36043 -25477 -42759 -43350 -34995 -40190 -45833 -31979
9747 -31979 -31533 -43443 -38599 -25664 -40444 -32057 -30225 -23846 -39906 -35516 -21946 -33250 -33617 -29124
9733 -29124 -33457 -37273 -25172 -37650 -30672 -25707 -29928 -29548 -24334 -16431 -8942 -2809 2106 -4161
9719 -4161 -5243 -8750 -5077 -17863 -23271 -29616 -36254 -24649 -27675 -29916 -32632 -28498 -32193 -31322 -25241
9704 -25241 -29771 -35635 -38102 -37284 -31527 -27761 -28371 -30396 -28769 -30500 -34329 -29207 -29700 -34886 -37717
9689 -37717 -39840 -28009 -26420 -37952 -35237 -33895 -40806 -37701 -29927 -32521 -34194 -36408 -32562 -45080
9675 -45080 -39239 -33229 -36367 -35431 -39779 -40290 -45859 -41663 -41211 -37366 -44726 -47172 -31635 -41666 -32540
9660 -32540 -38833 -37036 -37821 -38193 -27542 -29387 -34082 -39745 -41958 -43275 -38080 -35670 -42977 -38384 -38007
9645 -38007 -38043 -41367 -37535 -37316 -32240 -26640 -31278 -27734 -27763 -30668 -28737 -30231 -33536 -33828 -34444 -30954
9629 -30954 -31495 -33033 -31367 -35565 -36557 -29881 -36564 -31766 -31411 -34185 -29907 -37634 -31829 -30363 -31248 -25059
9613 -25059 -33489 -30911 -39771 -37259 -28777 -35341 -35129 -34806 -37898 -37838 -33986 -36822 -35139 -28346 -32924 -32886
9597 -32886 -31889 -22708 -24433 -31195 -21122 -31149 -23625 -27733 -28105 -28381 -20314 -20835 -16863 -24456 -23625
9582 -23625 -25163 -25901 -18682 -12981 -18763 -20954 -27333 -25312 -19413 -18348 -23580 -25745 -23010 -30899 -24398
9567 -24398 -17261 -20882 -29325 -26664 -27048 -22689 -25446 -19465 -17359 -29319 -21806 -24027 -26285 -19942 -22020
9552 -22020 -31046 -29783 -31163 -19404 -28320 -19272 -16381 -27911 -26011 -21745 -27850 -28167 -14226 -13145
9538 -13145 -4830 -810 14883 34500 51523 47065 33147 32222 15733 1997 -2309 -4041 -1371
9525 -1371 -12452 -24191 -17679 -27865 -18407 -19742 -18522 -23614 -24450 -22134 -18852 -14262 -29813 -27757
9511 -27757 -22479 -23770 -27134 -15631 -22309 -13510 -24652 -21471 -14174 -24983 -22612 -18348 -22049 -25603
9497 -25603 -20043 -19954 -14735 -23057 -19797 -14264 -15225 -11029 -19012 -24616 -21117 -22975 -21773 -23726 -22320
9482 -22320 -29044 -22010 -22131 -12884 -28152 -14528 -19834 -28756 -21882 -23733 -16676 -21078 -19488 -26871
9468 -26871 -25270 -24043 -18692 -21400 -22153 -18933 -23139 -22327 -29519 -27247 -20085 -26083 -11938 -25123 -20809
9453 -20809 -26937 -16441 -21193 -23212 -20124 -24124 -26056 -25229 -21508 -18929 -17017 -20643 -25819 -22495 -17625
9438 -17625 -18703 -14460 -26116 -16478 -29026 -15906 -9436 -17690 -11925 -23940 -20360 -18817 -14937 -18333
9424 -18333 -22661 -12374 -22189 -18081 -6941 -14854 -14368 -16157 -17766 -11201 -15356 -8112 -12242 -26883
9410 -26883 -23158 -23982 -14783 -17281 -16655 -20563 -19038 -20297 -21122 -11145 -13479 -15312 -18016 -19719 -14878
9395 -14878 -15031 -9972 -13547 -18052 -15196 -8656 -10175 -13492 -17584 -9039 -10801 -6089 -8962 -7517 -9960
9380 -9960 -5513 -7805 -13550 437 2958 -2595 -1315 -1860 -2881 -780 4263 4649 -3326 5390 -7369
9365 -7369 3384 -4222 8038 1282 7071 13392 7106 17507 904 16007 20656 3020 16928
9352 16928 9844 3524 2136 8941 3837 10441 10993 8108 11853 9034 17834 14570 14239 17026 1857
9337 1857 14402 11564 18786 20042 27874 20146 15517 25973 25507 25998 24900 33204 34926 31343 34332
9322 34332 30697 38619 35012 37479 46633 44894 40919 51169 61071 61324 73385 73870 75407 78726 81769
9307 81769 92796 86281 92625 113107 112410 134655 148080 166171 176518 187224 185849 194105 198183
9294 198183 204400 225582 235665 258578 276695 292864 312917 321563 350149 378083 409144 434178
9282 434178 465952 501242 517241 519804 514973 505383 504312 513826 518626 538981 559412 590801 626988
9269 626988 652836 674714 711531 750379 786133 833869 879914 926447 1007309 1093712 1207036
9258 1207036 1334895 1439414 1536684 1583027 1609744 1610838 1581772 1554253 1497932 1452226 1439429
9247 1439429 1471419 1553005 1686835 1847430 1987219 2086104 2094802 2046497 1934766 1764017 1587141
9236 1587141 1419168 1275794 1166371 1104587 1089300 1104022 1116158 1101135 1074601 1040033 962418
9225 962418 902580 852241 800068 736081 669866 625587 584943 560015 557541 584734 608332 635857
9213 635857 622224 588610 550584 496894 439462 400576 350736 315828 285303 257238 251523 236546
9201 236546 220620 209489 197486 184936 174600 167663 168834 160954 154225 140617 139977 134434 133141
9188 133141 134363 127290 121499 110439 111382 108419 110025 105482 107737 105739 95194 88406 95408 109649
9174 109649 96606 93466 93026 91972 89153 97026 96551 95170 86530 93344 93594 91401 85762 74023 84047
9159 84047 74535 71370 81274 73452 76614 76377 74883 72915 73644 66683 62624 63008 56299 58103 61815
9144 61815 59374 50746 51033 45560 59473 50184 49596 47085 46918 33922 41078 42855 41729 37170 39909
9129 39909 43320 34138 33315 51096 42204 27437 30499 23549 22483 23460 36317 27915 23886 15856
9115 15856 22721 24696 23264 27717 16575 20603 12048 21441 27433 19666 17240 12128 5400 13721
9101 13721 13297 22338 12490 9416 17257 9348 19757 19321 21265 22995 18400 11194 22104 18303 19490
9086 19490 16806 9765 13448 15506 11614 21537 15042 22813 11791 17170 19795 14997 25300 22726
9072 22726 19119 13946 17821 18069 20971 17716 26419 14041 13144 15768 8847 11183 18075 21179 11945
9057 11945 16353 18065 14142 15143 10148 15144 22341 13486 24638 16644 15881 17477 17794 16273 15803
9042 15803 17169 16765 14718 19431 11629 18699 12840 13664 17060 22033 27447 22850 15707 22264 21120
9027 21120 15313 23851 22341 23134 16074 18490 28871 18799 25117 26201 23150 22189 18143 26697 25144
9012 25144 24783 20502 23621 28507 30350 17569 33885 25168 18695 30595 25188 26833 24573 21290
8998 21290 18471 21662 23585 23301 29097 30850 18046 21679 25191 21742 27456 22041 23800 27388 13761
8983 13761 18317 22895 18022 11295 21485 28557 21607 21055 37898 26332 25778 18732 23727 25139
8969 25139 22070 26989 23495 24860 24779 24805 26101 35030 33394 28582 39646 27995 25686 36561 37800
8954 37800 37466 25721 32620 32717 39347 38861 46641 35743 34972 41219 44064 41132 49273 36523 30351
8939 30351 42103 42722 42914 46133 38055 33132 35637 29462 33490 37549 34979 31846 30760 32483 38699
8924 38699 27219 36508 31888 26753 19512 36011 33409 25393 23483 32250 26853 25028 30584 28414
8910 28414 36936 17503 26453 26653 28403 27196 26252 31941 29560 26064 25865 20711 18211 25007 25615
8895 25615 23419 29202 6724 27799 23385 16307 30543 20404 27216 16990 25695 32132 18298
8882 18298 20360 19456 21813 22331 24507 33169 28460 19532 13437 18484 21261 22157 13104 16023 -660
8867 -660 8097 5629 16789 11550 15040 9211 14852 9378 4641 11351 14688 6942 8842 14229 6041
8852 6041 7667 3708 11057 9271 10870 6409 15256 1480 5128 13225 16909 11067 15246 6651 13890
8837 13890 12668 25256 7187 16057 2800 9953 7688 5258 8959 480 10720 3057 14702
8824 14702 16231 14140 9702 9080 -522 7335 6586 6881 1017 9690 4793 3063 2483 9169 496 11130
8808 11130 4095 8099 8304 5591 3444 423 -825 3405 5968 2775 6338 -1488 3124 -970 15603
8793 15603 9730 -5502 -51 5366 1651 7515 -2102 -5371 4731 -3978 8006 3333 -2631 2797
8779 2797 -6111 -1787 -4085 2279 -4143 4566 -2606 2727 -9816 -2877 -3633 -2080 -4970 2658 -9802
8764 -9802 -12061 -14640 -9490 -8495 -11102 -10561 -12837 -4447 -8499 -5141 -16920 -8596 -10582 -9298 -16919
8749 -16919 -9548 -15882 -16035 -11248 -95 -4991 -6735 -5838 -8528 2022 -10559 -6373 -12263 -1197
8735 -1197 -7918 -1397 3903 -4877 -380 -341 -3093 1324 -1653 -1196 -4179 -9117 -6052 -553 -5063 -4201
8719 -4201 -9880 -10359 -4555 -967 -7052 -13111 -5032 -3546 -16965 -2084 -4217 -6302 -10788 -10808 -12144
8704 -12144 -11899 -10039 -9168 -14079 -17037 -18467 -11937 -19005 -21811 -14395 -16372 -10583 -9311 -22214 -15679
8689 -15679 -12742 -13813 -16174 -12075 -6815 -18679 -18184 -14050 -11993 -11230 -9210 -11564 -12081 -24928 -13740
8674 -13740 -12465 -14769 -13071 -16048 -10515 -14335 -7022 -8908 -15043 -13104 -10534 -9674 -7710 -4279 -11554
8659 -11554 -11823 -12296 -15984 -24046 -18694 -13606 -20518 -16189 -16696 -10487 -20266 -20754 -17296 -10665 -5215 -19893
8643 -19893 -20642 -18644 -23856 -23439 -16280 -21884 -21532 -22427 -17166 -19301 -24893 -21964 -22484 -27139 -16841 -27425
8627 -27425 -17295 -20359 -16615 -17227 -17612 -21143 -15523 -18628 -12867 -16136 -16421 -17674 -15415 -23453 -28076
8612 -28076 -14472 -23132 -20491 -19097 -20754 -17780 -12875 -13504 -10719 -17648 -15966 -18665 -16097 -15885 -8648
8597 -8648 -15901 -4708 -19234 -22541 -11308 -10573 -12503 -8737 -14154 -12049 -11713 -10892 -8389 -15929 -11462
8582 -11462 -10563 -15068 -14942 -8719 -10830 -12411 -14825 -14611 -18276 -13625 -24357 -19001 -20865 -28937 -30793
8567 -30793 -15453 -15776 -20255 -11449 -26953 -19743 -25058 -26777 -19945 -21311 -28442 -24602 -27427 -17601
8553 -17601 -27811 -16949 -25205 -31298 -25313 -22020 -14034 -21754 -24388 -29041 -32683 -24719 -16417 -17959
8539 -17959 -22540 -25105 -23953 -28547 -19614 -23048 -15857 -15941 -56237 -9419 -26491 -9755 -12312 -7333
8525 -7333 -6391 -4847 -10537 -17795 -16092 -18238 -18989 -13487 -11111 -16319 -4330 -10915 -13673 -17716 -9977
8510 -9977 -18574 -17177 -21401 -13935 -27312 -17821 -25886 -13097 -24527 -25907 -18156 -15691 -22265 -28830
8496 -28830 -22563 -26818 -25515 -29818 -18893 -22964 -26121 -31602 -20248 -29159 -21630 -32070 -8836 -26568
8482 -26568 -19750 -21487 -18037 -14217 -20035 -17470 -19796 -20224 -21143 -11459 -9998 -15946 -20777 -9500 -14865
8467 -14865 -23499 -12151 -2883 -14926 -10892 -19778 -16682 -15208 -13123 -9303 -8475 -16339 -18021 -12448
8453 -12448 -20367 -11652 -20969 -15989 -26692 -15558 -23629 -21511 -22144 -15780 -18512 -24593 -21149 -15237
8439 -15237 -19045 -22138 -24258 -34741 -22939 -31536 -21595 -24895 -24508 -33877 -22728 -25473 -24264 -21081
8425 -21081 -26758 -30684 -30299 -34872 -23279 -24378 -28782 -27369 -24892 -30760 -31074 -18765 -20511 -24533 -27126
8410 -27126 -20330 -11757 -15402 -19449 -19730 -22483 -21702 -21970 -23220 -22745 -23518 -28234 -9590 -16443 -23610 -14736
8394 -14736 -21838 -21479 -17202 -14472 -11128 -21099 -27239 -15221 -18151 -18794 -21724 -28093 -22699 -33296 -17828
8379 -17828 -23611 -24982 -14783 -25530 -23790 -21393 -18536 -17671 -27981 -20837 -29156 -27637 -23344 -21173
8365 -21173 -23993 -25926 -25953 -23821 -12358 -26348 -27188 -29849 -16688 -23556 -26775 -19288 -23190 -18030 -15112
8350 -15112 -15890 -20950 -22706 -21217 -23841 -24828 -16196 -24042 -29289 -33164 -34390 -22773 -19199 -26021 -25466
8335 -25466 -24672 -32163 -32391 -22291 -18739 -27497 -29186 -26093 -22643 -25570 -24899 -19585 -24463 -30958 -27295
8320 -27295 -27753 -29603 -29463 -31841 -31186 -26996 -35946 -28267 -20637 -23569 -16046 -14083 -16035 -24266 -27486
8305 -27486 -23582 -20003 -25514 -21336 -32974 -33768 -32394 -26522 -29699 -18083 -26290 -26018 -35138 -23177
8291 -23177 -26661 -21027 -22345 -36379 -33917 -30016 -29277 -22910 -28184 -34419 -29988 -28685 -22874 -20362 -27985
8276 -27985 -23136 -31600 -25205 -32868 -32791 -29508 -21891 -30194 -35269 -27984 -29074 -27980 -27011 -26236 -23458 -18710
8260 -18710 -24879 -20934 -25344 -26023 -19282 -23403 -24895 -27610 -18135 -28367 -21988 -22686 -26916 -28602 -29319
8245 -29319 -10095 -27296 -14627 -17317 -20831 -25877 -20841 -19021 -28189 -23823 -37563 -37979 -29450 -28087
8231 -28087 -25674 -27231 -32036 -31666 -17942 -15760 -32563 -13949 -20730 -30844 -14805 -20719 -16229 -24731
8217 -24731 -26529 -22340 -26852 -20432 -20963 -26253 -35988 -28127 -40823 -38756 -27067 -36308 -36213 -29427 -16171
8202 -16171 -35381 -26601 -23084 -16845 -18804 -20228 -25669 -22645 -27985 -23663 118842 -36930 -29901
8189 -29901 -36521 -32330 -24909 -20385 -23528 -36083 -31396 -28041 -27463 -25880 -26196 -14329 -24573 -28167
8175 -28167 -20812 -13793 -21623 -19702 -20499 -26321 -20744 -24488 -20144 -24790 -20621 -17039 -19450 -18304 -8638
8160 -8638 -3998 -13565 -12840 -8069 -14851 -21675 -2736 -19032 -19117 -23449 -19969 -33259 -27216 -18136 -19725
8145 -19725 -11216 -17141 -14652 -25971 -18107 -17756 -19094 -30073 -24398 -24950 -24879 -15701 -17606 -27866 -21455
8130 -21455 -25152 -23681 -26916 -13269 -25901 -15135 -25175 -27395 -8802 -22113 -8452 -13291 -15346
8117 -15346 -27665 -20649 -13205 -22168 -23585 -14791 -22580 -10134 -10536 -3164 -11137 15 -8590 530
8103 530 -5260 -13 -987 -2297 -3070 6306 6822 -7950 -2027 5601 1042 2733 4449 -1224 -1669 713
8087 713 -304 -741 1941 -8192 -6264 116 -3464 -4652 -16548 -7562 -18510 -10774 -3521 -1518 -4285
8072 -4285 -6519 -10540 -14180 -6964 -10386 -11747 -8695 -17025 -21451 -11831 -13604 -20812 -9688 -15894 -22592
8057 -22592 -12120 -12846 -1717 -2434 -8474 3356 6823 4510 6334 5539 10894 2937 9690 7016 1355
8042 1355 2640 12944 10746 12355 10017 13816 11423 17088 19725 13754 26593 24094 21452 25104
8028 25104 32669 30205 28986 29597 25010 25020 20286 23183 26357 13322 13353 11248 13661 22002 15640 17621
8012 17621 12320 22580 29189 28701 27031 20702 24687 13015 19080 17266 19211 9993 12160 9703
7998 9703 10565 6407 20587 17236 10991 7785 12348 6622 20059 22084 28675 25915 30039 27406 32989
7983 32989 38558 36579 41335 39921 33760 28868 39064 31355 39082 38502 43269 37764 44413 41936 54291
7968 54291 52243 56672 58692 62145 59284 55003 60758 57867 58392 52215 50874 53158 58523 51874 58867
7953 58867 65129 60553 55057 64053 62180 68291 71144 72083 60417 62591 66463 58396 63139 70224 71634
7938 71634 68234 69404 67035 69535 86477 94636 86307 90482 90366 101342 97141 109347 108317 103887
7924 103887 102463 99991 105830 96355 101617 94457 87154 93720 94823 100436 96607 90096 89152 88429 103087
7909 103087 106844 111447 111385 114762 122660 117581 130628 136910 147683 145884 147603 150209 155679 160697
7895 160697 165102 163327 167312 173654 174328 180844 181084 185948 185702 192586 194621 200788 201814 205251 204302
7880 204302 210221 220413 218935 222343 224760 226182 229834 248459 243492 249601 245968 248888 246887 249716
7866 249716 239583 238841 239064 239347 240130 254222 256106 255142 252671 260695 257349 259723 272809 231841 295356
7851 295356 276989 276742 289477 286189 296077 294385 304006 308282 314445 321578 328406 338381 339010 356036
7837 356036 356338 365277 372619 383682 393202 402825 411978 418916 427546 443236 450056 463283 471215 476991
7823 476991 480521 488962 487244 487441 483652 503582 500189 510048 508044 521478 515850 529348 534324 531393
7809 531393 541390 545725 544269 533044 552865 546868 555145 555922 576767 586722 603097 618045 640737
7796 640737 646244 687627 705787 714163 714526 723216 723907 720183 719289 732764 748449 757228 766542 771360
7782 771360 793615 803628 822854 848080 871075 886252 916281 941304 963905 981225 1013160 1046811
7770 1046811 1068796 1095824 1119073 1141433 1163540 1189635 1205566 1232906 1244902 1260527 1267963 1290269
7758 1290269 1306708 1315073 1359355 1392201 1428628 1465653 1518435 1548294 1591401 1629468 1673685 1718381
7746 1718381 1756036 1802092 1824368 1844048 1868212 1892510 1925891 1945129 1985182 2023403 2072274
7735 2072274 2126156 2177206 2229979 2275653 2320658 2357016 2396512 2425195 2461087 2496696 2527679
7724 2527679 2556859 2606838 2643439 2684806 2711564 2752805 2783868 2838902 2896516 2951711 3022764
7713 3022764 3075879 3146051 3202822 3288058 3369512 3463102 3550764 3635742 3727051 3826346 3910380
7702 3910380 4005937 4088083 4162424 4232211 4313061 4397653 4492600 4583572 4687591 4796122 4924478
7691 4924478 5069476 5203961 5374416 5531185 5691496 5849500 6020465 6172133 6309643 6441619
7681 6441619 6575532 6737922 6904749 7099078 7321064 7542119 7772100 8018123 8282921 8579438
7671 8579438 8893284 9239830 9585332 9939811 10303083 10705305 11148418 11617168 12100045 12659877
7661 12659877 13327314 14103848 14976065 15972194 17133712 18520207 20120736 21951666 24006766
7652 24006766 26325549 28945648 31948194 35430429 39476885 44260635 49929819 56997005
7644 56997005 66080156 77916198 94715019 120589336 159960443 214868454 285469337
7637 285469337 356649305 398693369 399449359 377127452 349427708 316582098 278958461
7630 278958461 236152906 190851900 149083673 115235487 91227537 74804286 62901032
7623 62901032 53487494 45785174 39495188 34517765 30776040 27990647 25857670 24132960
7615 24132960 22681992 21430075 20331470 19347785 18446744 17628276 16884623 16237874 15653505
7606 15653505 15133591 14645402 14132536 13616114 13098713 12589097 12101589 11658158 11256874
7597 11256874 10844959 10477035 10150053 9859114 9592586 9328839 9049289 8764392 8500287
7588 8500287 8238422 8001781 7759025 7494901 7247514 7023848 6824178 6626450 6459411 6290676
7578 6290676 6106437 5917578 5745920 5571336 5404324 5267525 5120832 4995576 4876527 4757407
7568 4757407 4638691 4519222 4420477 4316461 4228405 4145822 4071144 3995354 3907630 3828296 3748846
7557 3748846 3667668 3596481 3518515 3433174 3350497 3295377 3234846 3167382 3096771 3035880 2985721
7546 2985721 2926764 2885715 2830165 2759029 2681488 2602895 2533369 2466300 2415176 2370855 2323527
7535 2323527 2280214 2240471 2203057 2150798 2122798 2087911 2036215 1999406 1968777 1928442 1891767
7524 1891767 1855745 1808203 1776112 1732412 1694737 1659754 1622693 1594274 1564109 1540076 1516918
7513 1516918 1487339 1465828 1436540 1408469 1375663 1339280 1304598 1276985 1243778 1225564 1202765
7502 1202765 1173520 1148316 1116961 1099434 1058144 1049565 1023486 1027129 1013453 1002730 994614 984925
7490 984925 965653 954963 943054 924800 916786 898567 890979 876152 851820 822784 791877 758985
7478 758985 737415 710730 704315 678854 667283 662854 654917 662056 665322 661946 656119 649437 637024
7465 637024 626894 614358 598360 580786 565720 544441 528771 519380 506263 492635 485069 484478
7453 484478 468624 452464 435143 413059 388508 369596 365363 344445 331848 324498 316887 304904
7441 304904 307187 317090 316521 305719 301812 300536 294406 292549 285904 276886 279141 274466 266213 269875
7427 269875 263290 249934 254000 254383 250984 249550 240278 228115 222438 210569 203646 199310 207018 191021
7413 191021 190225 191151 183926 178603 168385 181918 163070 163630 155487 151061 132558 129508 128206 123667
7399 123667 115065 114558 117539 114774 125677 114339 125718 108304 114108 116745 117702 120124 110316 99819
7385 99819 94289 94508 93726 93479 102644 91827 88578 77393 85398 79988 83280 83515 79715 83491 77062
7370 77062 74871 77480 75073 69835 67033 68384 71468 76592 69896 66849 72130 61574 73783 73886
7356 73886 72134 68836 75217 63422 69438 58587 50729 48175 42580 41013 35987 40776 31165 25481
7342 25481 27682 30810 31191 31401 27908 30036 27231 27960 33480 31480 39426 39965 39529 46988 32654 36326
7326 36326 32219 37572 32174 32311 31844 31481 24980 24086 32626 21937 23028 22856 24911 29419 28465 17477
7310 17477 18672 13752 13464 16581 21808 20048 20456 11069 22230 14304 21331 20833 8152 13319 8832
7295 8832 8725 6548 8807 13338 5251 8591 4226 -1286 8237 8290 9000 16792 5471 7611 12340 10121
7279 10121 10531 8298 686 955 8 2208 4129 -5300 1213 -1871 3881 9209 5660 16058 8646
7264 8646 13153 8703 7453 6139 19007 10333 13531 7394 4001 8522 10548 13354 15909 15170 14987
7249 14987 11509 13964 24813 30697 23163 25270 24707 25941 29410 20729 25916 15089 7082 16863
7235 16863 6735 18027 18141 14646 14711 18265 14360 16433 18149 17298 15066 6763 13241 14795 19961
7220 19961 18715 15472 5394 12251 -640 12626 1985 8644 332 11060 2911 2551 10243 13676
7206 13676 13992 17362 21451 14071 25619 23382 18393 21681 22496 22980 25528 33326 35859 33867 33556
7191 33556 34238 34399 38213 38259 37072 48283 48299 51838 57852 58910 66912 68589 66053 66727 72631 74722
7175 74722 80506 80673 99051 99541 104766 128783 135633 149334 173325 199987 244311 298922 378528
7162 378528 483753 587894 668513 706222 707964 656216 600046 556948 510605 482170 466244
7151 466244 458672 458838 474065 497600 540846 576892 621190 656585 728611 791371 850749 888358
7139 888358 900783 872590 830789 805709 763751 730959 681622 643378 593788 568748 532621 512426
7127 512426 497083 478930 477358 504520 565555 654415 744048 786592 795900 757825 685861 600374
7115 600374 513916 440375 367709 312561 262601 218914 185498 164080 147430 130310 117332 103959
7103 103959 99461 92863 93005 95066 87726 76051 82497 67565 75828 70060 63721 59426 50812 52010
7089 52010 47538 49267 42904 38791 26530 31116 35153 34443 25410 23756 15833 19879 19259 22605 25401
7074 25401 26480 16872 16775 18977 35465 27836 19113 5774 10884 7672 23486 21615 8833 2595
7060 2595 4689 7525 9456 2692 5155 5566 9031 8458 18201 16173 18065 12628 12181 17470 7824 12987
7044 12987 13366 4455 7857 6762 5918 7680 7723 9585 3384 433 16125 11796 11463 14246 20631 23091
7028 23091 8802 11769 14007 4948 11505 12434 -1185 6087 4383 10053 7880 23064 34620 47643
7014 47643 71144 72716 76906 73202 61796 44361 30553 25423 23896 -416 3708 4516 495 2867
7000 2867 -737 -910 -18819 -2147 519 -6063 -10615 -15514 -3809 -1191 -10284 -4935 8053 747
6986 747 -1728 -414 -1825 4867 -1426 13689 3135 -6303 -1966 1498 4697 -6671 -7344 -12339 -15593
6971 -15593 -2715 -11655 -11624 -9343 -12606 -12551 -13564 -11800 -18156 -4839 -14636 -4336 -24134 -16987 -15883
6956 -15883 -12540 -23007 -15207 -20310 -19350 -20510 -9603 -9396 -16650 -17367 -9623 -15983 -13279 -4433 -4888
6941 -4888 -9590 -10697 -11687 -11675 -14592 -4695 -8321 -14780 -8387 -12078 -9477 -3203 -5401 -2900 -9143 -5875
6925 -5875 -4951 -1961 -85 -999 1089 690 -6100 -2168 -5557 -11123 6216 -9139 -10247 -5819 -12653
6910 -12653 -2684 -721 -457 -948 -14098 -14935 -10358 -3921 -10460 -211 -13428 -15379 -15057 -20639 -13047
6895 -13047 -17531 -9263 -13372 -22312 -17809 -12564 -23625 -9386 -11669 -3768 -8600 -10849 -9219 -4793
6881 -4793 -9726 -4900 -9862 -3115 -10452 -8013 -6036 -10320 -7938 -6261 -10728 3722 6809 -2932 2847
6866 2847 7040 3011 -315 10912 5903 5488 4790 -5863 -9498 -11813 -14068 -4242 -11816 -17262 -16757
6851 -16757 -9143 -17985 -16499 -19746 -16695 -17045 -11875 -9955 -10454 -7122 -7900 -6061 -8798 -10208 -14054
6836 -14054 -12909 -8743 -4732 -15672 -13150 -5611 -9732 -706 -9898 14145 -9146 -9241 -1184 8994
6822 8994 1293 11253 10508 6904 -513 -927 -1154 2687 9201 3384 6147 8199 -154 6232 5620 6282
6806 6282 79 -4555 7207 450 10858 12189 862 2591 2683 -6073 -2668 1820 3664 -1729 10363
6791 10363 -5434 -6975 2297 5022 2515 3267 -1784 -4099 -4976 -8169 6613 7931 -2192 4838
6777 4838 3021 -204 2509 9223 8187 12943 6480 -740 518 12589 9498 10020 4821 17555 15008
6762 15008 18628 20454 28142 24021 20240 24600 20880 13549 17558 21603 23910 23617 29189 31783 28513
6747 28513 30967 33364 34945 32786 33456 36351 46912 33561 39329 44326 51347 46203 45860 54365 57627
6732 57627 53527 67874 65714 69365 77904 84021 84183 97689 101408 109147 121288 136705 153195 170259
6718 170259 182871 207832 235309 266575 297615 346233 394785 458013 532621 621250 761865
6707 761865 923839 1135407 1401284 1691386 1944138 2138149 2201737 2155935 2009448 1803824
6697 1803824 1579831 1350226 1137580 968070 799857 678597 582193 491782 424168 380647
6687 380647 330701 294567 271238 237164 211110 201267 185192 163200 163648 150901 140455 130086
6675 130086 125846 119759 107060 103701 102854 94643 98275 85277 85856 80583 80514 67946 62602 70466 65179
6660 65179 54279 53843 53323 41755 40475 48978 47886 30718 34479 39987 36389 35031 36569 22486
6646 22486 24982 31940 23662 30281 26460 23669 20599 21375 14467 21002 23991 17225 7911 10665 5458
6631 5458 410 3649 13248 -4336 -1986 2288 7095 -1647 9763 16666 5106 6258 7169 8990
6617 8990 -426 4497 -5513 5005 3062 -183 9892 1912 -2449 5838 -2943 3645 129 -2696
6603 -2696 5473 -1019 2391 -3746 -6983 -6231 5979 -93 -656 -1934 -773 -8534 -8528 -5022 -12120 -14854
6587 -14854 -3387 -1165 -5090 -6537 8324 1478 -9131 3981 -8150 -12878 -10795 -9373 -10242 -8886
6573 -8886 -4247 -8038 -2598 -9557 -1048 -9095 1662 -14568 -5513 -11510 -1587 -2217 -6624 -4336 -7776
6558 -7776 -12947 -9682 -2337 -247 680 -1728 -7355 -796 -8535 -7716 -1007 -16380 -17624 -11681 -5719
6543 -5719 -7913 -18145 -8903 -9312 -16318 -10262 1043 -8003 -12936 -10609 -20051 -13563 -10490 -20101 -18844
6528 -18844 -8852 -11783 -23546 -12983 -13096 -9138 -14054 -6004 -7845 -16426 -17954 -8920 -12965 -14095
6514 -14095 -17696 -8603 -15518 -4931 -14631 -17562 -12839 -17993 -16701 -23681 -15779 -16720 -11767 -11540 -10592
6499 -10592 -15934 -14960 -9997 -8240 -9289 -15292 -21279 -14861 -9053 -17686 -14177 -9086 -15383 -13051 -9646
6484 -9646 -8817 -13982 -6281 -11853 -14980 -16442 -8618 -9599 -7931 -15928 -9979 -10103 -5389 5998 -3381
6469 -3381 297 -4159 141 -15786 -1164 -7210 -10662 -8410 -10753 -15389 -12722 -16891 -9512 -15125
6455 -15125 -7952 -8623 -8550 -8230 4109 -4481 895 -5981 -6465 -4369 -4442 -3664 207 -13146 -7294 -6756
6439 -6756 -7760 -245 -10095 -7808 -11210 -6266 -1024 832 -5976 -3745 -15792 706 -12786 -16810
6425 -16810 -3274 -7873 -21742 -16392 -8966 -6945 -15884 -12060 -15872 -8129 -1811 -11475 -6959 -3881
6411 -3881 -5968 -695 -4299 1744 -9466 -12724 -9898 -3416 -13352 -6885 -12279 -15520 -15350 -13731 -7009
6396 -7009 -14756 5261 -20703 -12832 -12635 -381 -1904 -545 -7164 -13160 -8739 -7086 -9969 -1245
6382 -1245 2272 -7228 -6401 -3988 -5582 -6144 -5339 -4374 -9663 -9818 -15647 -4867 -9589 -10016 -11583 -10566
6366 -10566 -8514 -14344 -11859 -8179 -3192 -14400 -17995 -21747 -14336 -20632 -13304 -9942 -21151 -9621
6352 -9621 -11783 -3822 -4714 -1814 -8271 -4082 -8692 -8664 -7287 -7792 -4909 -5395 -9982 -4736 -9682 -4903
6336 -4903 -6247 -5613 -5439 -10475 1490 -4346 -2139 -1363 -3129 -9758 -6214 -530 -8456 -11981 -5725
6321 -5725 -9658 -10748 -10235 -20856 -18233 -17995 -16641 -19532 -18523 -10970 -14784 -12030 -13842 -21145 -19469
6306 -19469 -14777 -20375 -17612 -17564 -23231 -29808 -22437 -23988 -21356 -28599 -22858 -15848 -17111 -17686 -20011
6291 -20011 -20827 -23070 -23534 -15880 -25224 -14994 -13435 -10762 -12481 -13688 -16460 -16764 -11917 -22667 -12561
6276 -12561 -10110 -10101 -18154 -12439 -12754 -13599 -14584 -5196 -13699 -7957 -20793 -2585 -9797 -5489 -1562 -2808
6260 -2808 -8734 -5140 -7905 -1917 -7449 -10552 -8314 -5978 -50 -2826 -7916 -3765 -3839 -2013 736
6245 736 5528 9468 1032 6128 8671 4521 8834 375 12658 18697 9727 15646 21857 22338 22005
6230 22005 37144 24474 35524 31704 41346 29917 25763 35243 28745 34867 35667 24039 21329 20999
6216 20999 26025 20982 24503 31351 26750 24528 36985 31330 29545 33337 31149 32136 24445 21596 20893
6201 20893 18649 13617 12784 20753 18416 12924 7948 11853 15150 13291 20837 23866 11194 13089 15251
6186 15251 16292 16532 10875 10520 13962 25177 15891 15393 14573 7152 5058 711 19132 15270 8450
6171 8450 8842 7824 6107 10802 18734 14085 15825 18366 21877 25633 24453 18165 19771 13602 8933
6156 8933 7368 17638 20333 18984 21196 25948 24854 28570 35118 30146 30681 35448 31886 42291 41673
6141 41673 48099 40762 50017 43204 44584 48733 51417 48898 48934 60425 55078 56253 52646 63074 57959
6126 57959 63074 77226 76479 75935 85007 80465 88932 85595 94883 97385 106452 106105 121272 122963 135972
6111 135972 153300 159857 182882 198793 219024 246727 289988 334060 395729 469476 543543 616392
6099 616392 667678 680334 684324 663890 627949 597190 566835 556875 550669 540281 542518 555176
6087 555176 577087 608546 630263 670762 711567 747070 791861 833545 860415 871897 864532 845859
6075 845859 815460 781430 746217 713414 681296 641634 616070 583348 566158 549502 554161 551727
6063 551727 582590 629342 670214 709109 718792 714341 677621 631595 569043 517402 463735 412457
6051 412457 367043 328440 290181 266414 249058 231456 219280 218687 204093 203983 190915 182394 182088
6038 182088 170287 179008 159728 164888 165468 157742 159250 159314 162461 170178 165683 174767 167701 169181 174845
6023 174845 169315 176183 180002 181104 184494 184099 180940 190923 193775 196169 192694 193115 204306 200532 212655
6008 212655 212976 218144 220040 223149 225854 230881 230869 237733 244294 247129 240359 243972 255328 273742 269558
5993 269558 276129 285675 287322 295341 315823 324585 336768 358500 367144 388309 410605 437520 461988
5980 461988 471674 485193 506624 545596 587026 637660 691020 747293 809397 882301 996486 1196674
5968 1196674 1519319 1952011 2399697 2664929 2821032 2964833 3211858 3720438 4343585 4833795
5958 4833795 4994180 4981216 4990758 5285546 5896129 6613875 6851445 6674755 6310120 5906582
5948 5906582 5792551 5798047 5815565 5516551 5040322 4544411 4121510 3878169 3715475 3471155
5938 3471155 3123197 2734868 2337841 1985704 1667708 1412472 1209645 1016021 889823 803891
5928 803891 737598 683575 633431 600974 577757 548140 530449 515925 492974 472038 463819 441055
5916 441055 430422 420235 407599 405020 387570 381840 375813 363983 356398 349317 338965 333058 319840
5903 319840 315824 303108 303857 284156 276053 263459 273910 245184 253076 253105 230715 238784 237051 228997
5889 228997 208633 211845 207473 202686 200781 203474 197379 195824 188978 197831 195230 190444 185096 189962
5875 189962 181763 187723 176760 185740 178604 173009 168623 161033 161083 150229 147849 156201 141255 133235
5861 133235 137394 136050 131589 135580 131396 121660 132290 119401 128132 128339 127657 123288 124479 130943
5847 130943 124861 128793 126927 130751 119459 119858 121288 111763 114646 123067 109784 103591 111457 109073
5833 109073 99833 102796 99171 96501 102440 85701 90856 88059 86972 93201 89164 94423 91441 91560
5819 91560 91521 100946 84122 90694 90192 97373 93255 103827 93356 94359 98024 102176 97508 100082 100776
5804 100776 100800 110309 97033 99645 97675 107480 100550 95918 100617 116384 99459 109935 109716 115004
5790 115004 112817 122005 124912 112953 117803 120862 121691 132335 136625 135012 131721 136605 138878 142063
5776 142063 142499 145032 151059 140190 155236 162888 171187 169963 175006 183488 192644 203027 211853 219223
5762 219223 240914 245568 267975 312941 346511 393265 444220 531343 629078 729290 852851
5751 852851 962587 1055245 1134790 1192468 1208085 1193721 1135803 1065532 986056 905047 822743
5740 822743 744993 685153 625614 578460 556475 538472 521513 533028 530109 559812 587906 631885
5728 631885 686908 785892 877108 1046375 1209323 1396658 1596397 1793174 1958810 2095920
5718 2095920 2183028 2216984 2198843 2125448 2013611 1871607 1719418 1538763 1361006 1188283
5708 1188283 1035510 912367 813532 726481 675317 620759 595720 585348 579500 591370 615116
5697 615116 631796 666756 725703 799155 879927 988288 1098783 1222067 1331354 1409348 1480512
5686 1480512 1471007 1449805 1373396 1266585 1148950 1024041 887028 777403 672181 589803
5676 589803 516526 462269 416529 380443 357294 331041 304780 291299 285050 270564 254219 240188
5664 240188 242407 225495 217386 212997 206249 205143 195036 197529 179276 172753 171515 183137 185050
5651 185050 168548 165102 168606 159542 159944 164953 160453 161472 143048 150159 151135 145218 142739 141039
5637 141039 143244 139936 138556 150423 150819 143369 146873 147649 154321 143322 150875 147381 158760 142867
5623 142867 153732 155788 149424 145843 155023 156073 154156 164093 154215 165227 166426 169800 187655 195679
5609 195679 190493 188756 190203 201552 206057 226862 229188 219843 238656 248340 263355 277706 297138
5596 297138 321567 344078 370906 416270 473465 543944 614967 690928 796647 890423 1002898
5585 1002898 1088893 1161259 1220935 1230675 1224132 1191327 1139510 1072146 1010846 941122 882021 834751
5573 834751 804236 783083 777433 787243 810728 832999 873282 937160 1010390 1112453 1230063 1370634
5561 1370634 1546972 1739083 1948548 2162473 2387573 2570728 2740585 2844450 2897959 2886869
5551 2886869 2835589 2733043 2588775 2458346 2313354 2188256 2070490 1985044 1922824 1881959
5541 1881959 1872767 1883073 1896762 1950591 1993915 2064391 2153362 2246725 2347159 2464940 2598160
5530 2598160 2737532 2875025 3013863 3127941 3187906 3212570 3179528 3108204 2974312 2815356
5520 2815356 2650220 2451598 2279786 2116978 1971073 1861650 1761108 1676382 1604613 1540431
5510 1540431 1489610 1437031 1389796 1318988 1253687 1186178 1115712 1053855 992691 930200 860036
5499 860036 800263 738630 677208 642249 595581 562523 519748 488332 456642 434545 417422 407445
5487 407445 386307 374630 366533 348395 335256 333798 319552 305801 283130 272473 264074 252322
5475 252322 250397 232886 227529 214318 211143 201862 211786 206797 186516 185550 172472 171087 169285 169254
5461 169254 163546 163359 155888 147724 141680 132802 139507 127053 137030 129252 129554 124269 104858 112357
5447 112357 109842 109246 113720 99438 104045 103258 84067 87408 85938 83124 82724 86573 85012 83550 80217
5432 80217 77802 76933 69522 86701 81993 73124 75282 73749 70555 66685 79592 63621 67358 73067
5418 73067 74318 71136 51235 50992 54784 52139 61072 62670 45639 44762 43525 56350 68107 55606
5404 55606 54191 56988 59681 56181 65457 66710 50092 48596 43161 50242 64747 61637 60258 56967
5390 56967 54130 53918 62317 68056 54907 59284 54306 52124 46847 63443 59120 55345 56178 56036 60235
5375 60235 62012 64667 63042 62384 60298 59728 70190 60342 62088 57311 58187 63538 51013 65346 64316
5360 64316 61377 61205 62316 62389 63868 64120 70719 72140 68766 68207 62035 65011 72306 75540 81673 80866
5344 80866 82965 85422 78959 89596 87769 92685 88540 94093 96305 97674 111519 101437 108216 120103
5330 120103 115215 129134 128988 137463 143762 143582 143344 152071 161981 168196 182648 177421 191676 190103
5316 190103 200761 212689 227181 237256 238216 259367 263477 292533 320211 338694 366743 402190
5304 402190 433231 482565 518841 576832 619238 687109 734131 795563 845001 889233 941896 968924
5292 968924 1005819 1031168 1068474 1088981 1126483 1144114 1169574 1198947 1229143 1258501 1295881 1347662
5280 1347662 1402072 1480100 1548461 1621086 1682145 1757312 1807490 1849157 1874738 1882176 1851072 1818784
5268 1818784 1774354 1704101 1624328 1553011 1476992 1404125 1323413 1257507 1193422 1150739 1098371
5257 1098371 1061883 1038387 1022678 1010905 1019155 1023151 1013727 1015190 1011247 999198 960179 942422
5245 942422 896066 845531 792530 727056 670212 609902 563000 510981 475683 441269 399934 367594
5233 367594 351910 329003 303238 287551 274223 254537 250942 238590 224702 212359 195595 186970
5221 186970 186968 189033 177757 177493 174894 168581 171269 171338 160120 158207 147472 149542 140141 142952 144790
5206 144790 135795 136933 131200 133284 125364 132628 130413 131534 112185 125081 107953 118430 120717
5193 120717 117588 114857 114805 119226 117311 120118 124865 122827 122908 122627 131317 130667 135718 130482 130416 138181
5177 138181 138621 140925 142844 154200 161418 156536 169335 180608 199065 223986 245744 271686 307836
5164 307836 366494 414193 465496 503498 528400 532541 528695 506276 480712 443294 424246 394180
5152 394180 369254 353434 350622 345640 342914 346907 343893 352713 360863 359768 387839 410396 446579
5139 446579 495711 568581 654046 739503 822711 919582 1008036 1106373 1222124 1314212 1360045
5128 1360045 1358076 1307228 1208505 1097065 996757 906676 824162 750241 701082 649102 622855
5117 622855 603234 589888 579723 581363 572873 594993 629080 675391 734885 810966 880177 970805
5105 970805 1091669 1207799 1348665 1470538 1585086 1652145 1679113 1658465 1577636 1461994
5095 1461994 1321899 1170087 1030784 918525 807074 726556 667519 622554 579258 562811
5085 562811 556022 546857 538675 531005 528305 525791 540565 571232 627160 690862 768273 863378 938780
5072 938780 1008461 1062526 1081781 1071143 1026019 965899 866589 780461 675895 598787 528781
5061 528781 464263 419505 388199 355305 332584 316018 303298 289938 267506 270768 250801 245373
5049 245373 232771 236373 239365 263747 271085 299267 310469 338052 343966 356005 350527 331305 304640
5036 304640 283311 251429 225506 209235 179168 166758 144508 136139 128607 124840 117417 108700 92518
5023 92518 95106 92216 89033 95650 82371 80030 77017 77884 78705 76936 82982 78558 72153 79377 77847
5008 77847 82128 85065 77959 65714 64655 63235 64722 62153 68696 60992 44976 57349 54946 54590
4994 54590 55940 54135 53244 52687 50292 49141 48031 45692 35936 38942 39558 44618 34904 36520 39545
4979 39545 38871 31373 34974 32063 34304 36051 36753 38781 34160 30582 39956 38500 30567 38388 41361
4964 41361 32630 27074 23867 35017 35016 35366 29695 36375 23930 30873 35067 32911 31269 39436 35563
4949 35563 37207 32641 43842 38358 39761 43967 48524 41453 36486 35481 32827 43258 48782 47992
4935 47992 44238 52256 51011 59120 57314 51738 58310 68856 70389 90009 101997 119405 114431 114065
4921 114065 114139 121377 116521 114518 114063 104241 101203 107835 102492 91921 99444 96023 97105 104561 109315
4906 109315 120680 137226 145464 149727 151257 161244 137564 130923 126065 133946 126285 139621 142271
4893 142271 132078 140243 139396 146822 154361 158238 173755 169311 177093 194665 196829 206353 229216 233145
4879 233145 242065 256749 266529 273318 289579 304426 325970 328292 352435 366280 384228 395105
4867 395105 410333 414645 429688 448743 460585 492123 499033 510407 511096 515005 521148 529958 531093
4854 531093 542225 539359 568971 578630 620998 658138 688214 743343 793884 845815 920708 991960
4842 991960 1083953 1169045 1253081 1355919 1454120 1525089 1585599 1639086 1660564 1680866 1719712
4831 1719712 1772376 1816531 1906777 2025654 2181762 2334803 2489253 2589334 2643193 2652355 2636150
4820 2636150 2633124 2645442 2693337 2781667 2909324 3063872 3214650 3371945 3482165 3542392 3544770
4809 3544770 3492216 3389258 3248021 3092659 2934663 2806012 2692256 2649027 2630731 2640020
4799 2640020 2631059 2592935 2511107 2395134 2255504 2126079 2001440 1906728 1809584 1732502 1683861
4788 1683861 1644751 1617315 1580298 1535294 1475747 1392549 1316222 1221057 1131608 1054820 974315
4777 974315 906129 844438 784111 728170 684837 634134 597616 556295 530087 514674 495346 472105
4765 472105 467144 458407 456420 448442 430371 430969 417838 402433 395291 385717 365163 356189 347665 324231
4751 324231 307883 297726 282895 268996 259170 249490 241708 232813 215501 215424 206031 193103 179334
4738 179334 178326 170125 159734 153847 152644 141783 140540 133471 136100 126669 116552 116795 113886 110908
4724 110908 103732 106445 104512 96722 98217 94022 87906 87874 85749 82019 75979 81585 74295 77000 73581
4709 73581 76534 60652 74205 70070 67535 68572 57494 57503 54742 52122 50818 53588 60804 50215
4695 50215 49739 42699 47561 48649 55510 52987 52506 58288 50462 46707 48816 49419 45732 47230 47773 44100
4679 44100 44590 46906 43572 30360 39831 45821 35492 38955 39451 31169 33116 37264 38178 40137 34231
4664 34231 40940 29451 34449 32687 28782 25913 32350 20671 24264 24775 28455 32255 36423 30807
4650 30807 35719 35028 29711 30600 21880 22841 32986 21756 22232 22885 23976 21437 23016 19605 20153 22937
4634 22937 22013 34196 21035 27101 25824 23402 24610 29544 31643 23750 19648 23822 28448 25851
4620 25851 21391 32980 28751 19518 23822 29877 28744 36696 27901 26857 36724 24930 26532 36223
4606 36223 25994 25693 30336 23427 21939 32013 43778 25984 30528 34903 28430 32600 37628 41281
4592 41281 37138 37682 44973 37199 43819 45101 39118 49533 49696 45259 32772 43651 36557 38992
4578 38992 37569 44391 37856 36070 36080 45349 46156 43071 44072 44064 34833 41246 50341 39803 43275 47380
4562 47380 47361 38030 39427 43487 43603 38891 40302 38443 42533 39759 37724 35174 37104 30695 37852
4547 37852 41177 34755 38530 35557 39284 32453 37605 34505 34085 33339 30163 23783 33625 26603 35159
4532 35159 34729 29180 36921 26759 32365 21291 22572 19562 20539 19670 22677 23088 27761 18413 20194
4517 20194 22858 18576 17462 30853 30727 18612 14262 17652 5238 7663 23492 16610 20080 5624
4503 5624 14861 6654 12580 13434 20163 22509 12073 15452 9023 11059 5051 8605 6261 4565 -1282
4488 -1282 11291 -13 11300 8914 11195 3946 764 7117 13793 10841 12804 11375 9847 13289
4474 13289 8331 6256 13261 14555 8780 4715 11514 10125 10491 6897 8224 7250 7213 21733 11838
4459 11838 11288 15639 11464 10430 16231 12010 7406 7532 2073 7693 6612 2065 8369 12249 3790
4444 3790 3685 8705 9561 17077 12872 17737 9389 17090 10169 17495 11679 19810 17366 15936 5817
4429 5817 8466 13731 14231 25316 15218 12606 8421 9240 11421 15314 29291 25965 14734 23506
4415 23506 24165 28156 27341 38929 23045 27576 23208 37165 24926 31052 37807 23821 26120 22103
4401 22103 28025 34966 32640 46502 35119 36460 33293 40866 43806 44115 40998 45262 44552 40741 41996
4386 41996 47040 48796 42524 43167 61035 46742 57988 60926 63423 66601 60982 73844 74632 83912
4372 83912 81579 67583 77489 81568 81574 87068 90127 87794 90388 91576 97095 109195 109207 116410 119989
4357 119989 116801 129092 123544 137428 136948 149883 147621 160365 165141 168116 168266 178640 182056 183949
4343 183949 199384 199177 210882 224734 221178 239530 240380 262609 267818 254215 253142 232967 227100
4330 227100 212595 186001 176103 171892 144833 139635 124803 116763 115800 107945 100087 104669 104366 108389
4316 108389 106113 109595 102275 91973 96258 83531 72390 71479 76342 66836 69153 65969 68467 59742
4302 59742 61593 60103 63686 63161 71667 71879 79254 71634 79150 72128 70864 65867 56045 53908 40154
4287 40154 52786 42651 40418 32007 39032 32327 29025 31090 34653 37332 29337 31387 35241 27597
4273 27597 39274 26780 33221 30391 23378 22824 25354 26958 28245 18818 26853 17246 23200 30477
4259 30477 36010 22924 19146 22498 20720 21161 32887 20585 21233 13033 11219 22060 26495 24120
4245 24120 23601 12495 14972 21250 16134 23433 17453 25155 16177 11162 13688 15237 14699 18428 16380
4230 16380 16925 20726 14472 26432 20677 28349 31529 30325 21871 23736 33170 26092 18449 15549 15668
4215 15668 12310 13360 8760 14364 18399 10952 5463 21165 9894 20273 18297 19075 14704 9198
4201 9198 16711 23200 18515 23381 16009 28226 13785 17159 8386 24125 15256 3471 21294 23160
4187 23160 11783 13386 15611 237 6820 12278 6841 8455 -289 12535 14030 -1316 14567
4174 14567 9966 8678 1987 2622 2616 -3373 4924 2404 923 4137 9000 65 6082 7422 2042 5644
4158 5644 9728 12919 13701 2646 9061 6511 6514 14901 6056 6177 8732 2888 7460 4748 8079 8490
4142 8490 7860 218 9021 5404 10614 1958 13836 1763 1054 8166 5673 9 5070 4650 8714
4127 8714 2373 6219 15446 6892 10772 16565 24918 17644 16770 21679 23132 19510 27973 9927 12358
4112 12358 8280 13942 16607 23178 15412 21914 20319 18230 18245 23461 25424 28213 28159 24224 19712 32332
4096 32332 28745 25431 32160 26154 32754 28324 40752 36006 40612 37073 36136 37318 38579 37458 43264
4081 43264 45597 47379 37813 37095 43658 48601 54516 53000 51495 41905 49743 49550 46510 44079 44617
4066 44617 51803 47770 49622 54337 55363 55962 59588 62176 63519 71971 71753 75554 76025 81777 71473
4051 71473 79962 80102 76208 75476 81521 75057 70597 80704 77890 72446 86339 85193 89962 89089 85299
4036 85299 87093 90306 95117 89458 96395 91655 90137 94563 107187 108399 104369 107195 108719 102218
4022 102218 118156 105937 111156 105036 104540 99607 102186 105511 105124 95886 97966 94025 86672 92021
4008 92021 91007 102457 95629 88133 93760 86220 80142 83038 87439 89580 83788 91338 79644 92694
3994 92694 86576 79070 70348 73113 65281 62347 71076 65953 63197 63927 56963 60072 45301 44317 46701
3979 46701 48649 44920 43912 48637 46928 35838 37038 37831 31409 36642 35324 33088 20840 32345
3965 32345 24788 31833 19897 28339 6397 6004 12932 19992 8410 6170 12947 13555 752 3759
3951 3759 14153 8897 -2205 -5137 -2317 1007 9177 118 1274 1633 -1705 2111 10981 7869 10001
3936 10001 5902 -392 7657 -3019 -2206 -2596 -7425 -13394 -4727 -6932 -14662 -12893 -7358 -1117 -3702
3921 -3702 -12377 -5531 -5916 -7113 -1465 5032 -12455 -9073 -1625 -741 -11036 -15745 -16769 -4923 -12704
3906 -12704 -13134 -4205 -12262 -8245 -8483 -10268 -7642 -12685 -7355 -5479 -7646 -12599 -12251 -2829 -10395
3891 -10395 -17575 -15040 -14504 -18250 -11346 -12063 -12304 -10578 -12266 -17037 -12857 -14844 -13146 -16135 -13810
3876 -13810 -14800 -11310 -18434 -10635 -17212 -16795 -18722 -19170 -14594 -17832 -22247 -21909 -8022 -8148 -8719 -20632
3860 -20632 -22097 -24623 -20728 -16941 -9737 -14616 -24545 -23912 -24504 -17661 -17451 -11743 -19560 -26891 -18020
3845 -18020 -23706 -15761 -15681 -25339 -32893 -25992 -18346 -20640 -19121 -19020 -24595 -25127 -21351 -24429 -17581 -13730
3829 -13730 -30760 -26188 -30874 -35150 -19854 -25529 -26814 -21447 -28389 -11759 -23486 -16722 -16486 -17125
3815 -17125 -14390 -15373 -19649 -23338 -24806 -29098 -30265 -26370 -23706 -23207 -22568 -21904 -24221 -22694 -17866 -28163
3799 -28163 -21886 -17037 -11782 -11632 -24008 -19415 -18741 -30636 -18678 -14729 -26201 -29511 -21521 -22359
3785 -22359 -21211 -25859 -14042 -22057 -18160 -25023 -18177 -13566 -19221 -23808 -14396 -20788 -15872 -21612
3771 -21612 -15223 -30950 -26921 -24110 -18291 -21193 -28722 -21606 -21449 -25051 -19736 -20782 -23912 -22006 -26330
3756 -26330 -22762 -3341 -16170 -21321 -25590 -35630 -35358 -26556 -23967 -16242 -26365 -29869 -24006 -24379
3742 -24379 -23277 -24043 -19819 -25339 -26314 -24107 -11417 -17232 -17730 -21119 -24566 -21677 -26722 -19324 -23362
3727 -23362 -28679 -29179 -11620 -23960 -17634 -26350 -28923 -24484 -14206 -12542 -18306 -10587 -16883 -20006
3713 -20006 -18463 -17746 -17087 -22488 -22306 -23705 -33004 -27741 -30767 -31276 -24880 -25876 -29867 -30841 -22856 -24396
3697 -24396 -23237 -15084 -22443 -11573 -21497 -21108 -23411 -28190 -23441 -24351 -19618 -27107 -34526 -30903 -29668
3682 -29668 -28653 -24431 -32997 -24498 -20531 -14053 -24472 -26020 -21933 -21718 -23924 -19539 -22872 -23182 -28453
3667 -28453 -28625 -23314 -25207 -20109 -33354 -28027 -34904 -28429 -22211 -23743 -31290 -28097 -22426 -17708 -22459
3652 -22459 -18395 -22773 -27144 -32267 -24348 -22233 -19815 -27741 -28713 -25704 -30288 -31052 -22775 -30253 -23983
3637 -23983 -31579 -19163 -30896 -26660 -20321 -35535 -20166 -31139 -25130 -27500 -31549 -31044 -28234 -23277
3623 -23277 -29798 -35163 -20597 -29749 -35969 -28970 -25595 -27483 -31746 -23712 -25411 -34259 -32224 -24308
3609 -24308 -25896 -25211 -16141 -20987 -23301 -29693 -24487 -18277 -25953 -34792 -27372 -35793 -27906 -19315 -17259
3594 -17259 -23052 -26042 -32341 -25040 -21263 -18257 -19700 -23749 -34096 -33325 -26926 -24257 -23865 -25511 -37818
3579 -37818 -30750 -23783 -26593 -17544 -29238 -24591 -19038 -34990 -22375 -23797 -29491 -28850 -30714 -33974
3565 -33974 -33857 -34185 -31339 -33891 -26134 -25751 -33182 -31382 -26167 -29882 -20800 -24053 -18919 -32043 -25128
3550 -25128 -31570 -34768 -16166 -19929 -28486 -25849 -25635 -27618 -18088 -31399 -25083 -32790 -30912 -27640
3536 -27640 -21056 -29712 -28513 -32069 -21343 -18997 -17869 -22171 -23743 -21020 -19004 -26485 -26583 -33670 -34573
3521 -34573 -29074 -29530 -24205 -25383 -25851 -26088 -26169 -23629 -29437 -17180 -31905 -35398 -26258 -31531 -23975
3506 -23975 -24036 -23703 -25640 -30166 -37321 -22747 -25978 -20312 -26337 -32590 -33842 -32089 -32386 -31118 -32035 -25706
3490 -25706 -36678 -25665 -17266 -24282 -33145 -28552 -34609 -30207 -29323 -31729 -28082 -30250 -35236 -31761
3476 -31761 -28798 -35903 -29204 -32776 -28085 -32887 -27363 -26409 -22873 -25259 -21151 -27081 -23703 -30606 -26081
3461 -26081 -27984 -25858 -25431 -21641 -25442 -33469 -21345 -35293 -34240 -26623 -28054 -38315 -33355 -40925
3447 -40925 -33499 -28736 -26882 -30811 -28279 -18886 -32989 -27101 -30328 -26061 -31146 -25258 -21077 -28135
3433 -28135 -34811 -30396 -36711 -35892 -20830 -32057 -31250 -30049 -29647 -25871 -33952 -18696 -26001 -35936 -27309
3418 -27309 -33627 -36892 -17478 -32909 -36373 -33807 -22025 -32983 -27222 -17934 -27599 -34974 -24611
3405 -24611 -26753 -25819 -19236 -28058 -27613 -30875 -26374 -30648 -20820 -21916 -26635 -26102 -25896 -29258 -39832
3390 -39832 -26292 -20908 -38170 -32171 -31008 -29295 -32781 -22758 -31359 -31332 -38332 -27287 -38873 -41566
3376 -41566 -25735 -25290 -34604 -36318 -31284 -35260 -26863 -31502 -29446 -39910 -23734 -39285 -24583 -21580
3362 -21580 -31377 -38355 -33650 -26926 -27053 -24746 -27545 -26973 -34748 -26518 -32816 -22640 -29968 -32054 -27825
3347 -27825 -28219 -27850 -35525 -24380 -30595 -33044 -28596 -30578 -30331 -32949 -30179 -27807 -26338 -32403 -35467
3332 -35467 -26537 -32515 -34861 -22967 -38368 -31199 -25098 -27230 -28525 -23151 -30106 -28702 -34224 -23826
3318 -23826 -34582 -21748 -25730 -19878 -32519 -32227 -23620 -32486 -33468 -29758 -28300 -25713 -33244 -31117
3304 -31117 -24763 -34137 -30155 -29223 -25509 -37108 -26204 -38619 -35658 -23294 -22933 -31076 -19842 -34097
3290 -34097 -33971 -28260 -26558 -29862 -23489 -31045 -35743 -26989 -42722 -35479 -36338 -30235 -37841 -33979 -32241
3275 -32241 -21569 -29762 -15833 -22851 -31902 -39189 -31827 -28442 -26074 -34288 -28991 -31181 -35204 -32151
3261 -32151 -28655 -36744 -29265 -31318 -35884 -30982 -21408 -18840 -28148 -31817 -31819 -28565 -30244 -25325 -26860
3246 -26860 -33486 -31407 -30669 -32701 -30411 -29872 -23447 -35393 -26205 -19211 -28450 -27115 -20119 -24386 -25710
3231 -25710 -23216 -22780 -31912 -35988 -33388 -34470 -34727 -29011 -29628 -30581 -29232 -26030 -29114 -24357 -27909 -34646
3215 -34646 -24522 -31400 -32863 -32831 -30294 -38875 -30776 -33242 -24243 -27435 -28272 -31430 -34091 -39463 -24843
3200 -24843 -27755 -27282 -26973 -28945 -39632 -34088 -31432 -22848 -18527 -19359 -18182 -27453 -21401 -27902 -22964
3185 -22964 -24257 -24747 -33999 -21549 -27846 -33867 -30493 -19895 -24792 -26138 -32064 -27859 -33177 -27595
3171 -27595 -31461 -34178 -35354 -34679 -21483 -24985 -24129 -25335 -30052 -35638 -32112 -36465 -23788 -37449
3157 -37449 -31813 -41989 -27066 -35621 -25139 -27405 -26065 -28303 -19850 -27137 -33211 -27834 -19837 -29892
3143 -29892 -32121 -29624 -35417 -36058 -35035 -27015 -33144 -31749 -25656 -31764 -26615 -28586 -28183 -27501 -32371
3128 -32371 -28796 -36242 -33621 -27993 -23894 -22290 -25735 -34062 -30748 -40976 -20603 -23944 -26517 -31076
3114 -31076 -29863 -28441 -30371 -34036 -17297 -35196 -31045 -27692 -18024 -25337 -27915 -26086 -34026 -37644
3100 -37644 -34040 -29027 -31355 -27909 -31994 -30111 -29128 -28123 -21735 -28418 -30925 -34703 -48074 -32205
3086 -32205 -35027 -31796 -30158 -23682 -36625 -33456 -32569 -31803 -33101 -35062 -28453 -36721 -38158 -35870 -26307
3071 -26307 -26198 -29141 -36587 -32881 -41151 -23591 -30830 -34552 -33472 -37606 -34582 -20874 -29056 -35221
3057 -35221 -31119 -35176 -34404 -33421 -24899 -34653 -36833 -32192 -40011 -34187 -28907 -30856 -31314 -32008 -29275 -31005
3041 -31005 -33966 -34995 -21023 -30955 -27479 -27318 -27956 -23573 -23390 -26479 -27300 -32033 -28428 -34872 -37005
3026 -37005 -31731 -32856 -26749 -38192 -34084 -40437 -30589 -33758 -34851 -31282 -25275 -35146 -27929 -22906
3012 -22906 -20316 -21624 -31381 -37024 -40098 -29609 -28472 -31974 -27352 -30639 -38007 -32881 -32179 -41916 -34088
2997 -34088 -29008 -29930 -35346 -32714 -24579 -28312 -32167 -29888 -26139 -38640 -28004 -37078 -28582 -34757
2983 -34757 -25756 -42711 -25471 -30414 -31633 -31771 -25490 -20844 -29603 -29269 -21387 -27817 -30690 -26469 -30804
2968 -30804 -29165 -33073 -28179 -32009 -31267 -37428 -24636 -22426 -25186 -28761 -32232 -29654 -32232 -27379 -29584
2953 -29584 -24345 -33582 -30273 -28016 -30112 -34440 -29923 -34645 -28449 -41504 -29177 -31252 -36292 -34049
2939 -34049 -40405 -36520 -31173 -29356 -32791 -33921 -19687 -34311 -31319 -21510 -36548 -32532 -34379 -34482
2925 -34482 -33015 -37763 -33371 -32908 -37543 -28530 -35878 -29018 -18660 -26445 -30073 -23777 -30323 -29968 -25624
2910 -25624 -28355 -28286 -30276 -36857 -36431 -28628 -33199 -29852 -21349 -35831 -34925 -29688 -22101 -32720 -27549
2895 -27549 -28770 -19241 -27016 -20326 -19519 -17330 -26813 -36180 -23048 -29699 -27884 -22013 -24707 -35178
2881 -35178 -36466 -36730 -33034 -27984 -26827 -26014 -33254 -25802 -30074 -29851 -34764 -30786 -29796 -25044 -30086 -26298
2865 -26298 -29981 -33203 -25957 -27878 -34767 -32910 -35191 -28948 -37409 -28277 -25504 -27109 -32735 -19196
2851 -19196 -31869 -21869 -37971 -28012 -28409 -32049 -30554 -33288 -39517 -41767 -23888 -34961 -31900 -29875
2837 -29875 -28729 -27022 -27455 -30402 -26988 -34123 -21653 -31277 -29370 -29742 -28349 -33100 -34308 -30346 -33923
2822 -33923 -29867 -41488 -29338 -32886 -35645 -25494 -29981 -26822 -25846 -29332 -25190 -27387 -20444 -25613
2808 -25613 -29951 -38353 -33282 -25139 -28433 -35150 -34302 -36171 -34359 -34106 -30124 -35262 -31502 -26394 -27610
2793 -27610 -33869 -31455 -22344 -28997 -35944 -34105 -31248 -28248 -26063 -39221 -27012 -31680 -34274 -29466
2779 -29466 -35732 -34835 -35214 -39383 -31877 -25791 -29339 -37497 -23447 -28432 -32618 -30538 -33580 -36309 -30515
2764 -30515 -19820 -34205 -33550 -33604 -27531 -35917 -32432 -29954 -27373 -30646 -26900 -25512 -18590 -28555 -27332
2749 -27332 -32951 -24288 -32405 -23764 -28156 -35469 -30756 -29316 -32125 -24293 -30739 -36404 -28529 -35671 -33790
2734 -33790 -35632 -31861 -30731 -32032 -31650 -33408 -29922 -34428 -40836 -31298 -37453 -32124 -32618 -33907 -26865
2719 -26865 -36506 -34528 -26584 -36860 -27895 -31141 -34001 -30562 -32585 -33520 -33053 -29593 -32095 -37887 -35499
2704 -35499 -33334 -32075 -35371 -42425 -35554 -40331 -34458 -32833 -28087 -27499 -29060 -30659 -36219 -33933 -28050
2689 -28050 -23938 -34460 -29906 -33678 -27914 -28682 -29685 -26957 -35442 -33966 -21660 -32680 -30404 -27437
2675 -27437 -25355 -25795 -24776 -21888 -20976 -25858 -21256 -30065 -37310 -29523 -22613 -25199 -35714 -20750 -30326
2660 -30326 -30949 -28567 -30349 -24739 -33370 -26859 -26949 -31973 -36267 -30946 -25497 -34075 -35107 -29154 -36302
2645 -36302 -32169 -40200 -38757 -26223 -32574 -30918 -40919 -30197 -31111 -35692 -30045 -34671 -23727 -28443
2631 -28443 -36614 -32202 -24565 -31989 -27953 -26571 -31953 -37304 -32596 -34448 -30954 -29932 -27301 -34646 -34600
2616 -34600 -31310 -19227 -32419 -27240 -26328 -25338 -25922 -22668 -28268 -28681 -26293 -32593 -31007 -37332 -31816
2601 -31816 -26167 -26164 -34946 -34501 -39600 -32549 -25249 -25941 -30197 -31280 -31178 -36960 -27328 -24557 -28552 -30118
2585 -30118 -35206 -37972 -34141 -41413 -33151 -27613 -32821 -33387 -31939 -27771 -29248 -34913 -29384 -31227 -28529
2570 -28529 -26913 -21609 -41742 -43013 -32671 -37995 -37086 -33327 -27959 -41178 -34114 -30109 -31686 -31419
2556 -31419 -22054 -25279 -37527 -23472 -23014 -24219 -24251 -27291 -27289 -42159 -34193 -26734 -26010 -32158 -23974 -26968
2540 -26968 -32011 -36749 -25255 -21252 -23715 -30227 -29644 -29315 -33166 -22988 -23155 -23809 -27172 -29090 -34537
2525 -34537 -26707 -32520 -28900 -40392 -27896 -29868 -32144 -27306 -25149 -33916 -37278 -30998 -29938 -35180
2511 -35180 -29094 -28768 -37473 -29201 -25256 -25852 -37145 -24328 -29683 -28044 -29458 -32692 -32809 -38256 -32411
2496 -32411 -36300 -30033 -28034 -25973 -30810 -31170 -32101 -28031 -21991 -32957 -27316 -34120 -26831 -34951 -28015
2481 -28015 -26926 -34342 -31979 -34582 -28624 -28083 -27271 -35004 -41554 -34275 -26627 -26474 -33174 -25774 -33124
2466 -33124 -35955 -21748 -30451 -33749 -29485 -25552 -38967 -34645 -21619 -21318 -37265 -25957 -19808 -29161
2452 -29161 -35235 -27730 -31660 -38888 -33310 -32922 -39095 -41396 -39434 -36890 -30199 -29696 -28713 -30316 -30561 -35164
2436 -35164 -21335 -24759 -34129 -30855 -29828 -34676 -38710 -34582 -25155 -37670 -37904 -29548 -31508 -24405
2422 -24405 -32477 -31639 -40561 -30567 -28489 -33658 -25914 -30803 -41663 -36280 -26248 -36424 -39213 -24992
2408 -24992 -32815 -33050 -27791 -26199 -33879 -37818 -35093 -28752 -33772 -38055 -26349 -32752 -35590 -28963 -30441
2393 -30441 -33405 -33277 -38215 -33284 -41015 -31626 -39400 -38038 -24955 -30893 -36579 -35095 -33158 -38140 -35514
2378 -35514 -37625 -22560 -30550 -30465 -34408 -37237 -37687 -36045 -29086 -27745 -26780 -30027 -34174 -33315 -35703 -23889
2362 -23889 -31510 -32437 -28281 -32229 -30743 -23532 -32772 -28466 -34261 -31174 -33843 -32414 -28088 -27717 -34287
2347 -34287 -38260 -40050 -34882 -36111 -29578 -32209 -32815 -37768 -29689 -29137 -31046 -28677 -29363 -28490 -31521 -37594
2331 -37594 -33585 -29161 -31907 -35518 -25733 -39450 -33481 -33969 -25024 -32167 -25780 -34315 -33291 -31350 -29906
2316 -29906 -23860 -28456 -32150 -29955 -33447 -27169 -25369 -29995 -27002 -23852 -35633 -30993 -32699 -27733
2302 -27733 -28259 -32628 -31423 -26228 -36937 -36581 -24876 -33713 -24767 -32035 -35609 -38143 -34901 -31015 -26730
2287 -26730 -25324 -31106 -33903 -23073 -27671 -37637 -30548 -34535 -33639 -35111 -27930 -31943 -35800 -26128 -33096
2272 -33096 -31259 -30816 -26774 -27747 -23791 -27309 -31940 -39970 -29370 -34384 -33462 -31673 -27276 -35311 -28711
2257 -28711 -23337 -28711 -39217 -33671 -31865 -29871 -20758 -28008 -21905 -32476 -30488 -32118 -30251 -22347
2243 -22347 -36467 -31255 -28712 -35495 -34621 -33471 -24520 -31784 -28191 -36234 -31844 -34657 -32710 -27004 -37578
2228 -37578 -31578 -33164 -30095 -29372 -33503 -22200 -30181 -31698 -34012 -35439 -26506 -31467 -22533 -29094 -27069
2213 -27069 -37541 -31772 -29028 -19421 -22275 -29651 -28885 -26816 -25968 -30639 -32529 -26425 -29533 -36636 -32358
2198 -32358 -25640 -33966 -35006 -41837 -33243 -30867 -32029 -25466 -34949 -32696 -31585 -29638 -24244 -36245
2184 -36245 -29105 -31016 -27892 -18610 -24346 -18250 -29750 -28702 -32311 -23192 -31854 -26347 -35508 -34540 -33329
2169 -33329 -30579 -19993 -28294 -22096 -34319 -32108 -28593 -41073 -30861 -31778 -31900 -32170 -38960 -27693
2155 -27693 -29253 -31318 -29686 -29853 -31946 -39453 -40567 -30801 -35340 -36544 -30303 -33857 -34878 -34833 -35209 -22964
2139 -22964 -35291 -30839 -30198 -35094 -31665 -33801 -23314 -35607 -30331 -35410 -33175 -34232 -28568 -29809
2125 -29809 -27406 -28029 -33148 -28805 -25317 -38542 -37337 -30454 -27742 -27979 -40714 -28545 -41921 -29995
2111 -29995 -31381 -26380 -31061 -29406 -36607 -37810 -31346 -29068 -30429 -35995 -34406 -36146 -35015 -21552
2097 -21552 -32577 -23022 -33309 -30204 -31192 -29367 -38808 -40062 -37113 -35585 -30276 -33195 -28936 -36248
2083 -36248 -34611 -34908 -24265 -28755 -33448 -29029 -28679 -33968 -29378 -28285 -30868 -32564 -36390 -33104 -24862
2068 -24862 -36910 -31054 -34013 -33746 -33644 -35188 -35195 -37046 -31174 -29118 -28012 -32912 -34282 -28960 -29172 -33511
2052 -33511 -33233 -31347 -33735 -29772 -32270 -26092 -25275 -30520 -31776 -38980 -30149 -37794 -35548 -37269 -41245
2037 -41245 -33199 -33638 -25300 -30768 -37201 -42556 -32865 -34681 -31832 -26289 -27361 -32945 -37540 -38639 -20132
2022 -20132 -25516 -29390 -37049 -33689 -37545 -34676 -26486 -35291 -30381 -29800 -39261 -31714 -32011 -27186 -29923
2007 -29923 -32539 -34529 -33635 -27600 -29369 -27112 -34769 -41917 -41640 -26702 -30102 -24769 -33385 -28196 -33236
1992 -33236 -39211 -25963 -24563 -28813 -32266 -36760 -38887 -31613 -25947 -32078 -25429 -29688 -38040 -31395
1978 -31395 -32794 -34208 -29660 -26582 -37023 -31654 -29661 -27136 -32392 -35380 -42073 -27512 -33706 -28787
1964 -28787 -27705 -33100 -34243 -30348 -25260 -24108 -30485 -36916 -31427 -28442 -22417 -23415 -26067 -29621 -37082
1949 -37082 -32573 -32397 -26551 -32519 -32942 -30243 -44387 -36963 -26843 -22458 -22627 -29812 -32679 -34539 -22066
1934 -22066 -25752 -32777 -28442 -35988 -36682 -37431 -24982 -28274 -21280 -30416 -34805 -37483 -34918 -19820 -39359
1919 -39359 -32163 -31005 -35469 -34254 -26081 -27545 -34914 -31517 -35951 -31704 -30815 -27928 -25149 -29255 -38943
1904 -38943 -43654 -34120 -28827 -27127 -30614 -38561 -31991 -32668 -22515 -20395 -15900 -25076 -26062 -30774 -35662
1889 -35662 -33750 -23099 -28205 -29331 -39606 -35393 -26975 -33242 -29752 -25207 -38072 -34655 -26708 -28445
1875 -28445 -23671 -27548 -21565 -32772 -33994 -29799 -28236 -23912 -24383 -35354 -31204 -31279 -32276 -35055 -27362
1860 -27362 -38645 -28406 -32552 -30516 -28505 -30465 -24571 -26118 -23098 -31579 -31252 -34946 -33774 -35228
1846 -35228 -27577 -29538 -34419 -42948 -32834 -27425 -20191 -27288 -27759 -38464 -36059 -29939 -28838 -31143
1832 -31143 -30682 -37624 -39077 -32600 -34852 -30064 -23984 -24648 -23426 -35062 -35786 -32708 -26514 -32908 -35002
1817 -35002 -30372 -41114 -30910 -28088 -24761 -27740 -38556 -30117 -34852 -30824 -27854 -25260 -29638 -26244
1803 -26244 -31054 -34505 -34411 -29491 -25779 -33966 -28891 -39726 -36745 -25617 -25152 -31509 -31330 -41644 -36150
1788 -36150 -37331 -33567 -31996 -32710 -29875 -37002 -32892 -30910 -32796 -40100 -27802 -28312 -34231 -33422 -22245
1773 -22245 -31967 -34036 -31563 -26221 -38410 -34018 -35747 -36724 -36729 -26585 -43197 -38321 -31791 -34322 -31109
1758 -31109 -30746 -26868 -31823 -24935 -24412 -26644 -30536 -27404 -29056 -36558 -35297 -36163 -33114 -36995 -29426
1743 -29426 -40190 -30327 -29540 -27170 -35012 -31087 -38119 -30385 -27523 -26011 -28545 -28738 -28709 -29492 -35095 -32658
1727 -32658 -35142 -33087 -38342 -26444 -35530 -31170 -29123 -39645 -26896 -40558 -27854 -31492 -26674
1714 -26674 -30929 -34997 -27603 -27741 -33975 -33625 -34489 -41029 -41290 -38595 -33066 -30771 -36651 -34198 -31622 -36798
1698 -36798 -26827 -36218 -30911 -38512 -32315 -34058 -30757 -24110 -33344 -26068 -39293 -37852 -33115 -35408
1684 -35408 -36885 -32153 -31296 -37394 -37624 -32771 -34541 -25069 -30949 -25476 -31944 -25148 -27200 -28120 -31126
1669 -31126 -29901 -32243 -30847 -28531 -31383 -33176 -36244 -34495 -37657 -34125 -38899 -36184 -29417 -23765 -27655
1654 -27655 -31557 -38563 -28181 -26616 -24611 -32019 -34481 -32802 -32098 -32114 -31748 -29690 -38456 -33072 -28255
1639 -28255 -34536 -29064 -28222 -26854 -32504 -24558 -23421 -30153 -28102 -34336 -30474 -36876 -30558 -27235 -33681
1624 -33681 -34716 -25769 -24209 -32689 -26367 -34426 -37988 -38694 -34680 -16251 -22905 -27149 -32441 -31749 -35725
1609 -35725 -24398 -24667 -23156 -35227 -43354 -42149 -24933 -35068 -24921 -33947 -35676 -35520 -35110 -27953
1595 -27953 -26943 -25727 -38845 -30768 -26016 -31130 -32754 -31544 -33294 -33140 -32802 -31149 -26523 -33894 -30808
1580 -30808 -26781 -33160 -33750 -32967 -34656 -30556 -22581 -21151 -23791 -39877 -33048 -25963 -30107 -25917 -25729
$$ [...]
##END NTUPLES=NMR SPECTRUM
##END=
