##TITLE=abcd
##JCAMPDX= 6.0         $$ Bruker NMR JCAMP-DX V2.0
##DATA TYPE= NMR SPECTRUM
##DATA CLASS= NTUPLES
##ORIGIN= UXNMR, Bruker Analytische Messtechnik GmbH
##OWNER= root
$$ XWIN-NMR		Version 3.5
$$ Thu Oct 16 11:59:12 2025 Russian Standard Time (UT+4h)  servis@DPX200
##.OBSERVE FREQUENCY= 200.131235884673
##.OBSERVE NUCLEUS= ^1H
##.ACQUISITION MODE= SIMULTANEOUS
##.ACQUISITION SCHEME= undefined
##.AVERAGES= 32
##.DIGITISER RES= 18
##SPECTROMETER/DATA SYSTEM= spect
##.PULSE SEQUENCE= zg
##.SOLVENT NAME= DMSO
##.SHIFT REFERENCE= (INTERNAL, DMSO, 0, 16.4885)
##AUDIT TRAIL= $$ (NUMBER, WHEN, WHO, WHERE, WHAT)
$$ ##TITLE= Audit trail, XWIN-NMR		Version 3.5
$$ ##JCAMPDX= 5.01
$$ ##ORIGIN= Bruker BioSpin GmbH
$$ ##OWNER= servis
$$ F:\spectra/data/av/nmr/H1/1/pdata/1/auditp.txt
$$ ##AUDIT TRAIL=  $$ (NUMBER, WHEN, WHO, WHERE, WHAT)
(   1,<2025-10-16 11:58:30.25 +0400>,<servis>,<DPX200>,
      <created by zg, POWCHK disabled, PULCHK disabled
       configuration hash MD5:
       00 E9 B6 7A A2 85 ED C7 34 08 36 98 17 FE 4E 26
       data hash MD5: 32K
       56 97 D5 92 60 77 12 1B 5B 48 FC 37 EE EC 66 A2>)
(   2,<2025-10-16 11:58:31.81 +0400>,<servis>,<DPX200>,
      <Start of raw data processing
       efp BC_mod = 2 LB = 0.05 FT_mod = 6 PKNL = 1 PHC0 = -269.0701 PHC1 = 2.101565 SI = 16K 
       data hash MD5: 16K
       4B BD DB 61 97 D1 F3 56 EF D9 5D C1 0D 9A B6 DA>)
(   3,<2025-10-16 11:58:46.29 +0400>,<servis>,<DPX200>,
      <pk PHC0 = -2.6 PHC1 = 0 
       data hash MD5: 16K
       30 D3 68 31 B8 35 D5 F6 04 65 5A FC FF 7E 98 19>)
(   4,<2025-10-16 11:58:48.67 +0400>,<servis>,<DPX200>,
      <abs ABSG = 5 
       data hash MD5: 16K
       DB DB C0 14 23 02 62 F2 10 81 25 3A 6D 0E 47 8C>)
$$ ##END=
$$ 
$$ hash MD5
$$ 8A 9F 71 C3 97 90 15 66 9A 94 2A 6C AE 1E F1 3E
##$RELAX= 
##$RELAX= 
##$RELAX= 
##$RELAX= 
##$RELAX= 
##$RELAX= 
##$RELAX= 
##$RELAX= 
$$ Bruker specific parameters
$$ --------------------------
##$DU= <F:\spectra>
##$EXPNO= 1
##$NAME= <H1>
##$PROCNO= 1
##$TYPE= <nmr>
##$USER= <av>
##$AMP= (0..31)
100 100 100 100 100 100 100 100 100 100 100 100 100 100 100 100 100 100 
100 100 100 100 100 100 100 100 100 100 100 100 100 100 
##$AQSEQ= 0
##$AQ_mod= 1
##$AUNM= <au_zg>
##$AUTOPOS= <>
##$BF1= 200.13
##$BF2= 200.13
##$BF3= 200.13
##$BF4= 200.13
##$BF5= 500.13
##$BF6= 500.13
##$BF7= 500.13
##$BF8= 500.13
##$BYTORDA= 1
##$CFDGTYP= 0
##$CFRGTYP= 5
##$CHEMSTR= <none>
##$CNST= (0..31)
1 1 145 1 1 1 1 1 1 1 1 1 1 1 1 1 1 1 1 1 1 1 1 1 1 1 1 1 1 1 1 1 
##$CPDPRG= <>
##$CPDPRG1= <>
##$CPDPRG2= <>
##$CPDPRG3= <>
##$CPDPRG4= <mlev>
##$CPDPRG5= <mlev>
##$CPDPRG6= <mlev>
##$CPDPRG7= <mlev>
##$CPDPRG8= <mlev>
##$CPDPRGB= <>
##$CPDPRGT= <>
##$D= (0..31)
0 2 0 0 0 0 0 0 0 0.06 0 0 0 0 0 0 0.0002 0 0 0 0 0 0 0 0 0 0 0 0 0 0 
0 
##$DATE= 1760601509
##$DBL= (0..7)
120 120 120 120 120 120 120 120 
##$DBP= (0..7)
150 150 150 150 150 150 150 150 
##$DBP07= 0
##$DBPNAM0= <>
##$DBPNAM1= <>
##$DBPNAM2= <>
##$DBPNAM3= <>
##$DBPNAM4= <>
##$DBPNAM5= <>
$$ [...]
##$SUBNAM5= <"">
##$SUBNAM6= <"">
##$SUBNAM7= <"">
##$SUBNAM8= <"">
##$SUBNAM9= <"">
##$SW= 20.6817932712277
##$SWIBOX= (0..15)
0 0 3 0 0 0 0 0 0 0 0 0 0 0 0 0 
##$SW_h= 4139.07284768212
##$TD= 32768
##$TD0= 1
##$TE= 0
##$TE2= 300
##$TE3= 300
##$TEG= 300
##$TL= (0..7)
0 120 120 120 120 120 120 120 
##$TP= (0..7)
150 150 150 150 150 150 150 150 
##$TP07= 0
##$TPNAME0= <>
##$TPNAME1= <>
##$TPNAME2= <>
##$TPNAME3= <>
##$TPNAME4= <>
##$TPNAME5= <>
##$TPNAME6= <>
##$TPNAME7= <>
##$TPOAL= (0..7)
0.5 0.5 0.5 0.5 0.5 0.5 0.5 0.5 
##$TPOFFS= (0..7)
0 0 0 0 0 0 0 0 
##$TUNHIN= 0
##$TUNHOUT= 0
##$TUNXOUT= 0
##$USERA1= <user>
##$USERA2= <user>
##$USERA3= <user>
##$USERA4= <user>
##$USERA5= <user>
##$V9= 5
##$VALIST= <valist>
##$VCLIST= <CCCCCCCCCCCCCCC>
##$VD= 0
##$VDLIST= <DDDDDDDDDDDDDDD>
##$VPLIST= <PPPPPPPPPPPPPPP>
##$VTLIST= <TTTTTTTTTTTTTTT>
##$WBST= 1024
##$WBSW= 30
##$XGAIN= (0..3)
0 0 0 0 
##$XL= 0
##$YL= 0
##$YMAX_a= 1805644
##$YMIN_a= -1789627
##$ZGOPTNS= <>
##$ZL1= 120
##$ZL2= 120
##$ZL3= 120
##$ZL4= 120
##$ABSF1= 16.48848
##$ABSF2= -4.193441
##$ABSG= 5
##$ABSL= 3
##$ALPHA= 0
##$AQORDER= 0
##$ASSFAC= 0
##$ASSFACI= 0
##$ASSFACX= 0
##$ASSWID= 0
##$AUNMP= <proc_1d>
##$AZFE= 0.1
##$AZFW= 0.1
##$BCFW= 0
##$BC_mod= 2
##$BYTORDP= 0
##$COROFFS= 0
##$CY= 18.4799938201904
##$DATMOD= 1
##$DC= 0
##$DFILT= <>
##$DTYPP= 0
##$F1P= 9.9274215381318
##$F2P= -0.165520771350173
##$FCOR= 1
##$FTSIZE= 16384
##$FT_mod= 6
##$GAMMA= 0
##$GB= 0
##$INTBC= 1
##$INTSCL= 4.127829e-11
##$ISEN= 128
##$LB= 0.05
##$LEV0= 0
##$LPBIN= 0
##$MAXI= 10000
##$MC2= 0
##$MEAN= 0
##$ME_mod= 0
##$MI= 50
##$NCOEF= 0
##$NC_proc= -3
##$NLEV= 6
##$NOISF1= 3.799351
##$NOISF2= 2.8
##$NSP= 0
##$NTH_PI= 0
##$NZP= 0
##$OFFSET= 16.48848
##$PC= 4
##$PHC0= -271.6701
##$PHC1= 2.101565
##$PH_mod= 1
##$PKNL= yes
##$PPARMOD= 0
##$PSCAL= 4
##$PSIGN= 0
##$REVERSE= no
##$SF= 200.130005582386
##$SI= 16384
##$SIGF1= 3
##$SIGF2= 2
##$SINO= 400
##$SIOLD= 16384
##$SREGLST= <1H.CDCl3>
##$SSB= 0
##$STSI= 16384
##$STSR= 0
##$SW_p= 4139.07284768211
##$SYMM= 0
##$S_DEV= 0
##$TDeff= 32768
##$TDoff= 0
##$TI= <>
##$TILT= no
##$TM1= 0
##$TM2= 0
##$TOPLEV= 0
##$USERP1= <user>
##$USERP2= <user>
##$USERP3= <user>
##$USERP4= <user>
##$USERP5= <user>
##$WDW= 1
##$XDIM= 16384
##$YMAX_p= 299503180
##$YMIN_p= -73833
$$ End of Bruker specific parameters
$$ ---------------------------------
##NTUPLES= NMR SPECTRUM
##VAR_NAME=  FREQUENCY,     SPECTRUM/REAL,   SPECTRUM/IMAG
##SYMBOL=    X,             R,               I
##VAR_TYPE=  INDEPENDENT,   DEPENDENT,       DEPENDENT
##VAR_FORM=  AFFN,          ASDF,            ASDF
##VAR_DIM=   16384,         16384,           16384
##UNITS=     HZ,            ARBITRARY UNITS, ARBITRARY UNITS
##FACTOR=    0.252644378177508, 1,           1
##FIRST=     3299.83951724647, 0,            0
##LAST=      -839.233330435636, 0,           0
##MIN=       -839.233330435636, -73833,      0
##MAX=       3299.83951724647, 299503180,    0
$$ Real data points
##PAGE= N=1
##DATA TABLE= (X++(R..R)), XYDATA
$$ [...]
7811A074334J8536L2736K3111M2631K0157K3666L4288N2023k2M1603L7269P378
$$ 1074334 1092870 1125606 1148717 1191348 1211505 1235171 1269459 1321482 1321460 1363063 1400332 1407710
7799A407710K9806N8028N6116J7265N8398J0528M1589O2315N3286J9859L0525
$$ 1407710 1437516 1495544 1551660 1568925 1627323 1637851 1679440 1741755 1795041 1814900 1845425
7788A845425N6627M7901N5102O0576P9468M6218M5513O2861R5438M7953P2367
$$ 1845425 1902052 1949953 2005055 2065631 2145099 2191317 2236830 2299691 2395129 2443082 2515449
7777B515449O7888L3422M9292Q7094R5207M5241J02237Q6678N7171Q1042J00528
$$ 2515449 2583337 2616759 2666051 2753145 2848352 2893593 2995830 3082508 3139679 3220721 3321249
7766C321249O0011J07519Q9922N1228Q9840R1042P2136J17447Q0784Q2167P5432
$$ 3321249 3381260 3488779 3578701 3629929 3719769 3810811 3882947 4000394 4081178 4163345 4238777
7755D238777J27148R2615P3001R4232J04495Q8949J05862P9604Q0615R2463R3649
$$ 4238777 4365925 4458540 4531541 4625773 4730268 4819217 4925079 5004683 5085298 5177761 5271410
7744E271410R4847N5145J09604Q2855Q4736Q6492O1848R4410M4086J11440K0260
$$ 5271410 5366257 5421402 5531006 5613861 5698597 5785089 5846937 5941347 5985433 6096873 6117133
7733F117133O5399O1117M7254K9380Q9839K9353L4110L7419L4953N9518l175J7474
$$ 6117133 6182532 6243649 6290903 6320283 6410122 6439475 6473585 6511004 6545957 6605475 6602300 6619774
7721F619774L2890J5189L511J4622j9333n914k1015p226j6352l2052l9666l4342
$$ 6619774 6652664 6667853 6671364 6685986 6666653 6660739 6639724 6632498 6616146 6584094 6544428 6510086
7709F510086m4905n1355k6785p5581n9905o2944r9098p2943n2044q8309j04080
$$ 6510086 6465181 6413826 6387041 6311460 6251555 6188611 6089513 6016570 5964526 5876217 5772137
7698E772137m5082p6110p9800r9515p5370j03384q6827r0030j17980r3055q4772
$$ 5772137 5727055 5650945 5571145 5471630 5396260 5292876 5206049 5116019 4998039 4904984 4820212
7687D820212p6595j23328p5758r3044j05850q0213r0790j04525r1046j05912q9689
$$ 4820212 4743617 4620289 4544531 4451487 4345637 4265424 4174634 4070109 3979063 3873151 3783462
7676C783462r9673q3897p4303q6822q4340n6862j11539o8938p5114p8221r3214
$$ 3783462 3683789 3599892 3525589 3438767 3354427 3297565 3186026 3117088 3041974 2963753 2870539
7665B870539m5950q4286n7562o9229o6089n2426n9863m6769n1177p5820m3346
$$ 2870539 2824589 2740303 2682741 2613512 2547423 2494997 2435134 2388365 2337188 2261368 2218022
7654B218022p7112m1763l2333l4774p6063k4237o4126l8046l8519n1450k5131
$$ 2218022 2140910 2099147 2066814 2032040 1955977 1931740 1867614 1829568 1791049 1739599 1714468
7643A714468k2972o6823n57m0278l1433n2974j8532l3716J3353o2372k1247k7070
$$ 1714468 1691496 1624673 1624116 1583838 1552405 1499431 1480899 1447183 1460536 1398164 1376917 1349847
7631A349847n6102J3397l2407m8020k624k9833k1155j2487l3689j3743m4508p256
$$ 1349847 1293745 1307142 1274735 1226715 1224091 1194258 1173103 1160616 1126927 1113184 1068676 1061420
7619A061420m01l7811J1102k2216J2559m0744j9357r603n445l9587l041k6691
$$ 1061420 1061019 1023208 1034310 1012094 1024653 983909 964552 954949 949504 909917 906876 880185
7607H80185j2158j7477j5474j596j5941p442j7352J381l9188M0662j4962k9264
$$ 880185 868027 850550 835076 833480 817539 810097 792745 794126 754938 795600 780638 751374
7595G51374r202k980j1248l6841Q773j9152j5127j4333L004o526j9137J3073P348
$$ 751374 742172 739192 727944 691103 699876 680724 665597 651264 654268 647742 628605 641678 649026
7582F49026l8566j9204N99q555O056k0609P792K2399j4561l4431o843K2864k6280
$$ 649026 610460 591256 591855 583300 589356 568747 576539 598938 584377 549946 543103 565967 539687
7569E39687n165J1207k3590p134p307k6084J412k4274k133J5823J66l1190P860
$$ 539687 534522 545729 522139 515005 507698 481614 483026 458752 456619 472442 472608 441418 449278
7556D49278M502j7505J159N193q410j6520j2129L723J366m700q288K711J1543
$$ 449278 453780 436275 437434 442627 434217 417697 405568 409291 410657 405957 397669 400380 411923
7543D11923j1933l7302k5J9730j8812q243j5638P83L1419j7974Q045k221k8190
$$ 411923 399990 362688 362663 382393 363581 355338 339700 340483 371902 353928 361973 359752 331562
7530C31562r706O36K5485o815l3022J2471O338j5547j60J0497k8123p360q355
$$ 331562 321856 322492 347977 341162 308140 320611 326949 311402 311242 321739 293616 286256 277901
7517B77901K3782j3078J2157k1695K459L905j9834J5042l6642K0496k739p391
$$ 277901 301683 288605 300762 279067 281526 285431 265597 280639 243997 264493 261754 254363
7505B54363k1919J5773p288j9862K8878r169r656L859O70o817l734J6159k2960
$$ 254363 232444 248217 240929 221067 249945 240776 231120 234979 235649 228832 225098 241257 218297
7492B18297n558p261J3839j2071k241L40M118j6103K4149j1935j8541J7296n441
$$ 218297 212739 205478 219317 207246 205005 205345 209463 193360 217509 205574 187033 204329 198888
7479A98888N323l059n754j6694r172m574j2015K5371j898J8276l5744P161p493
$$ 198888 204211 201152 195398 178704 169532 164958 152943 178314 176416 194692 158948 166109 158616
7466A58616J2379j0550K8230m2157J5699K4139j3990k7541K4514j1969O724l3216
$$ 158616 170995 160445 188675 146518 162217 186356 172366 144825 169339 157370 164094 130878
7454A30878J0347O797n961q514J4785l427o027L2505k8824q780N66J3984P033
$$ 130878 141225 148022 142061 133547 148332 144905 138878 171383 142559 133779 134345 148329 155362
7441A55362j8161o817j298J3815q249j6984p92M579R654j1797P010O814k176J4058
$$ 155362 137201 130384 129086 142901 134652 117668 116876 121455 131109 119312 126322 133136 130960 145018
7427A45018m4141J6406J7677k3888J4807m652P13n584j4154L3026m729l1430L4950
$$ 145018 100877 117283 134960 111072 125879 121227 121940 116356 102202 135228 130499 99069 134019
7414A34019l0373K5169l363j4624M813J1170R241j9761j2118l415r55O27j6563
$$ 134019 103646 128815 125452 110828 115641 126811 136052 116291 104173 100758 99803 100430 83867
7401H3867K9229o910o092K1201k2540N164Q121j2659P061j1297J302J5536J6412
$$ 83867 113096 106186 100094 121295 98755 103919 112040 99381 106442 95145 96447 111983 128395
7388A28395l2694K8746q018l564m71P246j9803p076K0952k7710L0640q655P26
$$ 128395 95701 124447 116429 112865 112394 119640 99837 92761 113713 86003 116643 107988 108714
7375A08714O330n846J5857M95O444r376L481j6558K7446j9494L435k7285L3081
$$ 108714 115044 109198 125055 125550 131994 122618 126099 109541 136987 117493 120928 93643 126724
7362A26724j1508r992M0484j559k7610J0871j819j4261J5842J473J1719j1672
$$ 126724 115216 105224 145708 144149 116539 127410 125591 111330 127172 128645 140364 128692
7350A28692o149J6577N426o371N31Q13m777j623J8346p688K5383j9738j154j606
$$ 128692 122543 139120 144546 138175 138706 139519 134742 133119 151465 143777 169160 149422 148268 146662
7336A46662K6257n8900K6625J3658k0984K5239k3820M097J448J2923J7184j384
$$ 146662 172919 114019 140644 154302 133318 158557 134737 138834 140282 153205 170389 169005
7324A69005k2244k641K064m510L0099j3369j6549o379K1877J2601j9319Q166n578
$$ 169005 146761 144120 146184 141674 171773 158404 141855 135476 157353 169954 150635 158801 153223
7311A53223j4291O155m042J1758L725k3494K664j974J2020j0321l447n374p800
$$ 153223 138932 145087 141045 152803 156528 133034 135698 133724 145744 135423 131976 126602 118802
7298A18802P247J6794j9235J2199j6519K7194k9706K2183k3932J3362l965j0954
$$ 118802 126049 142843 123608 135807 119288 146482 116776 138959 115027 128389 124424 113470
7286A13470Q338k4416K0817n476O50k2652J8915O92R42j467j4959K8731l1479
$$ 113470 121808 97392 118209 112733 113383 90731 109646 110338 111280 109813 94854 123585 92106
7273I2106J5923k3371R458n49q03o609K2513k0829P236L86l6680M4258k7722J1736
$$ 92106 108029 84658 94116 93567 92764 86155 108668 87839 95075 95461 58781 103039 75317 87053
7259H7053k8638j7043L9236j9858M7868m1629k0557K7248k2094K1266j976J259
$$ 87053 58415 41372 80608 60750 108618 66989 46432 73680 51586 72852 70876 72135
7247G2135j9630l333J6131l181j2240J5166o987k120K1144k5274J2410j4865K799
$$ 72135 52505 49172 65303 62122 49882 65048 58061 55941 77085 51811 64221 49356 52155
7234E2155K6660j9933j640K724l270K0183j3252j2907M497P687J0653l9631L9489
$$ 52155 78815 58882 57242 59966 56696 76879 63627 50720 55217 62904 73557 33926 73415
7221G3415k7675J07K1443o243o351p973j8063J6106J021J8141n351k1921j0689
$$ 73415 45740 45847 67290 61047 54696 46723 28660 44766 45787 63928 58577 36656 25967
7208B5967K805o731K8709o795j6489L5630n2838J7065p083J826K4171k3890K5040
$$ 25967 28772 22041 50750 43955 27466 63096 10258 27323 20240 22066 46237 22347 47387
7195D7387O7j7088K9399l3637J5190k3203R994M908j9745o2K8064o678j022k1669
$$ 47387 47454 30366 59765 26128 41318 18115 28109 33017 13272 13210 41274 34596 33574 11905
7181A1905J2900O591K5134j4854j7206q197K7584k2111k656J3451J192j4202J6813
$$ 11905 24805 31396 56530 41676 24470 16273 43857 21746 19090 32541 33733 19531 36344
7168C6344l7057K4172k0929K526K1950l844R750k3423P59j7555m531K0975j6549
$$ 36344 -713 23459 2530 5056 27006 23162 32912 9489 10248 -7307 -11838 9137 -7412
7155g412K3753r625o48j5598L6957j7116n042l528j0022K8716l8263J0211M6169
$$ -7412 16341 6716 6068 -9530 27427 10311 5269 1741 -8281 20435 -17828 -7617 38552
7142C8552k8483O11j6209Q475J2442j9026L81p587L246K1273j6407J9461j2262
$$ 38552 10069 10680 -5529 2946 15388 -3638 -3257 -10844 -7598 13675 -2732 16729 4467
7129D467J7228k8917N794K2647j3722O154j8108K980J2595r67O142O090l5607
$$ 4467 21695 -7222 -1428 21219 7497 13651 -4457 -1477 11118 10151 16293 22383 -13224
7116a3224K1930o654R414p273m853k3745K0995m137O656J5178j9965o228J9150
$$ -13224 8706 2052 11466 4193 -660 -24405 -3410 -7547 -891 14287 -5678 -11906 7244
7103G244k6897J9426J7575j9697J1465j9156J6185p448J6820r983O376l4335M8443
$$ 7244 -19653 -227 17348 -2349 9116 -10040 6145 -1303 15517 5534 11910 -22425 26018
7090B6018l3946J8450p330Q161j2676m369J511n68Q783J2974r812k7216L8298
$$ 26018 -7928 10522 3192 11353 -1323 -5692 -4181 -4749 4034 17008 7196 -20020 18278
7077A8278j6851J636n837j3094N613j7115L9360j6417j303J1361L462J823j3876
$$ 18278 1427 3063 -2774 -15868 -10255 -27370 11990 -4427 -5730 5631 9093 10916 -2960
7064b960J2254o641J4193n772J2793j6542j8304K2289p077j430p025J488N063
$$ -2960 9294 2653 16846 11074 23867 7325 -10979 11310 4233 2803 -4222 -2734 2329
7051B329J106J6557p309n021Q392K140j9550Q285J0203l0846L841n170N5107l4592
$$ 2329 3435 19992 12683 7662 16054 18194 -1356 6929 17132 -13714 -9873 -15043 40064 5472
7037E472J1930k5956p443J0522J6600J4843j3689j9404L1586k2401l038J8304
$$ 5472 17402 -8554 -15997 -5475 11125 25968 12279 -7125 24461 2060 -978 17326
7025A7326o847M877j2104J0804k0133K2586j5767p3J0252q042O332q398J0884
$$ 17326 10479 15356 3252 14056 -6077 16509 742 669 10921 2879 9211 813 11697
7012A1697j6756J3047m220n22j8345K0065q613J0837r444P550j643j7255k331
$$ 11697 -5059 7988 3768 3246 -15099 4966 -3647 7190 -2254 5296 3653 -13602 -15933
6999a5933j4483M6924l3194L7373l3099K9435m3462J6225J037J291K720n48q038
$$ -15933 -30416 16508 -16686 20687 -12412 17023 -26439 -10214 -9177 -7886 -5166 -5714 -13752
6986a3752k1293K7351o956j4023k544L3086m696r896J6771k7441l93J5992J891
$$ -13752 -35045 -7694 -14650 -28673 -31217 1869 -2827 -12723 4048 -23393 -23786 -7794 -5903
6973e903j2927J1063r255K233J9234o135r646j2495O992j4272J7277O134J0984
$$ -5903 -18830 -7767 -17022 -14789 4445 -1690 -11336 -23831 -16839 -31111 -13834 -7700 3284
6960C284l0941L409R349J2610l0625J5709n071K8563l0861R920Q166j3772J8628
$$ 3284 -27657 -24248 -14899 -2289 -32914 -17205 -22276 6287 -24574 -14654 -6488 -20260 -1632
6947a632k4648M213j8066J3421n330J1211N035J6054k6691M2081l1064p625J1146
$$ -1632 -26280 -22067 -40133 -26712 -32042 -20831 -15796 258 -26433 15648 -15416 -23041 -11895
6934a1895j4503K8088k7336L0582j7037K571l169j5759J0549m65J3801k5713J6506
$$ -11895 -26398 1690 -25646 4936 -12101 -9530 -12699 -28458 -17909 -18374 -4573 -30286 -13780
6921a3780N263k4352R566J1112j6355p180J0009M641k53L7788l2996p947J6982
$$ -13780 -8517 -32869 -23303 -12191 -28546 -35726 -25717 -21076 -21329 16459 -16537 -24484 -7502
6908g502j5721J4222J2102j5129j6424L320J5025O911j0374r763J3397J0733j1392
$$ -7502 -23223 -9001 3101 -12028 -28452 -25132 -10107 -3196 -13570 -23333 -9936 797 -10595
6895a0595n405o446P643j7632P171Q371P731J4343J508k0007j4093K3524O526
$$ -10595 -16000 -22446 -14803 -32435 -25264 -16893 -9162 5181 6689 -13318 -27411 -3887 2639
6882B639j9688j5854j6563J8665K0883l4449L0200L26j70O525M702j0312j1931
$$ 2639 -17049 -32903 -49466 -30801 -9918 -44367 -14167 -13841 -14011 -7486 -2784 -13096 -25027
6869b5027m144L756N793l55M281q918R146k2491J493q82M8145l3955l121o020
$$ -25027 -29171 -25415 -19622 -19977 -15696 -24614 -15468 -37959 -36466 -37348 10797 -23158 -26279 -32299
6855c2299J8967m2729L8004n69p166J1399j6009L433K9103m8501J5574k137K089
$$ -32299 -13332 -56061 -18057 -18626 -25792 -14393 -30402 -26969 2134 -46367 -30793 -32930 -30841
6842c0841J0438n751J1189N273R771k1509k024J2230j8841P762j0003J3494q595
$$ -30841 -20403 -26154 -14965 -9692 79 -21430 -23454 -11224 -30065 -22303 -32306 -18812 -27407
6829b7407k117J2427k7082K4728M531k2554O490p366K1311o797j6820L0316p757
$$ -27407 -29524 -17097 -44179 -19451 -14920 -37474 -30984 -38350 -17039 -23836 -40656 -10340 -18097
6816a8097r99J5756j3037p191o816O924O669m351p945m0466N1288j9232K6373
$$ -18097 -19096 -3340 -16377 -23568 -30384 -23460 -16791 -21142 -29087 -69553 -18265 -37497 -11124
6803a1124Q842k225k1777K0868j6518j0961J8703k0547J2011L107j7968J7142
$$ -11124 -2282 -4507 -26284 -5416 -21934 -32895 -14192 -34739 -22728 -19621 -37589 -20447
6791b0447J1971l156l663j2175N302r751N526q083o045P729O83Q832J5695j5129
$$ -20447 -8476 -11632 -15295 -27470 -22168 -31919 -26393 -34476 -40521 -32792 -32109 -23277 -7582 -22711
6777b2711n640K3696j2705k979l197J7642k2179J4383k7888K5601k0135L56K4117
$$ -22711 -28351 -4655 -17360 -20339 -23536 -5894 -28073 -13690 -41578 -15977 -36112 -35756 -11639
6764a1639j2924j2380J8912j3812L707J0981N49p450n764j7452N283K4587j4621
$$ -11639 -24563 -36943 -18031 -31843 -28136 -17155 -16606 -24056 -29820 -47272 -41989 -17402 -32023
6751c2023J3275K063p549l318j3999N216r395L0350k8263J6794O623p359K95R870
$$ -32023 -18748 -16685 -24234 -27552 -41551 -36335 -45730 -15380 -43643 -26849 -20226 -27585 -27290 -17420
6737a7420R09o664j1467P228k4381J8557J1564R041k0712j7451J6738L976p486
$$ -17420 -16511 -23175 -34642 -27414 -51795 -33238 -21674 -12633 -33345 -50796 -34058 -30082 -37568
6724c7568J1217k0272J8893k0953K9688o209j9292J0616O099j4005j7741L0869
$$ -37568 -26351 -46623 -27730 -48683 -18995 -25204 -44496 -33880 -27781 -41786 -59527 -28658
6712b8658j0995N856Q813k5016J9403Q889k0824K6043j4673M497N562l1514K6280
$$ -28658 -39653 -33797 -24984 -50000 -30597 -21708 -42532 -16489 -31162 -26665 -21103 -52617 -26337
6699b6337J428j1038p971J6485j3749M1722m7180M069K0679M893j0464j5361J4776
$$ -26337 -24909 -35947 -43918 -27433 -41182 540 -46640 -42571 -21892 -16999 -27463 -42824 -28048
6686b8048l1736N7557r387l6391K1870j7552n049J1758K2561k0782j0320N160
$$ -28048 -59784 -2227 -11614 -48005 -26135 -43687 -48736 -36978 -14417 -35199 -45519 -40359
6674d0359M187J810k0706J8420Q953m099k1827J7429k4959L8615q037J7438l1856
$$ -40359 -36172 -34362 -55068 -36648 -27695 -31794 -53621 -36192 -61151 -22536 -30573 -13135 -44991
6661d4991K3939Q254k9935j2648Q036K2141o341L25n167K3896m1801K2841J3703
$$ -44991 -21052 -12798 -42733 -55381 -47345 -25204 -31545 -31220 -36387 -12491 -54292 -31451 -17748
6648a7748M329j9744q30k117q196J1708J4147k687j4554J05Q00J0929l982j235
$$ -17748 -13419 -33163 -33993 -36110 -44306 -32598 -18451 -21138 -35692 -35587 -34787 -23858 -27840 -29075
6634b9075J0525q151j2813L033K3049j5015J5280l7575J5809R701j7385J1575
$$ -29075 -18550 -26701 -39514 -36481 -13432 -28447 -13167 -50742 -34933 -25232 -42617 -31042
6622c1042p545J9378j9041R316k5550K0097k344K106j3525K0290j3209J3475L530
$$ -31042 -38587 -19209 -38250 -28934 -54484 -34387 -36731 -34625 -48150 -27860 -41069 -27594 -24064
6609b4064r498j3790Q591k80L007r417K0889n364L675p367r538k803J5671O341
$$ -24064 -33562 -47352 -38761 -39041 -36034 -45451 -24562 -29926 -26251 -33618 -43156 -45959 -30288 -23947
6595b3947L719o934j789k2958M366J169j708J7944k9344J3558K6161k3270O893
$$ -23947 -20228 -27162 -28951 -51909 -47543 -46374 -48082 -30138 -59482 -45924 -19763 -43033 -36140
6582c6140L312j6150Q437j0172j161K949J0817R016m528Q638j4865l858L632Q51
$$ -36140 -32828 -48978 -40541 -50713 -51874 -48925 -38108 -29092 -33620 -24982 -39847 -43705 -40073 -39222
6568c9222p712K9443j8829N314M36L376q580l944j3032K4446p12n956j7616J5937
$$ -39222 -46934 -17491 -36320 -31006 -30570 -27194 -35774 -39718 -52750 -28304 -29016 -34972 -52588 -36651
6554c6651k0796L4558k600k4039J1161O09j7564J8125O760L487q115j294M190
$$ -36651 -57447 -22889 -25489 -49528 -38367 -37758 -55322 -37197 -30437 -26950 -35065 -36359 -32169
6541c2169j479j0672J50J649m410k98J5470N979O847m248r576q335J6988j4185
$$ -32169 -33648 -44320 -44170 -42521 -46931 -47229 -31759 -25780 -18933 -23181 -32757 -41092 -24104 -38289
6527c8289J0121j0947m221J7332r840J0542n626M56j4530R171n380J2410j3850
$$ -38289 -28168 -39115 -43336 -26004 -35844 -25302 -30928 -30472 -45002 -35831 -41211 -28801 -42651
6514d2651Q321o554j0846l829L9580j5031J1464j5373O979Q325o190l1457L9002
$$ -42651 -34330 -40884 -51730 -55559 -15979 -31010 -19546 -34919 -27940 -19615 -25805 -57262 -18260
6501a8260j1528m169l888J0743O714R02J695o945l1256L2563Q500k0332K1719
$$ -18260 -29788 -33957 -37845 -27102 -20388 -19486 -17791 -24736 -55992 -23429 -14929 -35261 -13542
6488a3542r887r29M470j9237K0577k5718J9155P334k654J2892k3719l425K3107
$$ -13542 -23429 -24358 -19888 -39125 -18548 -44266 -25111 -17777 -20431 -7539 -31258 -34683 -11576
6475a1576j7935l934Q184J802l6591J7697M092j9327K6235K0514j8763J614o145
$$ -11576 -29511 -33445 -25261 -23459 -60050 -42353 -38261 -57588 -31353 -10839 -29602 -27988 -34133
6462c4133P41O068j4715J1553r424K915J1062l0790L2138N528l0781K0200p216
$$ -34133 -33392 -27324 -42039 -30486 -39910 -36995 -25933 -56723 -24585 -19057 -49838 -29638 -36854
6449c6854R005P848j9134M321J2314k144j1244n639N508P540j2475j006j14P241
$$ -36854 -27849 -20001 -39135 -34814 -22500 -24644 -35888 -41527 -36019 -28479 -40954 -41960 -42074 -34833
6435c4833p935j3445K6165O791R688j4292k3691o095R412J0277J9251K049k5288
$$ -34833 -42768 -56213 -30048 -23257 -13569 -27861 -51552 -57647 -48235 -37958 -18707 -16658 -41946
6422d1946J3402r314J1909j3735J2885r181Q232J6368q398j6376J4871p725k0827
$$ -41946 -28544 -37858 -25949 -39684 -26799 -35980 -27748 -11380 -19778 -36154 -21283 -29008 -49835
6409d9835J1224j8983J0974O171J473O388K384q616k304P101J0613j9993k178
$$ -49835 -38611 -57594 -46620 -40449 -38976 -32588 -30204 -38820 -41124 -34023 -23410 -43403 -45581
6396d5581J6380j5976N980L6418l7717J3388l992K968k587k063J5051q802j1647
$$ -45581 -29201 -45177 -39197 -2779 -40496 -27108 -31100 -28132 -30719 -32782 -17731 -26533 -38180
6383c8180k170K956J1783j1592R752l2767J0262J2456K2969m378k8661L3182k3837
$$ -38180 -40350 -37394 -25611 -37203 -27451 -60218 -49956 -37500 -14531 -18909 -47570 -14388 -38225
6370c8225j4159J4796k4841K9158O714L254p536j0742k680R191k2673N0706k8158
$$ -38225 -52384 -37588 -62429 -33271 -26557 -23303 -30839 -41581 -44261 -35070 -57743 -7037 -35195
6357c5195j0828K845j7636K3402J0220l8894K3341J2037P075k426M663k5516N492
$$ -35195 -46023 -43178 -60814 -37412 -27192 -66086 -42745 -30708 -23633 -26059 -21396 -46912 -41420
6344d1420q91P835q015M404o625J5249m972K198k437m578K103K2527j5612N895
$$ -41420 -42311 -34476 -42491 -38087 -44712 -29463 -34435 -32237 -34674 -39252 -37149 -14622 -30234 -24339
6330b4339J1401j2948J3510j0231M36r689j21P650J7192m9948J2648J2458k6226
$$ -24339 -12938 -25886 -12376 -22607 -22171 -31860 -31981 -24331 -7139 -57087 -44439 -31981 -58207
6317e8207L5076j7147l3555M4684J6016j5823j5384q304Q447j9127J2085J5395
$$ -58207 -23131 -40278 -73833 -29149 -13133 -28956 -44340 -52644 -44197 -63324 -51239 -35844
6305c5844n50r783k866K4647p182j0759K4766k3171J2784J3345l38r136O117N966
$$ -35844 -36394 -46177 -49043 -24396 -31578 -42337 -17571 -40742 -27958 -14613 -14951 -24087 -17970 -12004
6291a2004j7258l054p827K5329J0396l4728P041K3128j8422j450J3686k6531K080
$$ -12004 -29262 -32316 -40143 -14814 -4418 -39146 -32105 -8977 -27399 -28849 -15163 -41694 -39614
6278c9614k4712M6246j2366j3599L0072k6174L5511k2586j8770M867J9619J7450
$$ -39614 -64326 -18080 -30446 -44045 -13973 -40147 -4636 -27222 -45992 -41125 -21506 -4056
6266d056k7966j6886M197O515J0582k1810J9058J5238j8457j5102L3859l4369
$$ -4056 -32022 -48908 -44711 -38196 -27614 -49424 -30366 -15128 -33585 -48687 -14828 -49197
6254d9197O681J5527J1861k0611J1352L54j9774K7793p553K608k2094K3696r54
$$ -49197 -42516 -26989 -15128 -35739 -24387 -24033 -43807 -16014 -23567 -20959 -43053 -19357 -20311
6241b0311P252j4068j9891J633J0690K090J3467k815q947o072J5981r398Q205
$$ -20311 -13059 -27127 -47018 -45385 -34695 -32605 -19138 -21953 -30900 -36972 -20991 -30389 -22184
6228b2184P45j9005J2638J4227q613k1381O146K6948j5337j8994K908P399Q40
$$ -22184 -21439 -40444 -27806 -13579 -22192 -43573 -37427 -10479 -25816 -44810 -41902 -34503 -33663
6215c3663r974K3832j4420m448j9401K6233L546J2778j9546r256j0057K7028M840
$$ -33663 -43637 -19805 -34225 -38673 -58074 -31841 -28295 -15517 -35063 -44319 -54376 -27348 -22508
6202b2508j0072j2055K162o188K5649k3852K4882K412J10j2960O485j4350J3362
$$ -22508 -32580 -44635 -42473 -48661 -23012 -46864 -21982 -19570 -19460 -32420 -25935 -40285 -26923
6189b6923j0907P145J7800k5716J760o452J3341j8390K1695R389j5235P172j5005
$$ -26923 -37830 -30685 -12885 -38601 -36841 -43293 -29952 -48342 -26647 -17258 -32493 -25321 -40326
6176d0326J5309k3472K6984n800K499P820j4892K362j047j4750l965L3510j3747
$$ -40326 -25017 -48489 -21505 -27305 -24806 -16986 -31878 -29516 -30563 -45313 -49278 -15768 -29515
6163b9515P789l8968K8735J8J0601j0695l559J3445j0380p297M227R59J0562m304
$$ -29515 -21726 -60694 -31959 -31941 -21340 -32035 -35594 -22149 -32529 -39826 -35599 -34640 -24078 -28382
6149b8382J061J4184j4932l0058J0696P697M262M878j1001J0845j0357L3384k8002
$$ -28382 -27321 -13137 -28069 -58127 -47431 -39734 -35472 -30594 -41595 -30750 -41107 -7723 -35725
6136c5725K100K2081k3051R31J6708l0004K0236j3966Q390M541J7380K538k3240
$$ -35725 -33625 -11544 -34595 -33664 -16956 -46960 -26724 -40690 -32300 -27759 -10379 -7841 -31081
6123c1081Q237l2366L6567j8878K7044k5290J6868j0853N344o33q650K028K3424
$$ -31081 -22844 -55210 -18643 -37521 -10477 -35767 -18899 -29752 -24408 -25041 -33691 -31663 -8239
6110h239l5585Q370k612K7491l593j5748j1699K2104r530O295m846m309M585J4267
$$ -8239 -43824 -35454 -38066 -10575 -14168 -29916 -41615 -19511 -29041 -22746 -27592 -31901 -27316 -13049
6096a3049m0664K4782L8084l7473M915j9512J1869j4195L1444J538k2963J2764
$$ -13049 -53713 -28931 9153 -28320 -23405 -42917 -31048 -45243 -13799 -12261 -35224 -22460
6084b2460j460M033n784m509K425J4179j5440l778K3900j826m218M40l431j1666
$$ -22460 -23920 -19887 -25671 -30180 -27755 -13576 -29016 -32794 -8894 -10720 -14938 -14498 -17929 -29595
6070b9595K911J886k0638r006K8175l92j455N48k651P168m849K4020k8104J5498
$$ -29595 -26684 -24798 -45436 -54442 -26267 -26659 -28114 -27566 -30217 -23049 -27898 -3878 -31982 -16484
6056a6484j1569N560N833j1509m44l256p865J6829l74k655l35k0719L5880l056
$$ -16484 -28053 -22493 -16660 -28169 -28613 -31869 -39734 -22905 -23279 -25934 -26269 -46988 -11108 -14164
6042a4164p597j1536K2613m616j4078K020P695J3477K3715j5441p205j2304j1161
$$ -14164 -21761 -33297 -10684 -15300 -29378 -27358 -19663 -6186 17529 2088 -5117 -17421 -28582
6029b8582N94J0156m1417L0165J1183n117J822j458j8783R10R209P275J8496j0314
$$ -28582 -27988 -17832 -59249 -29084 -17901 -23018 -21196 -22654 -41437 -40527 -31318 -24043 -5547 -15861
6015a5861o840M54K4446m3818m61P502K7716L795k0291J1059J8406k7002j9635
$$ -15861 -22701 -22247 2199 -41619 -42080 -34578 -6862 -3067 -23358 -12299 6107 -20895 -40530
6002d0530L5923m863j7720k798p089N715J0400k3199J1628J8703j6497q827K3727
$$ -40530 -4607 -9470 -27190 -29988 -37077 -31362 -20962 -44161 -32533 -13830 -30327 -39154 -15427
5989a5427p608J0541n955L281j8047K7260L408k7242k047L428K490O640p441J208
$$ -15427 -23035 -12494 -18449 -15168 -33215 -5955 -2547 -29789 -31836 -28408 -25918 -19278 -26719 -25511
5975b5511K0018j5356L371j6967K2996k1751J1507J9660j3075l168J0500l8206
$$ -25511 -5493 -20849 -17478 -34445 -11449 -33200 -21693 -2033 -15108 -18276 -7776 -45982
5963d5982K8920k7875J1419K2089j5389j4959K5298R340k2705q080P635L507q834
$$ -45982 -17062 -44937 -33518 -11429 -26818 -41777 -16479 -7139 -29844 -37924 -30289 -26782 -35616
5950c5616M953P101m951m361K1968k3785K6723j2800L61L3877J3013m5859J8693
$$ -35616 -30663 -23562 -28513 -32874 -10906 -34691 -7968 -20768 -20407 13470 26483 -19376 -683
5937f83j0808k1612P899O953J2925r005P299j1017n502j115M881o666j1085J0118
$$ -683 -11491 -33103 -25204 -18251 -5326 -14331 -7032 -18049 -23551 -24666 -19785 -26451 -37536 -27418
5923b7418q589K1415L188j0621m69L8167k0127r546J0750l1305L3186j1252p940
$$ -27418 -36007 -14592 -11404 -22025 -22494 15673 -4454 -14000 -3250 -34555 -1369 -12621 -20561
5910b0561J126j2718J6606L467N043j9793K6952j7773j2815P483J9049o683j4947
$$ -20561 -19435 -32153 -15547 -12080 -7037 -26830 122 -17651 -30466 -22983 -3934 -10617 -25564
5897b5564L2647k6587j938J0728k5994J6182j7468L5118j6982K6565k2769k163
$$ -25564 7083 -19504 -21442 -10714 -36708 -20526 -37994 -2876 -19858 6707 -16062 -18225
5885a8225J1009O990r000r873J431R516k348o609L998J1489k4665L842J9979j2065
$$ -18225 -7216 -226 -9226 -19099 -17668 -8152 -10500 -17109 -13111 -1622 -26287 -22445 -2466 -14531
5871a4531J5903k1867J8024j7298J6585j5030j0765Q704k3605J9509k9206K2016
$$ -14531 1372 -20495 -2471 -19769 -3184 -18214 -28979 -20275 -43880 -24371 -53577 -31561
5859c1561M7502k9133N871o992J349M025j9003L1012j6041J3962M311k4731Q491
$$ -31561 15941 -13192 -7321 -14313 -12964 -8939 -27942 3070 -12971 991 5302 -19429 -10938
5846a0938J7681k849n286Q470k6797N039J3940k3043J7024j5853K2076Q544k4006
$$ -10938 6743 3894 -1392 7078 -19719 -14680 -740 -23783 -6759 -22612 -536 8008 -15998
5833a5998n920m991N784M736P365N934J055L165J107k6895K5852J3189j3531m354
$$ -15998 -21918 -26909 -21125 -16389 -9024 -3090 -2035 1130 2237 -24658 1194 14383 852 -3502
5819c502L35N208j2098N277J0241q781j3075J8311J1749j3127j0609L910N179
$$ -3502 -3167 2041 -10057 -4780 5461 -3320 -16395 1916 13665 538 -10071 -6161 -982
5806i82j5513K0339L715k276j4218l999J1704k4559K4095j117r066k489n918J3678
$$ -982 -16495 3844 7559 5283 -8935 -12934 -1230 -25789 -1694 -2811 -11877 -14366 -20284 -6606
5792f606J0173K861M40L628r964J063k0282m120J2100J4812K548j8426r987K4259
$$ -6606 3567 6428 6868 10496 532 1595 -18687 -22807 -10707 4105 6653 -11773 -21760 2499
5778B499R619j3197L377j6868L5508q717j2433R168k5155R21R028j294m044o001
$$ 2499 12118 -1079 2298 -14570 20938 12221 -212 8956 -16199 -15278 -6250 -7544 -11588 -17589
5764a7589j164J3440k797Q573j7890N088Q450p053o583O619K810O750Q810j2713
$$ -17589 -18753 -5313 -8110 463 -17427 -12339 -3889 -10942 -17525 -10906 -8096 -1346 7464 -5249
5750e249m574R543k1490K5111j2153l259j2858K4640J3158j974j0722l022K434
$$ -5249 -9823 -280 -21770 3341 -8812 -12071 -24929 -289 12869 10895 173 -2849 -415
5737d15j323j878j1832L1808j8394O532k402Q762p537j1451K1687j7177J7278
$$ -415 -1738 -3616 -15448 16360 -2034 4498 2096 10858 3321 -8130 13557 -3620 13658
5724A3658l738o068k061j7293M5047m6074J1929K0080k5071J5996j1787K0986
$$ 13658 9920 3852 1791 -15502 29545 -16529 -4600 15480 -9591 6405 -5382 15604
5712A5604p651J1299k9524R182L04K3051O702k5038j8506L3663k0287K3042J2844
$$ 15604 7953 19252 -10272 -1090 -786 22265 28967 3929 -14577 19086 -1201 21841 34685
5699C4685o989r358l582k7322J8044J6048j1839J039L072m198j1218J6235j0462
$$ 34685 27696 18338 14756 -12566 5478 21526 9687 10726 13798 9600 -1618 14617 4155
5686D155m174o834K6770k2094J2171J4890k8984J1021j7590J9389p583K1210k1103
$$ 4155 -19 -6853 19917 -2177 9994 24884 -4100 6921 -10669 8720 1137 22347 1244
5673A244P412j6701n613J5556J9626q776m985m37J2631J67p997l041J5212j2843
$$ 1244 8656 -8045 -13658 1898 21524 12748 7763 7326 19957 20124 12127 9086 24298 11455
5659A1455o707J65l064p384J3691O592K297L317M499j6832J6436J663k8872P234
$$ 11455 4748 4913 1849 -5535 8156 14748 17045 20362 24861 8029 24465 26128 -2744 4490
5645D490P289P242o196k331K1460P254l3641J6025l1254j09L8865k2185q143K2787
$$ 4490 11779 19021 12825 10494 31954 39208 5567 21592 -9662 -9771 29094 6909 -1234 21553
5631B1553P267J059j756N539k3176J5715o926J4054n999R332k3804K585K447J265
$$ 21553 28820 29879 28123 33662 10486 26201 19275 33329 27330 36662 12858 15443 17890 19155
5617A9155j2607L2622k2369j8563N179q038P010J7671J9738k7406O663o224J3281
$$ 19155 6548 39170 16801 -1762 3417 -4621 2389 20060 39798 12392 19055 12831 26112
5604B6112j6965r693K4444K595m075O844l2068J5799J0088o049J2564J759n040
$$ 26112 9147 -546 23898 26493 22418 29262 -2806 12993 23081 17032 29596 31355 26315
5591B6315m5138L9637j3041J6593l1508L0120K616l2525K5447P072j8315j564
$$ 26315 -18823 20814 7773 24366 -7142 22978 25594 -6931 18516 25588 7273 5709
5579E709K0351q700J9424J1315l0984M581K4024k6707q064j2500K3555k6506L025
$$ 5709 26060 17360 36784 48099 17115 21696 45720 19013 10949 -1551 22004 -4502 -1477
5566a477L1377j7619j4342K6190J3212k6604j3683L9141k7657J7987p429r480
$$ -1477 29900 12281 -2061 24129 37341 10737 -2946 36195 8538 26525 19096 9616
5554I616J975o271J6262O021J7744k7766L701l765Q382K2969m2490J2059j5680
$$ 9616 11591 5320 21582 27603 45347 17581 21282 17517 25899 48868 6378 18437 2757
5541B757R601P111K6026k7003L3517k8443Q400j5688j8337J7743K4208k7546K5519
$$ 2757 12358 19469 45495 18492 52009 23566 31966 16278 -2059 15684 39892 12346 37865
5528C7865k0513l940m23J5861J916n599K6205k1755l0642L1752r549J250J6444
$$ 37865 17352 13412 12989 28850 30766 25167 51372 29617 -1025 30727 21178 22428 38872
5515C8872k20r740k0079K0763q775J4604l1448J2996l112J0689Q696j6276K356
$$ 38872 38652 28912 8833 29596 20821 35425 3977 16973 13861 24550 33246 16970 19326
5502A9326j537J5922M316J4174k8916j2967q084J1905K4917p454K421o672p213
$$ 19326 17789 33711 38027 52201 23285 10318 2234 14139 39056 31602 34023 27351 20138
5489B0138J2122N620J837p132J4158l3157M3264j6506j9077R757j9242Q572j1878
$$ 20138 32260 37880 39717 32585 46743 13586 56850 40344 21267 31024 11782 20354 8476
5476H476J2696J1882P250q048P652Q951k2766L7624q292m1895O452J7047J8486
$$ 8476 21172 33054 40304 32256 39908 48859 26093 63717 55425 13530 19982 37029 55515
5463E5515l2598P654j4875R771L492J9375k5603K0513J9271k3656J937J691J325
$$ 55515 22917 30571 15696 25467 28959 48334 22731 43244 62515 38859 40796 42487 43812
5450D3812J547L403j255M82R87m899r246J0086n746j2823L1154j8336J6544j8442
$$ 43812 45359 48762 47507 47989 48976 44077 34831 44917 39171 26348 57502 39166 55710 37268
5436C7268K99O689k9240P76K9025k9509K0752r075J609K5601q825k0205K3299
$$ 37268 37567 44256 15016 15792 44817 15308 36060 26985 28594 54195 45370 25165 48464
5423D8464k2900o650K0824k79P528j8528J0683K7609j5836k2054K7260j3901l031
$$ 48464 25564 18914 39738 39459 46987 28459 39142 66751 50915 28861 56121 42220 39189
5410C9189O048r578p66l788J4073Q165K412J7052j9532j9369J1024O705L920p997
$$ 39189 45237 35659 34893 31105 45178 53343 55755 72807 53275 33906 44930 51635 55555 47558
5396D7558m286J3315R448k715k1179L0809k3637J7494m97k6427l454L4912l1572
$$ 47558 43272 56587 66035 63320 42141 72950 49313 66807 66310 39883 36429 71341 39769
5383C9769M894j3735o171P798R063Q738J1152j4496j2180L5102j7484j3514M582
$$ 39769 44663 30928 24757 32555 41618 50356 61508 47012 34832 69934 52450 38936 43518
5370D3518J1606N758j6048J421J6115j1886J3404o722l293l647k2750L2890j3046
$$ 43518 55124 60882 44834 46255 62370 50484 63888 57166 53873 50226 27476 60366 47320
5357D7320J810r979l163J858K1594j2007Q756o870K829k0598L5341j7816O247
$$ 47320 49130 39151 35988 37846 59440 47433 56189 49319 52148 31550 66891 49075 55322
5344E5322K0323k2261M898r613K3464o21l1936K0016J727l517j2501M2026k5865
$$ 55322 75645 53384 58282 48669 72133 71512 39576 59592 61319 57802 45301 87327 61462
5331F1462k193j5050L1550l4480J8855k0456R128J9527r290Q290Q736k3284J4427
$$ 61462 59269 44219 75769 41289 60144 39688 48816 68343 59053 67343 76079 52795 67222
5318F7222n494J1045l769k0747K2017K079j9299M340J7377l1926J0800p216k136
$$ 67222 61728 72773 69004 48257 70274 72353 53054 57394 74771 42845 53645 46429 44293
5305D4293J6918K664q111L2196l1310J3882r382K3368k3671K3588n136k050K942
$$ 44293 61211 63875 55764 87960 56650 70532 61150 84518 60847 84435 79299 77249 80191
5292H0191j5122J0901k167J8938k2225K7085k3428P608j5313k941L288o014K0040
$$ 80191 65069 75970 73803 92741 70516 97601 74173 81781 66468 63527 66815 60801 80841
5279H0841j3135K5529j363K2070l4467o875l963r990J9478j2407l096J4265L836
$$ 80841 67706 93235 91872 113942 79475 72600 68637 58647 78125 65718 62622 76887 80723
5266H0723J1647j9067k933O113M453k4133K3802k2802J5819M189M305K0476q772
$$ 80723 92370 73303 70370 76483 80936 56803 80605 57803 73622 77811 82116 102592 93820
5253I3820q316j20j90j1228j458R007O410L974j2243K6237k5100o269K6909L928
$$ 93820 85504 85384 85194 73966 72508 81515 87925 91899 79656 105893 80793 74524 101433 105361
5239A05361j4061M006n684K7613k8206m912L304J5387j9662J2875j0015J7103
$$ 105361 91300 95306 89622 117235 89029 84117 87421 102808 83146 96021 86006 103109
5227A03109p194j8704L0876k7866Q550J5715k0832P398m264P254r428L3687j5466
$$ 103109 95915 77211 108087 80221 88771 104486 83654 91052 86788 94042 84614 118301 102835
5214A02835j1806K729k541K2098l6957j4523L7411j800p553O230J4407m8399K1434
$$ 102835 91029 93758 91217 113315 76358 61835 99246 97446 89893 96123 110530 62131 83565
5201H3565K2516K776j0172K072p34j2230q26k960L1246j09j4911l3398L8971k283
$$ 83565 106081 108857 98685 100757 100023 87793 86967 84007 115253 115144 100233 66835 105806 103523
5187A03523n405k824j2486O953P367J652j0828P734Q442R197j4484L7574j9178
$$ 103523 98118 95294 82808 89761 97128 98780 87952 95686 104128 113325 98841 136415 117237
5174A17237n244k290j0710P412L761M495R154j899P363k4182K7554l5188K4487
$$ 117237 111993 109703 98993 106405 110166 114661 123815 121916 129279 105097 132651 97463 121950
5161A21950p197k381P356k7407K1342M60J4779L232k2662J256P972J0104k1178
$$ 121950 114753 112372 119728 92321 113663 114123 128902 132134 109472 110728 118700 128804 107626
5148A07626J0773n529o801J5275k6071M4664k0795P656j1366k0302L0209j590
$$ 107626 118399 112870 106069 121344 95273 139937 119142 126798 115432 95130 125339 123749
5136A23749j169k6093K4386k3458J1440J3978R406j9561L86J3591O917j3277N063
$$ 123749 122580 96487 120873 97415 108855 122833 132239 112678 113064 126655 133572 120295 125358
5123A25358Q483O634O115o147o052L810j109N186N797R19j6256M0867k5705J0893
$$ 125358 133841 140475 146590 140443 134391 138201 137092 142278 148075 148994 132738 173605 147900 158793
5109A58793K1940p533k18P756j9574M318P476K6126j7520m037j6062J2546l7605
$$ 158793 180733 173200 172982 180738 161164 165482 172958 199084 181564 177527 161465 174011 136406
5096A36406J4964Q926M686l053J021m494m916L036K0661l3675P229J4865j6302
$$ 136406 151370 160296 164982 161929 162950 158456 153540 156576 177237 143562 150791 165656 149354
5083A49354R048m489J6911k0823o038J6909j02o259m64n129K3931j3216k7221
$$ 149354 158402 153913 170824 150001 143963 160872 160770 154511 154047 148918 172849 159633 132412
5070A32412J8353J1440q374J2927j7918K6204k1229L5677l6609m036K6085q923
$$ 132412 150765 162205 153831 166758 148840 175044 153815 189492 152883 148847 174932 166009
5058A66009P932j972j3273K8884k4878J2259J1185l0461Q143K638J4846r886Q567
$$ 166009 173941 171969 158696 187580 162702 174961 186146 155685 163828 166466 181312 171426 179993
5045A79993p443J0534j5033J237J0016n245K7872j8954j5265K6557K025j3099
$$ 179993 172550 183084 168051 169288 179304 174059 201931 182977 167712 194269 196294 183195
5033A83195K1563R573p347l976j1715P915K3588j3671J4730Q281p08k1430J1930
$$ 183195 204758 214331 206984 203008 191293 199208 222796 209125 223855 232136 231428 209998 221928
5020B21928o94J2470n961l520J6540j5077j9320K0654N503j6854L4660m0713L9535
$$ 221928 221234 233704 227743 224223 240763 225686 206366 227020 232523 215669 250329 209616 249151
5007B49151o698J4366j2387j5624M3837j2799J3700J2347L1288k9347L8290k713
$$ 249151 242453 256819 244432 228808 272645 259846 273546 285893 317181 287834 326124 323411
4995C23411L6011j1788j0604j9755K971k452l5449M423O989j977j6558n17j1806
$$ 323411 359422 347634 337030 317275 320246 317794 282345 286768 293757 291780 275222 274705 262899
4982B62899K3927Q779k6581L916L9575l0649J6031o049L2356j6254J6130J2745
$$ 262899 286826 295605 269024 272940 312515 281866 297897 291848 324204 307950 324080 336825
4970C36825J7091J9264j2474K933N121m267L786k3042o854j2629k2940j665p299
$$ 336825 353916 373180 360706 363639 368760 364493 368279 345237 338383 325754 302814 301149 293850
4957B93850P980Q984j3159m837N217j9594p345J6656L801j1564K943K0957K862
$$ 293850 301830 310814 297655 292818 298035 278441 271096 287752 291553 279989 282932 303889 306751
4944C06751j5617L886l977K6703R103m6489R405J2004j5898J891K6392o421k1525
$$ 306751 291134 295020 291043 317746 326849 280360 289765 301769 285871 287762 314154 307733 286208
4931B86208N812j5619J2989j7380P497o441J3169r003P633q715j922j258q929
$$ 286208 292020 276401 289390 272010 279507 273066 286235 277232 284865 276150 274228 272970 264041
4918B64041K7009k9986J6498K1435j8603p593J0215J3755j0070K8551k8929M22
$$ 264041 291050 261064 277562 298997 280394 272801 283016 296771 286701 315252 286323 286745
4906B86745m696n418K786J3288l709j1501J3184j0479M571J2222l282K083j6120
$$ 286745 282049 276631 279417 292705 288996 277495 290679 280200 284771 296993 293711 295794 279674
4893B79674J9247k382L727P124n659j2026J6356r64J4635k0452q729M0234j4006
$$ 279674 298921 296539 300266 307390 301731 289705 306061 305097 319732 299280 290551 330785 316779
4880C16779k2061K02j562l077K2806j1441J192J1625J742J4528j4657k191M433
$$ 316779 294718 294920 293358 290281 313087 301646 302838 314463 316205 330733 316076 313885 318318
4867C18318K0720o245q986J8912l6379n564K5409J4876K892m731M357r548J1076
$$ 318318 339038 332793 323807 342719 306340 300776 326185 341061 343953 339222 343579 334031 345107
4854C45107j341k7051L4386p123Q183l3401K2515J1940n687M004k29o240J5495
$$ 345107 343766 316715 351101 343978 352161 318760 341275 353215 347528 351532 351303 345063 360558
4841C60558Q493J3478P30j5899j9231J6599J4205O449q696l661P277j8787J8962
$$ 360558 369051 382529 383259 367360 348129 364728 378933 385382 376686 373025 380302 361515 380477
4828C80477j1246L519K6149k617j4914L3303j2329M635k6116J0272K6190l1115
$$ 380477 369231 372750 398899 396282 381368 414671 402342 406977 380861 391133 417323 386208
4816C86208O906J3343L672j3195J3033L447o797O380J1800K876k359K7595l0191
$$ 386208 393114 406457 410129 396934 409967 413414 406617 412997 424797 427673 425314 452909 422718
4803D22718L863J7255Q018p933J4900o670k4113L4819j4896Q921R609J0123J970
$$ 422718 426581 443836 451854 443921 458821 452151 428038 462857 447961 456882 466491 476614 478584
4790D78584j1737J3375p951j1070M454K3629p607J9528K2754m345M299N561o280
$$ 478584 466847 480222 472271 461201 465655 489284 481677 501205 523959 519614 523913 529474 523194
4777E23194l710K7565j4011J6163j2789J3658n640K99O759j471J8534l867q149
$$ 523194 519484 547049 533038 549201 536412 550070 544430 544729 551488 550017 568551 564684 556535
4764E56535L4644k6900J3246l979O635M16R497L7044j2435J4813l893K583K6708
$$ 556535 591179 564279 577525 573546 580181 580597 590094 627138 614703 629516 625623 628206 654914
4751F54914j2515L1803j3768J4264J1584k6281L916M447K882j2298l1711K6226
$$ 654914 642399 674202 660434 674698 686282 660001 663917 668364 671246 658948 627237 653463
4739F53463p666k093L8153m8084L5213j3753K4339K442q24o625M8518m325j0129
$$ 653463 645797 643704 681857 633773 668986 655233 679572 682014 681190 674565 723083 718758 708629
4726G08629K5347J3397q71K1863j9369J7678J8681j1191j0008J5922j4549K042
$$ 708629 733976 747373 746502 768365 748996 766674 785355 774164 764156 780078 765529 767571
4714G67571j7044j0308K5940k1658K3175L104j4285K0878j5537K836K3286K2167
$$ 767571 750527 740219 766159 744501 767676 770780 756495 777373 761836 764672 787958 810125
4702H10125m0930K6934q610K1856n685K6815k2626K0373k795k443J0822J0861
$$ 810125 769195 796129 787519 809375 803690 830505 807879 828252 825457 823014 833836 844697
4690H44697j4974k069J9057k4751L1690k6379P1823l2402K2928j5530j1521J2952
$$ 844697 829723 827654 846711 821960 853650 827271 899094 866692 889620 874090 862569 875521
4678H75521J0416M3946l6037k8898J6612L5644j9355J3773M896K2474J5498L07
$$ 875521 885937 929883 893846 864948 881560 917204 897849 911622 916518 938992 954490 954797
4666I54797l5360L5098P931j0031L1557l880J4313j2627J4054J960p485M4765
$$ 954797 919437 954535 962466 952435 983992 980112 994425 981798 995852 997812 990327 1035092
4654A035092j4865O724J1906J1456J438R121N958K5233m021j9354M5187k2198
$$ 1035092 1020227 1026951 1038857 1050313 1051751 1060872 1066830 1092063 1088042 1068688 1113875 1091677
4642A091677J5956O92j049K2684m396J7884L2923K783J9361r960J7462p240k0716
$$ 1091677 1107633 1108325 1107276 1129960 1125564 1143448 1176371 1179154 1198515 1188555 1206017 1198777 1178061
4629A178061N5991L24J6969k142k3355L2888J6534K0515l9657M6484j2848J3184
$$ 1178061 1234052 1234376 1251345 1249203 1225848 1258736 1275270 1295785 1256128 1302612 1289764 1302948
4617A302948K2979K240K288K9239j73J5751L1678r29m401o130M4967J1871l227
$$ 1302948 1325927 1328167 1330455 1359694 1359521 1375272 1406950 1406021 1401620 1395490 1440457 1452328 1449101
4604A449101L0777P602L654L6453r015K4171P945J4813p71K1721j407K2873K3678
$$ 1449101 1479878 1487480 1491134 1527587 1518572 1542743 1550688 1565501 1564730 1586451 1585044 1607917 1631595
4591A631595J3143m448L3476p711J8581L966K2395J3442N954J9962J6806K6886
$$ 1631595 1644738 1640290 1673766 1666055 1684636 1688602 1710997 1724439 1730393 1750355 1767161 1794047
4579A794047J1997M942J6821K0110K1362K0266K3025J1486j31L1898J5307L4178
$$ 1794047 1806044 1810986 1827807 1847917 1869279 1889545 1912570 1924056 1923925 1955823 1971130 2005308
4567B005308j1232K937J716O9244J5253j3578N5289L544K2677k3621N8524K9210
$$ 2005308 1994076 1997013 1998729 2067973 2083226 2069648 2124937 2128481 2151158 2127537 2186061 2215271
4555B215271J7724M352K3975M9579m206K8475K9390l437L5276K4484K3634J9889
$$ 2215271 2232995 2237347 2261322 2310901 2306695 2335170 2364560 2361123 2396399 2420883 2444517 2464406
4543B464406L0762K7096q30N8099K3040J2222J1643M6663M7733M310L3497K8475
$$ 2464406 2495168 2522264 2521434 2579533 2602573 2614795 2626438 2673101 2720834 2725144 2758641 2787116
4531B787116K4672K5761J5006L9139K5080J9064M8199L3321J9855J4427L9781
$$ 2787116 2811788 2837549 2852555 2891694 2916774 2935838 2984037 3017358 3037213 3051640 3091421
4520C091421K1020M4403L5501Q846N3076M3337K7673L6161K0490O2933J6807N3230
$$ 3091421 3112441 3156844 3192345 3201191 3254267 3297604 3325277 3361438 3381928 3444861 3461668 3514898
4508C514898Q752M0015N6467M1621K4411K8427M2347M7747M6406N5443M9036J710
$$ 3514898 3523650 3563665 3620132 3661753 3686164 3714591 3756938 3804685 3851091 3906534 3955570 3957280
4496C957280P6252O5849L9525J5549N2210N3180N9192K9955O9378M4076M7243
$$ 3957280 4033532 4099381 4138906 4154455 4206665 4259845 4319037 4348992 4418370 4462446 4509689
4485D509689N8777M9137Q2121O0140Q025Q4983N4315J3120P1738Q9922N9078J3814
$$ 4509689 4568466 4617603 4699724 4759864 4767889 4852872 4907187 4920307 4992045 5081967 5141045 5154859
4473E154859P3030P3093M4199J00602K0121P1165Q0882M4358Q4377R0531N7777
$$ 5154859 5227889 5300982 5345181 5445783 5465904 5537069 5617951 5662309 5746686 5837217 5894994
4462E894994O2797Q5124P9228N2617Q8166Q9534N2528Q5228Q4933R1814Q8972
$$ 5894994 5957791 6042915 6122143 6174760 6262926 6352460 6404988 6490216 6575149 6666963 6755935
4451F755935N8762R8276Q6095J04732R0043P5271J00247P8958J25383P6086J26694
$$ 6755935 6814697 6912973 6999068 7103800 7193843 7269114 7369361 7448319 7573702 7649788 7776482
4440G776482O9423J04466J15676J25887O6377J19116J08844J02778J22301J05114
$$ 7776482 7845905 7950371 8066047 8191934 8258311 8377427 8486271 8589049 8711350 8816464
4430H816464J23900R1475J23179J30441J31041J26341J07985J55587J33327R7450
$$ 8816464 8940364 9031839 9155018 9285459 9416500 9542841 9650826 9806413 9939740 10037190
4420A0037190J64294J43961J40318J22423J56960J35951J69282J46383J56387
$$ 10037190 10201484 10345445 10485763 10608186 10765146 10901097 11070379 11216762 11373149
4411A1373149J91696J42187J44213K11844J61147J61216J67331K04583J78956
$$ 11373149 11564845 11707032 11851245 12063089 12224236 12385452 12552783 12757366 12936322
4402A2936322J86329K02200J79430K24637J87253K33273K04205K26224K37784
$$ 12936322 13122651 13324851 13504281 13728918 13916171 14149444 14353649 14579873 14817657
4393A4817657K44635K32548K94473K23856K85744K66734K83843K72741L32393
$$ 14817657 15062292 15294840 15589313 15813169 16098913 16365647 16649490 16922231 17254624
4384A7254624K70842L21176K92618L56354L48409L65476L48872L92916L86334
$$ 17254624 17525466 17846642 18139260 18495614 18844023 19209499 19558371 19951287 20337621
4375B0337621L83610M31951M07895M58936M59896M48433M97525N16635N15588
$$ 20337621 20721231 21153182 21561077 22020013 22479909 22928342 23425867 23942502 24458090
4366B4458090N47600N54065O06053O15234N78898O83673O82477P07649O97750
$$ 24458090 25005690 25559755 26165808 26781042 27359940 28043613 28726090 29433739 30131489
4357C0131489P58921P82567Q42206Q52936Q93232Q77161R55427J018263R98524
$$ 30131489 30890410 31672977 32515183 33368119 34261351 35138512 36093939 37112202 38110726
4348C8110726J065696J106394J147695J228646J251783J288592J392238J400403
$$ 38110726 39176422 40282816 41430511 42659157 43910940 45199532 46591770 47992173
4340D7992173J512714J521402J623677J698605J775490J850170J954962K068166
$$ 47992173 49504887 51026289 52649966 54348571 56124061 57974231 59929193 61997359
4332F1997359K126486K221845K357334K476518K589898K719157K890515L041954
$$ 61997359 64123845 66345690 68703024 71179542 73769440 76488597 79379112 82421066
4324H2421066L166751L355782L533907L726813L921665M151062M349949M553239
$$ 82421066 85587817 88943599 92477506 96204319 100125984 104277046 108626995 113180234
4316A13180234M861863N092328N355358N615349N935554O218041O490062O786322
$$ 113180234 118042097 123134425 128489783 134105132 140040686 146258727 152748789 159535111
4308A59535111P089805P379663P657344P884485Q111905Q283300Q450025Q551714
$$ 159535111 166624916 174004579 181661923 189546408 197658313 205941613 214391638 222943352
4300B22943352Q505706Q441704Q338088Q064669P668652P235190O611730N898649
$$ 222943352 231449058 239890762 248228850 256293519 263962171 271197361 277809091 283707740
4292B83707740N116360M180509L233054K160345J105172k0978j072801k087023
$$ 283707740 288824100 293004609 296237663 298398008 299503180 299482202 298409401 296322378
4284B96322378l088398l957161m715269n431499o021461o474932o836006p076487
$$ 296322378 293233980 289276819 284561550 279130051 273108590 266633658 259797652 252721165
4276B52721165p282508p364056p381880p372929p252111p152841p046870o777135
$$ 252721165 245438657 238074601 230692721 223319792 216067681 208914840 201867970 195090835
4268A95090835o635437o425778o213552n966312n740931n539407n292494n095064
$$ 195090835 188455398 182029620 175816068 169849756 164108825 158569418 153276924 148181860
4260A48181860m911099m667595m485308m324528m127844l936021l801538l644837
$$ 148181860 143270761 138603166 134117858 129793330 125665486 121729465 117927927 114283090
4252A14283090l483363l363652l242781l104569k997793k883559k778708k694250
$$ 114283090 110799727 107436075 104193294 101088725 98090932 95207373 92428665 89734415
4244H9734415k557465k502323k410222k313044k244197k161308k089454j998457
$$ 89734415 87176950 84674627 82264405 79951361 77707164 75545856 73456402 71457945
4236G1457945j959831j847818j811842j721420j688689j613064j511710j482147
$$ 71457945 69498114 67650296 65838454 64117034 62428345 60815281 59303571 57821424
4228E7821424j459992j365995j329317j281791j231585j155922j119024j111655
$$ 57821424 56361432 54995437 53666120 52384329 51152744 49996822 48877798 47766143
4220D7766143j057929r74440r94036r06869q71726q73989q14995p88025p41050
$$ 47766143 46708214 45733774 44739738 43832869 42961143 42087154 41272159 40484134 39743084
4211C9743084p29469o98126o78666o51144o47535o07712o05369n76302n73081
$$ 39743084 39013615 38315489 37636823 36985679 36338144 35730432 35125063 34548761 33975680
4202C3975680n46131n21606n13004n10513m76873m60095m11869m18404l84608
$$ 33975680 33429549 32907943 32394939 31884426 31407553 30947458 30535589 30117185 29732577
4193B9732577l70716l43523l59637l24183l40662l33364l10202l18709k94229
$$ 29732577 29361861 29018338 28658701 28334518 27993856 27660492 27350290 27031581 26737352
4184B6737352l07139k72815k66310l04513k87936k93407k89661l18756k87196
$$ 26737352 26430213 26157398 25891088 25586575 25298639 25005232 24715571 24396815 24109619
4175B4109619k95738l09340k87462l08233k77209k31448k25558k29689j82350
$$ 24109619 23813881 23504541 23217079 22908846 22631637 22400189 22174631 21944942 21762592
4166B1762592j95113j75260j60044j71152j95931k90868k92575k87620k31535
$$ 21762592 21567479 21392219 21232175 21061023 20865092 20574224 20281649 19994029 19762494
4157A9762494k68101k39796k89031k57509k52408k55794k98188k69229k47800
$$ 19762494 19494393 19254597 18965566 18708057 18455649 18199855 17901667 17632438 17384638
4148A7384638k83013k67319k38293k24063k46062j92767j98661j64556j54537
$$ 17384638 17101625 16834306 16596013 16371950 16125888 15933121 15734460 15569904 15415367
4139A5415367j85267j20920j56989j39369j65091k14024k64169k80504j97918
$$ 15415367 15230100 15109180 14952191 14812822 14647731 14433707 14169538 13889034 13691116
4130A3691116k92647k16639k01113k21009k34520k27061j89849k17628j97130
$$ 13691116 13398469 13181830 12980717 12759708 12525188 12298127 12108278 11890650 11693520
4121A1693520k27846j65187j86318j82795j78644j44278j71183j10343j58787
$$ 11693520 11465674 11300487 11114169 10931374 10752730 10608452 10437269 10326926 10168139
4112A0168139j40202j09448j19499j20470j02064j18747j65775j47030j42122
$$ 10168139 10027937 9918489 9798990 9678520 9576456 9457709 9291934 9144904 9002782
4103I002782j16742j39943j36080j39712r2838r4868j13420j18512j17290r6074
$$ 9002782 8886040 8746097 8610017 8470305 8377467 8282599 8169179 8050667 7933377 7837303
4093G837303p4751j02464r0040j08130p6437q2832o0744j13615q1553n5718p2384
$$ 7837303 7762552 7660088 7570048 7461918 7385481 7302649 7241905 7128290 7046737 6991019 6918635
4082F918635j02599o0107n7351p1816m0772o5515n9135n3530n4631o2707p4761
$$ 6918635 6816036 6755929 6698578 6626762 6585990 6520475 6461340 6407810 6353179 6290472 6215711
4071F215711m2886p7540n6939j07105m3348p2812n5873l2770q1427o5716l3602
$$ 6215711 6172825 6095285 6038346 5931241 5887893 5815081 5759208 5726438 5645011 5579295 5545693
4060E545693n1574o4839p5292n4701r997n0290o4121m0184m7436j9525m4046l2413
$$ 5545693 5494119 5429280 5353988 5299287 5289290 5239000 5174879 5134695 5087259 5067734 5023688 4991275
4048D991275m1746n6753j844l0398l9125l5565m6934p4059l6971p0712k5188l3905
$$ 4991275 4949529 4892776 4890932 4860534 4821409 4785844 4738910 4664851 4627880 4557168 4531980 4498075
4036D498075o6277o0112k4918l5902j6979o2255j7939k6431l6260k2008j2715
$$ 4498075 4431798 4371686 4346768 4310866 4293887 4231632 4213693 4187262 4151002 4128994 4116279
4025D116279l3127m9186k4466k3665j1485J254n7501P183l3276l0414l7196J7082
$$ 4116279 4083152 4033966 4009500 3985835 3974350 3975604 3918103 3925286 3892010 3861596 3824400 3841482
4013C841482l6149q722k0801k0034m9608K5720k3358k5898j9665k622j3696r694
$$ 3841482 3805333 3796611 3775810 3755776 3706168 3731888 3708530 3682632 3662967 3660345 3646649 3636955
4001C636955j8433j9960L5976l9884J0705j568j6851M697j0270k3054K6056k7382
$$ 3636955 3618522 3598562 3634538 3594654 3605359 3603791 3586940 3591637 3581367 3558313 3584369 3556987
3989C556987J3523N294K2140p137L1726L956J1482N948K8910M0403K5581N2719
$$ 3556987 3570510 3575804 3597944 3590807 3622533 3626489 3637971 3643919 3672829 3713232 3738813 3791532
3977C791532M2765K9291M6581O4211J7677Q8208O5684N5143P4794P5798R3096
$$ 3791532 3834297 3863588 3910169 3974380 3992057 4080265 4145949 4201092 4275886 4351684 4444780
3966D444780Q4765R9630O8299Q5211O4060Q3145J01457K3044Q2691K0919L2468
$$ 4444780 4529545 4629175 4697474 4782685 4846745 4929890 5031347 5054391 5137082 5158001 5190469
3955E190469L8800L9160J5007k5358L6013q809N33J6418p334K5339K7054N4631
$$ 5190469 5229269 5268429 5283436 5258078 5294091 5285282 5285815 5302233 5294899 5320238 5347292 5401923
3943E401923M7141N6535Q9180J10428P0907J04004J18991J46099J55274R0280
$$ 5401923 5449064 5505599 5594779 5705207 5776114 5880118 5999109 6145208 6300482 6390762
3933F390762J45266J30418J14662J18175O2529N6308J4322n789o8927n9604r1480
$$ 6390762 6536028 6666446 6781108 6899283 6961812 7018120 7032442 7026653 6957726 6898122 6806642
3922F806642j28098j19409j41937j36550j21260j37259j50579q4544r7047r8831
$$ 6806642 6678544 6559135 6417198 6280648 6159388 6022129 5871550 5787006 5689959 5591128
3912E591128q6412p2628j5424o8207k6595j624n417j9973J9368k6285J5630K511
$$ 5591128 5504716 5432088 5416664 5348457 5321862 5320238 5314821 5294848 5314216 5287931 5303561 5306072
3900E306072p900j2728n7186m1449n7526n9797j13176q9524q4961j26321j18332
$$ 5306072 5298172 5285444 5228258 5186809 5129283 5069486 4956310 4866786 4781825 4655504 4537172
3889D537172j15255j21693q9713j15361j07554j24919p4730q4050q2879j01310
$$ 4537172 4421917 4300224 4210511 4095150 3987596 3862677 3787947 3703897 3621018 3519708
3879C519708m2490o3094o6702q1582n5697m8682k5088o5300m3893j9183n6670
$$ 3519708 3477218 3414124 3347422 3265840 3210143 3161461 3136373 3071073 3027180 3007997 2951327
3868B951327R071m4682m892m3230j2513l9707K747j4324j4426l0757K6352J6085
$$ 2951327 2960398 2915716 2910824 2867594 2855081 2815374 2818121 2803797 2789371 2758614 2784966 2801051
3856B801051k3722n895K429J3766J4970o705L815R109L6466r324J2832L4325K1011
$$ 2801051 2777329 2771434 2773863 2787629 2802599 2795894 2799709 2808818 2845284 2835960 2848792 2883117 2904128
3843B904128K5271K4085J7945L5974J7753P3926J9181N9906M0743N2474M4694
$$ 2904128 2929399 2953484 2971429 3007403 3025156 3099082 3118263 3178169 3218912 3271386 3316080
3832C316080O4695M8534Q5439P6929Q7950P9236R3924J02489Q9010J09910J06945
$$ 3316080 3380775 3429309 3514748 3591677 3679627 3758863 3852787 3955276 4044286 4154196 4261141
3821D261141J20238R1048J17282P5537J57040R9189J24679J10113Q5735J09935
$$ 4261141 4381379 4472427 4589709 4665246 4822286 4921475 5046154 5156267 5242002 5351937
3811E351937J20364P3823J40290R1848J12091J01206J28390R4929J20377J10038
$$ 5351937 5472301 5546124 5686414 5778262 5890353 5991559 6119949 6214878 6335255 6445293
3801F445293J43598Q9219R9891R3758J21898Q4789M8548O5765L5796K3303J054
$$ 6445293 6588891 6678110 6778001 6871759 6993657 7078446 7126994 7192759 7228555 7251858 7252912
3790G252912O001o2626l4293m1472p2833m9509p5832r1817o4217o6076j05145
$$ 7252912 7258913 7196287 7161994 7120522 7047689 6998180 6922348 6830531 6766314 6700238 6595093
3779F595093j1796m5818o6895m6759k8690m0073l5477n2171p350k6686l1674n2689
$$ 6595093 6583297 6537479 6470584 6423825 6395135 6355062 6319585 6267414 6260064 6233378 6201704 6149015
3767F149015m8646o1958k9046n2407m8933p8391k9663o9762k8206o3651k0862
$$ 6149015 6100369 6038411 6009365 5956958 5908025 5829634 5799971 5730209 5702003 5638352 5617490
3756E617490q4286j5325k8765m6258M640k563n9274l6270L797k0788m901j3081
$$ 5617490 5533204 5517879 5489114 5442856 5447496 5444933 5385659 5349389 5353186 5332398 5327497 5314416
3744E314416q458Q435P676j0951J9532Q776L3800L5001K2553J7756K2680N2267
$$ 5314416 5305958 5314393 5322069 5311118 5330650 5339426 5373226 5408227 5430780 5448536 5471216 5523483
3732E523483L4813M3335L2307M6342L8365R429O5693L0147J544J9667L349k0002
$$ 5523483 5558296 5601631 5633938 5680280 5718645 5728074 5793767 5823914 5825458 5845125 5848474 5828472
3720E828472J963k8802m008n3813l5775l1836o5135m9641l8963l8637o8273j9358
$$ 5828472 5830435 5801633 5797625 5743812 5708037 5676201 5611066 5561425 5522462 5483825 5415552 5396194
3708E396194o8211j3827n3105n3524j5790l4727p629k3555l9547J7765n8387k048
$$ 5396194 5327983 5314156 5261051 5207527 5191737 5157010 5149381 5125826 5086279 5104044 5045657 5043609
3696E043609k2435k5718j3065l0827m7832k7412k4384n4126j1355k4818n3072
$$ 5043609 5021174 4995456 4982391 4951564 4903732 4876320 4851936 4797810 4786455 4761637 4708565
3685D708565j0123o6360m1002k1113n1953k7636m6914j5116n5339j3616k8945
$$ 4708565 4698442 4632082 4591080 4569967 4518014 4490378 4443464 4428348 4373009 4359393 4330448
3674D330448k3824R348q261j7933o216K3707J9329J8659N9179P9397L4045O5116
$$ 4330448 4306624 4315972 4307711 4289778 4283562 4307269 4326598 4345257 4404436 4483833 4517878 4582994
3662D582994N7039P0510P5713P8239N3503N5281N6249L7400M8828N3165L9389
$$ 4582994 4640033 4710543 4786256 4864495 4917998 4973279 5029528 5066928 5115756 5168921 5208310
3651E208310J1042O0724J4458L9071L4660O7416P0808J07295N7590J01550J32567
$$ 5208310 5219352 5280076 5294534 5333605 5368265 5435681 5506489 5613784 5671374 5772924 5905491
3640E905491J05075J38111J10454J60009J03260J17404J04598R2374J18055M8969
$$ 5905491 6010566 6148677 6259131 6419140 6522400 6639804 6744402 6836776 6954831 7003800
3630G003800P8911O6395L0973L870L4568L0424N100n617p84K9681k0304L8064
$$ 7003800 7082711 7149106 7180079 7183949 7218517 7248941 7254041 7248424 7247640 7277321 7257017 7295081
3618G295081r87L0588N9151J8714M5795O8046N1255P7366O5975M5935O1118P3726
$$ 7295081 7294094 7324682 7383833 7402547 7448342 7516388 7567643 7645009 7710984 7756919 7818037 7891763
3606G891763K6688O2118L1015J9456J4625j995j1676j6659m0419n1346m6223m4427
$$ 7891763 7918451 7980569 8011584 8031040 8045665 8043670 8031994 8015335 7974916 7923570 7877347 7832920
3594G832920m2273n4611n7225j8392k7896J7207j480k423L7322M8503J5666O4861
$$ 7832920 7790647 7736036 7678811 7660419 7632523 7649730 7648250 7645827 7683149 7731652 7747318 7812179
3582G812179N7509M9559N2085N0227J3455J6107j225r488Q970l8708k1389m6380
$$ 7812179 7869688 7919247 7971332 8021559 8035014 8051121 8049896 8040408 8049378 8010670 7989281 7942901
3570G942901m1589o247l1850r166J6346l4657o046L1489J5512J4337J787L2368
$$ 7942901 7901312 7895065 7863215 7854049 7870395 7835738 7829692 7861181 7876693 7891030 7892817 7925185
3558G925185k1005j4732j3537m5896n4689o7093q1018p1450r5508j39090j13153
$$ 7925185 7904180 7889448 7875911 7830015 7775326 7708233 7627215 7555765 7460257 7321167 7208014
3547G208014j11480j13217j24075j44075j20374j36572j40743j24598j22930j23473
$$ 7208014 7096534 6983317 6859242 6715167 6594793 6458221 6317478 6192880 6069950 5946477
3537E946477j48323j35276j17927j20333j36423j71245j31423j31737j69072j51879
$$ 5946477 5798154 5662878 5544951 5424618 5288195 5116950 4985527 4853790 4684718 4532839
3527D532839j34009j11905j67590j01306j15707j22798j19946q9185j29802j01283
$$ 4532839 4398830 4286925 4119335 4018029 3902322 3779524 3659578 3570393 3440591 3339308
3517C339308q2825r8570p9730l7385j28440p5092o3017q3738o4170m0786p0374
$$ 3339308 3256483 3157913 3078183 3040798 2912358 2837266 2774249 2690511 2626341 2585555 2515181
3506B515181n8921l5360p1920n0706l5723n1881n8806l2566k2853n6510j9225
$$ 2515181 2456260 2420900 2348980 2298274 2262551 2210670 2151864 2119298 2096445 2039935 2020710
3495B020710l9791l4681l1731l3696k0594l1500o2905R187j7465k0948m580k8587
$$ 2020710 1980919 1946238 1914507 1880811 1860217 1828717 1765812 1774999 1757534 1736586 1732006 1703419
3483A703419m646j5741J092K539q792J4379l6438j5281O041l2127k5852j1688
$$ 1703419 1698773 1683032 1684124 1686663 1677871 1692250 1655812 1640531 1646572 1614445 1588593 1576905
3471A576905j1681q816O6r476k2743N370l084L126J515J5782l684J8197J7534
$$ 1576905 1565224 1556408 1556474 1546998 1524255 1529625 1526541 1529667 1531182 1546964 1543280 1561477 1579011
3458A579011j0877J9487K5045K0541J388M3174L1360M9180N2192K5500Q2569M1725
$$ 1579011 1568134 1587621 1612666 1633207 1634595 1677769 1709129 1758309 1810501 1836001 1918570 1960295
3446A960295J00457J14321R8402J06590J81993J27660K24336K06949K84720K83212
$$ 1960295 2060752 2175073 2273475 2380065 2562058 2689718 2914054 3121003 3405723 3688935
3436C688935L09425L27330L73606L35237L89919L67227L20673L59979M29744M02627
$$ 3688935 3998360 4325690 4699296 5034533 5424452 5791679 6112352 6472331 6902075 7304702
3426G304702M03021L69679K37387J87808J90726J73324K40236K02627R6100r4795
$$ 7304702 7707723 8077402 8314789 8502597 8693323 8866647 9106883 9309510 9405610 9310815
3416I310815j96692k25860j98530j87177j57376k26467k74080m01087l96797l53948
$$ 9310815 9114123 8888263 8689733 8502556 8345180 8118713 7844633 7443546 7046749 6692801
3406F692801l55347l20061k91078l26740l32885l35804l07342l10276k35341k11698
$$ 6692801 6337454 6017393 5726315 5399575 5066690 4730886 4423544 4113268 3877927 3666229
3396C666229j68047j44733j61534j06427j10564q7574q0095n6717p1938l4791
$$ 3666229 3498182 3353449 3191915 3085488 2974924 2887350 2807255 2750538 2678600 2643809
3386B643809m5361m5371n157n8240j3235k6360n4478k5612n3850n7576p8258p3159
$$ 2643809 2598448 2553077 2547920 2489680 2476445 2450085 2395607 2369995 2316145 2258569 2180311 2107152
3374B107152n0918p7861o9886m6937o7942o3927m6082o2056n0193l0015m8181
$$ 2107152 2056234 1978373 1908487 1861550 1793608 1729681 1683599 1621543 1571350 1541335 1493154
3363A493154n2604k2671l3760k9440k7887m4398l2259l6373K6610m9326j9539
$$ 1493154 1440550 1417879 1384119 1354679 1326792 1282394 1250135 1213762 1240372 1191046 1171507
3352A171507j8577k4523j2376p804k2030K829m5778m349k9393Q473k341k7736
$$ 1171507 1152930 1128407 1116031 1108227 1086197 1089026 1043248 1038899 1009506 1017979 1015638 987902
3340I87902M972Q990k8832J8824k3856n979j0522j6573o54K4484q504N474k3543
$$ 987902 992874 1001864 973032 991856 968000 962021 951499 934926 934272 958756 950252 955726 932183
3327I32183P952K8240j0380j6690K6988j4722q120J7611R641l3657N5629j2003
$$ 932183 940135 968375 957995 941305 968293 953571 945451 963062 972703 939046 994675 982672
3315I82672K2299J2563J9144K8729K9062K9245K0346M6096K3442P2214K8777M1994
$$ 982672 1004971 1017534 1036678 1065407 1094469 1123714 1144060 1190156 1213598 1285812 1314589 1356583
3303A356583L7096K3193M9408j2519K720k7586l7143m5228n8391o2019k7434n1412
$$ 1356583 1393679 1416872 1466280 1453761 1456481 1428895 1391752 1346524 1288133 1226114 1198680 1147268
3291A147268n7207j0272m4206n139p2492j5382k2922l2742O827l9453q403m004
$$ 1147268 1090061 1079789 1035583 1030444 957952 942570 919648 886906 893733 854280 845877 841873
3279H41873k7815k4035p094k834l881l4775k1027K470o481l6227J7837j1412r784
$$ 841873 814058 790023 782929 780095 776214 741439 720412 722882 716401 680174 698011 686599 676815
3266F76815K853q02k9358l011L886m792j3778l028j943k5142O452m115l920l6245
$$ 676815 679668 678866 649508 646497 650383 645591 631813 628785 626842 601700 608152 604037 600117 563872
3252E63872J0089m659J5815R827k4841J213j0637Q438K107l992J3736k24j3596
$$ 563872 573961 569302 585117 594944 570103 571316 560679 569117 571224 567232 580968 580744 567148
3239E67148J8060q583r705n365r924K1455q586L49k071j5634L5028m790k2959
$$ 567148 585208 576625 566920 561555 551631 573086 564500 564849 562778 547144 582172 577382 554423
3226E54423M7601k9457J8648j138J0040j5283K4510K9376l4540K5400J8977o488
$$ 554423 602024 572567 591215 590077 600117 584834 609344 638720 604180 629580 648557 642069
3214F42069K2268M077Q779L966K6060j946R332J6024L3509K0017J2473R230J1784
$$ 642069 664337 668414 677193 681159 707219 705273 714605 730629 764138 784155 796628 805858 817642
3201H17642M8901q637K1927K9507K7972J7525J4678M2757M8644L2182M7585L9804
$$ 817642 866543 857906 879833 909340 937312 954837 969515 1012272 1060916 1093098 1140683 1180487
3189A180487L9711K1373K9936N9677O9737M3274L1245N8169N0191K2190O2029
$$ 1180487 1220198 1241571 1271507 1331184 1400921 1444195 1475440 1533609 1583800 1605990 1668019
3178A668019K3915J1831L0616L9437O0840j4616O1228L5622L8445O6754O1091
$$ 1668019 1691934 1703765 1734381 1773818 1834658 1820042 1881270 1916892 1955337 2022091 2083182
3167B083182L5020P1105M5433P3906R8263N3993J14548Q8446J02752Q1993J34693
$$ 2083182 2118202 2189307 2234740 2308646 2406909 2460902 2575450 2663896 2766648 2848641 2983334
3156B983334J03411J23637P3916R9977M0924P7505K7882N5507k2794Q754q202
$$ 2983334 3086745 3210382 3284298 3384275 3425199 3502704 3530586 3586093 3563299 3572053 3563851
3145C563851J3702k725j9980P490k722J311K7570Q664M6208L9730P8419M1474
$$ 3563851 3577553 3574828 3554848 3562338 3559616 3560927 3588497 3597161 3643369 3683099 3761518 3802992
3133C802992R6269P5248Q5701O5382J27232Q8931Q7193J19293J7276Q1677J2196
$$ 3802992 3899261 3974509 4060210 4125592 4252824 4341755 4428948 4548241 4565517 4647194 4659390
3122D659390L603k6744l8626o8424m0870q7368j00038r8597r3580r1358o7545
$$ 4659390 4662993 4636249 4597623 4529199 4488329 4400961 4300923 4202326 4108746 4017388 3949843
3111C949843o6240n0675q9882n6888l5958j5270o8374k372n238p981j834o116
$$ 3949843 3883603 3832928 3743046 3686158 3650200 3634930 3566556 3564184 3558946 3550965 3549131 3543015
3099C543015O962o367M3240k0510l6348j7487r507m1215l8815p6822q0113o6253
$$ 3543015 3549977 3543610 3586850 3566340 3529992 3512505 3502998 3461783 3422968 3346146 3266033 3199780
3087C199780o0255j27516q9386o0835r5994j01571o8783r4120n5004o0282p1410
$$ 3199780 3139525 3012009 2922623 2861788 2765794 2664223 2595440 2501320 2446316 2386034 2314624
3076B314624m7872n9634m9312o8533m2354m7098j8531m1795n1664m5400o39m4634
$$ 2314624 2266752 2207118 2157806 2089273 2046919 1999821 1981290 1939495 1887831 1842431 1841792 1797158
3064A797158m3251k5611j5441q1503k3547k6945p2455k5586l6241m3129p0318
$$ 1797158 1753907 1728296 1712855 1631352 1607805 1580860 1508405 1482819 1446578 1403449 1333131
3053A333131k0222o0498k3928k7374j0688n4087m1029p24l8179k4055m0342L231
$$ 1333131 1312909 1252411 1228483 1201109 1190421 1136334 1095305 1094581 1056402 1032347 992005 995236
3041I95236k5546k1703l0924l558j6550l4066j7044j4179l7485q285N133j8609
$$ 995236 969690 947987 917063 913505 896955 862889 845845 831666 794181 785896 791029 772420
3029G72420o176l9767q705j760j6126K7318l4195l050j8985j1760K510j4842j3129
$$ 772420 766244 726477 717772 716012 699886 727204 693009 689959 670974 659214 661724 646882 633753
3016F33753p87k1972N939k1222o097K5011l1779Q799k3592J7757r975o114r737
$$ 633753 632966 610994 616933 595711 589614 614625 582846 591645 568053 585810 575835 569721 559984
3003E59984j7505j2891J3189L783J7411k1063k4621Q363N113j2046Q542k246k0897
$$ 559984 542479 529588 542777 546560 563971 542908 518287 526650 531763 519717 528259 526013 505116
2990E05116J9224j8443J0765m672J9397k2636M128m360J1182j9941O363J3544
$$ 505116 524340 505897 516662 511990 531387 508751 512879 508519 519701 499760 506123 519667
2978E19667l5253K0992J2572o476J7996j9138P085O307k1715L5465o123M525p492
$$ 519667 484414 505406 517978 511502 529498 510360 517445 523752 502037 537502 531379 535904 528412
2965E28412j5364L1632J1359j7424j4082Q925O869o947m444J4698K1903l521k2759
$$ 528412 513048 544680 556039 538615 524533 533458 540327 533380 528936 543634 565537 562016 539257
2952E39257J2174K2621j48j953R105L6K1024J5087J9505Q861k7428M5148N872
$$ 539257 551431 574052 573904 571951 581056 581092 602116 617203 636708 645569 618141 663289 669161
2939F69161J269L821K1742n557J8926K3512J7721j2489K2496k3387M973K6390
$$ 669161 670430 674251 695993 690436 709362 732874 750595 738106 760602 737215 742188 768578
2927G68578k5108O064J6954L812M019L6635j866L0926N716M3710n319L1729J1478
$$ 768578 743470 749534 766488 770300 774319 810954 809088 840014 845730 889440 884121 915850 927328
2914I27328K9754L6822K545M0406O3623j1403M2783M3758L1455N1285M7338L2033
$$ 927328 957082 993904 996449 1036855 1100478 1089075 1131858 1175616 1207071 1258356 1305694 1337727
2902A337727J4718O2363M0489M9599N0784N2123M6527P0430M4873O6458N6302
$$ 1337727 1352445 1414808 1455297 1504896 1555680 1607803 1654330 1724760 1769633 1836091 1892393
2891A892393P0091N3903P3279N2373O4565M7998R4064N0786R5836O1763Q8197
$$ 1892393 1962484 2016387 2089666 2142039 2206604 2254602 2348666 2399452 2495288 2557051 2645248
2880B645248P2430P0417Q9153J11532Q5839Q9978J31890J36891J25502J54741
$$ 2645248 2717678 2788095 2877248 2988780 3074619 3164597 3296487 3433378 3558880 3713621
2870C713621J05579J55298J31341J42893J75203J69566J39736J77830J41209J61524
$$ 3713621 3819200 3974498 4105839 4248732 4423935 4593501 4733237 4911067 5052276 5213800
2860E213800J69386J48083J74075J93053K07438J90012K22612K24241K15050K61556
$$ 5213800 5383186 5531269 5705344 5898397 6105835 6295847 6518459 6742700 6957750 7219306
2850G219306K37913K76745K67805K78308K84543K52898J93957K16484K29436J41666
$$ 7219306 7457219 7733964 8001769 8280077 8564620 8817518 9011475 9227959 9457395 9599061
2840I599061J64228J29468J31274P2357Q5310Q0941Q7207M7934K2853L4303L9062
$$ 9599061 9763289 9892757 10024031 10096388 10181698 10262639 10349846 10397780 10420633 10454936 10493998
2829A0493998q311M377j8489m6449m3840o9404l8209j13270j31385j38519j33025
$$ 10493998 10485687 10490064 10471575 10425126 10381286 10311882 10273673 10160403 10029018 9890499 9757474
2818I757474j82785j87565j86346k35272j94417k36610j81805k21383k17318j98941
$$ 9757474 9574689 9387124 9200778 8965506 8771089 8534479 8352674 8131291 7913973 7715032
2808G715032j77158j81306j89830j78847j60258j60600j94884j30856j86071j26648
$$ 7715032 7537874 7356568 7166738 6987891 6827633 6667033 6472149 6341293 6155222 6028574
2798F028574j60245j85918j26322j75845j15494j68715j43209j40062j47371q0345
$$ 6028574 5868329 5682411 5556089 5380244 5264750 5096035 4952826 4812764 4665393 4585048
2788D585048j48888j04919j36635j04847p2157j12682r8475j04465o3765p1649
$$ 4585048 4436160 4331241 4194606 4089759 4017602 3904920 3806445 3701980 3638215 3566566
2778C566566p5014o5014n3383q7541o1953m2221m6351p8780o4736o1123n8493
$$ 3566566 3491552 3426538 3373155 3285614 3223661 3181440 3135089 3056309 2991573 2930450 2871957
2767B871957m1079n3907j4475l1979o3219j7719o5562o065n3622J2466k8632k2934
$$ 2871957 2830878 2776971 2762496 2730517 2667298 2649579 2584017 2577952 2524330 2536796 2508164 2485230
2755B485230l602l5478l4448J8578o410o0965k2990j3577J7596l9963K4135l3147
$$ 2485230 2481628 2446150 2411702 2430280 2423870 2362905 2339915 2326338 2343934 2303971 2328106 2294959
2743B294959N920j1931L0742P662j2712J7101J8656N3032L4676l376K6870L9341
$$ 2294959 2300879 2288948 2319690 2327352 2314640 2331741 2350397 2403429 2438105 2434729 2461599 2500940
2731B500940P3180L8948M4968M9765M8305N7663Q6850O4584P7249Q0867M9701
$$ 2500940 2574120 2613068 2658036 2707801 2756106 2813769 2900619 2965203 3042452 3123319 3173020
2720C173020R0238R1216R0576R8858Q5199J05136J06668J19406J07841J37897
$$ 3173020 3263258 3354474 3445050 3543908 3629107 3734243 3840911 3960317 4068158 4206055
2710D206055J31193J06660J66684J59842J63648J80185J97436K07642K15074K58128
$$ 4206055 4337248 4443908 4610592 4770434 4934082 5114267 5311703 5519345 5734419 5992547
2700E992547K98224L19944L37992M23839M62240M54573N04335N43124O52735Q04744
$$ 5992547 6290771 6610715 6948707 7372546 7834786 8289359 8793694 9336818 9989553 10794297
2690A0794297R92358J204979J149534R57757J180532J119644J187977R98559r11682
$$ 10794297 11786655 12991634 14141168 15098925 16279457 17399101 18587078 19585637 18673955
2681A8673955j638618j090781q73876p44465o06476m94289l57222k38167l01098
$$ 18673955 17035337 15944556 15070680 14326215 13719739 13225450 12868228 12630061 12328963
2672A2328963k98075k12129j45782j11578j11259m7265j8982l4049k2318k6881
$$ 12328963 12030888 11818759 11672977 11561399 11450140 11402875 11383893 11349844 11327526 11300645
2662A1300645l0116o644l8410j1719m6699j0484n9557n5660n3191j04633o9692
$$ 11300645 11270529 11263885 11225475 11213756 11167057 11156573 11097016 11041356 10988165 10883532 10813840
2651A0813840r5064r9351p3989j24923p9452r1358o1739r4048j11032p2498q8323
$$ 10813840 10718776 10619425 10545436 10420513 10341061 10249703 10187964 10093916 9982884 9910386 9822063
2640I822063j16960r7868j18375q1908q9469r7265j13510j06829q1120j18580
$$ 9822063 9705103 9607235 9488860 9406952 9317483 9220218 9106708 8999879 8918759 8800179
2630H800179j30951j46268j33618j56066j54030j69440j57812j68645j64515j60603
$$ 8800179 8669228 8522960 8389342 8233276 8079246 7909806 7751994 7583349 7418834 7258231
2620G258231j56297j91986j50589j47821j79000j19432j65411j31742j12724j29978
$$ 7258231 7101934 6909948 6759359 6611538 6432538 6313106 6147695 6015953 5903229 5773251
2610E773251j14291j07961j43658j14751j28833q3613j54453p3558j46369j09596
$$ 5773251 5658960 5550999 5407341 5292590 5163757 5080144 4925691 4852133 4705764 4596168
2600D596168j22852q6539j15500j05747j06600j14039q5539j01399o8463r6547
$$ 4596168 4473316 4386777 4271277 4165530 4058930 3944891 3859352 3757953 3689490 3592943
2590C592943r0703o8205p0263p0151p2244n9022l9583m8306l7998o3677k2730
$$ 3592943 3502240 3434035 3363772 3293621 3221377 3162355 3122772 3074466 3036468 2972791 2950061
2579B950061k0608l3977q186k2749j0900N605l0594J4838j0069K9422k6884n2366
$$ 2950061 2929453 2895476 2887290 2864541 2853641 2859246 2828652 2843490 2833421 2862843 2835959 2783593
2567B783593n0301m7325m2656k7666J6839k9555k8495j5138K1678j8879J8356
$$ 2783593 2733292 2685967 2643311 2615645 2632484 2602929 2574434 2559296 2580974 2562095 2580451
2556B580451K334Q436J9202m742K5639Q453M7267M355j1012N3476L8778K1577
$$ 2580451 2582785 2591221 2610423 2605681 2631320 2639773 2687040 2691395 2680383 2733859 2772637 2794214
2544B794214J8209P5315K9074N3464L1910M8772N7730O3278N2744P2235R2358
$$ 2794214 2812423 2887738 2916812 2970276 3002186 3050958 3108688 3171966 3224710 3296945 3389303
2533C389303N3539Q7689Q8633R5363J09359J07406J66563J46967J30476J72511
$$ 3389303 3442842 3530531 3619164 3714527 3823886 3931292 4097855 4244822 4375298 4547809
2523D547809J46362K08564J64597J66819J77018J50543J73625J74994J46523K14143
$$ 4547809 4694171 4902735 5067332 5234151 5411169 5561712 5735337 5910331 6056854 6270997
2513F270997K04028K14008K04393K67244K08662K29069K22274K21646K09775K00529
$$ 6270997 6475025 6689033 6893426 7160670 7369332 7598401 7820675 8042321 8252096 8452625
2503H452625K04970J92551J79102K08568J73749K19850K18605K04435K24700K25273
$$ 8452625 8657595 8850146 9029248 9237816 9411565 9631415 9850020 10054455 10279155 10504428
2493A0504428K41075J84795K55681K15566J82495K18662K11016K33215J94583
$$ 10504428 10745503 10930298 11185979 11401545 11584040 11802702 12013718 12246933 12441516
2484A2441516J72082J33913J65796R6919P7148r800m8025o7043q3865j09527j69990
$$ 12441516 12613598 12747511 12913307 13010226 13087374 13077574 13029549 12962506 12878641 12769114 12599124
2473A2599124j91439j33776j41635j67185j84417j43180j49049j22767j50587
$$ 12599124 12407685 12273909 12132274 11965089 11780672 11637492 11488443 11365676 11215089
2464A1215089j49841j51173j97717j60040j89966j83839j74289k26317k06589
$$ 11215089 11065248 10914075 10716358 10556318 10366352 10182513 10008224 9781907 9575318
2455I575318k00165k28138k25065k06990k57588j95715k66868k60016k11813k66434
$$ 9575318 9375153 9147015 8921950 8714960 8457372 8261657 7994789 7734773 7522960 7256526
2445G256526k07771k20428k30081k24682j88340j90013j91385j84228j73385j59055
$$ 7256526 7048755 6828327 6598246 6373564 6185224 5995211 5803826 5619598 5446213 5287158
2435E287158j35017j35971j38791j14968j26618j09489j07598r1481j17435j06190
$$ 5287158 5152141 5016170 4877379 4762411 4635793 4526304 4418706 4327225 4209790 4103600
2425D103600j42872j41363j12302j44786j24472j06935r8443j29582p0521r5367
$$ 4103600 3960728 3819365 3707063 3562277 3437805 3330870 3232427 3102845 3032324 2936957
2415B936957r0672o8079o3765p5760p0651k1247n4906q8008m0549p905n2613n749
$$ 2936957 2846285 2778206 2714441 2638681 2568030 2546783 2491877 2403869 2363320 2355415 2302802 2297053
2403B297053l3542o8626k7206j2099l2367m3694m3850j8301m1543m8787o2461
$$ 2297053 2263511 2194885 2167679 2155580 2123213 2079519 2035669 2017368 1975825 1927038 1864577
2392A864577n2323j5192n9895j5805o5831j8721m0010j0248k4167m4780j9782
$$ 1864577 1812254 1797062 1737167 1721362 1655531 1636810 1596800 1586552 1562385 1517605 1497823
2381A497823m3022J0777m0328r623j4220p625l6490k2851k4091l514m8353O925
$$ 1497823 1454801 1465578 1425250 1415627 1401407 1393782 1357292 1334441 1310350 1306836 1258483 1265408
2369A265408n0974k0196l7769j9210j958j62k9760m1264O484K1211j2586m0735
$$ 1265408 1214434 1194238 1156469 1137259 1135301 1135139 1105379 1064115 1070599 1091810 1079224 1038489
2357A038489n469j7621P397j0175m3702P057R397r34k6925K1521P875j7128J322
$$ 1038489 1033020 1015399 1022796 1012621 968919 975976 985373 984439 957514 979035 986910 969782 971104
2344I71104k1087J4803k0297K5076J1960l602M939l20k1590J9176J6287K7633
$$ 971104 950017 964820 944523 969599 981559 977957 982896 982576 960986 980162 996449 1024082
2332A024082J1111P714q864J1574M1950K2434K8753Q664L1284L3391L8726M1563
$$ 1024082 1035193 1042907 1034043 1045617 1087567 1110001 1138754 1147418 1178702 1212093 1250819 1292382
2320A292382O2761J14028O8097J02327J51128J49012J61910J84049K57411K67332
$$ 1292382 1355143 1469171 1537268 1639595 1790723 1939735 2101645 2285694 2543105 2810437
2310B810437M07267M64819M85557M34471M42203N15954M40460L18948k70262p43205
$$ 2810437 3217704 3682523 4168080 4602551 5044754 5560708 6001168 6320116 6049854 5306649
2300E306649n91185m60940l95131l25799k68125k00120j13259j70952r1707j00597
$$ 5306649 4715464 4254524 3859393 3533594 3265469 3065349 2952090 2781138 2689431 2588834
2290B588834q3732o2224k3165l7689o4674j58422j16351j28919j02340o7789j01290
$$ 2588834 2505102 2442878 2419713 2382024 2317350 2158928 2042577 1913658 1811318 1743529 1642239
2279A642239l2205l0406j2208n9478k9649m658J5177j2066j864k9027K2889K4308
$$ 1642239 1610034 1579628 1567420 1507942 1478293 1473635 1488812 1476746 1474882 1445855 1468744 1493052
2267A493052M6706P5133J15101J01333Q9778Q2871J11586Q9194R5051p3866k25597
$$ 1493052 1539758 1614891 1729992 1831325 1921103 2003974 2115560 2204754 2299805 2225939 2000342
2256B000342j70277j21673j12554r4108q0856k1656m4016k3136l0336l9214R633
$$ 2000342 1830065 1708392 1595838 1501730 1420874 1399218 1355202 1332066 1301730 1262516 1272149
2245A272149K951p2831l5307k3189k0803m2038L2066J5196K3222L6402L0969O4016
$$ 1272149 1275100 1202269 1166962 1143773 1122970 1080932 1112998 1128194 1151416 1187818 1218787 1282803
2233A282803O4140O846J8507q5710j06891p0128n8829o6204k7450o2427j9692
$$ 1282803 1346943 1353789 1372296 1286586 1179695 1109567 1050738 984534 957084 894657 874965
2222H74965k0917m2942J2019j7691l0499k2336m7505j3306l2719o593j4730n4104
$$ 874965 854048 811106 823125 805434 774935 752599 705094 691788 659069 652476 637746 583642
2210E83642n098m5615j3446j8319Q189j3945k2573m345j0691Q86k1349o048M402
$$ 583642 578544 532929 519483 501164 509353 495408 472835 468490 457799 458685 437336 431288 435690
2197D35690k7781m267m436P927j4350N218m3642K5372j4700j0748K45L487j9431
$$ 435690 407909 403642 399206 407133 392783 398001 354359 379731 365031 354283 354528 358015 338584
2184C38584p220j2485Q293m3699J1294o067j0597R643j4442M9120k3694k5786
$$ 338584 331364 318879 327172 283473 294767 288700 278103 287746 273304 322424 298730 272944
2172B72944J0278K192k6945K8404r704j6832J699K318k2181J0768k271q076q922
$$ 272944 283222 285414 258469 286873 277169 260337 262036 264354 242173 252941 250670 242594 233672
2159B33672J0213O989k3268J3278m084k1677K4012j9136k148j2535K1884j8525
$$ 233672 243885 250874 227606 240884 236800 215123 239135 219999 217851 205316 227200 208675
2147B08675R97N260J7483k7193J7112k4547J5011O408O05m4212J251M5525o107
$$ 208675 209672 214932 232415 205222 222334 197787 212798 219206 219811 175599 176850 222375 216268
2134B16268K42m4360K7859j1055K5330j1323m061k1120J7495k1942K4253k0961
$$ 216268 216510 172150 200009 188954 214284 202961 198900 177780 195275 173333 197586 176625
2122A76625J3493q137o66Q975k5730L2019o898j4270l154L3060K81j8388J9080
$$ 176625 190118 181981 181315 190290 164560 196579 189681 175411 172257 205317 205598 187210 206290
2109B06290l3790J5864M745j7240J6226m0304M1887l2607N028K8655j0731k4144
$$ 206290 172500 188364 193109 175869 192095 151791 193678 161071 166099 194754 184023 159879
2097A59879N0172j7630J797j4501j2363j881n262L0688k2229J8288j6368j5621
$$ 159879 210051 192421 194218 179717 167354 165473 160211 190899 168670 186958 170590 154969
2085A54969J5138k8375M680K6330o156p876P496j5761J0554j9703K0062j5537
$$ 154969 170107 141732 146412 172742 166586 158710 166206 150445 160999 141296 161358 145821
2073A45821m634j8163K3610k360Q679o710o776M995K741j6889N5472n1369J2356
$$ 145821 141187 123024 146634 144274 152953 146243 139467 144462 147203 130314 185786 134417 146773
2060A46773J1439l90l0914L8130M858j7609J106j2461K0162l7761L697K2359p741
$$ 146773 158212 157822 126908 165038 169896 152287 153393 140932 161094 123333 127030 149389 141648
2047A41648j3605L681j37k0662K5537p953Q960j0177r364L859p786P083J0016
$$ 141648 128043 131724 131587 110925 136462 128509 137469 127292 117928 121787 114001 121084 131100
2034A31100k0506j2881J4371n255j4803J2698K2549l6996N1269j2336j676l3226
$$ 131100 110594 97713 112084 106829 92026 104724 127273 90277 141546 129210 127534 94308
2022I4308K2212J5941k1999Q320j7885K8498l091j2557j7691P863j466J8181k2195
$$ 94308 116520 132461 110462 118782 100897 129395 126304 113747 96056 103919 102453 120634 98439
2009I8439m086J9465p9O354n180l9457M1961k4376K4642O653n923k1937J053j869
$$ 98439 94353 113818 113739 120093 114913 75456 117417 93041 117683 124336 118413 96476 97529 95660
1995I5660K075r867q137P2O608p493P348r638m380L958O918J0997m532L951j9482
$$ 95660 97735 87868 79731 79803 86411 78918 86266 76628 72248 76206 83124 94121 89589 93540 74058
1980G4058R509k1644R601q413O12L760l022L982J8634k8595j8910L7718l4289
$$ 74058 83567 61923 71524 63111 63723 67483 64461 68443 87077 58482 39572 77290 43001
1967D3001J4896j0160O029J392Q90J6776k5107p151J1962j2004N370n008l2539
$$ 43001 57897 47737 53766 55158 56048 72824 47717 40566 52528 40524 45894 40886 8347
1954H347M7926m802j1342J1382k8526K6711k5316K538j0196J6656k0399J7219
$$ 8347 56273 51471 40129 51511 22985 49696 24380 26918 16722 33378 12979 30198
1942C0198J2039k9417Q227Q674L861j2096K7650m141j9177j5536K1063J0781j7129
$$ 30198 42237 12820 21047 29721 33582 21486 49136 44995 25818 10282 31345 42126 24997
1929B4997n280J0028l957k649M820j758P238j1470M314j9338j33k33J9956k3761
$$ 24997 19717 29745 25788 23139 27959 26201 33439 21969 26283 6945 6812 6579 26535 2774
1915B774O70q6K2333o885n965M252R457o902j92P2J0075p733j1252j0488J3297
$$ 2774 3444 3358 25691 18806 12841 17093 26550 19648 19456 19528 29603 21870 10618 130 13427
1900A3427P614o162j3171K737m299K2110l641j9804L3777r380r450k1169K2436
$$ 13427 21041 14879 1708 4445 146 22256 18615 -1189 32588 23208 13758 -7411 15025
1887A5025J9143j5689o965j3452j6193K4526p960J5314k2414Q963l057r68J1859
$$ 15025 34168 18479 11514 -1938 -18131 6395 -1565 13749 -8665 298 -2759 -3727 8132
1874H132k824j9593J1651m065M147J307J8500o073K226L99k8861N910O033j8429
$$ 8132 5308 -14285 -2634 -6699 -2552 -1245 17255 11182 13408 13807 -15054 -9144 -3111 -21540
1860b1540o756K1827m128J4587m101J1586o317k2586L0753j2085m263J4946k2229
$$ -21540 -28296 -6469 -10597 3990 -111 11475 5158 -17428 13325 1240 -3023 11923 -10306
1847a0306J8104k4623J1162J3409k4180P321J0834j1013J9517j9409j6372L5007
$$ -10306 7798 -16825 -5663 7746 -16434 -9113 1721 -9292 10225 -9184 -25556 9451
1835I451p783M332j6325K302J5575j1916J3153j2839M014K163Q831j6636J097
$$ 9451 1668 6000 -10325 -8023 7552 -4364 8789 -4050 -36 2127 10958 -5678 -4581
1822d581k3852K1686q948J2772k1607N282L4790k5737L971O493j6835j2048K5756
$$ -4581 -28433 -6747 -15695 -2923 -24530 -19248 15542 -10195 -6224 269 -16566 -28614 -2858
1809b858k170n371J1122l9394L1147K811l742r302p039J4945J0462J3312k4833
$$ -2858 -5028 -10399 723 -38671 -7524 -4713 -8455 -17757 -24796 -9851 611 13923 -10910
1796a0910q115N274J4437n769k0119L352N08K505K0935k3893M3918m1810r875
$$ -10910 -19025 -13751 686 -5083 -25202 -21850 -21342 -18837 2098 -21795 22123 -19687 -29562
1783b9562K19K0345j5897J167J7663k3666J812K9295k2089K3721k4361O691K3670
$$ -29562 -29343 -8998 -24895 -23728 -6065 -29731 -27919 1376 -20713 3008 -21353 -14662 9008
1770I008j7751k348J599M213j6950K4452q398j0806N414Q103l68k6672L1754M046
$$ 9008 -8743 -11091 -9492 -5279 -22229 2223 -6175 -16981 -11567 -3464 -3832 -30504 1250 5296
1756E296o502N417l1142O080l196K1205K502j4946j2778K5179j5961J7066j4559
$$ 5296 -1206 4211 -26931 -20851 -24047 -2842 -340 -15286 -28064 -2885 -18846 -1780 -16339
1743a6339O229N929j2210k0666L2948j4311j4805K362k411J8124J4324R54Q25
$$ -16339 -10110 -4181 -16391 -37057 -4109 -18420 -33225 -30863 -33274 -15150 -826 128 953
1730I53q008j2403J8549j7011j796P109j1171k723J0353J3268k6906K1092p588
$$ 953 -7055 -19458 -909 -17920 -19716 -12607 -23778 -26501 -16148 -2880 -29786 -8694 -16282
1717a6282P888l029k4523L2844j0967K6948l5783K7052j0624Q043l0288O417m460
$$ -16282 -8394 -11423 -35946 -3102 -14069 12879 -22904 4148 -6476 1567 -28721 -22304 -26764
1704b6764M784M330j1182L0987k4207O634r588K262M479J1263o284K112R124l1480
$$ -26764 -21980 -17650 -28832 2155 -22052 -15418 -25006 -22744 -18265 -7002 -13286 -11174 -2050 -33530
1690c3530J9469J1978k6519N948n061j115N923k374P089k4645M2460j2803k9771
$$ -33530 -14061 -2083 -28602 -22654 -27715 -28830 -22907 -25281 -18192 -42837 -377 -13180 -42951
1677d2951M862J3852P06Q294J7302k6594j6588K4813j679N541l308n430K9738
$$ -42951 -38089 -24237 -23531 -15237 2065 -24529 -41117 -16304 -17983 -12442 -15750 -21180 8558
1664H558j7553m85n64Q865L712r743J7736k4643J4591k3627K1501K6014k5556
$$ 8558 -8995 -9480 -10044 -1179 2533 -7210 10526 -14117 474 -23153 -1652 24362 -1194
1651a194J6726J6655k8776J5159q299R565k1190J2875k9175n724K6029p714R501
$$ -1194 15532 32187 3411 18570 10271 19836 -1354 11521 -17654 -23378 2651 -5063 4438
1638D438q009J585l978j1552r838J0387r495L2640r927q950N252J1238k1581L3177
$$ 4438 -3571 -1986 -5964 -17516 -27354 -16967 -26462 6178 -3749 -12699 -7447 3791 -17790 15387
1624A5387o150m0299K8824j0157K5226m8374L1776k0845p528J7278P833n349J2813
$$ 15387 9237 -31062 -2238 -12395 12831 -35543 -3767 -24612 -32140 -14862 -7029 -12378 435
1611D35j8312j587j9325M0280l9602J5143K4444o957n023j3495J7180Q01m606
$$ 435 -17877 -19464 -38789 1491 -38111 -22968 1476 -5481 -10504 -23999 -6819 -6018 -10624
1598a0624J4009k4362j435j8146L7401j8369k612P514L231J2262j5013K2852j4572
$$ -10624 3385 -20977 -22412 -40558 -3157 -21526 -24138 -16624 -13393 -1131 -16144 6708 -7864
1585g864J5668j0936r675J7261k4975K5983l2487K9951o260J1419j9862J4446
$$ -7864 7804 -3132 -12807 4454 -20521 5462 -27025 2926 -3334 8085 -11777 2669
1573B669K4379m4285K864J6866j0349o824R38q929L0720j3041N825Q275j9640
$$ 2669 27048 -17237 -14373 2493 -7856 -14680 -13742 -22671 8049 -4992 833 9108 -10532
1560a0532K7238r756o832j703n939J9844j101q069n405J5772p727J632j2971Q402
$$ -10532 16706 6950 118 -1585 -7524 12320 11219 3150 -2255 13517 5790 7422 -5549 2853
1546B853K132J4352n366j4964J2451k3496j0589L2591K079J4386j0199Q302l1433
$$ 2853 4985 19337 13971 -993 11458 -12038 -22627 9964 12043 26429 16230 24532 -6901
1533f901L311J5978J1570N53j9619Q278K120k3382K7156k562r150J36L557K1094
$$ -6901 -3590 12388 23958 24511 4892 13170 15290 -8092 19064 16502 7352 7488 11045 32139
1519C2139l507j3195n735L707j1851K7686L074j6294L0010j5878n050M816j7349
$$ 32139 28632 15437 9702 13409 1558 29244 32318 16024 46034 30156 25106 29922 12573
1506A2573R709J2753j9806j346J290J9689J2473j783j0434r784K6061k1477K587
$$ 12573 22282 35035 15229 13883 15173 34862 47335 45552 35118 25334 51395 29918 32505
1493C2505P864l4659R766K0704M597k8563N327L8695k295L981j9524J6141K2066
$$ 32505 40369 5710 15476 36180 40777 12214 17541 56236 53941 57922 38398 54539 76605
1480G6605j3311j2942M245K6612L771P601l382J31l638L2003K147j5410k2841
$$ 76605 63294 50352 54597 81209 84980 92581 89199 89330 85692 117695 119842 104432 81591
1467H1591L4552k8506K4809J3222N400K4825l6800M5480J918m494L0843k7550
$$ 81591 116143 87637 112446 125668 131068 155893 119093 164573 166491 161997 192840 165290
1455A65290K4667R907J4425j2542N4293q321K1047K6375M1668q103R189L1129
$$ 165290 189957 199864 214289 201747 256040 247719 268766 295141 336809 328706 337895 369024
1443C69024O1494J1673L8145M5373M0731N1863P9359O6864O5276J15147J18974
$$ 369024 430518 442191 480336 525709 566440 618303 697662 764526 829802 944949 1063923
1432A063923J46017J69660J54358J62192J82987K29355L47221M18117N77040N71517
$$ 1063923 1209940 1379600 1533958 1696150 1879137 2108492 2455713 2873830 3450870 4022387
1422D022387M64831N42551N65930N90612N36577l57217r76888o78564n49512m78074
$$ 4022387 4487218 5029769 5595699 6186311 6722888 6365671 5388783 4710219 4160707 3682633
1412C682633m31293l28163k69887k02593j89987j97162j50546j58082j58091q0302
$$ 3682633 3251340 2923177 2653290 2450697 2260710 2063548 1913002 1754920 1596829 1516527
1402A516527j29159q9928r7226n9071r0722p1811l4531n5363n0983n2269m3468
$$ 1516527 1387368 1297440 1200214 1141143 1050421 978610 944079 888716 837733 785464 741996
1391G41996j2298m1399k7030k9264k2628m3240Q589k2075j4612L254l4041l126
$$ 741996 729698 688299 661269 632005 609377 566137 574726 552651 538039 541293 507252 504126
1379E04126j1757j0297k3128k3180j5983j6737j7058l3375j3297k2805k1557M680
$$ 504126 492369 482072 458944 435764 419781 403044 385986 352611 339314 316509 294952 299632
1367B99632l0763J2169k0221j4469J0477k2753j3711j4393j5464L0643k0954p629
$$ 299632 268869 281038 260817 246348 256825 234072 220361 205968 190504 221147 200193 192564
1355A92564j1106L401r883R21P683p887j6630k2502J9703k5750P76J008m046m130
$$ 192564 181458 184859 174976 175897 183580 175693 159063 136561 156264 130514 131290 132298 128252 124122
1341A24122K911p951L18p19k6237K795J8068l722k1151O147J6264m1958M3942
$$ 124122 127033 119082 119400 118681 92444 95239 113307 109585 88434 94581 110845 68887 112829
1328A12829k5907J8850k3486J9167j5562K6081k8496o300N489j7941J5179J2559
$$ 112829 86922 105772 82286 101453 85891 111972 83476 77176 82665 64724 79903 92462
1316I2462o830L337J2420l4641M168Q31k0911R593q772J8624q526n25j3512K305
$$ 92462 85632 88969 101389 66748 70916 71747 50836 60429 51657 70281 61755 61230 47718 50023
1302E0023o456o271J6519j065l3743M773j399Q608r51K81J6421l4844K966l442
$$ 50023 43567 37296 53815 52750 19007 23780 22381 30989 30038 30319 46740 11896 14862 11420
1288A1420L7364l1352K6863l562k8352L9193l3547K1526m408r794q704J5873k7520
$$ 11420 48784 17432 44295 40733 12381 51574 18027 39553 35145 25351 16647 32520 5000
1275E000K0639J4124j4346J701j9686J8898j5237N974k909j3025J091j6181L2421
$$ 5000 25639 39763 25417 27118 7432 26330 11093 17067 14158 1133 2224 -13957 18464
1262A8464n200k7631K3555J1115j2479J252J937N592M981j3244p58M216J6397
$$ 18464 13264 -14367 9188 20303 7824 9076 11013 16605 21586 8342 7584 11800 28197
1249B8197l0625J1842P505j9291K2398p295o075M758l7319J9349N394r80O522
$$ 28197 -2428 9414 16919 -2372 20026 12731 6656 11414 -25905 -6556 -1162 -2142 4380
1236D380m927J4454j3392j4626O123J1981p019j5695R336J2754P277j1187j0400
$$ 4380 -547 13907 515 -14111 -7988 3993 -3026 -18721 -9385 3369 10646 -541 -10941
1223a0941J8394p455J6322l9461J7809j0497J3872j951J1910n340p608K7378l9682
$$ -10941 7453 -2 16320 -23141 -5332 -15829 -1957 -3908 8002 2662 -4946 22432 -17250
1210a7250L2039l3756R331M829j8994K134Q500R274m193K786k4316L7450k5674
$$ -17250 14789 -18967 -9636 -4807 -23801 -21667 -13167 -3893 -8086 -5300 -29616 7834 -17840
1197a7840R699J7270j2159J7251J2361l5820K260M100J7040J0906k0678J2184
$$ -17840 -8141 9129 -3030 14221 26582 -9238 -6978 -2878 14162 25068 4390 16574
1185A6574j7694K9057j9438J8426j086p820q821p847L234j0624L558l7054L6605
$$ 16574 -1120 27937 8499 26925 25839 18019 9198 1351 4585 -6039 -2481 -39535 -2930
1172b930j8609K4948j3120k090K3881l2962L3978j1435J556N316m0228J4213L555
$$ -2930 -21539 3409 -9711 -11801 12080 -20882 13096 1661 3217 8533 -31695 -17482 -13927
1159a3927j0291K7472J9678m0842l935J5652j2283K530R082K759j3084p794Q447
$$ -13927 -24218 3254 22932 -17910 -21845 -6193 -18476 -15946 -6864 -4105 -17189 -24983 -16536
1146a6536J5957r797k7887L1493k720n608L68O165j5882P328J2386m052J5414
$$ -16536 -579 -10376 -38263 -6770 -9490 -15098 -14730 -8565 -24447 -17119 -4733 -8785 6629
1133F629l1079P621N78M183J0393j2048r536J0097L642J6040k8037J4535q481
$$ 6629 -24450 -16829 -16251 -12068 -1675 -13723 -23259 -13162 -9520 6520 -21517 -6982 -15463
1120a5463p558N457k387J6965K480k2121J3319J0151q109o420o836J609J866q306
$$ -15463 -23021 -17564 -19951 -2986 -506 -22627 -9308 843 -7266 -13686 -20522 -18913 -17047 -25353
1106b5353J6849J0106k2948L0880l1633m227Q571j8456R16J3098j8502K8097J4419
$$ -25353 -8504 1602 -21346 9534 -22099 -26326 -17755 -36211 -35295 -22197 -40699 -12602 1817
1093A817p420l881m746L9578n2576N605j1707K298K825K5227J738j9349q110J0069
$$ 1817 -5603 -9484 -14230 25348 -27228 -21623 -33330 -31032 -28207 -2980 -1242 -20591 -28701 -18632
1079a8632P837O692m4753K7625N501J579J074M862L063o401j278o04P828j3332
$$ -18632 -10795 -4103 -48856 -21231 -15730 -14151 -13077 -8215 -5152 -11553 -12831 -13435 -5607 -18939
1065a8939j2097J9352q436k131N022j0481J1237r475P613L259K6519k0535j4546
$$ -18939 -31036 -11684 -20120 -22251 -17229 -27710 -16473 -25948 -18335 -15076 11443 -9092 -23638
1052b3638k242j308O21j0193L5322q522j5126k7421K6368K3389k3726J7797J419
$$ -23638 -25880 -27188 -26567 -36760 -1438 -9960 -25086 -52507 -26139 -2750 -26476 -8679 -7260
1039g260j0526Q726J955m152j9792j5884K5274K3385k9373P623J3744R160l0403
$$ -7260 -17786 -9060 -7105 -11257 -31049 -46933 -21659 1726 -27647 -20024 -6280 2880 -27523
$$ [...]
##END NTUPLES=NMR SPECTRUM
##END=
