##TITLE=abcd
##JCAMPDX= 6.0         $$ Bruker NMR JCAMP-DX V2.0
##DATA TYPE= NMR SPECTRUM
##DATA CLASS= NTUPLES
##ORIGIN= UXNMR, Bruker Analytische Messtechnik GmbH
##OWNER= root
$$ XWIN-NMR		Version 3.5
$$ Wed Oct 15 17:43:14 2025 Russian Standard Time (UT+4h)  servis@DPX200
##.OBSERVE FREQUENCY= 200.131235884673
##.OBSERVE NUCLEUS= ^1H
##.ACQUISITION MODE= SIMULTANEOUS
##.ACQUISITION SCHEME= undefined
##.AVERAGES= 32
##.DIGITISER RES= 18
##SPECTROMETER/DATA SYSTEM= spect
##.PULSE SEQUENCE= zg
##.SOLVENT NAME= DMSO
##.SHIFT REFERENCE= (INTERNAL, DMSO, 0, 16.4885)
##AUDIT TRAIL= $$ (NUMBER, WHEN, WHO, WHERE, WHAT)
$$ ##TITLE= Audit trail, XWIN-NMR		Version 3.5
$$ ##JCAMPDX= 5.01
$$ ##ORIGIN= Bruker BioSpin GmbH
$$ ##OWNER= servis
$$ F:\spectra/data/av/nmr/H1/1/pdata/1/auditp.txt
$$ ##AUDIT TRAIL=  $$ (NUMBER, WHEN, WHO, WHERE, WHAT)
(   1,<2025-10-15 17:42:40.42 +0400>,<servis>,<DPX200>,
      <created by zg, POWCHK disabled, PULCHK disabled
       configuration hash MD5:
       00 E9 B6 7A A2 85 ED C7 34 08 36 98 17 FE 4E 26
       data hash MD5: 32K
       CE 96 DA 9C 15 57 81 45 FB 64 72 C2 5A 50 3F DD>)
(   2,<2025-10-15 17:42:57.35 +0400>,<servis>,<DPX200>,
      <Start of raw data processing
       efp BC_mod = 2 LB = 0.05 FT_mod = 6 PKNL = 1 PHC0 = -274.2701 PHC1 = 2.101565 SI = 16K 
       data hash MD5: 16K
       F7 1B 30 F0 56 A9 41 AC 42 6D 98 D0 65 A8 36 2B>)
$$ ##END=
$$ 
$$ hash MD5
$$ 67 66 DE 3C 0D 4A DB B5 62 F9 2B 3A 72 6B 37 E9
##$RELAX= 
##$RELAX= 
##$RELAX= 
##$RELAX= 
##$RELAX= 
##$RELAX= 
##$RELAX= 
##$RELAX= 
$$ Bruker specific parameters
$$ --------------------------
##$DU= <F:\spectra>
##$EXPNO= 1
##$NAME= <H1>
##$PROCNO= 1
##$TYPE= <nmr>
##$USER= <av>
##$AMP= (0..31)
100 100 100 100 100 100 100 100 100 100 100 100 100 100 100 100 100 100 
100 100 100 100 100 100 100 100 100 100 100 100 100 100 
##$AQSEQ= 0
##$AQ_mod= 1
##$AUNM= <au_zg>
##$AUTOPOS= <>
##$BF1= 200.13
##$BF2= 200.13
##$BF3= 200.13
##$BF4= 200.13
##$BF5= 500.13
##$BF6= 500.13
##$BF7= 500.13
##$BF8= 500.13
##$BYTORDA= 1
##$CFDGTYP= 0
##$CFRGTYP= 5
##$CHEMSTR= <none>
##$CNST= (0..31)
1 1 145 1 1 1 1 1 1 1 1 1 1 1 1 1 1 1 1 1 1 1 1 1 1 1 1 1 1 1 1 1 
##$CPDPRG= <>
##$CPDPRG1= <>
##$CPDPRG2= <>
##$CPDPRG3= <>
##$CPDPRG4= <mlev>
##$CPDPRG5= <mlev>
##$CPDPRG6= <mlev>
##$CPDPRG7= <mlev>
##$CPDPRG8= <mlev>
##$CPDPRGB= <>
##$CPDPRGT= <>
##$D= (0..31)
0 2 0 0 0 0 0 0 0 0.06 0 0 0 0 0 0 0.0002 0 0 0 0 0 0 0 0 0 0 0 0 0 0 
0 
##$DATE= 1760535759
##$DBL= (0..7)
120 120 120 120 120 120 120 120 
##$DBP= (0..7)
150 150 150 150 150 150 150 150 
##$DBP07= 0
##$DBPNAM0= <>
##$DBPNAM1= <>
##$DBPNAM2= <>
##$DBPNAM3= <>
##$DBPNAM4= <>
##$DBPNAM5= <>
##$DBPNAM6= <>
##$DBPNAM7= <>
##$DBPOAL= (0..7)
0.5 0.5 0.5 0.5 0.5 0.5 0.5 0.5 
##$DBPOFFS= (0..7)
0 0 0 0 0 0 0 0 
##$DE= 6
##$DECBNUC= <off>
##$DECIM= 32
##$DECNUC= <off>
##$DECSTAT= 4
##$DIGMOD= 1
##$DIGTYP= 9
##$DL= (0..7)
0 120 120 120 120 120 120 120 
##$DP= (0..7)
150 150 150 150 150 150 150 150 
##$DP07= 0
##$DPNAME0= <>
$$ [...]
##$SUBNAM4= <"">
##$SUBNAM5= <"">
##$SUBNAM6= <"">
##$SUBNAM7= <"">
##$SUBNAM8= <"">
##$SUBNAM9= <"">
##$SW= 20.6817932712277
##$SWIBOX= (0..15)
0 0 3 0 0 0 0 0 0 0 0 0 0 0 0 0 
##$SW_h= 4139.07284768212
##$TD= 32768
##$TD0= 1
##$TE= 0
##$TE2= 300
##$TE3= 300
##$TEG= 300
##$TL= (0..7)
0 120 120 120 120 120 120 120 
##$TP= (0..7)
150 150 150 150 150 150 150 150 
##$TP07= 0
##$TPNAME0= <>
##$TPNAME1= <>
##$TPNAME2= <>
##$TPNAME3= <>
##$TPNAME4= <>
##$TPNAME5= <>
##$TPNAME6= <>
##$TPNAME7= <>
##$TPOAL= (0..7)
0.5 0.5 0.5 0.5 0.5 0.5 0.5 0.5 
##$TPOFFS= (0..7)
0 0 0 0 0 0 0 0 
##$TUNHIN= 0
##$TUNHOUT= 0
##$TUNXOUT= 0
##$USERA1= <user>
##$USERA2= <user>
##$USERA3= <user>
##$USERA4= <user>
##$USERA5= <user>
##$V9= 5
##$VALIST= <valist>
##$VCLIST= <CCCCCCCCCCCCCCC>
##$VD= 0
##$VDLIST= <DDDDDDDDDDDDDDD>
##$VPLIST= <PPPPPPPPPPPPPPP>
##$VTLIST= <TTTTTTTTTTTTTTT>
##$WBST= 1024
##$WBSW= 30
##$XGAIN= (0..3)
0 0 0 0 
##$XL= 0
##$YL= 0
##$YMAX_a= 242215
##$YMIN_a= -191950
##$ZGOPTNS= <>
##$ZL1= 120
##$ZL2= 120
##$ZL3= 120
##$ZL4= 120
##$ABSF1= 0
##$ABSF2= 0
##$ABSG= 0
##$ABSL= 0
##$ALPHA= 0
##$AQORDER= 0
##$ASSFAC= 0
##$ASSFACI= 0
##$ASSFACX= 0
##$ASSWID= 0
##$AUNMP= <proc_1d>
##$AZFE= 0.1
##$AZFW= 0.1
##$BCFW= 0
##$BC_mod= 2
##$BYTORDP= 0
##$COROFFS= 0
##$CY= 18.4799938201904
##$DATMOD= 1
##$DC= 0
##$DFILT= <>
##$DTYPP= 0
##$F1P= 9.9274215381318
##$F2P= -0.165520771350173
##$FCOR= 1
##$FTSIZE= 16384
##$FT_mod= 6
##$GAMMA= 0
##$GB= 0
##$INTBC= 1
##$INTSCL= 4.127829e-11
##$ISEN= 128
##$LB= 0.05
##$LEV0= 0
##$LPBIN= 0
##$MAXI= 10000
##$MC2= 0
##$MEAN= 0
##$ME_mod= 0
##$MI= 50
##$NCOEF= 0
##$NC_proc= -8
##$NLEV= 6
##$NOISF1= 3.799351
##$NOISF2= 2.8
##$NSP= 0
##$NTH_PI= 0
##$NZP= 0
##$OFFSET= 16.48848
##$PC= 4
##$PHC0= -274.2701
##$PHC1= 2.101565
##$PH_mod= 1
##$PKNL= yes
##$PPARMOD= 0
##$PSCAL= 4
##$PSIGN= 0
##$REVERSE= no
##$SF= 200.130005582386
##$SI= 16384
##$SIGF1= 3
##$SIGF2= 2
##$SINO= 400
##$SIOLD= 16384
##$SREGLST= <1H.CDCl3>
##$SSB= 0
##$STSI= 16384
##$STSR= 0
##$SW_p= 4139.07284768211
##$SYMM= 0
##$S_DEV= 0
##$TDeff= 32768
##$TDoff= 0
##$TI= <>
##$TILT= no
##$TM1= 0
##$TM2= 0
##$TOPLEV= 0
##$USERP1= <user>
##$USERP2= <user>
##$USERP3= <user>
##$USERP4= <user>
##$USERP5= <user>
##$WDW= 1
##$XDIM= 16384
##$YMAX_p= 516128932
##$YMIN_p= -3078726
$$ End of Bruker specific parameters
$$ ---------------------------------
##NTUPLES= NMR SPECTRUM
##VAR_NAME=  FREQUENCY,     SPECTRUM/REAL,   SPECTRUM/IMAG
##SYMBOL=    X,             R,               I
##VAR_TYPE=  INDEPENDENT,   DEPENDENT,       DEPENDENT
##VAR_FORM=  AFFN,          ASDF,            ASDF
##VAR_DIM=   16384,         16384,           16384
##UNITS=     HZ,            ARBITRARY UNITS, ARBITRARY UNITS
##FACTOR=    0.252644378177508, 1,           1
##FIRST=     3299.83951724647, 0,            0
##LAST=      -839.233330435636, 0,           0
##MIN=       -839.233330435636, -3078726,    0
##MAX=       3299.83951724647, 516128932,    0
$$ Real data points
##PAGE= N=1
##DATA TABLE= (X++(R..R)), XYDATA
$$ [...]
$$ plain form
4018 44816254 45544767 46003290 47234394 48872381 49394344 50720724 51227799 52044791 53101069
4009 53101069 54311736 55148703 55728712 57455448 59646441 60557569 61522550 62892680 64442657
4000 64442657 65014233 66535965 68564678 70171375 71249707 72320915 73760026 75203287
3992 75203287 76522601 77959278 79028794 81191687 81622735 83828389 85614053 86633331
3984 86633331 87958114 89905563 91222719 92651840 94255131 95477510 96398571 97259423
3976 97259423 99338733 100196128 100405817 102535624 103676120 104349275 105092735 106794749 107527545
3967 107527545 108948773 109293674 110545415 110705228 111840190 113015555 113803680 114014216 114542849
3958 114542849 115096289 115015643 114860207 114306202 114431661 114185598 113885212 113188563 112090364
$$ packed form
4018D4816254P28513M58523J231104J637987N21963J326380N07075Q16992J056278
4009E3101069J210667Q36967N80009J726736K190993R11128R64981J370130J549977
4000F4442657N71576J521732K028713J606697J078332J071208J439111J443261
3992G5203287J319314J436677J069516K162893M31048K205654J785664J019278
3984H6633331J324783J947449J317156J429121J603291J222379R21061Q60852
3976I7259423K079310Q57395K09689K129807J140496O73155P43460J702014P32796
3967A07527545J421228L44901J251741J59813J134962J175365P88125K10536N28633
3958A14542849N53440q0646j55436n54005J25459k46063l00386o96649j098199
$$ plain form
3949 112090364 112334247 111689400 110909899 110285706 109244277 108117787 108274181 106729579 106766896
3940 106766896 105571511 104974513 104063028 104076711 102629624 102845453 101241902 100191352 98957674
3931 98957674 99363440 98334770 97537062 96931665 95573427 94284577 93247418 93429301 91654140
3922 91654140 91400566 90624009 89274196 88562104 87745017 86341035 85817866 83944581 84707536
3913 84707536 83407858 82071942 81948244 81411586 81898053 80945627 80760952 80410634 80324237
3904 80324237 80050264 79674933 79035369 79737030 79327272 79329637 79622108 79983601 80257060 81050704
3894 81050704 81357130 81486607 81322843 81795189 82154257 82241396 83953369 83957886 84990175 86012419
3884 86012419 86306932 87472881 88360933 89290306 89526047 90957919 92159280 93711933 94589581
$$ packed form
3949A12090364K43883o44847p79501o24193j041429j126490J56394j544602L7317
3940A06766896j195385n96998r11485J3683j447087K15829j603551j050550j233678
3931I8957674M05766j028670p97708o05397j358238j288850j037159J81883j775161
3922I1654140k53574p76557j349813p12092q17087j403982n23169j873285P62955
3913H4707536j299678j335916j23698n36658M86467r52426j84675l50318q6397
3904H0324237k73973l75331o39564P01661m09758K365K92471L61493K73459P93644
3894H1050704L06426J29477j63764M72346L59068Q7139J711973M517J032289J022244
3884H6012419K94513J165949Q88052R29373K35741J431872J201361J552653Q77648
$$ plain form
3875 94589581 95389959 97198236 97937905 99085598 100720528 102540339 104484645 106368010
3867 106368010 107457224 109471557 111027880 111824968 114227312 114832237 116423779 118768069
3859 118768069 119969432 121448229 123684819 125002187 126407102 127400464 129890862 131193553
3851 131193553 132233136 133633719 135220112 135727571 138208582 139155248 139302300 140773783
3843 140773783 142021952 143700493 143716369 144869807 144753473 145146162 145807084 146436346 146860274
3834 146860274 145692910 146797619 145923454 145233745 145641028 144805190 143597224 143485451 143090364
3825 143090364 142229328 141350852 141286569 139781590 139302861 137618532 136234289 136524171 135271097
3816 135271097 134744095 133536892 132700910 132092012 131376171 129458565 128382779 127985730 126260149
$$ packed form
3875I4589581Q00378J808277P39669J147693J634930J819811J944306J883365
3867A06368010J089214K014333J556323P97088K402344O04925J591542K344290
3859A18768069J201363J478797K236590J317368J404915R93362K490398J302691
3851A31193553J039583J400583J586393N07459K481011R46666J47052J471483
3843A40773783J248169J678541J5876J153438j16334L92689O60922O29262M23928
3834A46860274j167364J104709q74165o89709M07283q35838j207966j11773l95087
3825A43090364q61036q78476o4283j504979m78729j684329j384243K89882j253074
3816A35271097n27002j207203q35982o08898p15841j917606j075786l97049j725581
$$ plain form
3807 126260149 126198353 125171323 124091000 123514972 121739958 121563844 120382454 119214035 117992028
3798 117992028 117846955 117259017 115817305 115294034 113371657 113138525 112370012 111329364 111097110
3789 111097110 110121830 109100676 108677603 107878789 106838650 105005455 104611662 103322580 102866348
3780 102866348 101534306 100584172 98910012 98067837 97977358 95985306 94553164 93680091 92760320
3771 92760320 91932930 90328641 89262383 88599153 86769110 86117809 85131950 84420724 83392300
3762 83392300 82176390 81233813 80815998 79072160 78105897 76925835 76504963 75633282 74644054
3753 74644054 73949470 73335172 72824513 71034544 70576929 69145866 68868900 68690282 67997364
3744 67997364 67284031 66095727 66302949 65091741 64695828 64889891 64955491 64211691 64529810
$$ packed form
3807A26260149o1796j027030j080323n76028j775014j76114j181390j168419j222007
3798A17992028j45073n87938j441712n23271j922377k33132p68513j040648k32254
3789A11097110r75280j021154m23073p98814j040139j833195l93793j289082m56232
3780A02866348j332042r50134j674160q42175r0479j992052j432142q73073r19771
3771I2760320q27390j604289j066258o63230j830043o51301r85859p11226j028424
3762H3392300j215910r42577m17815j743838r66263j180062m20872q71681r89228
3753G4644054o94584o14298n10659j789969m57615j431063k76966j78618o92918
3744F7997364p13333j188304K07222j211208l95913J94063O5600p43800L18119
$$ plain form
3735 64529810 64098120 63529182 64059780 63550851 63812761 63318035 62704760 62776987 62933432 63189043
3725 63189043 62740494 62794373 62914773 63635678 63346991 63962875 64459791 64438724 64227782 65477357
3715 65477357 65486330 66314820 66324777 67139952 67486427 68360351 69273802 69880549 70181575 72355930
3705 72355930 71717837 73273438 73814443 73614888 74887235 75386951 75766737 76836286 77803089
3696 77803089 77281966 78621372 78998877 80319035 80490509 81847919 82597718 83507133 84605584
3687 84605584 85437525 86466149 87765576 88736575 89475029 90945061 92511148 94790692 96029455
3678 96029455 97062911 98284198 100082230 101879162 103057967 105399186 106857315 107229228
3670 107229228 108968667 111392088 113029326 115049710 116249759 117923119 119052968 121462749
$$ packed form
3735F4529810m31690n68938N30598n08929K61910m94726o13275P2227J56445K55611
3725F3189043m48549N3879J20400P20905k88687O15884M96916k1067k10942J249575
3715F5477357Q973Q28490R957Q15175L46475Q73924R13451O06747L01026K174355
3705G2355930o38093J555601N41005j99555J272347M99716L79786J069549R66803
3696G7803089n21123J339406L77505J320158J71474J357410P49799R09415J098451
3687H4605584Q31941J028624J299427R70999P38454J470032J566087K279544J238763
3678I6029455J033456J221287J798032J796932J178805K341219J458129L71913
3670A07229228J739439K423421J637238K020384J200049J673360J129849K409781
$$ plain form
3662 121462749 123763293 125405902 127081975 129526237 130814210 133489490 134698298 136968260
3654 136968260 138623605 140512797 142772346 144476287 145644005 148039579 148753122 151230730
3646 151230730 152157116 153833909 154679110 156842937 157639896 158304467 159904837 160329131 161754085
3637 161754085 161401303 161427509 161652736 162067633 161671167 160752733 160075428 159050551 158396434
3628 158396434 157464028 155754361 154310520 153122561 150758319 149385714 147127268 144948511
3620 144948511 142858831 141518936 138529812 137182606 133321479 131787289 129250700 126165649
3612 126165649 124195753 121947797 118813028 117038796 113882550 112396051 108887305 106989423
3604 106989423 104747407 101332641 100573088 98160890 96487329 93770142 91620731 89742776
$$ packed form
3662A21462749K300544J642609J676073K444262J287973K675280J208808K269962
3654A36968260J655345J889192K259549J703941J167718K395574P13543K477608
3646A51230730R26386J676793Q45201K163827P96959O64571J600370M24294J424954
3637A61754085l52782K6206K25227M14897l96466r18434o77305j024877o54117
3628A58396434r32406j709667j443841j187959k364242j372605k258446k178757
3620A44948511k089680j339895k989124j347206l861127j534190k536589l085051
3612A26165649j969896k247956l134769j774232l156246j486499l508746j897882
3604A06989423k242016l414766p59553k412198j673561k717187k149411j877955
$$ plain form
3596 89742776 88214983 86192073 84085178 82455596 81342546 80387547 78755018 77995440
3588 77995440 76281783 74890872 73748094 73004166 72039896 71537908 70705837 69786788 69360809
3579 69360809 68102989 67449941 66977566 66287657 64666274 64515977 63278107 62673564 62245430
3570 62245430 61203692 61050840 60265171 59792342 59600808 58594899 57699350 58449466 58679354
3561 58679354 58392788 58031013 57079387 57305919 56737107 56331384 55741686 55609219 54582352
3552 54582352 54543145 54078956 53164511 53121972 51344709 51204511 51095801 50108323 48187366
3543 48187366 47828478 46820023 45540365 44039052 43248614 43163649 42040848 41664366 40542115
3534 40542115 40180488 39074169 38345216 37544819 36324027 36278074 34857244 33945698 32846992
$$ packed form
3596H9742776j527793k022910k106895j629582j113050r54999j632529p59578
3588G7995440j713657j390911j142778p43928r64270n01988q32071r19049m25979
3579F9360809j257820o53048m72375o89909j621383j50297j237870o04543m28134
3570F2245430j041738j52852p85669m72829j91534j005909q95549P50116K29888
3561E8679354k86566l61775r51626K26532n68812m05723n89698j32467j026867
3552E4582352l9207m64189r14445m2539j777263j40198j08710r87478j920957
3543D8187366l58888j008455j279658j501313p90438q4965j122801l76482j122251
3534D0542115l61627j106319p28953q00397j220792m5953j420830r11546j098706
$$ plain form
3525 32846992 32830303 31488255 30766051 30533791 29601077 29298696 28419548 27857590 26460210
3516 26460210 26103732 26165255 24600078 25165903 23510208 23152228 23032143 22352284 21834913
3507 21834913 21883586 21690345 21767074 22100598 19885423 20523158 19553340 19440240 19604655 18642034
3497 18642034 19128771 19161190 17968041 18510126 17782590 17696708 18398464 17639359 17554687 17239560
3487 17239560 18006697 17402609 16515199 17029910 16538263 17676546 16483057 16938258 16161064
3478 16161064 16226387 15827022 15549909 16645287 16524864 15778306 14924514 16244718 15883936
3469 15883936 15816838 15404467 15554171 15163559 15288789 15565437 15547260 15276850 14740135 15402809
3459 15402809 15280493 16049858 15908081 16059700 16282467 15077796 15767277 16002757 15525540
$$ packed form
3525C2846992j6689j342048p22204k32260r32714l02381q79148n61958j397380
3516B6460210l56478O1523j565177N65825j655695l57980j20085o79859n17371
3507B1834913M8673j93241P6729L33524k215175O37735r69818j13100J64415r62621
3497A8642034M86737L2419j193149N42085p27536q5882P01756p59105q4672l15127
3487A7239560P67137o04088q87410N14711m91647J138283j193489M55201p77194
3478A6161064O5323l99365k77113J095378j20423p46558q53792J320204l60782
3469A5883936o7098m12371J49704l90612J25230K76648j8177k70410n36715O62674
3459A5402809j22316P69365j41777J51619K22767j204671O89481K35480m77217
$$ plain form
3450 15525540 16730053 16381919 16288213 16560822 16435759 15932227 16758324 17057832 17854775
3441 17854775 17188223 17126609 17696522 17556278 17701858 17952114 17991874 18768958 18817847 20036065
3431 20036065 20091277 20194040 19660167 20097176 20707967 21410695 21923833 22926847 23358510
3422 23358510 24160023 23799871 25496011 25774003 26376246 27374053 28032646 28893141 30666862
3413 30666862 31516088 33011472 35332626 35922481 37953219 40017934 41748566 44594601
3405 44594601 47668766 50130689 54034908 57566377 62091768 67223340 73317699 79165434
3397 79165434 85841823 92847628 100511254 107352246 114934537 122461644 129859573 137399169
3389 137399169 145741841 153418153 161188607 167061746 173217070 178898445 182562120 187378175
$$ packed form
3450A5525540J204513l48134r3706K72609j25063n03532Q26097K99508P96943
3441A7854775o66552o1614N69913j40244J45580K50256L9760P77084M8889J218218
3431B0036065N5212J02763n33873M37009O10791P02728N13138J003014M31663
3422B3358510Q01513l60152J696140K77992O02243R97807O58593Q60495J773721
3413C0666862Q49226J495384K321154N89855K030738K064715J730632K846035
3405D4594601L074165K461923L904219L531469M525391N131572O094359N847735
3397G9165434O676389P005805P663626O840992P582291P527107P397929P539596
3389A37399169Q342672P676312P770454N873139O155324N681375L663675M816055
$$ plain form
3381 187378175 191302766 193302039 194585916 194096862 191936781 189225356 185835219 182593834
3373 182593834 176723094 171848496 165436506 159377545 151882530 144397270 137650955 129828429
3365 129828429 123068740 115835647 108922537 100635761 94215922 87641589 82108591 76043394
3357 76043394 70863865 66246648 62150001 58552351 56135049 52908384 50058375 47624261
3349 47624261 45631295 43124281 42264095 40329230 38846398 36553091 36092534 34830698
3341 34830698 33190447 33220917 32459610 31244167 30075500 29868343 29555847 29333493 28567273
3332 28567273 28172069 27799373 26469029 26944594 27026321 26200101 25851209 26163667 25689110
3323 25689110 24807084 25924227 25656146 25140623 25415621 25953026 26171838 26037240 25669445
$$ packed form
3381A87378175L924591J999273J283877m89054k160081k711425l390137l241385
3373A82593834n870740m874598o411990o058961p495015p485260o746315p822526
3365A29828429o759689p233093o913110q286776o419839o574333n532998o065197
3357G6043394n179529m617217m096647l597650k417302l226665k850009k434114
3349D7624261j992966k507014q60186j934865j482832k293307m60557j261836
3341C4830698j640251L0470p61307j215443j168667k07157l12496k22354p66220
3332B8567273l95204l72696j330344M75565Q1727q26220l48892L12458m74557
3323B5689110q82026J117143k68081n15523K74998N37405K18812j34598l67795
$$ plain form
3314 25669445 25468348 25081674 25052029 26181008 26706683 25701368 25308760 24780452 25379770
3305 25379770 24415687 25077541 24363064 25175405 24488902 24427823 25185695 24286717 24042228 23443489
3295 23443489 23603712 23687738 22677154 22841599 22618024 22825133 21994482 21637839 21205355
3286 21205355 21306051 20623258 20397940 20899001 19966074 19805399 19371418 19278216 19018718 18517399
3276 18517399 18069653 17524148 17880945 17931354 17638451 17454765 17698406 16859014 16712666 16092647
3266 16092647 16880579 16354355 16611748 16388213 15560162 16195998 16031728 16738099 15965389
3257 15965389 15399021 15801284 15503005 15756280 15292127 15354073 15665252 15457964 17240916
3248 17240916 16147930 17030569 16181359 17143972 16055071 16656065 17427755 16945293 17186270
$$ packed form
3314B5669445k01097l86674k9645J128979N25675j005315l92608n28308N99318
3305B5379770r64083O61854p14477Q12341o86503o1079P57872q98978k44489n98739
3295B3443489J60223Q4026j010584J64445k23575K07109q30651l56643m32484
3286B1205355J00696o82793k25318N01061r32927j60675m33981r3202k59498n01319
3276A8517399m47746n45505L56797N0409k92903j83686K43641q39392j46348o20019
3266A6092647P87932n26224K57393k23535q28051O35836j64270P06371p72710
3257A5965389n66368M02263k98279K53275m64153O1946L11179k07288J782952
3248A7240916j092986Q82639q49210R62613j088901O00994P71690m82462K40977
$$ plain form
3239 17186270 17794375 18062559 17908388 19104804 18076644 18553744 19163577 19028360 19356507
3230 19356507 19573421 20214488 20964758 21549241 21904579 21967057 23026967 23310021 23518828
3221 23518828 23325945 24881011 25220943 25814927 26695083 26685208 28616523 29238436 29181868 29771657
3211 29771657 29896654 31278572 31990253 33069199 33838763 34589962 34883609 35757260 37432684
3202 37432684 38054675 40046705 40637707 40622824 42567890 43087681 44312085 45090272 45958388
3193 45958388 47879059 48953732 49357870 50851653 51786486 53056959 53954172 55333803 56745766
3184 56745766 57958545 57943643 59975375 60564918 62142802 62889227 64919456 65456460 66546287
3175 66546287 66868814 67290005 67996211 69723805 69085065 70309238 71259783 71852329 73358391
$$ packed form
3239A7186270O08105K68184j54171J196416j028160M77100O09833j35217L28147
3230A9356507K16914O41067P50270N84483L55338O2478J059910K83054K08807
3221B3518828j92883J555066L39932N93984Q80156r875J931315O21913n6568N89789
3211B9771657J24997J381918P11681J078946P69564P51199K93647Q73651J675424
3202C7432684O21991J992030N91002j4883J945066N19791J224404P78187Q68116
3193D5958388J920671J074673M04138J493783R34833J270473Q97213J379631J411963
3184E6745766J212779j4902K031732N89543J577884P46425K030229N37004J089827
3175F6546287L22527M21191P06206J727594o38740J224173R50545N92546J506062
$$ plain form
3166 73358391 73346959 75031888 74646443 75745659 76263471 77826046 77842058 77970162 78267982
3157 78267982 80041392 80062665 80022047 80601059 80252305 81208999 80816774 81044030 80837305 80882615
3147 80882615 81097105 81099471 80692304 80463661 80419607 79809533 79051597 78424895 78723375 77406649
3137 77406649 77860879 76921676 75846284 75456619 75414938 74325262 73841895 73129510 73277170
3128 73277170 72175214 72322457 70618408 69592648 69126710 68335879 67668645 67572509 66833166
3119 66833166 65317482 64331644 62694492 62831826 61790912 59953461 59693332 57919517 56247068
3110 56247068 56243617 54828576 54386331 52805650 52395828 51925034 50496052 49608237 48383266
3101 48383266 46399164 46996622 45454677 44291475 44491581 43901497 42428706 41369967 40519824
$$ packed form
3166G3358391j1432J684929l85445J099216N17812J562575J6012J28104K97820
3157G8267982J773410K1273m0618N79012l48754R56694l92225K27256k06725M5310
3147H0882615K14490K366m07167k28643m4054o10074p57936o26702K98480j316726
3137G7406649M54230r39203j075392l89665m1681j089676m83367p12385J47660
3128G3277170j101956J47243j704049j025760m65938p90831o67234r6136p39343
3119F6833166j515684r85838j637152J37334j040914j837451k60129j773815j672449
3110E6247068l451j415041m42245j580681m09822m70794j428982q87815j224971
3101D8383266j984102N97458j541945j163202K00106n90084j472791j058739q50143
$$ plain form
3092 40519824 39880358 39244957 38650098 37440290 36993708 36313091 35213496 35028123 34003090
3083 34003090 33151300 32846340 31897427 30947037 30619649 29524409 28907827 28444288 28091213
3074 28091213 27320397 26890650 27496267 26033210 25818351 25613841 24769970 24786635 25111047
3065 25111047 23457534 24406085 23702519 23383343 22843727 22095139 22220985 22146868 21912243
3056 21912243 22076138 20979891 20796452 21169311 20916543 20347870 20395928 20007811 20570115
3047 20570115 19531098 20086641 19315695 18821248 19497999 18597649 18733046 19269149 18671934
3038 18671934 18568991 18977618 18077288 17908660 17330603 18263108 18550563 17926648 18300119
3029 18300119 17765799 18185354 16811440 17442587 17390279 17367825 17450278 17488055 16994475 16923783
$$ packed form
3092D0519824o39466o35401n94859j209808m46582o80617j099595j85373j025033
3083C4003090q51790l04960r48913r50390l27388j095240o16582m63539l53075
3074B8091213p70816m29747O05617j463057k14859k04510q43871J6665L24412
3065B5111047j653513R48551p03566l19176n39616p48588J25846p4117k34625
3056B1912243J63895j096247j83439L72859k52768n68673M8058l88117N62304
3047B0570115j039017N55543p70946m94447O76751r00350J35397N36103n97215
3038A8671934j02943M08627r00330j68628n78057R32505K87455o23915L73471
3029A8300119n34320M19555j373914O31147n2308k2454Q2453L7777m93580p0692
$$ plain form
3019 16923783 16796231 17238053 17831306 16725279 16601827 16791937 16909495 16451515 16876118
3010 16876118 16528327 17324627 17114875 16994889 17317847 16599941 17095434 17013877 17599125 18010577
3000 18010577 17461787 17193450 17374035 17493020 18514239 17348320 17725651 17941965 17730121
2991 17730121 18146144 17909564 18631679 18814166 19057453 19323371 19385690 19835588 20223444 20693487
2981 20693487 20589952 20215717 21326514 21533634 21185867 21406677 21337743 22220889 22858027
2972 22858027 23087637 24028331 23305097 23848406 24763606 24609290 25810710 26561304 26303205
2963 26303205 26989478 27995795 29099527 28476781 28229589 30231967 30592340 31932149 32541409
2954 32541409 33062144 33762713 35445403 36385824 36150549 37416412 38852844 40022712 40359570
$$ packed form
3019A6923783j27552M41822N93253j106027j23452J90110J17558m57980M24603
3010A6876118l47791P96300k09752j19986L22958p17906M95493q1557N85248M11452
3000A8010577n48790k68337J80585J18985J021219j165919L77331K16314k11844
2991A7730121M16023k36580P22115J82487K43287K65918O2319M49898L87856M70043
2981B0693487j03535l74235J110797K07120l47767K20810o8934Q83146O37138
2972B2858027K29610R40694p23234N43309R15200j54316J201420P50594k58099
2963B6303205O86273J006317J103732o22746k47192K002378L60373J339809O09260
2954C2541409N20735P00569J682690R40421k35275J265863J436432J169868L36858
$$ plain form
2945 40359570 41622111 42716034 44385290 45640588 46504733 48367004 49772211 50556263
2937 50556263 51647414 53570843 55414915 56252022 58399927 59899166 61714913 63451656
2929 63451656 65672174 67376376 69073676 71378326 74057353 76557415 79188361 80477917
2921 80477917 83740846 86960349 90263229 92795745 96495788 99702792 103356470 105371648
2913 105371648 109890189 113789606 118142137 122616641 127391001 132452850 137695249 142233477
2905 142233477 147830115 152590344 157431957 160564858 162473406 164595939 167505171 169358810
2897 169358810 172200505 176203948 178117838 180297494 181811768 184710902 187488706 189608469
2889 189608469 191346136 192309528 194343328 194916697 195919323 197294205 198037213 197329588 197552707
$$ packed form
2945D0359570J262541J093923J669256J255298Q64145J862271J405207P84052
2937E0556263J091151J923429J844072Q37107K147905J499239J815747J736743
2929F3451656K220518J704202J697300K304650K679027K500062K630946J289556
2921H0477917L262929L219503L302880K532516L700043L207004L653678K015178
2913A05371648M518541L899417M352531M474504M774360N061849N242399M538228
2905A42233477N596638M760229M841613L132901J908548K122533K909232J853639
2897A69358810K841695M003443J913890K179656J514274K899134K777804K119763
2889A89608469J737667R63392K033800N73369J002626J374882P43008p07625K23119
$$ plain form
2880 197552707 196641566 196452005 195376854 194012530 192696615 190882671 189031050 186307565
2872 186307565 184821283 182706842 180259380 178215578 175278285 172199788 170263474 167645460
2864 167645460 165249167 163005667 159985037 157935816 155427669 153291039 150246640 147774118
2856 147774118 146563032 143456293 141110696 139518638 136112527 134236862 133078419 131085707
2848 131085707 128181597 126784501 124873804 122408373 121379831 118372561 117415194 115395512
2840 115395512 113264003 111861638 110611126 109182481 107573708 105580444 104385265 102730730
2832 102730730 101106811 99857216 98852798 97504279 96909378 94938109 94423509 93136141
2824 93136141 92080110 90449787 90007142 88965400 88003148 87197994 86534226 85151467 85505554
$$ packed form
2880A97552707r11141j89561j075151j364324j315915j813944j851621k723485
2872A86307565j486282k114441k447462k043802k937293l078497j936314k618014
2864A67645460k396293k243500l020630k049221k508147k136630l044399k472522
2856A47774118j211086l106739k345597j592058l406111j875665j158443j992712
2848A31085707k904110j397096j910697k465431j028542l007270r57367k019682
2840A15395512k131509j402365j250512j428645j608773j993264j195179j654535
2832A02730730j623919j249595j004418j348519n94901j971269n14600j287368
2824I3136141j056031j630323m42645j041742r62252q05154o63768j382759L54087
$$ plain form
2815 85505554 84998359 83007870 83619537 83487350 82825154 83521118 83064198 82875014 83586030
2806 83586030 82368272 82913624 83102769 83297555 83746648 83618347 84845224 85867517 86883648
2797 86883648 86650990 87829015 88894870 90260635 90512010 91700841 93241306 93978417 95640461
2788 95640461 97306018 99688659 101119037 102497828 104832112 106291811 108198905 110289930
2780 110289930 113111562 114326908 117718087 119860218 121265087 124789609 126278001 128952257
2772 128952257 131202320 133102939 135680844 137972744 138912676 141133359 141781814 143820768
2764 143820768 145017295 146343637 148253374 148809013 149442307 149958490 150190120 150924891 151110363
2755 151110363 150721057 149838349 148689632 148899702 147315382 146825638 146166684 143728368 142104540
$$ packed form
2815H5505554n07195j990489O11667j32187o62196O95964m56920j89184P11016
2806H3586030j217758N45352J89145J94786M49093j28301J226877J022293J016131
2797H6883648k32658J178025J065855J365765K51375J188831J540465P37111J662044
2788I5640461J665557K382641J430378J378791K334284J459699J907094K091025
2780A10289930K821632J215346L391179K142131J404869L524522J488392K674256
2772A28952257K250063J900619K577905K291900R39932K220683O48455K038954
2764A43820768J196527J326342J909737N55639O33294N16183K31630P34771J85472
2755A51110363l89306q82708j148717K10070j584320m89744o58954k438316j623828
$$ plain form
2746 142104540 141024865 138339214 135617725 134107813 131821229 128237556 125545768 122984419
2738 122984419 120907322 116827392 115645276 112295708 109714089 106445095 103068193 100746942
2730 100746942 97599620 94698832 92319043 88723501 86394758 83196849 82634885 79282549
2722 79282549 76466803 74732051 71904140 69749362 67972225 66040589 64944680 63133209
2714 63133209 61538389 59776180 58285327 55808525 54949928 53197814 51996225 50455052
2706 50455052 50498138 47502088 46530866 45179996 43628583 42802991 42698809 40800530 39519954
2697 39519954 38848216 38840075 37137788 36640036 35893016 34979994 34119445 33188123 32950590 31588498
2687 31588498 31356890 30418281 29817768 28887036 28882561 27551908 27778112 26848024 26302289 25746400
$$ packed form
2746A42104540j079675k685651k721489j509912k286584l583673k691788k561349
2738A22984419k077097m079930j182116l349568k581619l268994l376902k321251
2730A00746942l147322k900788k379789l595542k328743l197909n61964l352336
2722G9282549k815746j734752k827911k154778j777137j931636j095909j811471
2714F3133209j594820j762209j490853k476802q58597j752114j201589j541173
2706E0455052M3086k996050r71222j350870j551413q25592j04182j898279j280576
2697C9519954o71738q141j702287m97752p47020r13022q60549r31322k37533j362092
2687C1588498k31608r38609o00513r30732m475j330653K26204r30088n45735n55889
$$ plain form
2677 25746400 25218812 25383116 24114716 24429041 24007609 23328877 22842953 22270902 22089375
2668 22089375 21056297 20969654 20491761 20372309 20434484 19751085 18490426 19159723 18114813
2659 18114813 18425843 18421408 18083093 17674830 17003921 17119177 16952144 16773798 16309072 16110391
2649 16110391 16036457 15842733 14841623 15867174 15643951 15723903 14375928 14795489 14334308
2640 14334308 14935629 14356767 14851105 14471976 14049279 13790530 14049039 13678818 13037056
2631 13037056 13989895 13389622 12849926 13066194 13376973 12085910 12222831 12496612 11581573
2622 11581573 11698199 12132386 11870273 11729792 11465971 12035123 11288934 11043387 10971699 11163304
2612 11163304 11064451 11156582 10185686 11073167 10653047 10431683 9912366 9326450 10557176 10028986
$$ packed form
2677B5746400n27588J64304j268400L14325m21432o78732m85924n72051j81527
2668B2089375j033078q6643m77893j19452O2175o83399j260659O69297j044910
2659A8114813L11030m435l38315m08263o70909J15256j67033j78346m64726j98681
2649A6110391p3934j93724j001110J025551k23223P9952j347975M19561m61181
2640A4334308O01321n78862M94338l79129m22697k58749K58509l70221o41762
2631A3037056R52839o00273n39696K16268L10779j291063J36921K73781r15039
2622A1581573J16626M34187k62113j40481k63821N69152p46189k45547p1688J91605
2612A1163304r8853R2131r70896Q87481m20120k21364n19317n85916J230726n28190
$$ plain form
2602 10028986 10130396 10878454 9955016 9979870 10290385 9616304 9693306 9623973 9914269 9127906
2592 9127906 9494516 8971533 9088873 9271442 9916335 8871529 9018491 8958945 9279290 9596743
2582 9596743 9839047 10075867 10003231 9120066 9811378 9735309 9764930 10455256 9946200 9573203
2572 9573203 9311835 8957365 9475045 9257087 9493766 8389882 8713806 8387270 8441407 8863301
2562 8863301 8181626 7097451 9063841 7728000 8377929 7605940 7917398 7871013 8569877
2553 8569877 7853574 8061829 8361417 8112466 7703016 8507937 8429520 9256394 7859292 7611463
2543 7611463 7992543 8720824 8389640 9268181 9238816 8508840 8586928 8172050 8982183 9581596
2533 9581596 9429404 9833531 9555643 9742031 10529891 10823917 10336671 10123185 10511948 11043572
$$ packed form
2602A0028986J01410P48058r23438K4854L10515o74081P7002o9333K90296p86363
2592I127906L66610n22983J17340J82569O44893j044806J46962n9546L20345L17453
2582I596743K42304K36820p2636q83165O91312p6069K9621O90326n09056l72997
2572I573203k61368l54470N17680k17958K36679j103884L23924l26536N4137M21894
2562H863301o81675j084175J966390j335841O49929p71989L11458m6385O98864
2553H569877p16303K08255K99588k48951m09450Q04921p8417Q26874j397102k47829
2543G611463L81080P28281l31184Q78541k9365p29976P8088m14878Q10133N99413
2533I581596j52192M04127k77888J86388P87860K94026m87246k13486L88763N31624
$$ plain form
2523 11043572 11886026 11818630 11845229 12233437 13427824 13747464 14008157 14236575 14953350 16405508
2513 16405508 16457563 17257443 17844603 18474998 19068003 20513031 20707990 21184122 22107997
2504 22107997 22238504 22926245 22895395 23713873 24428891 25150845 24747273 25013515 26514313
2495 26514313 27219753 27858538 29537078 30841878 32802658 34760676 36367160 39461961
2487 39461961 41216957 44343381 45473704 48739800 51402117 52758253 52925623 53564630
2479 53564630 53534019 53375053 52673769 51212685 50500985 48732834 47195042 45837228 45228221
2470 45228221 44156570 43324128 43827782 43684224 44359795 44102660 45826967 46830728 47386136
2461 47386136 50041978 50572879 51095936 50615241 50350956 50708491 49950953 47926787 47234687
$$ packed form
2523A1043572Q42454o7396K6599L88208J194387L19640K60693K28418P16775J452158
2513A6405508N2055P99880N87160O30395N93005J445028J94959M76132R23875
2504B2107997J30507O87741l0850Q18478P15018P21954m03572K66242J500798
2495B6514313P05440O38785J678540J304800J960780J958018J606484L094801
2487C9461961J754996L126424J130323L266096K662317J356136J67370O39007
2479E3564630l0611j58966p01284j461084p11700j768151j537792j357814o09007
2470D5228221j071651q32442N03654j43558O75571k57135J724307J003761N55408
2461D7386136K655842N30901N23057m80695k64285L57535p57538k024166o92100
$$ plain form
2452 47234687 45682207 44136715 41920590 40739017 38956481 37224957 35194817 34397723
2444 34397723 31957341 30727464 29389378 28523838 28162250 27271078 26668867 26179470 24825076
2435 24825076 24259123 23468711 23001805 22636182 22847636 22145711 22076481 21028620 21298401
2426 21298401 20764073 20512228 19644138 19840919 20078236 19720923 19477130 18821670 19105385
2417 19105385 17660548 17856702 17397628 17693270 17095357 16377711 16483840 16415925 15749687
2408 15749687 15744269 16597337 15902854 16383119 16121291 16314260 16115382 16179707 16043777 16474457
2398 16474457 17456494 17137677 16544362 16753028 17610000 18579926 18079256 18091019 18647921 18934972
2388 18934972 18946145 20543696 20157709 20968623 22059155 21903758 23124504 22362746 24378809
$$ packed form
2452D7234687j552480j545492k216125j181573j782536j731524k030140p97094
2444C4397723k440382j229877j338086q65540l61588q91172o02211m89397j354394
2435B4825076n65953p90412m66906l65623K11454p01925o9230j047861K69781
2426B1298401n34328k51845q68090J96781K37317l57313k43793o55460K83715
2417A9105385j444837J96154m59074K95642n97913p17646J06129o7915o66238
2408A5749687n418Q53068o94483M80265k61828J92969j98878O4325j35930M30680
2398A6474457R82037l18817n93315K08666Q56972R69926n00670J1763N56902K87051
2388A8934972J1173J597551l85987Q10914J090532j55397J220746p61758K016063
$$ plain form
2379 24378809 23896697 25849262 25532286 26498230 27526333 26608783 26952044 28118357 26522876
2370 26522876 26548094 26398560 24446451 23309322 22560729 22610201 21492073 20364427 19484799
2361 19484799 18281777 18263195 16998541 17526002 16024763 15551567 15918163 16431027 15459763
2352 15459763 15284098 14305330 13998006 13663237 13858129 12973047 12509882 13571600 13247668
2343 13247668 13630823 13215468 13025361 13122638 12511976 12500997 13136782 12587080 12739166 12317922
2333 12317922 12253870 12362615 11830441 11939617 11798883 12843203 12207096 11557522 12047805
2324 12047805 12438015 11627607 11925632 11416624 11206592 12065793 11148248 11746655 11777167 10991469
2314 10991469 10710799 11327101 11232678 11887750 11491217 12026781 11937342 12132369 11092222 11075882
$$ packed form
2379B4378809m82112J952565l16976R65944J028103r17550L43261J166313j595481
2370B6522876K5218j49534j952109j137129p48593M9472j118128j127646q79628
2361A9484799j203022j8582j264654N27461j501239m73196L66596N12864r71264
2352A5459763j75665r78768l07324l34769J94892q85082m63165J061718l23932
2343A3247668L83155m15355j90107R7277o10662j0979O35785n49702J52086m21244
2333A2317922o4052J08745n32174J09176j40734J044320o36107o49574M90283
2324A2047805L90210q10408K98025n09008k10032Q59201r17545N98407L0512p85698
2314A0991469k80670O16302r4423O55072l96533N35564q9439J95027j040147j6340
$$ plain form
2304 11075882 11097253 11250767 12212266 11533506 12069711 12138491 11694826 12563518 12331322 12941974
2294 12941974 12475499 12135712 12689255 13243336 13402915 13604746 13358853 13876620 13585263
2285 13585263 14062328 14513397 14187596 15046495 15150948 15168306 16285000 15970133 16948396
2276 16948396 17881808 17434029 18824050 19100739 18813080 20322974 20994849 21697856 21764912
2267 21764912 22946149 23322132 25605347 26245556 27276113 28216346 29874588 31676586 32812331
2258 32812331 35223600 37061686 39366866 42224087 45050667 48192252 52494440 56346058
2250 56346058 61821780 67817454 73283468 81343246 89132344 98418341 109875320 123776530
2242 123776530 141457579 165028944 191744582 219390298 249532945 279089443 301306970
$$ packed form
2304A1075882K1371J53514R61499o78760N36205O8780m43665Q68692k32196O10652
2294A2941974m66475l39787N53543N54081J59579K01831k45893N17767k91357
2285A3585263M77065M51069l25801Q58899J04453J7358J116694l14867R78263
2276A6948396R33412m47779J390021K76689k87659J509894O71875P03007O7056
2267B1764912J181237L75983K283215O40209J030557R40233J658242J801998J135745
2258C2812331K411269J838086K305180K857221K826580L141585M302188L851618
2250E6346058N475722N995674N466014Q059778P789098R285997J1456979J3901210
2242A23776530J7681049K3571365K6715638K7645716L0142647K9556498K2217527
$$ plain form
2235 301306970 313067104 307430741 285955789 260438363 237766054 218298156 202656687
2228 202656687 191073378 181351470 173637152 167683902 163788971 160970840 161732159 163811018
2220 163811018 167440310 174122456 186562985 202970364 223919751 247663120 270051320
2213 270051320 293109655 309340537 316441536 306128219 279647179 249566998 221207535
2206 221207535 197947124 179207292 161390387 146596737 133672573 121782566 110420822
2199 110420822 100313380 91967981 84803042 78190559 72533163 67021293 62358682 57864275
2191 57864275 54595645 50112523 48692166 44801975 43418054 40938095 38751018 36944631
2183 36944631 35690003 33721604 31849673 30973133 29824175 28495272 27054397 26313441
$$ packed form
2235C01306970J1760134n636363k1474952k5517426k2672309j9467898j5641469
2228B02656687j1583309r721908p714318n953250l894931k818131P61319K078859
2220A63811018L629292O682146J2440529J6407379K0949387K3743369K2388200
2213B70051320K3058335J6230882P100999j0313317k6481040l0080181k8359463
2206B21207535k3260411j8739832j7816905j4793650j2924164j1890007j1361744
2199A10420822j0107442q345399p164939o612483n657396n511870m662611m494407
2191E7864275l268630m483122j420357l890191j383921k479959k187077j806387
2183C6944631j254628j968399j871931q76540j148958j328903j440875p40956
$$ plain form
2175 26313441 25389812 24472684 23980586 22734549 22177121 21206421 19668410 19726671 19169193
2166 19169193 17850996 17023635 17003478 16691377 15337477 16044508 14939225 14359424 14470315
2157 14470315 14332394 13818211 13523863 13006172 12529309 11668433 12472305 12156770 11824804
2148 11824804 11130737 10821262 10380998 10561538 10194091 10904395 10198591 9737009 9554492
2139 9554492 9847615 9430777 10100411 9650183 8837668 8107723 8820424 8343471 8248393 8758752
2129 8758752 8412053 8717290 7881781 7671709 7584086 7697129 8111081 7308721 8323774 6958593
2119 6958593 6891799 7951632 7476870 8057353 7541133 7712145 7396336 7342861 6813593 7805981
2109 7805981 7446200 7136350 7388130 6525351 6691400 7954779 6265451 6718442 6937901
$$ packed form
2175B6313441r23629r17128m92098j246037n57428r70700j538011N8261n57478
2166A9169193j318197q27361k0157l12101j353900P07031j105283n79801J10891
2157A4470315j37921n14183k94348n17691m76863q60876Q03872l15535l31966
2148A1824804o94067l09475m40264J80540l67447P10304p05804m61582j82517
2139I554492K93123m16838O69634m50228q12515p29945P12701m76953r5078N10359
2129H758752l46699L05237q35509k10072q7623J13043M13952q02360J015053j365181
2119F958593o6794J059833m74762N80483n16220J71012l15809n3475n29268R92388
2109G805981l59781l09850K51780q62779J66049J263379j689328M52991K19459
$$ plain form
2100 6937901 5906943 6642582 6475297 6990721 7073223 6949328 6557732 6600325 7420388 7536303
2090 7536303 6871781 7366101 7329830 7721761 7691825 7531378 6080705 6726088 6729712 6182343
2080 6182343 6198816 5718675 5532403 5841074 5335788 5844251 5810981 5635376 5478998 5807384
2070 5807384 4944501 5133724 5275577 5855468 5924875 5516012 6055632 5574011 6190644 5856624
2060 5856624 5482845 5580092 5018986 4838822 5126821 5025369 5115701 3982065 3561618 4494215
2050 4494215 2991042 3822079 5085488 3385053 3585215 2643358 3363439 2972507 3965624
2041 3965624 3146656 3123929 2826491 3292401 3573516 3730339 2868225 3076780 2742829 3147331
2031 3147331 3332541 2407309 2446712 2939351 2698492 1594670 1764579 1552788 1658219 1939951
$$ packed form
2100F937901j030958P35639j67285N15424Q2502j23895l91596M2593Q20063J15915
2090G536303o64522M94320l6271L91931k9936j60447j450673O45383L624n47369
2080F182343J6473m80141j86272L08671n05286N08463l3270j75605j56378L28386
2070E807384q62883J89223J41853N79891O9407m08863N39620m81621O16633l34020
2060E856624l73779R7247n61106j80164K87999j01452R0332j133636m20447R32597
2050D494215j503173Q31037J263409j700435K00162r41857P20081l90932R93117
2041C965624q18968k2727k97438M65910K81115J56823q62114K08555l33951M04502
2031C147331J85210r25232L9403M92639k40859j103822J69909k11791J05431K81732
$$ plain form
2021 1939951 1758713 2275625 1456004 1256833 1675527 1869374 2173056 1402283 1790406 2229897
2011 2229897 1457370 1058415 1546662 1653084 1308029 1276490 630731 1717846 855106 1426861
2001 1426861 755200 605683 1360029 1222994 1381289 1172826 1362602 1362258 2183889 808089
1991 808089 1844941 1760640 2261533 2017558 2669690 1986248 1472655 2000888 1707197 1796945
1981 1796945 1657731 1526721 717810 620984 656345 1141011 1302488 763404 1312614 184084
1971 184084 1657853 1609206 900001 1649015 1788866 1701168 1655863 1654193 1314473 1650165
1961 1650165 1686328 1618368 1769882 1552417 451565 946840 1361405 1567329 306284 986117
1951 986117 234956 478979 -198945 411982 874895 598142 -224396 -19354 561926 -357649
$$ packed form
2021A939951j81238N16912q19621j99171M18694J93847L03682p70773L88123M39491
2011B229897p72527l98955M88247J06422l45055l1539o45759J087115q62740N71755
2001A426861o71661j49517P54346j37035J58295k08463J89776l44Q21631j375800
1991H08089J036852q4301N00893k43975O52132o83442n13593N28233k93691Q9748
1981A796945j39214j31010q08911r6826L5361M84666J61477n39084N49210j128530
1971A84084J473769m8647p09205P49014J39851q7698m5305j670l39720L35692
1961A650165L6163o7960J51514k17465j100852M95275M14565K05924j261045O79833
1951I86117p51161K44023o77924O10927M62913k76753q22538K05042N81280r19575
$$ plain form
1941 -357649 -727656 -41537 111095 -522466 107048 396708 908322 394621 487352 164567
1931 164567 -252882 -419006 -608535 -407268 -387446 -579752 -352727 106804 -205543 -146326
1921 -146326 -26096 -346602 284191 75126 -564933 -44897 -182896 -639436 -482461 -93434
1911 -93434 -538932 -242303 -653435 256339 -769481 -1044228 -834555 -764104 184180 -414296
1901 -414296 -414396 -249576 605191 -881182 -447328 -923798 -398744 56581 -596693 -936680
1891 -936680 -320717 -358939 -383266 -548971 -282560 -291712 -77955 -557859 -637374 -492852 -1092375
1880 -1092375 -572926 -1147467 -259249 -131188 -137430 -1330066 -620884 -455457 -1363254 -52846
1870 -52846 -14026 -500076 -724522 -935587 -699510 -640943 -965697 -29627 -513950 -1208663
$$ packed form
1941c57649l70007O86119J52632o33561O29514K89660N11614n13701R2731l22785
1931A64567m17449j66124j89529K01267J9822j92306K27025M59531l12347N9217
1921a46326J20230l20506O30793k09065o40059N20036j37999m56540J56975L89027
1911i3434m45498K96629m11132R09774j025820k74747K09673P0451R48284n98476
1901d14296j00J64820Q54767j486373M33854m76470N25054M55325o53274l39987
1891i36680O15963l8222k4327j65705K66411r152K13757m79904p9515J44522n99523
1880a092375N19449n74541Q88218J28061o242j192636P09182J65427r07797J310408
1870e2846L8820m86050k24446k11065K36077N8567l24754R36070m84323o94713
$$ plain form
1860 -1208663 -1154097 -1246369 -997287 -534322 -847833 -1287151 -570636 -671097 -424103 -920493
1850 -920493 -777184 -459131 -919834 -1006620 -1477876 -342437 11192 -1027622 -1064250 -814896
1840 -814896 -957393 -291567 125050 -349190 156830 -294292 -241392 -286973 -706360 -1251704
1830 -1251704 -790983 -107954 -439482 -193939 -432352 -183869 -592964 -976354 -912852 -1211425
1820 -1211425 -648026 -471806 -982982 -899953 -1636421 -661686 -147132 -467432 -477538 -740120
1810 -740120 3598 -828986 -503440 -756094 -379688 -1021997 160103 -213509 -720582 -693641
1800 -693641 -903089 -1063143 -717622 -180996 -248032 -200855 -252817 -500411 109609 -363975
1790 -363975 -521353 -324348 -999658 -684847 -326954 -236921 -703645 -1481940 -48773 -69551
$$ packed form
1860a208663N4566r2272K49082M62965l13511m39318P16515j00461K46994m96390
1850i20493J43309L18053m60703q6786m71256J135439L53629j038814l6628K49354
1840h14896j42497O65826M16617m74240N06020m51122N2900m5581m19387n45344
1830a251704M60721O83029l31528K45543k38413K48483m09095l83390O3502k98573
1820a211425N63399J76220n11176Q3029p36468R74735N14554l20300j0106k62582
1810g40120P43718q32584L25546k52654L76406o42309J182100l73612n07073K6941
1800f93641k09448j60054L45521N36626o7036M7177n1962k47594O10020m73584
1790c63975j57378J97005o75310L14811L57893R0033m66724p78295J433167k0778
$$ plain form
1780 -69551 -617323 -874015 -670212 -462351 149669 162051 -322652 201381 -1004325 -663224
1770 -663224 -651214 -1450360 -983884 -1058479 -958654 -815574 -793476 -717889 -614497 -281797 -734073
1759 -734073 -927361 -750823 -536743 -716285 -745180 -1100736 -1590039 -262194 -721582 -315127
1749 -315127 -492247 -955740 -272183 -480142 -716103 -409581 -1008564 -578218 -631082 -49359
1739 -49359 -215917 -475501 -498433 44841 37458 -56444 -57063 -576819 -479265 -578539 -599645 -830365
1727 -830365 -34052 -250922 -670940 -302822 39015 -762457 -1160682 -1097174 -386102 -560661
1717 -560661 -1136908 -998477 -857742 -464148 -603292 -550986 -1002525 691 -747444 56108
1707 56108 -501874 -757494 -1048263 -1422808 -334147 260069 -393126 -450398 -368327 -29463
$$ packed form
1780f9551n47772k56692K03803K07861O12020J2382m84703N24033j205706L41101
1770f63224J2010p99146M66476p4595R9825J43080K2098P5587J03392L32700m52276
1759g34073j93288J76538K14080j79542k8895l55556m89303J327845m59388M06455
1749c15127j77120m63493O83557k07959k35961L06522n98983M30346n2864N81723
1739d9359j66558k59584k2932N43274p383r3902o19n19756R7554r9274k1106k30720
1727h30365P96313k16870m20018L68118L41837q01472l98225O3508P11072j74559
1717e60661n76247J38431J40735L93594j39144N2306m51539J003216p48135Q03552
1707E6108n57982k55620k90769l74545J088661N94216o53195n7272Q2071L38864
$$ plain form
1697 -29463 -1009291 -230993 -21812 -908667 -515708 -193832 -43639 154761 58530 37274
1687 37274 -751356 -441312 -620774 -906121 -972521 -624074 -154514 -479265 -931569 -201462
1677 -201462 -910156 -549318 400425 427461 593494 221642 -624825 45679 184403 -1051046
1667 -1051046 -502108 -1220071 -10215 8803 -1043368 -1114643 -216222 -72825 233856 -137832
1657 -137832 218326 -212099 -271064 -56084 -670940 294027 585075 172653 -313762 -183721
1647 -183721 591117 484263 180349 254089 900149 375442 711912 189315 462905 -132667
1637 -132667 241941 136247 914385 1080325 943244 1894744 1463652 1356223 2739142 2676326
1627 2676326 2447572 3263761 3062854 2497401 2398360 1593264 1456373 1469055 1664016 1488023
$$ packed form
1697b9463r79828P78298K09181q86855L92959L21876J50193J98400r6231k1256
1687C7274p88630L10044j79462k85347o6400L48447M69560l24751m52304P30107
1677b01462p08694L60838R49743K7036J66033l71852q46467O70504J38724j235449
1667a051046N48938p17963J209856J9018j052171p1275Q98421J43397L06681l71688
1657a37832L56158m30425n8965K14980o14856R64967K91048m12422m86415J30041
1647a83721P74838j06854l03914P3740O46060n24707L36470n22597K73590n95572
1637a32667L74608j05694P78138J65940j37081R51500m31092j07429J382919o2816
1627B676326k28754Q16189k00907n65453r9041q05096j36891J2682J94961j75993
$$ plain form
1617 1488023 2065224 1809350 732522 417602 722392 948792 264396 565525 1320730
1608 1320730 1037923 425073 978618 641692 957818 1330366 1413411 944971 190141 230164
1598 230164 680924 471620 1216264 1020203 -89635 777867 1154047 478099 819969 684831
1588 684831 724316 1162195 1126588 399218 452312 953043 1172851 434669 851573 876682
1578 876682 976782 575082 2147092 869423 1367490 1327302 1373734 467217 972577 983692
1568 983692 1617501 509247 834478 1097063 631500 1221674 750152 310677 825320 889470
1558 889470 1283487 1342770 192833 1964282 1717698 1304598 776866 1418226 1146458 1231276
1548 1231276 1251985 1157127 1518031 1532180 1679440 1285464 1069954 1582640 1703195 1553340
$$ packed form
1617A488023N77201k55874j076828l14920L04790K26400o84396L01129P55205
1608A320730k82807o12850N53545l36926L16126L72548Q3045m68440p54830M0023
1598B30164M50760k09304P44644j96061j109838Q67502L76180o75948L41870j35138
1588F84831L9485M37879l5607p27370N3094N00731K19808p38182M16904K5109
1578H76682J00100m01700J572010j277669M98067m0188M6432r06517N05360J1115
1568I83692O33809j108254L25231K62585m65563N90174m71522m39475N14643O4150
1558H89470L94017N9283j149937J771449k46584m13100n27732O41360k71768Q4818
1548A231276K0709r4858L60904J4149J47260l93976k15510N12686J20555j49855
$$ plain form
1538 1553340 1423458 173898 1094694 2082523 1118107 1255277 1126468 1865643 794723
1529 794723 1896207 1911330 2178647 2010567 2394714 1320579 1545717 1841322 1494988 1992386
1519 1992386 1967031 1774917 2246386 1819602 1871170 2288828 2487499 2372008 1996921 1481836
1509 1481836 2322137 2016822 2269137 3160477 2103268 2359573 2995913 3092065 2670527 2756143
1499 2756143 2810278 2617838 3338625 2360313 2698311 2836383 2868748 2740771 2466803 3354465
1489 3354465 2786914 3466919 3515246 3743848 3384892 4056771 3987212 3753585 4082968 3608210
1479 3608210 3766456 4381209 4178988 4209765 4884116 4587133 4414809 5016547 5637044 4983884
1469 4983884 4636644 5478532 4963959 5223777 4923489 5597423 5774186 5517407 6074385 6070325
$$ packed form
1538A553340j29882j249560R20796R87829r64416J37170j28809P39175j070920
1529G94723J101484J5123K67317j68080L84147j074135K25138K95605l46334M97398
1519A992386k5355j92114M71469m26784N1568M17658J98671j15491l75087n15085
1509A481836Q40301l05315K52315Q91340j057209K56305O36340R6152m21538Q5616
1499B756143N4135j92440P20787r78312L37998J38072L2365j27977k73968Q87662
1489C354465n67551O80005M8327K28602l58956O71879o9559k33627L29383m74758
1479C608210J58246O14753k02221L0777O74351k96983j72324O01738O20497o53160
1469D983884l47240Q41888n14573K59818l00288O73934J76763k56779N56978m060
$$ plain form
1459 6070325 6467888 7086891 6669775 7443704 7587699 8124220 7577963 7798469 7735611 8859432
1449 8859432 8753843 8062777 9374964 10299406 10004811 10626962 10933058 11524651 11427505 11878888
1439 11878888 11966318 12308050 12796915 13431577 14056166 14552011 15620623 16398660 17059409
1430 17059409 17522614 18976911 19219070 20816998 21586161 22673388 23371578 25339465 26432399
1421 26432399 28136415 29422869 31149554 33094011 34940108 37967066 41003242 43599158
1413 43599158 47995986 52302426 57446693 64730364 70937534 78489754 87592847 96360440
1405 96360440 106365188 116409069 127584716 139947354 157413220 180264760 212691161
1398 212691161 257190579 311013517 358444739 413355279 469258723 503998833 516128932
$$ packed form
1459F070325L97563O19003m17116P73929J43995N36521n46257K20506o2858J123821
1449H859432j05589o91066J312187R24442k94595O22151L06096N91593r7146M51383
1439A1878888Q7430L41732M88865O34662O24589M95845J068612P78037O60749
1430A7059409M63205J454297K42159J597928P69163J087227O98190J967887J092934
1421B6432399J704016J286454J726685J944457J846097L026958L036176K595916
1413D3599158M396828M306440N144267P283671O207170P552220R103093Q767593
1405I6360440J0004748J0043881J1175647J2362638J7465866K2851540L2426401
1398B12691161M4499418N3822938M7431222N4910540N5903444L4740110J2130099
$$ plain form
1391 516128932 474752288 404195496 348260640 304792263 268763025 239900998 214886423
1384 214886423 193959593 175296200 158641333 144788218 131409713 119968328 110364313
1377 110364313 100576465 91204930 83160352 76301841 69444452 64378629 59111980 55938823
1369 55938823 51276141 48823384 45524187 42895309 40499463 38091437 36624114 35168616
1361 35168616 32819774 32030959 30091028 28552219 27382156 26206079 24600172 23920892
1353 23920892 23197466 21846702 20260975 19527924 18349596 17230722 16462528 16005530 16025701
1344 16025701 14563116 13568896 14393429 12682660 12686083 12851881 11858697 12257926 10609098
1335 10609098 10565288 10308036 9152964 9992324 9398798 9448000 8890791 8177580 8771257 8477421
$$ packed form
1391E16128932m1376644p0556792n5934856m3468377l6029238k8862027k5014575
1384B14886423k0926830j8663393j6654867j3853115j3378505j1441385r604015
1377A10364313r787848r371535q044578o858511o857389n065823n266649l173157
1369E5938823m662682k452757l299197k628878k395846k408026j467323j455498
1361C5168616k348842p88815j939931j538809j170063j176077j605907o79280
1353B3920892p23426j350764j585727p33051j178328j118874p68194m56998K0171
1344A6025701j462585r94220Q24533j710769L423J65798r93184L99229j648828
1335A0609098m3810k57252j155072Q39360n93526M9202n57209p13211N93677k93836
$$ plain form
1325 8477421 7063120 8056919 7869758 6623636 7581739 6930392 6452808 6489804 6306541
1316 6306541 6481062 5634397 5616332 5747028 5561114 5361484 5154545 5308433 4377640 4830498
1306 4830498 4105747 4232244 4779167 4890708 4403701 4354376 3870470 4104163 4335507 3718428
1296 3718428 3457859 3699359 3206497 3166317 3254026 3386838 3245167 3329185 2779010 3016894
1286 3016894 2566277 2732604 2442771 2159220 2630555 1947063 1954128 2401124 1829817 2659716
1276 2659716 1724655 1932781 1754642 1970839 1907203 2026808 1834766 1688126 1803822 1996907
1266 1996907 1646854 1903127 1526291 870212 1328279 1079552 1372487 1779689 1504392 1283368
1256 1283368 1025141 452731 529569 654872 528843 554783 554388 888735 918238 1017469 604708
$$ packed form
1325H477421j414301R93799j87161j246122R58103o51347m77584L6996j83263
1316F306541J74521q46665j8065J30696j85914j99630k06939J53888r30793M52858
1306D830498p24751J26497N46923J11541m87007m9325m83906K33693K31344o17079
1296C718428k60569K41500m92862m0180Q7709J32812j41671Q4018n50175K37884
1286C016894m50617J66327k89833k83551M71335o83492P065M46996n71307Q29899
1276B659716r35061K08126j78139K16197o3636J19605j92042j46640J15696J93085
1266A996907l50053K56273l76836o56079M58067k48727K92935M07202k75297k21024
1256A283368k58227n72410P6838J25303j26029K5940l95L34347K9503R9231m12761
$$ plain form
1245 604708 704011 722652 197206 908247 279000 547278 871175 727051 392803 603438
1235 603438 312285 93115 693171 191695 -8574 967 352916 132413 256898 401563
1225 401563 -691944 176502 -450767 -606810 21054 548004 -3303 407536 -145025 -210061
1215 -210061 -749406 -158192 -121220 734974 -273291 -410205 -353114 -297500 -256499 88673
1205 88673 -713710 -395557 345030 -319216 -328753 -95190 -615767 214229 -544794 -473633
1195 -473633 -471637 -460367 -1197365 -577344 -996937 70537 69154 -627199 -485815 -913489
1185 -913489 -99715 -343146 -188538 -166075 -245082 209915 -730788 -91611 -721282 -232062
1175 -232062 -859609 -515012 324304 -444320 11742 245165 116609 -138813 105595 -44245
$$ packed form
1245F04708R9303J8641n25446P11041o29247K68278L23897j44124l34248K10635
1235F03438k91153k19170O00056n01476k00269R541L51949k20503J24485J44665
1225D01563j093507Q68446o27269j56043O27864N26950n51307M10839n52561o5036
1215b10061n39345N91214L6972Q56194j008265j36914N7091N5614M1001L45172
1205H8673q02383L18153P40587o64246r537K33563n20577Q29996p59023P1161
1195d73633J996J1270p36998O20021m19593J067474j383o96353J41384m27674
1185i13489Q13774k43431J54608K2463p9007M54997r40703O39177o29671M89220
1175b32062o27547L44597Q39316p68624M56062K33423j28556k55422K44408j49840
$$ plain form
1165 -44245 -37800 245539 896851 1239477 803619 1242575 1153552 1754691 1905027 1788358
1155 1788358 1025122 548015 599874 452386 201696 669916 -89399 -212096 -421610 -88682
1145 -88682 -326687 -493472 -540646 -618864 -1009469 262012 600483 -395361 77593 -500504
1135 -500504 -1340195 -740484 -1292850 -476675 -950132 -1303913 -361460 -1579475 -803441 -243431
1125 -243431 -901918 -996003 -608486 -1213986 -951484 -1523000 -1713616 -1308661 -664921 -1247833
1115 -1247833 -1954880 -665958 -1019976 -1233954 -589591 -159853 -1280173 -1218081 -1077002
1106 -1077002 -1061234 -1478565 -907568 -595174 -1865158 -1090761 -761757 -932373 -577038 -884049
1096 -884049 -1242844 -833718 -868571 -1370061 -745178 -1290850 -980594 -843276 -982309 -2156351
$$ packed form
1165d4245O445K83339O51312L42626m35858M38956q9023O01139J50336j16669
1155A788358p63236m77107N1859j47488k50690M68220p59315j22697k09514L32928
1145h8682k38005j66785m7174p8218l90605J271481L38471r95844M72954n78097
1135e00504q39691N99711n52366Q16175m73457l53781R42453j218015P76034N60010
1125b43431o58487r4085L87517o05500K62502n71516j90616M04955O43740n82912
1115a247833p07047J288922l54018k13978O44363M29738j120320O2092J41079
1106a077002J5768m17331N70997L12394j269984P74397L29004j70616L55335l07011
1096h84049l58795M09126l4853n01490O24883n45672L10256J37318j39033j174042
$$ plain form
1086 -2156351 -1023709 -1397109 -1590922 -1127188 -1767293 -1060286 -1819505 -1426222 -1058952
1077 -1058952 -953748 -226908 -1198640 -1192492 -1568705 -1555567 -1357879 -804383 -1234620 -1242592
1067 -1242592 -1336741 -1298141 -1115208 -844667 -1174932 -916496 -1540208 -1703477 -707684 -1582308
1057 -1582308 -1193926 -965273 -979033 -950211 -1548849 -927739 -1395606 -1676534 -1201113 -1414426
1047 -1414426 -807011 -1192338 -1802675 -1784522 -1014269 -1341417 -1022827 -729926 -136226 -1080501
1037 -1080501 -1506219 -879253 -1298164 -1536210 -1779382 -1275621 -1142845 -1347333 -1869567 -1274467
1027 -1274467 -1316041 -1156703 -1846666 -868052 -1027855 -447000 -1207736 -1412200 -1449866 -1342427
1017 -1342427 -1769338 -1515750 -883109 -1117644 -887305 -251867 -779869 -1131718 -1876711 -1191277
$$ packed form
1086b156351J132642l73400j93813M63734o40105P07007p59219L93283L67270
1077a058952J05204P26840r71732O148l76213J3138J97688N53496m30237p972
1067a242592r4149L8600J82933K70541l30265K58436o23712j63269R95793q74624
1057a582308L88382K28653j3760K8822n98638O21110m67867k80928M75421k13313
1047a414426O07415l85327o10337J8153P70253l27148L18590K92901N93700r44275
1037a080501m25718O26966m18911k38046k43172N03761J32776k04488n22234N95100
1027a274467m1574J59338o89963R78614j59803N80855p60736k04464l7666J07439
1017a342427m26911K53588O32641k34535K30339O35438n28002l51849p44993O85434
$$ plain form
1007 -1191277 -1491749 -1368621 -1517452 -1166563 -1824531 -1171423 -1685125 -734963 -1279701 -1312870
997 -1312870 -1449522 -715441 -892754 -1714514 -1063143 -1157070 -1081050 -1486925 -1686366 -1274719
987 -1274719 -994998 -1873418 -1170948 -1076960 -1630484 -809434 -888223 -699112 -1147739 -1531988
977 -1531988 -1473071 -1001219 -1643748 -1642305 -999967 -675732 -1711504 -741811 -1747653 -1642223
967 -1642223 -169084 -831215 -740783 -996125 -873567 -1708442 -1409617 -648107 -1316589 -1604090
957 -1604090 -1452442 -1257001 -927236 -1787154 -1331632 -1303201 -2125043 -1991789 -1002719 -772748
947 -772748 -1423097 -1332100 -637962 -1176201 -980487 -1356581 -1181058 -1847851 -1568351 -1037747
937 -1037747 -1252544 -1633822 -1048368 -1282652 -1697544 -1252100 -1015248 -1638827 -1032124 -1337040
$$ packed form
1007a191277l00472J23128j48831L50889o57968O53108n13702R50162n44738l3169
997a312870j36652P34081j77313q21760O51371r3927P6020m05875j99441M11647
987a274719K79721q78420P02470R3988n53524Q21050p8789J89111m48627l84249
977a531988N8917M71852o42529J443O42338L24235j035772R69693j005842J05430
967a642223J473139o62131R0432k55342J22558q34875K98825P61510o68482k87501
957a604090J51648J95441L29765q59918M55522K8431q21842J33254R89070K29971
947g72748o50349R0997O94138n38239J95714l76094J75523o66793K79500N30604
937a037747k14797l81278N85454k34284m14892M45444K36852o23579O06703l04916
$$ plain form
927 -1337040 -1301350 -1277946 -1123894 -871264 -278803 -1700696 -1694984 -1055966 -1305661 -1581703
917 -1581703 -789001 -1126438 -1064230 -622351 -888567 -723576 -463364 -854054 -1547211 -538509
907 -538509 -790423 -753263 -1263873 -1389776 -1115915 -1275532 -1785935 -1420406 -1472537 -1140087
897 -1140087 -1566482 -940478 -1106290 -1010903 -976506 -769894 -1273434 -1572448 -1427851 -1343838
887 -1343838 -802066 -1248950 -621385 -912123 -1518586 -1321961 -1202126 -1344918 -1332239 -1543898
877 -1543898 -1229975 -980757 -1465383 -1581429 -1196468 -1197256 -1094405 -1412159 -889946 -1172233
867 -1172233 -1070460 -1465010 -1232708 -1609008 -1627698 -819197 -1540598 -1448908 -1476185 -1761692
857 -1761692 -630200 -1760486 -1360448 -1426441 -982717 -1193078 -1349248 -1409637 -1828291 -1714438
$$ packed form
927a337040L5690K3404J54052K52630N92461j421893N712O39018k49695k76042
917a581703P92702l37437O2208M41879k66216J64991K60212l90690o93157J008702
907e38509k51914L7160n10610j25903K73861j59617n10403L65529n2131L32450
897a140087m26395O26004j65812R5387L4397K06612n03540k99014J44597Q4013
887a343838N41772m46884O27565k90738o06463J96625J19835j42792J2679k11659
877a543898L13923K49218m84626j16046L84961p88J02851l17754N22213k82287
867a172233J01773l94550K32302l76300j8690Q08501p21401R1690k7277k85507
857a761692J131492j130286M00038o5993M43724k10361j56170o0389m18654J13853
$$ plain form
847 -1714438 -1759525 -1154599 -1462954 -1201526 -1490830 -281596 -810841 -1503526 -1085631 -859340
837 -859340 -1405336 -1953918 -599185 -723719 -1163540 -1081882 -763867 -1660361 -805444 -1152678
827 -1152678 -1580105 -1463109 -865011 -1463232 -620521 -1321059 -301456 -1160991 -1785894 -1385405
817 -1385405 -1637825 -984745 -687600 -1472836 -468162 -748930 -1278340 -925198 -870585 -971571
807 -971571 -731601 -1991400 -1362409 -1291955 -1046475 -1160603 -981880 -1010107 -1109603 -644544
797 -644544 -944450 -665093 -1570015 -1133948 -1176004 -640126 -1015485 -1733372 -2177507 -869553
787 -869553 -2227551 -1324364 -555045 -490564 -1438260 -1444854 -1543271 -1171727 -1021238 -955749 -1254443
776 -1254443 -1351076 -1230562 -1019939 -1399168 -2102053 -1203232 -992296 -1241691 -710350 -445781
$$ packed form
847a714438m5087O04926l08355K61428k89304J209234n29245o92685M17895K26291
837h59340n45996n48582J354733j24534m39821Q1658L18015q96494Q54917l47234
827a152678m27427J16996N98098n98221Q42711p00538J019603q59535o24903M00489
817a385405k52420O53080K97145p85236J004674k80768n29410L53142N4613j00986
807i71571K39970j259799O28991P0454K45480j14128J78723k8227r9496M65059
797f44544k99906K79357r04922M36067m2056N35878l75359p17887m44135J307954
787h69553j357998R03187P69319O4481r47696o594r8417L71544J50489O5489k98694
776a254443r6633J20514K10623l79229p02885Q98821K10936k49395N31341K64569
$$ plain form
766 -445781 -875151 -965950 -1884837 -1866291 -1074707 -696707 -662430 -1294170 -1882222 -874296
756 -874296 -1433588 -1340283 -967246 -952735 -952092 -1467232 -379043 -642733 -1279147 -1411210 -1108439
745 -1108439 -1438810 -1281815 -1846647 -473208 -456531 -1597311 -1324673 -956636 -459768 -1004506
735 -1004506 -1136947 -1068063 -982376 -1373663 -928880 -1307022 -1153879 -1376361 -904847 -1401284
725 -1401284 -1016409 -1126694 -970812 -1154393 -1480554 -1404285 -958093 -791564 -1157124 -417242
715 -417242 -1049349 -752362 -809501 -739101 -867325 -1214884 -839514 -88604 -893039 -1125375
705 -1125375 -993091 -1180842 -1064332 -1182915 -1262378 -979073 -1406177 -1269469 -566511 -1244615
695 -1244615 -1928236 -1124004 -880765 -442281 -1264239 -669989 -297248 -1472724 -1426195 -1196821
$$ packed form
766d45781m29370r0799r18887J8546P91584L78000L4277o31740n88052J007926
756h74296n59292R3305L73037J4511O43n15140J088189k63690o36414j32063L02771
745a108439l30371J56995n64832J373439J6677j140780K72638L68037M96868n44738
735a004506j32441O8884Q5687l91287M44783l78142J53143k22482M71514m96437
725a401284L84875j10285J55882j83581l26161P6269M46192J66529l65560P39882
715d17242o32107K96987n7139P0400j28224l47559L75370P50910q04435k32336
705a125375J32284j87751J16510j18583p9463K83305m27104J36708P02958o78104
695a244615o83621Q04232K43239M38484q21958N94250L72741j175476M6529K29374
$$ plain form
685 -1196821 -1077621 -426003 -798962 -1114854 -1109000 -1237385 -593589 -1175539 -1294047 -2090138
675 -2090138 -1486887 -1227364 -443159 -985983 -782414 -682411 -1147486 -1532445 -1740742 -1254964
665 -1254964 -1265066 -764644 -1265479 -1277529 -698260 -1834924 -732174 -1364410 -480389 -1339164
655 -1339164 -2264314 -1532658 -1342240 -807896 -1038047 -1166206 -1068876 -1760282 -1614917 -1268084
645 -1268084 -1109578 -1278969 -1040246 -1608877 -1321480 -949856 -910751 -1486382 -1604269 -590276
635 -590276 -1920425 -1366086 -979171 -1734517 -1405436 -1541541 -896618 -1231352 -1257392 -1095772
625 -1095772 -1006140 -741218 -731264 -1375226 -999122 -1580103 -772914 -986186 -658046 -1130426
615 -1130426 -1022007 -440148 -1328877 -1260303 -835468 -779828 -1310980 -823932 -633426 -1069130
$$ packed form
685a196821J19200O51618l72959l15892N854j28385O43796n81950j18508p96091
675b090138O03251K59523P84205n42824K03569J00003m65075l84959k08297M85778
665a254964j0102N00422n00835j2050N79269j136664J102750o32236Q84021q58775
655a339164r25150P31656J90418N34344k30151j28159R7330o91406J45365L46833
645a268084J58506j69391K38723n68631K87397L71624L9105n75631j17887J013993
635e90276j330149N54339L86915p55346L29081j36105O44923l34734k6040J61620
625a095772Q9632K64922R954o43962L76104n80981Q07189k13272L28140m72380
615a130426J08419N81859q88729O8574M24835N5640n31152M87048J90506m35704
$$ plain form
605 -1069130 -912728 -1040611 -1417657 -337279 -541458 -955028 -1077357 -790216 -554265 -1414361
595 -1414361 -688057 -1727104 -731129 -572558 -1438037 -879680 -618991 -1322599 -437339 -1001099
585 -1001099 -432940 -863187 -1190431 -645351 -860315 -1767743 -1331211 -1685243 -515725 -1497154
575 -1497154 -722464 -818951 -1451571 -376654 -393252 -1545221 -842763 -898327 -601355 -368565
565 -368565 -1503488 -856731 -1073722 -1311740 -289886 -660112 -1144597 -805302 -1753312 -872396
555 -872396 -1527730 -1525790 -1206765 -1594150 -1462210 -1496055 -1288758 -913011 -1261802 -811407
545 -811407 -1582378 -1984769 -1750987 -1798382 -662637 -1521774 -91486 -792765 -619215 -588294
535 -588294 -973459 -1026668 -1007640 -1199215 -933093 -1421747 -1000984 -1189683 -1157177 -766204
$$ packed form
605a069130J56402j27883l77046J080378k04179m13570j22329K87141K35951q60096
595a414361P26304j039047R95975J58571q65479N58357K60689p03608Q85260n63760
585a001099N68159m30247l27244N45080k14964r07428M36532l54032J169518r81429
575a497154P74690r6487o32620J074917j6598j151969P02458n5564K96972K32790
565c68565j134923O46757k16991k38018J021854l70226m84485L39295r48010Q80916
555h72396o55334J940L19025l87385J31940l3845K07297L75747l48791M50395
545h11407p70971m02391K33782m7395J135745q59137J430288p01279J73550L0921
535e88294l85165n3209J9028j91575K66122m88654M20763j88699L2506L90973
$$ plain form
525 -766204 -1365767 -1108038 -736203 -573145 -189532 -1085226 -1248957 -700576 -900749 -1659152
515 -1659152 -751141 -724716 -1667438 -1583880 -1795895 -2420798 -296470 -1484071 -834037 -1062094
505 -1062094 -1139063 -718269 -1334342 -1243820 -1554292 -839715 -466455 -1570738 -1263455 -958482
495 -958482 -445799 -1290114 -1131238 -708565 -1639857 -884112 -674211 -1083613 -947532 -1154860
485 -1154860 -1630561 -1786897 -1240721 -695561 -1948397 -1205216 -962306 -1129984 -810510 -814223
475 -814223 -767016 -1563479 -1223940 -1772884 -893001 -507779 -1169719 -858648 -1636250 -957008
465 -957008 -551340 -1430315 -1115188 -988312 -1400371 -785694 -81061 -912348 -430407 -1015210
455 -1015210 -1220725 -877154 -901242 -1344022 -1005495 -1112543 -1201655 -940496 -834301 -820133
$$ packed form
525g66204n99563K57729L71835J63058L83613q95694j63731N48381k00173p58403
515a659152R08011K6425r42722Q3558k12015o24903K124328j187601O50034k28057
505a062094p6969M20794o16073R0522l10472P14577L73260j104283L07283L04973
495i58482N12683q44315J58876M22673r31292P55745K09901m09402J36081k07328
485a154860m75701j56336N46176N45160j252836P43181K42910j67678L19474l713
475h14223M7207p96463L39539n48944Q79883L85222o61940L11071p77602O79242
465i57008M05668q78975L15127J26876m12059O14677P04633q31287M81941n84803
455a015210k05515L43571k4088m42780L38527j07048q9112K61159J06195J4168
$$ plain form
445 -820133 -817139 -1174385 -872380 -667287 -1626894 -1232882 -1107051 -532469 -1326389 -1087990
435 -1087990 -1313950 -585353 -785013 -346358 -1039727 -413750 -478049 -1291557 -794413 -1498998
425 -1498998 -1486984 -1095162 -1039862 -677323 -1320128 -1513570 -708690 -1321108 -867304 -1044951
415 -1044951 -53233 -1426518 -807229 -801717 -3273 -739369 -1010728 -925805 -914244 -1184966
405 -1184966 -1001181 -1215917 -1601195 -1109569 -1950763 -446742 -1199382 -1332169 -766909 -1561049
395 -1561049 -510336 -1036196 -1465952 -1401120 -760606 -892158 -1211431 -901998 -571034 -588555
385 -588555 -1491538 -289288 -1381136 -1256860 -2065660 -942564 -1368032 -1652055 -817796
376 -817796 -909402 -1616177 -1444381 -1326179 -949161 -558510 -1137290 -1071861 -1064959 -548028 -1019910
$$ packed form
445h20133K994l57246L02005K05093r59607L94012J25831N74582p93920K38399
435a087990k25960P28597j99660M38655o93369O25977o4299q13508M97144p04585
425a498998J2014L91822N5300L62539o42805j93442Q04880o12418M53804j77647
415a044951R91718j373285O19289N512P98444p36096k71359Q4923J1561k70722
405a184966J83785k14736l85278M91626q41194J504021p52640j32787N65260p94140
395a561049J050713n25860m29756O4832O40514j31552l19273L09433L30964j7521
385e88555r02983J202250j091848J24276q08800J123096m25468k84023Q34259
376h17796r1606p06775J71796J18202L77018L90651n78780O5429O902N16931m71882
$$ plain form
365 -1019910 -1584468 -903016 -756214 -503426 -506396 -888760 -90607 -1334815 -1071604 -1429187
355 -1429187 -1224492 -577028 -935203 -1244312 -759315 -814100 -908263 -1519647 -1243224 -943748
345 -943748 -936347 -630542 -1518768 -1305298 -633812 -970945 -633922 -1580884 -1786691 -1378187
335 -1378187 -1563265 -1401673 -668807 -1724487 -549906 -757251 -796180 -839097 -859093 -732188
325 -732188 -754792 -652665 -1238693 -782762 -1185345 -1492105 -1213824 -967637 -545634 -184904
315 -184904 -933908 -1134752 -1357756 -718855 -1538753 -1136821 -1505605 -890324 -1209822 -813290
305 -813290 -766232 -821496 -773169 -1285335 -1813111 -1156304 -583245 -1353505 -1425147 -795682 -895013
294 -895013 -920473 -1100884 -980526 -1049624 -320843 -671147 -544295 -1121706 -844710 -1033877
$$ packed form
365a019910n64558O81452J46802K52788k970l82364P98153j244208K63211l57583
355a429187K04695O47464l58175l09109M84997n4785r4163o11384K76423K99476
345i43748P401L05805q88226K13470O71486l37133L37023r46962k05807M08504
335a378187j85078J61592P32866j055680J174581k07345l8929m2917j9996J26905
325g32188k2604J02127n86028M55931m02583l06760K78281K46187M22003L60730
315a84904p49004k00844k23004O38901q19898M01932l68784O15281l19498L96532
305h13290M7058n5264M8327n12166n27776O56807N73059p70260p1642O29465r9331
294h95013k5460j80411J20358o9098P28781l50304J26852n77411K76996j89167
$$ plain form
284 -1033877 -1035957 -1239377 -1619719 -1534195 -961267 -373910 -755506 -1329776 -798461 -1247718
274 -1247718 -351963 -613040 -1579294 -757108 -222543 -1075286 -802575 -967596 -1231674 -1448088
264 -1448088 -904126 -581644 -901689 -685104 -1207604 -936747 -1480636 -1221290 -1096038 -1611062
254 -1611062 -413947 -1072546 -1127170 -921701 -668419 -1561372 -820969 -1396493 -1037015 -526331
244 -526331 -591402 -1418451 -1497646 -423918 -1236850 -919967 -1407151 -1499143 -1178641 -1468734
234 -1468734 -507088 -1429356 -1269101 -1124555 -982695 -504416 -1008626 -330047 -1094293 -892827
224 -892827 -569301 -793842 -1594400 -823127 -689166 -1737081 -1286987 -934057 -722335 -479471
214 -479471 -539625 -1152378 -532934 -107770 -806750 -1026099 -1182384 -806823 -668600 -387656
$$ packed form
284a033877k080k03420l80342Q5524N72928N87357l81596n74270N31315m49257
274a247718Q95755k61077r66254Q22186N34565q52743K72711j65021k64078k16414
264a448088N43962L22482l20045K16585n22500K70857n43889K59346J25252n15024
254a611062J197115o58599n4624K05469K53282q92953P40403n75524L59478N10684
244e26331o5071q27049p9195J073728q12932L16883m87184r1992L20502k90093
234a468734R61646r22268J60255J44546J41860M78279n04210O78579p64246K01466
224h92827L23526k24541q00558P71273J33961j047915M50094L52930K11722K42864
214d79471o0154o12753O19444M25164o98980k19349j56285L75561J38223K80944
$$ plain form
204 -387656 -700647 -502511 -921739 -855232 -333729 -1086622 -764331 -995421 -828628 -1335391
194 -1335391 -160636 -949307 -1074239 -631239 -912293 -838312 -1396885 -524837 -1134732 -761730
184 -761730 -459373 -632341 -1041963 -587067 -1286865 -894927 -1673584 -1891814 -1198429 -841114
174 -841114 -745295 -1253704 -802739 -1653168 -1047598 -630054 -1011268 -1515992 -916685 -815223
164 -815223 -426253 -1042252 -573774 -605932 -1538615 -154876 -924621 -724137 -1352955 -1207560
154 -1207560 -724432 -591746 -333984 -1039673 -1528614 -1519350 -1557275 -1051770 -355596 -1118925
144 -1118925 -1137025 -852114 -761301 -1598822 -1150124 -1047896 -692949 -1053458 -939157 -1107622
134 -1107622 -718907 -522397 -841557 -816334 -630819 -1213440 -1188940 -479975 -1047630 -920732
$$ packed form
204c87656l12991J98136m19228O6507N21503p52893L22291k31090J66793n06763
194a335391J174755p88671j24932M43000k81054P3981n58573Q72048o09895L73002
184g61730L02357j72968m09622M54896o99798L91938p78657k18230O93385L57315
174h41114R5819n08409M50965q50429O05570M17544l81214n04724N99307J01462
164h15223L88970o15999M68478l2158r32683J383739p69745K00484o28818J45395
154a207560M83128J32686K57762p05689m88941R264l7925N05505O96174p63329
144a118925j8100K84911R0813q37521M48698J02228L54947l60509J14301j68465
134a107622L88715J96510l19160K5223J85515n82621K4500P08965n67655J26898
$$ plain form
124 -920732 -522694 -864186 -1137945 -1186343 -854912 -1012234 -1274073 -1270489 -1548534 -881574
114 -881574 -1008581 -962329 -824429 -846693 -843601 -1137332 -797064 -341139 -622523 -791961 -1231101
103 -1231101 -856772 -873068 -1238063 -826997 -1060315 -1069261 -920990 -1165992 -805543 -914595
93 -914595 -519669 -1062301 -1080791 -424071 -495552 -428500 -891319 -911422 -1328717 -1116667 -976382
82 -976382 -432796 -1061699 -1085670 -858249 -1403014 -1113331 -1022109 -1246745 -1019214 -403780
72 -403780 -1182665 -1267360 -701509 -1061758 -781912 -1035086 -666797 -942494 -1197886 -932694
62 -932694 -1090174 -456853 -844587 -1225952 -622572 -1185089 -752554 -883735 -939633 -545412
52 -545412 -925089 -788155 -834340 -432892 -918281 -683709 -774544 -559746 -1410689 -901607
$$ packed form
124i20732L98038l41492k73759m8398L31431j57322k61839L584k78045O66960
114h81574j27007M6252J37900k2264L092k93731L40268M55925k81384j69438m39140
103a231101L74329j6296l64995M11066k33318q946J48271k45002L60449j09052
93i14595L94926n42632j8490O56720p1481O7052m62819k0103m17295K12050J40285
82i76382N43586o28903k3971K27421n44765K89683R1222k24636K27531O15434
72d03780p78885q4695N65851l60249K79846k53174L68289k75697k55392K65192
62i32694j57480O33321l87734l81365O03380n62517M32535j31181n5898L94221
52e45412l79677J36934m6185M01448m85389K34572r0835K14798q50943N09082
$$ plain form
42 -901607 -623686 -815218 -846970 -993820 -970699 -709509 -742329 -1039582 -1380774 -534713 -1192365
31 -1192365 -1063225 -739541 -1125579 -1171822 -1029365 -1173175 -786266 -737903 -869915 -862017 -1074173
20 -1074173 -1078574 -1116755 -869601 -710343 -906565 -658722 -814963 -914124 -314767 -802163 -861194
9 -861194 -1310058 -578278 -905687 -418017 -540743 -640873 -823411 -944404 -717102
0 -717102
$$ packed form
42i01607K77921j91532l1752j46850K3121K61190l2820k97253l41192Q46061o57652
31a192365J29140L23684l86038m6243J42457j43810L86909M8363j32012P898k12156
20a074173m401l8181K47154J59258j96222K47843j56241r9161N99357m87396n9031
9h61194m48864P31780l27409M87670j22726j00130j82538j20993K27302
0g17102
$$ Imaginary data points
##PAGE= N=2
##DATA TABLE= (X++(I..I)), XYDATA
$$ plain form
16383 -6157041 -5672571 -6407510 -5943949 -5456121 -5895032 -5513955 -6059816 -5211915 -5639966
16374 -5639966 -5491239 -5372552 -5187373 -5473218 -4762315 -5109615 -4736066 -4895842 -5040565
16365 -5040565 -4625723 -4509492 -4545858 -4394363 -3965218 -4022308 -3857484 -3909147 -3601397 -4086053
16355 -4086053 -3422318 -3737328 -4524857 -3525254 -3412872 -3584157 -3406166 -3204510 -3367498
16346 -3367498 -3301881 -3016862 -3406910 -3051827 -2684279 -3064137 -2813997 -2784762 -2927040 -2842281
16336 -2842281 -2565178 -2092267 -2113267 -2486367 -2259559 -2342193 -1609753 -2101701 -2245669 -1775417
16326 -1775417 -1159946 -1819343 -1434787 -2148526 -1110984 -1888473 -1350361 -1381300 -2155419
16317 -2155419 -1683598 -1187301 -1911420 -1717002 -1335130 -1500274 -1048516 -908514 -837250 -222680
$$ packed form
16383f157041M84470p34939M63561M87828m38911L81077n45861Q47901m28051
16374e639966J48727J18687J85179k85845P10903l47300L73549j59776j44723
16365e040565M14842J16231l6366J51495M29145n7090J64824n1663L07750m84656
16355d086053O63735l15010p87529R99603J12382j71285J77991K01656j62988
16346c367498O5617K85019l90048L55083L67548l79858K50140K9235j42278Q4759
16336b842281K77103M72911k1000l73100K26808q2634P32440m91948j43968M70252
16326a775417O15471o59397L84556p13739J037542p77489N38112l0939p74119
16317b155419M71821M96297p24119J94418L81872j65144M51758J40002P1264O14570
$$ plain form
16307 -222680 -631429 -772137 -485529 -316062 -728727 -257808 -832845 -710048 -317209 -107772
16297 -107772 125419 170656 92039 -216569 -448229 710981 -2803 371651 807464 -298264
16287 -298264 452466 471573 627580 119123 911919 851133 571183 748764 454974 852253
16277 852253 1613968 946421 1496623 1439291 1237130 1814557 985366 1289919 1305301 2043885
16267 2043885 1429586 1126841 1768426 1122766 1734849 2182980 1605013 2976133 1537233
16258 1537233 1639416 2267017 1566457 2062071 2344821 2178394 2189563 2495117 1521452 1518878
16248 1518878 2170851 2445373 1787365 2665183 2896580 2824683 2207129 2478120 3035384 2413855
16238 2413855 3137226 2721110 2705655 2151343 3193513 3057840 2918989 2143844 3184473
$$ packed form
16307b22680m08749j40708K86608J69467m12665M70919n75037J22797L92839K09437
16297a07772K33191M5237p8617l08608k31660J159210p13784L74454M35813j105728
16287b98264P50730J9107J56007n08457P92796o0786k79950J77581k93790L97279
16277H52253P61715o67547N50202n7332k02161N77427q29191L04553J5382P38584
16267B043885o14299l02745O41585o45660O12083M48131n77967J371120j438900
16258A537233J02183O27601p00560M95614K82750j66427J1169L05554r73665k574
16248A518878O51973K74522o58008Q77818K31397p1897o17554K70991N57264o21529
16238B413855P23371m16116j5455n54312J042170j35673j38851p75145J040629
$$ plain form
16229 3184473 2641384 2387040 2914116 3203081 3704837 2836291 3539338 3048873 3894674
16220 3894674 3090699 3588017 4059013 2983370 2964550 3397979 4026428 3440446 3264738
16211 3264738 3380164 3801272 3797607 3957665 3951682 4113455 3603117 4665884 3815265 3787062
16201 3787062 3303190 4251937 3606402 3438162 3851893 3920291 3600527 4242999 3618033 4785584
16191 4785584 4078094 3531901 4479078 3656785 3878534 3610907 4630634 3713912 4989651
16182 4989651 3815519 4162982 5046071 4962062 4349108 4962931 3801481 4700526 5256564
16173 5256564 4771571 5112030 4553550 4427594 4501379 5118542 4456632 5043302 4307491 5512057
16163 5512057 4447255 4289956 5090658 4809115 4367101 5063260 5027243 4991046 5394016 4683703
$$ packed form
16229C184473n43089k54344N27076K88965N01756q68546P03047m90465Q45801
16220C894674q03975M97318M70996j075643j8820M33429O28449n85982j75708
16211C264738J15426M21108l665J60058n983J61773n10338J062767q50619k8203
16201C787062m83872R48747o45535j68240M13731O8398l19764O42472o24966J167551
16191D785584p07490n46193R47177q22293K21749k67627J019727r16722J275739
16182D989651j174132L47463Q83089q4009o12954O13823j161450Q99045N56038
16173E256564m84993L40459n58480j25956P3785O17163o61910N86670p35811J204566
16163E512057j064802j57299Q00702k81543m42014O96159l6017l6197M02970p10313
$$ plain form
16153 4683703 4442259 4862805 4508911 5195081 5414196 4775397 5122628 5342259 5961144
16144 5961144 5481224 5567737 4953389 5052752 4644233 4763847 5863282 5491672 5460652 5249585
16134 5249585 4770206 5214187 5585026 5737882 5970479 5318402 5363750 5458887 5766543 5253021
16124 5253021 5067306 4631484 4657561 5305786 5603762 5237221 5294972 5749642 5057437 5564681
16114 5564681 4729202 5333282 5477089 5689548 5646374 5744621 5022485 5342851 5124938 5166461
16104 5166461 4818990 5353656 4896390 5167765 4814661 4857509 5886426 5601000 5013412
16095 5013412 5286368 5483098 5777744 5750261 5895958 4643776 6130222 5831054 4927656
16086 4927656 6075675 5213758 5580565 5898763 4680882 5762923 5282707 6205669 6181771
$$ packed form
16153D683703k41444M20546l53894O86170K19115o38799L47231K19631O18885
16144E961144m79920Q6513o14348R9363m08519J19614J099435l71610l1020k11067
16134E249585m79379M43981L70839J52856K32597o52077M5348R5137L07656n13522
16124E253021j85715m35822K6077O48225K97976l66541N7751M54670o92205N07244
16114E564681q35479O04080J43807K12459m3174R8247p22136L20366k17913M1523
16104E166461l47471N34666m57266K71375l53104M2848J028917k85426n87588
16095E013412K72956J96730K94646k7483J45697j252182J486446k99168r03398
16086D927656J148019q61917L66807L18198j217881J082041m80216R22962k3898
$$ plain form
16077 6181771 5323098 5565281 5339975 5196725 5470385 5323082 4365921 5207623 5113970 6213173
16067 6213173 5886552 5715577 5536381 5527661 5485935 6058760 5101236 5003926 5721421 4733408
16057 4733408 5950591 5247362 6129768 5747957 4957051 5291246 5558119 5927615 5385542
16048 5385542 5207103 5256859 5099374 5088797 5570797 5693983 5776483 4893782 5412279 5609225
16038 5609225 6181702 5461725 6101559 5481755 6922462 5902729 5756473 5758495 5170648
16029 5170648 5673113 5576321 5186207 5371431 6296030 5783987 6012029 6317871 5349627 5744973
16019 5744973 5079474 5406627 5529023 5130936 6015181 5905408 6109502 5484300 5266133
16010 5266133 5738225 5632907 5918824 5757046 6021246 5996388 5356260 5720217 5014365 4735566
$$ packed form
16077F181771q58673K42183k25306j43250K73660j47303r57161Q41702r3653J099203
16067F213173l26621j70975j79196q720m1726N72825r57524r7310P17495r88013
16057D733408J217183p03229Q82406l81811p90906L34195K66873L69496n42073
16048E385542j78439M9756j57485j0577M82000J23186Q2500q82701N18497J96946
16038E609225N72477p19977O39834o19804J440707j019733j46256K022n87847
16029E170648N02465r6792l90114J85224R24599n12043K28042L05842r68244L95346
16019E744973o65499L27153J22396l98087Q84245j09773K04094o25202k18167
16010E266133M72092j05318K85917j61778K64200k4858o40128L63957p05852k78799
$$ plain form
16000 4735566 5514590 5389850 5173171 5148320 5791992 5628323 6061208 5138437 5685237 5948736
15990 5948736 5407037 5863889 5502166 5746383 6104163 5913031 5217566 4706298 5562918
15981 5562918 6200032 6148373 5511194 5915567 5772660 5891055 5909569 5703143 5463467 5175903
15971 5175903 5862155 6188776 6624675 5624755 5652384 5749475 5095859 6039456 5795405 5024075
15961 5024075 5588020 5613006 5503011 5678750 5717256 5910814 5172142 6036181 5785552 5857667
15951 5857667 5716022 5860752 5633296 5803669 5826391 5547716 4712848 6786939 5827752
15942 5827752 5867577 4980517 5549999 5504916 5128994 5617231 5799207 5215840 5683969 6480485
15932 6480485 5573234 5877081 5892251 6213990 5727104 5831662 6006266 5273273 5628478 5942495
$$ packed form
16000D735566P79024j24740k16679k4851O43672j63669M32885r22771N46800K63499
15990E948736n41699M56852l61723K44217L57780j91132o95465n11268Q56620
15981E562918O37114n1659o37179M04373j42907J18395J8514k06426k39676k87564
15971E175903O86252L26621M35899r99920K7629R7091o53616R43597k44051p71330
15961E024075N63945K4986j09995J75739L8506J93558p38672Q64039k50629P2115
15951E857667j41645J44730k27456J70373K2722k78675q34868K074091r59187
15942E827752L9825q87060N69482m5083l75922M88237J81976n83367M68129P96516
15932F480485r07251L03847J5170L21739m86886J04558J74604p32993L55205L14017
$$ plain form
15922 5942495 5682798 5822784 4916648 5768535 5836654 5292100 6147052 5988978 5577011 5280692
15912 5280692 6319246 5772124 6578613 5327878 5827769 5529169 5066950 4960199 5134631
15903 5134631 5196474 5751215 5285412 4865357 5530671 5648606 6154319 6315017 5546405 5575502
15893 5575502 6141067 5744156 5313555 5934373 5488061 5653995 5560950 5722665 5839402 5884723
15883 5884723 5977707 4992537 5059524 5872452 6067394 5536235 6094503 5640319 5500332 5352039
15873 5352039 5882956 5264956 5508800 5288871 4917879 4981001 5418091 6034044 5609783 5812574
15863 5812574 5846202 5266813 5857802 5963966 6073270 5797703 6001667 5860297 5028827 5846671
15853 5846671 5649604 6378875 5825971 6058684 6836785 6081632 5827446 5344854 5346251 5446921
$$ packed form
15922E942495k59697J39986r06136Q51887O8119n44554Q54952j58074m11967k96319
15912E280692J038554n47122Q06489j250735M99891k98600m62219j06751J74432
15903E134631O1843N54741m65803m20055O65314J17935N05713J60698p68612K9097
15893E575502N65565l96911m30601O20818m46312J65934r3045J61715J16737M5321
15883E884723R2984r85170O6987Q12928J94942n31159N58268m54184j39987j48293
15873E352039N30917o18000K43844k19929l70992O3122M37090O15953m24261K02791
15863E812574L3628n79389N90989J06164J09304k75567K03964j41370q31470Q17844
15853E846671j97067P29271n52904K32713P78101p55153k54186m82592J397J00670
$$ plain form
15843 5446921 5513807 6458706 5937329 6220781 5247006 5628782 6132707 5206393 5964818 5715554
15833 5715554 6342784 5500319 5465236 5931537 6399457 6186575 5855778 5146352 6122676 5452271
15823 5452271 5748131 5786486 5927366 5646557 5862193 5360848 6385595 5472684 5286562
15814 5286562 5889000 6270090 5534653 5272340 5537100 6539402 6118428 5550062 5548816 5554244
15804 5554244 5885511 5258529 5699591 5454148 5868065 5465711 5566574 6399481 5825758
15795 5825758 6010075 5980261 6010289 6106370 5907320 5420192 5384154 5967873 5480126 5777836
15785 5777836 6176079 6497672 5124351 6051402 5917857 5143259 5469864 5917358 6410117
15776 6410117 6261284 6243482 5711801 6082013 5780771 5956839 6531330 5342869 5921488
$$ packed form
15843E446921O6886R44899n21377K83452r73775L81776N03925r26314P58425k49264
15833E715554O27230q42465l5083M66301M67920k12882l30797p09426R76324o70405
15823E452271K95860L8355J40880k80809K15636n01345J024747r12911j86122
15814E286562O02438L81090p35437k62313K64760J002302m20974n68366j246N428
15804E554244L31267o26982M41062k45443M13917m02354J00863Q32907n73723
15795E825758J84317k9814L0028R6081j99050m87128l6038N83719m87747K97710
15785E777836L98243L21593j373321R27051j33545p74598L26605M47494M92759
15776F410117j48833j7802n31681L70212l01242J76068N74491j188461N78619
$$ plain form
15767 5921488 6112348 6189637 6032973 5526305 6306647 5101306 5585762 5510405 5844162 5857132
15757 5857132 6182840 6567316 6274165 5239532 5576697 5310144 6096633 5423588 5946016
15748 5946016 5674659 5890376 5972679 5431248 6241016 5563137 5419931 5703300 5231521 5483572
15738 5483572 5405912 5967691 5523383 6672242 5962400 6176078 6279878 6120476 5277991
15729 5277991 5794248 5622352 5927619 6634573 6456195 5824365 5967391 6214095 6200769 5629697
15719 5629697 5665966 5456064 5541182 6505410 5948732 5844985 5001254 6077013 6583568 6280130
15709 6280130 6057172 5616128 5815408 5322005 5808167 6257503 5940197 5957145 5641741 5593010
15699 5593010 5609822 5588065 5304960 5859176 6074867 5737277 6514557 5771327 6251129 5548326
$$ packed form
15767E921488J90860P7289j56664n06668P80342j205341M84456p5357L33757J2970
15757E857132L25708L84476k93151j034633L37165k66553P86489o73045N22428
15748E946016k71357K15717Q2303n41431Q09768o77879j43206K83369m71779K52051
15738E483572p7660N61779m44308J148859p09842K13678J03800j59402q42485
15729E277991N16257j71896L05267P06954j78378o31830J43026K46704j3326n71072
15719E629697L6269k09902Q5118R64228n56678j03747q43731J075759N06555l03438
15709F280130k22958m41044J99280m93403M86162M49336l17306J6948l15404m8731
15699E593010J6812k1757k83105N54216K15691l37590P77280p43230M79802p02803
$$ plain form
15689 5548326 5669891 5525400 5981998 5535236 6524046 6192024 6157919 6070355 6008966 6362549
15679 6362549 5421307 5985967 5166194 5686351 6100915 5392003 5516812 5241893 5179613 5841861
15669 5841861 5533416 5906462 5867881 5774365 6138857 5808953 5834301 5295334 6205587 6061931
15659 6061931 6266553 6160341 6243228 6593318 6069810 5857189 5901325 6032429 5822607 5813775
15649 5813775 5261069 5913566 5702171 5444105 6005850 5995959 5267167 6246875 5526312 6311081
15639 6311081 6179190 5276216 5540884 6089757 5585596 6102117 5958584 5720181 5283623
15630 5283623 6016655 6351711 6142701 5121162 6226305 6037591 6758616 6379931 6823044
15621 6823044 6628625 6749255 5502773 5697311 5219053 5796438 5731366 5378590 6060603
$$ packed form
15689E548326J21565j44491M56598m46762R88810l32022l4105q7564o1389L53583
15679F362549r41242N64660q19773N20157M14564p08912J24809k74919o2280O62248
15669E841861l08445L73046l8581r3516L64492l29904K5348n38967R10253j43656
15659F061931K04622j06212Q2887L50090n23508k12621M4136J31104k09822q832
15649E813775n52706O52497k11395k58066N61745r891p28792R79708p20563P84769
15639F311081j31891r02974K64668N48873n04161N16521j43533k38403m36558
15630E283623P33032L35056k09010j021539J105143j88714P21025l78685M43113
15621F823044j94419J20630j246482J94538m78258N77385o5072l52776O82013
$$ plain form
15612 6060603 6296950 5567123 6049417 5719167 5736112 5855594 6402204 6493243 5652724 5946822
15602 5946822 5929865 6329613 5453376 6314665 5357510 6480819 6237988 7056244 6142078
15593 6142078 5834778 5961383 5751906 5557106 5439344 5572804 6034607 5505011 5309018
15584 5309018 6146424 6572560 5608514 6016104 6493441 6438525 6492897 6176715 6218770 6523416
15574 6523416 6253177 5921266 5671575 6444496 6345179 5859756 5996403 6060890 4611447 5830072
15564 5830072 6110777 6794295 6422917 6887887 6427857 5821371 5999455 7080732 6826532
15555 6826532 5944149 5743085 6456188 5956055 6153610 6236133 5539868 5776130 5854977 5932373
15545 5932373 5812038 6034381 6319415 6307930 5724524 6125100 5741626 6296490 6661773 6201187
$$ packed form
15612F060603K36347p29827M82294l30250J6945J19482N46610R1039q40519K94098
15602E946822j6957L99748q76237Q61289r57155J123309k42831Q18256r14166
15593F142078l07300J26605k09477j94800j17762J33460M61803n29596j95993
15584E309018Q37406M26136r64046M07590M77337n4916N4372l16182M2055L04646
15574F523416k70239l31911k49691P72921r9317m85423J36647O4487j449443J218625
15564E830072K80705O83518l71378M64970m60030o06486J78084J081277k54200
15555F826532q82383k01064P13103n00133J97555Q2523o96265K36262P8847P7396
15545E932373j20335K22343K85034j1485n83406M00576l83474N54864L65283m60586
$$ plain form
15535 6201187 5953630 6167824 6884966 5627271 6398985 6871233 6620436 5503408 5406759
15526 5406759 6215852 5813124 5659059 5547047 6041617 6454232 5889471 6412743 5575371
15517 5575371 6350685 6605971 6753132 6399303 5943224 5796594 6382871 6457892 6170275 6269697
15507 6269697 5771842 6008418 6811351 5918402 5984498 5686658 6060414 5671413 6775984
15498 6775984 5949990 5558193 5800959 5766971 6172057 6249046 6211399 6721348 6418880 6522144
15488 6522144 5623782 5546478 5718291 5985520 6045551 6616287 6003001 6301041 6587475 6151608
15478 6151608 5785145 5730901 6028414 6782042 6449421 6798238 6291526 6044055 5893756 6779831
15468 6779831 6457160 5330360 6762845 5988375 5926276 6733860 5919880 6231572 5905542
$$ packed form
15535F201187k47557K14194P17142j257695P71714M72248k50797j117028r6649
15526E406759Q09093m02728j54065j12012M94570M12615n64761N23272q37372
15517E575371P75314K55286J47161l53829m56079j46630N86277P5021k87617R9422
15507F269697m97855K36576Q02933q92949O6096k97840L73756l89001J104571
15498F775984q25994l91797K42766l3988M05086P6989l7647N09949l02468J03264
15488F522144q98362p7304J71813K67229O0031N70736o13286K98040K86434m35867
15478F151608l66463n4244K97513P53628l32621L48817n06712k47471j50299Q86075
15468F779831l22671j126800J432485p74470o2099Q07584q13980L11692l26030
$$ plain form
15459 5905542 5736256 6408985 6007553 5906305 6843790 6407203 5996126 6346240 5384383
15450 5384383 6443331 6924437 6463140 6084777 6213008 6108149 6111741 6598871 6389829 5991712
15440 5991712 5924689 6116169 6156811 6360622 6145980 5658900 5264464 6020987 5833029 6632615
15430 6632615 5986936 5982294 5730939 6338886 6611561 6698152 5561293 6520148 5804227 5909162
15420 5909162 6255519 6038540 6281081 6350248 6678481 6278443 6305399 6838019 5848231 6283489
15410 6283489 6005467 7133311 5916493 6159958 7073283 6728010 6450346 5592518 6981195
15401 6981195 5854601 6588805 6537302 6022211 6636459 6022854 6023124 6574558 6210022 5838387
15391 5838387 6019701 6490758 5929550 6607087 5879964 6112188 6665299 5769570 6394182
$$ packed form
15459E905542j69286O72729m01432j01248R37485m36587m11077L50114r61857
15450E384383J058948M81106m61297l78363J28231j04859L592M87130k09042l98117
15440E991712o7023J91480M0642K03811k14642m87080l94436P56523j87958P99586
15430F632615o45679m642k51355O07947K72675Q6591j136859R58855p15921J04935
15420E909162L46357k16979K42541O9167L28233m00038K6956N32620r89788M35258
15410F283489k78022J127844j216818K43465R13325l45273k77664q57828J388677
15401F981195j126594P34204n1503n15091O14248o13605K70N51434l64536l71635
15391E838387J81314M71057n61208O77537p27123K32224N53111q95729O24612
$$ plain form
15382 6394182 6344982 6280710 6847113 5497974 6231848 6350527 5952679 6080542 6282254 6739780
15372 6739780 6284427 6942961 6229428 6187535 6423136 6268064 6715168 6333467 6589659 6483168
15362 6483168 6872049 6651228 6608657 7397536 5754593 6342060 6248169 6427014 6250710 6401053
15352 6401053 6606336 6007286 6498474 6446135 5697943 6622238 6173119 6212174 6092065 6289675
15342 6289675 6579844 6368536 5425310 6178630 6681209 6597175 6435200 6815414 6567142 5882580
15332 5882580 6756578 6258401 6147628 6477937 6976478 5956212 6174503 5718696 6206438
15323 6206438 6377414 6584670 5771157 6002271 6156846 6224250 6208073 6555119 6565399 6416886
15313 6416886 6360166 6592132 7103509 5683337 6532698 6251777 6050993 5981762 6787430 6303453
$$ packed form
15382F394182m9200o4272N66403j349139P33874J18679l97848J27863K01712M57526
15372F739780m55353O58534p13533m1893K35601j55072M47104l81701K56192j06491
15362F483168L88881k20821m2571P88879j642943N87467r3891J78845j76304J50343
15352F401053K05283n99050M91188n2339p48192R24295m49119L9055j20109J97610
15342F289675K90169k11308r43226P53320N02579q4034j61975L80214k48272o84562
15332E882580Q73998m98177j10773L30309M98541j020266K18291m55807M87742
15323F206438J70976K07256q13513K31114J54575O7404j6177L47046J0280j48513
15313F416886n6720K31966N11377j420172Q49361k80921k00784o9231Q05668m83977
$$ plain form
15303 6303453 6401013 6464959 5878637 5945975 5591331 6630516 5628180 5785411 6374919 5619983
15293 5619983 5573412 4914300 6540537 6126028 6359401 6033809 6281999 6289596 6220583 6907539
15283 6907539 6299496 6371731 6236282 6910787 6201691 5995645 6179041 6256025 6702661 6214806
15273 6214806 6584054 6541666 5816619 6367630 6488357 6443236 6124664 6136474 5728236 6445503
15263 6445503 6427416 6518734 6016625 6154719 6361054 6130305 6545943 7223451 6315523 5853054
15253 5853054 6638582 6475191 6225152 5812643 5796854 5609519 6550916 6674851 6425228 6095114
15243 6095114 6359640 6636013 6533192 5869144 6720954 7007220 6527970 5665452 5403758
15234 5403758 6880777 6218081 6842082 7032685 5954609 5301377 6142683 6724236 6032154
$$ packed form
15303F303453R7560O3946n86322O7338l54644J039185j002336J57231N89508p54936
15293E619983m6571o59112J626237m14509K33373l25592K48190P597o9013O86956
15283F907539o08043P2235j35449O74505p09096k06046J83396P6984M46636m87855
15273F214806L69248m2388p25047N51011J20727m5121l18572J1810m08238P17267
15263F445503j8087R1318n02109J38094K06335k30749M15638O77508r07928m62469
15253E853054P85528j63391k50039m12509j5789j87335R41397J23935k49623l30114
15243F095114K64526K76373j02821o64048Q51810K86266m79250q62518k61694
15234E403758J477019o62696O24001J90603j078076o53232Q41306N81553o92082
$$ plain form
15225 6032154 6945612 6190891 5860741 6062335 6801149 6818012 6600629 6278971 6543534 6697981
15215 6697981 6280070 5992856 6801226 5567548 6193410 6481266 6954573 7296490 6135044
15206 6135044 6077999 6429601 6154844 6691718 6213039 7228811 7026437 6788735 6221361
15197 6221361 5849415 5985167 6865499 6344609 5969548 6612248 6846088 6102129 6482832
15188 6482832 6799433 6488449 6647704 6364530 7037030 6950373 6519973 6928056 6467238 6526174
15178 6526174 6633259 6177157 6708957 5646533 6806873 6529865 6597772 6659067 6107421
15169 6107421 6658682 6881181 6210162 5816056 6813145 6582596 6186570 6032054 7342271
15160 7342271 6826420 6138101 6530669 6721589 6011402 6122799 6310396 6675755 6803956
$$ packed form
15225F032154R13458p54721l30150K01594P38814J6863k17383l21658K64563J54447
15215F697981m17911k87214Q08370j233678O25862K87856M73307L41917j161446
15206F135044n7045L51602k74757N36874m78679J015772k02374k37702n67374
15197F221361l71946J35752Q80332n20890l75061O42700K33840p43959L80703
15188F482832L16601l10984J59255k83174O72500q6657m30400M08083m60818N8936
15178F526174J07085m56102N31800j062424J160340k77008O7907O1295n51646
15169F107421N51261K22499o71019l94106R97089k30549l96026j54516J310217
15160G342271n15851o88319L92568J90920p10187J11397J87597L65359J28201
$$ plain form
15151 6803956 6374836 6788592 6627826 7002377 6977089 6219044 6702136 6507844 6569273 5992122
15141 5992122 7057877 6442256 6248386 6518775 6460485 6501204 7003884 5819524 6070508
15132 6070508 5622197 6842447 7173132 6086972 6769071 6117374 6545388 6979004 6837263
15123 6837263 6203418 6904764 6123626 6438487 7105420 7582894 6264347 6173612 6709420
15114 6709420 7290312 6406314 5947521 6423687 6244089 6700710 7014541 5835839 6958998
15105 6958998 6858073 6942007 6335812 6734407 6938733 6759999 6348681 6401643 7022383 7107965
15095 7107965 7007350 7002573 6518917 6027229 5660211 7151209 6634451 6801942 6362283 6887969
15085 6887969 6187600 6298183 6758136 6334119 7384140 6830925 6785722 6037566 6612322
$$ packed form
15151F803956m29120M13756j60766L74551k5288p58045M83092j94292O1429n77151
15141E992122J065755o15621j93870K70389n8290M0719N02680j184360K50984
15132F070508m48311J220250L30685j086160O82099o51697M28014M33616j41741
15123F837263o33845P01346p81138L14861O66933M77474j318547r0735N35808
15114F709420N80892q83998m58793M76166j79598M56621L13831j178702J123159
15105F958998j00925Q3934o06195L98595K04326j78734m11318N2962O20740Q5582
15095G107965j00615m777m83656m91688l67018J490998n16758J67491m39659N25686
15085F887969p00369J10583M59953m24017J050021n53215m5203p48156N74756
$$ plain form
15076 6612322 6597947 7475635 6276611 7367015 8171083 6587574 6641237 7077142 6516841
15067 6516841 6608698 6777891 6728381 6602574 6944642 7141251 6304138 7451978 7410712 6355748
15057 6355748 6461581 6709911 6256094 5889629 6408916 6595478 6674098 6621719 6897706 6527667
15047 6527667 6462990 6404482 6376981 6505146 6559757 5961311 6380470 6775974 6119484 5842445
15037 5842445 6585268 6685283 6423925 6391080 5937883 6895462 6291203 6350241 6671631 6833677
15027 6833677 7360090 6965145 7381808 6388836 6231814 7294244 6131446 7278500 7178120
15018 7178120 6145614 7114237 6613818 7843220 7258455 7528155 7613033 7104000 6495533
15009 6495533 6550735 6557598 7602012 6779312 6487299 6434481 7116380 6759868 6649247 6897319
$$ packed form
15076F612322j4375Q77688j199024J090404Q04068j583509N3663M35905n60301
15067F516841R1857J69193m9510j25807L42068J96609q37113J147840m1266j054964
15057F355748J05833K48330m53817l66465N19287J86562P8620n2379K75987l70039
15047F527667o4677n8508k7501J28165N4611n98446M19159L95504o56490k77039
15037E842445P42823J00015k61358l2845m53197R57579o04259N9038L21390J62046
15027F833677N26413l94945M16663r92972j57022J062430j162798J147054j00380
15018G178120j032506R68623n00419J229402n84765K69700Q4878n09033o08467
15009F495533N5202O863J044414q22700k92013n2818O81899l56512j10621K48072
$$ plain form
14999 6897319 6773311 6374739 6539150 6489094 7013023 6780134 7134892 6720704 6749528 6351993
$$ packed form
14999F897319j24008l98572J64411n0056N23929k32889L54758m14188K8824l97535
$$ [...]
##END NTUPLES=NMR SPECTRUM
##END=
