##TITLE=abcd
##JCAMPDX= 6.0         $$ Bruker NMR JCAMP-DX V2.0
##DATA TYPE= NMR SPECTRUM
##DATA CLASS= NTUPLES
##ORIGIN= UXNMR, Bruker Analytische Messtechnik GmbH
##OWNER= root
$$ XWIN-NMR		Version 3.5
$$ Thu Jul 23 11:13:16 2026 Russian Standard Time (UT+4h)  servis@DPX200
##.OBSERVE FREQUENCY= 200.131235884673
##.OBSERVE NUCLEUS= ^1H
##.ACQUISITION MODE= SIMULTANEOUS
##.ACQUISITION SCHEME= undefined
##.AVERAGES= 32
##.DIGITISER RES= 18
##SPECTROMETER/DATA SYSTEM= spect
##.PULSE SEQUENCE= zg
##.SOLVENT NAME= CDCl3
##.SHIFT REFERENCE= (INTERNAL, CDCl3, 0, 16.4885)
##AUDIT TRAIL= $$ (NUMBER, WHEN, WHO, WHERE, WHAT)
$$ ##TITLE= Audit trail, XWIN-NMR		Version 3.5
$$ ##JCAMPDX= 5.01
$$ ##ORIGIN= Bruker BioSpin GmbH
$$ ##OWNER= servis
$$ F:\spectra/data/av/nmr/H1/1/pdata/1/auditp.txt
$$ ##AUDIT TRAIL=  $$ (NUMBER, WHEN, WHO, WHERE, WHAT)
(   1,<2026-07-23 11:12:15.09 +0400>,<servis>,<DPX200>,
      <created by zg, POWCHK disabled, PULCHK disabled
       configuration hash MD5:
       00 E9 B6 7A A2 85 ED C7 34 08 36 98 17 FE 4E 26
       data hash MD5: 32K
       9F 71 73 96 C3 51 A2 8B 9E 0C BB 9B 8B 18 25 8D>)
(   2,<2026-07-23 11:12:44.90 +0400>,<servis>,<DPX200>,
      <Start of raw data processing
       efp BC_mod = 2 LB = 0.05 FT_mod = 6 PKNL = 1 PHC0 = -416.59 PHC1 = 3.101563 SI = 16K 
       data hash MD5: 16K
       F3 5B 37 F5 38 73 05 B4 10 F8 B0 86 28 78 FE AB>)
$$ ##END=
$$ 
$$ hash MD5
$$ 7A A1 89 EF 46 25 DA 87 94 F1 3D 78 B8 9E 4E B6
##$RELAX= 
##$RELAX= 
##$RELAX= 
##$RELAX= 
##$RELAX= 
##$RELAX= 
##$RELAX= 
##$RELAX= 
$$ Bruker specific parameters
$$ --------------------------
##$DU= <F:\spectra>
##$EXPNO= 1
##$NAME= <H1>
##$PROCNO= 1
##$TYPE= <nmr>
##$USER= <av>
##$AMP= (0..31)
100 100 100 100 100 100 100 100 100 100 100 100 100 100 100 100 100 100 
100 100 100 100 100 100 100 100 100 100 100 100 100 100 
##$AQSEQ= 0
##$AQ_mod= 1
##$AUNM= <au_zg>
##$AUTOPOS= <>
##$BF1= 200.13
##$BF2= 200.13
##$BF3= 200.13
##$BF4= 200.13
##$BF5= 500.13
##$BF6= 500.13
##$BF7= 500.13
##$BF8= 500.13
##$BYTORDA= 1
##$CFDGTYP= 0
##$CFRGTYP= 5
##$CHEMSTR= <none>
##$CNST= (0..31)
1 1 145 1 1 1 1 1 1 1 1 1 1 1 1 1 1 1 1 1 1 1 1 1 1 1 1 1 1 1 1 1 
##$CPDPRG= <>
##$CPDPRG1= <>
##$CPDPRG2= <>
##$CPDPRG3= <>
##$CPDPRG4= <mlev>
##$CPDPRG5= <mlev>
##$CPDPRG6= <mlev>
##$CPDPRG7= <mlev>
##$CPDPRG8= <mlev>
##$CPDPRGB= <>
##$CPDPRGT= <>
##$D= (0..31)
0 2 0 0 0 0 0 0 0 0.06 0 0 0 0 0 0 0.0002 0 0 0 0 0 0 0 0 0 0 0 0 0 0 
0 
##$DATE= 1784790734
##$DBL= (0..7)
120 120 120 120 120 120 120 120 
##$DBP= (0..7)
150 150 150 150 150 150 150 150 
##$DBP07= 0
##$DBPNAM0= <>
##$DBPNAM1= <>
##$DBPNAM2= <>
##$DBPNAM3= <>
##$DBPNAM4= <>
##$DBPNAM5= <>
##$DBPNAM6= <>
##$DBPNAM7= <>
##$DBPOAL= (0..7)
0.5 0.5 0.5 0.5 0.5 0.5 0.5 0.5 
##$DBPOFFS= (0..7)
0 0 0 0 0 0 0 0 
##$DE= 6
##$DECBNUC= <off>
##$DECIM= 32
##$DECNUC= <off>
##$DECSTAT= 4
##$DIGMOD= 1
##$DIGTYP= 9
##$DL= (0..7)
0 120 120 120 120 120 120 120 
##$DP= (0..7)
150 150 150 150 150 150 150 150 
##$DP07= 0
##$DPNAME0= <>
$$ [...]
##$SUBNAM4= <"">
##$SUBNAM5= <"">
##$SUBNAM6= <"">
##$SUBNAM7= <"">
##$SUBNAM8= <"">
##$SUBNAM9= <"">
##$SW= 20.6817932712277
##$SWIBOX= (0..15)
0 0 3 0 0 0 0 0 0 0 0 0 0 0 0 0 
##$SW_h= 4139.07284768212
##$TD= 32768
##$TD0= 1
##$TE= 0
##$TE2= 300
##$TE3= 300
##$TEG= 300
##$TL= (0..7)
0 120 120 120 120 120 120 120 
##$TP= (0..7)
150 150 150 150 150 150 150 150 
##$TP07= 0
##$TPNAME0= <>
##$TPNAME1= <>
##$TPNAME2= <>
##$TPNAME3= <>
##$TPNAME4= <>
##$TPNAME5= <>
##$TPNAME6= <>
##$TPNAME7= <>
##$TPOAL= (0..7)
0.5 0.5 0.5 0.5 0.5 0.5 0.5 0.5 
##$TPOFFS= (0..7)
0 0 0 0 0 0 0 0 
##$TUNHIN= 0
##$TUNHOUT= 0
##$TUNXOUT= 0
##$USERA1= <user>
##$USERA2= <user>
##$USERA3= <user>
##$USERA4= <user>
##$USERA5= <user>
##$V9= 5
##$VALIST= <valist>
##$VCLIST= <CCCCCCCCCCCCCCC>
##$VD= 0
##$VDLIST= <DDDDDDDDDDDDDDD>
##$VPLIST= <PPPPPPPPPPPPPPP>
##$VTLIST= <TTTTTTTTTTTTTTT>
##$WBST= 1024
##$WBSW= 30
##$XGAIN= (0..3)
0 0 0 0 
##$XL= 0
##$YL= 0
##$YMAX_a= 521591
##$YMIN_a= -1034053
##$ZGOPTNS= <>
##$ZL1= 120
##$ZL2= 120
##$ZL3= 120
##$ZL4= 120
##$ABSF1= 0
##$ABSF2= 0
##$ABSG= 0
##$ABSL= 0
##$ALPHA= 0
##$AQORDER= 0
##$ASSFAC= 0
##$ASSFACI= 0
##$ASSFACX= 0
##$ASSWID= 0
##$AUNMP= <proc_1d>
##$AZFE= 0.1
##$AZFW= 0.1
##$BCFW= 0
##$BC_mod= 2
##$BYTORDP= 0
##$COROFFS= 0
##$CY= 18.4799938201904
##$DATMOD= 1
##$DC= 0
##$DFILT= <>
##$DTYPP= 0
##$F1P= 9.9274215381318
##$F2P= -0.165520771350173
##$FCOR= 1
##$FTSIZE= 16384
##$FT_mod= 6
##$GAMMA= 0
##$GB= 0
##$INTBC= 1
##$INTSCL= 4.127829e-11
##$ISEN= 128
##$LB= 0.05
##$LEV0= 0
##$LPBIN= 0
##$MAXI= 10000
##$MC2= 0
##$MEAN= 0
##$ME_mod= 0
##$MI= 50
##$NCOEF= 0
##$NC_proc= -5
##$NLEV= 6
##$NOISF1= 3.799351
##$NOISF2= 2.8
##$NSP= 0
##$NTH_PI= 0
##$NZP= 0
##$OFFSET= 16.48848
##$PC= 4
##$PHC0= -416.59
##$PHC1= 3.101563
##$PH_mod= 1
##$PKNL= yes
##$PPARMOD= 0
##$PSCAL= 4
##$PSIGN= 0
##$REVERSE= no
##$SF= 200.130005582386
##$SI= 16384
##$SIGF1= 3
##$SIGF2= 2
##$SINO= 400
##$SIOLD= 16384
##$SREGLST= <1H.CDCl3>
##$SSB= 0
##$STSI= 16384
##$STSR= 0
##$SW_p= 4139.07284768211
##$SYMM= 0
##$S_DEV= 0
##$TDeff= 32768
##$TDoff= 0
##$TI= <>
##$TILT= no
##$TM1= 0
##$TM2= 0
##$TOPLEV= 0
##$USERP1= <user>
##$USERP2= <user>
##$USERP3= <user>
##$USERP4= <user>
##$USERP5= <user>
##$WDW= 1
##$XDIM= 16384
##$YMAX_p= 528420838
##$YMIN_p= -629606
$$ End of Bruker specific parameters
$$ ---------------------------------
##NTUPLES= NMR SPECTRUM
##VAR_NAME=  FREQUENCY,     SPECTRUM/REAL,   SPECTRUM/IMAG
##SYMBOL=    X,             R,               I
##VAR_TYPE=  INDEPENDENT,   DEPENDENT,       DEPENDENT
##VAR_FORM=  AFFN,          ASDF,            ASDF
##VAR_DIM=   16384,         16384,           16384
##UNITS=     HZ,            ARBITRARY UNITS, ARBITRARY UNITS
##FACTOR=    0.252644378177508, 1,           1
##FIRST=     3299.83951724647, 0,            0
##LAST=      -839.233330435636, 0,           0
##MIN=       -839.233330435636, -629606,     0
##MAX=       3299.83951724647, 528420838,    0
$$ Real data points
##PAGE= N=1
##DATA TABLE= (X++(R..R)), XYDATA
$$ [...]
9780A06730j70392N5654J64938L614j22043J3882J51317p7212q864M362m3528
9769G8458M6088j5372k9612j419L3546k6212O463J2723q2325M9261J32161P0891
9757B74651j61036j16548Q1581l1531J3216O1454r070N871M4911m8594P7338k8130
9745A64113l0528j8203J01388q8826q957K028l4573l3785J47527j0704J261m4085
9733A46656j5905M130j8770k095R1153J5032J6139m3671j37910J93851j43703
9722A04907o0123J21981n0742n057j2528K1922r9188K5607J23621o4330O1195
9711A67265J30450l6570q0207n8050P5734O8865r1020q431M2214m0276n7992j1823
9699A00159Q6051q9578J25336r6537j5711M9412j00358J85033q5582n8521K213
$$ y = [106730, -63662, -8008, 156930, 160544, 38501, 52383, 203700, 126488, 117624, 121986, 78458, 124546, 109174, 79562, 78143, 111689, 85477, 91940, 104663, 22338, 71599, 203760, 274651, 113615, -2933, 78648, 47117, 60333, 121787, 112717, 118588, 163499, 114905, 192243, 164113, 133585, 115382, 216770, 127944, 118987, 121015, 86442, 52657, 200184, 189480, 190741, 146656, 130751, 134881, 116111, 114016, 205169, 220201, 236340, 192669, 54759, 248610, 104907, 44784, 166765, 116023, 110966, 98438, 120360, 21172, 46779, 170400, 106070, 167265, 297715, 261145, 180938, 122888, 198622, 267487, 176467, 168036, 210250, 169974, 111982, 100159, 186210, 96632, 221968, 125431, 109720, 159132, 58774, 243807, 158225, 99704, 101917]
9688A01917N1969J29832p9716j1169o6715J87419r2935J5553j3992N7047p2635
9677B06575R9818m4394n2787j32258J80882Q1803M7098j8474K7157j10159J00155
9666C85416j28983O4846K1922J77634j76401q5815O7078J11445j43594L9722M5402
9655C78672m9063k1361o5876P5306q8508O8647l1788p6310N682J5438J10374Q951
9643C30164j17207K8058K3703N0594n5550p881o8023R9127j2989M5272j44848
9632A70420R1818R4592o4203q8939R4645j15408P7141m7366m2545P2897q3051
9621A60001J54946k1010m8199m4692N5011k0483N4808j98015K21287J9941j38113
9610A95482N7850m8990o2510L9439M5905K0388l5503N685l564M6669k7759M7407
$$ y = [101917, 153886, 283718, 204002, 192833, 126118, 313537, 220602, 236155, 222163, 279210, 206575, 306393, 261999, 209212, 76954, 257836, 339639, 386737, 368263, 395420, 285261, 385416, 256433, 321279, 343201, 520835, 344434, 258619, 325697, 437142, 293548, 333270, 378672, 329609, 308248, 242372, 317678, 229170, 297817, 266029, 189719, 195401, 210839, 321213, 330164, 212957, 241015, 264718, 315312, 259762, 251881, 183858, 282985, 269996, 315268, 170420, 262238, 356830, 292627, 203688, 298333, 182925, 260066, 212700, 170155, 243052, 160001, 314947, 293937, 245738, 201046, 256057, 235574, 290382, 92367, 313654, 333595, 195482, 253332, 204342, 141832, 181271, 227176, 247564, 212061, 217746, 214182, 260851, 233092, 280499]
9598B80499o9295p5527J1076M8777n9410J11640q519r8046q3630J66417q6849
9587A37133J44461r0616K8628O9619n4773P618J604p4061q6678N8873L4817p5649
9575A00976O9378N1885k9782p329N5975p3384K6394K1631Q392m4359L1505K2771
9563B34053p8820n7189O9509n5460J662N5679J10796j82826J07012j25877k4544
9552E3995J54234J7998p4031K8804n1016k2707M796J02122j03234R9432o987j48114
9540E5292K2292N7636J8380K5408K2097j00570m3727k5167P9666k2292P2264n9105
9528A02174n1409J18657k9097j2927N1038l6576J027j4890J5488M9047K4520r2330
9516A24722n1279p154N2303m0206Q9170p5644K45n0233N4205j3393N0149N6247
$$ y = [280499, 211204, 135677, 146753, 195530, 136120, 247760, 239241, 141195, 57565, 223982, 137133, 281594, 190978, 219606, 289225, 234452, 242070, 243674, 169613, 82935, 141808, 176625, 100976, 170354, 222239, 192457, 185128, 241103, 167719, 194113, 215744, 224136, 179777, 211282, 234053, 155233, 98044, 167553, 112093, 113755, 169434, 280230, 97404, 204416, 78539, 53995, 208229, 226227, 152196, 181000, 129984, 107277, 112073, 214195, 110961, 210393, 203406, 55292, 77584, 135220, 153600, 179008, 201105, 100535, 56808, 31641, 111307, 89015, 161279, 102174, 50765, 169422, 140325, 127398, 178436, 141860, 142887, 127997, 143485, 192532, 217052, 124722, 73443, 66289, 118592, 78386, 167556, 91912, 92157, 41924, 96129, 82736, 132885, 189132]
9504A89132p5261M287l3788N0502k6584l094q083L182R156J45504j30821l3242
9492I0890k9472M9151o6063P1721r4120O2081M1294j7313r4487Q6620o532l7674
9480E6096R0040r1808J38443n7104o5742J08262q776p3046M4407m2198m7070L0447
9468H1951O1981j44360J88284j80201J20309M1998o872L1780j28169N7498k1992
9457A02207j2240l1211K554N4124N8793j04088j2296Q1791r5672M1901M548K841
9445I3252J8865m9379J02154K6444j44965P4948p3380o3443K7158J10295O1562
9434A83511j51270k385N8292L7449m2429Q1634Q6768q8924j38870M7760N3726
9423A25262l1298J7246J10438K1256j30398l5505J0611O4124L0210n0319l8599
$$ y = [189132, 113871, 118158, 84370, 134872, 108288, 105194, 97111, 100293, 109449, 254953, 124132, 90890, 61418, 110569, 44506, 116227, 22107, 84188, 125482, 108169, 13682, 100302, 93770, 56096, 146136, 54328, 192771, 135667, 69925, 178187, 169411, 96365, 140772, 98574, 51504, 81951, 143932, -428, 187856, 7655, 127964, 169962, 163090, 194870, 66701, 124199, 102207, 89967, 58756, 61310, 115434, 174227, 70139, 57843, 139634, 43962, 85863, 90411, 93252, 112117, 62738, 164892, 191336, 46371, 121319, 47939, -15504, 11654, 121949, 183511, 32241, 29856, 88148, 125597, 83168, 164802, 251570, 162646, 23776, 71536, 125262, 93964, 111210, 221648, 242904, 112506, 77001, 87612, 151736, 181946, 131627, 93028]
9412I3028j7073N4354n374K6162q6369R3821j2531l1426J3949n687l4122L9095
9400A27827P656k0137Q7610j04364n6251P4836J2900o6435o0554J28664j27202
9389D550K0103J38354j13375Q8190m8973j0593m0165J45170j14615Q4356o5596
9378H7406m4418M7565J2642P733K7039j02357J15380J7940m0305K7008j7693o8032
9366F9908j27765J15162K9956N7061j42801P7940M0244j03314P810K42399J5522
9355B82122k75382R6982L8138n7232P1758j50762J74902j7268l9676j46390K0514
9344b294L5810J14868j772k247k3424J4598j3887J2780R4561j29785K5339k2156
9332A02391L8751o5721K8564R4098j22353Q1382j20014l012j4806J93598p7641
$$ y = [93028, 75955, 130309, 124935, 151097, 64728, 158549, 146018, 114592, 128541, 122854, 88732, 127827, 135483, 115346, 202956, 98592, 42341, 117177, 130077, 63642, 3088, 131752, 4550, 24653, 163007, 49632, 137822, 88849, 78256, 38091, 183261, 68646, 153002, 87406, 42988, 90553, 103195, 110928, 137967, 35610, 150990, 168930, 128625, 155633, 137940, 69908, -57857, 57305, 87261, 144322, 1521, 79461, 119705, 16391, 24201, 266600, 282122, 6740, 103722, 141860, 84628, 156386, 5624, 180526, 163258, 123582, -22808, -2294, 33516, 148384, 146612, 144365, 120941, 135539, 121652, 134432, 228993, 99208, 124547, 102391, 141142, 75421, 103985, 198083, 75730, 157112, 37098, 34086, 19280, 212878, 135237]
9321A35237j624j21046M6860J4954L9880k5071l5339O712l5622P6051O3219L4191
9309A98402m7727j13481J67201O8721j49359P9088j17438j11667Q6133Q9684k7909
9298A21648J4442j7244r1578J8274K4937O8817K3127n5333R4776r0386l8161J8562
9286I1881N3757J4370m22Q4235p6331p6280k6835J18771O963p6442k3812j896
9274H7959j2324O8464K5081l9780K4329p3821l4688J33777o4700J7822n658Q5314
9262B11775m1161J8863P2852k1889J0481r2213L5527o1425m688N7835q2851O6124
9250A69230J1282j53364K04068l4155m7836l5715O5517O6616j35677J63166j64069
9239A09063P4031r3777K772P0243L5388K410n4037m5346O0180m7317J7711N4802
$$ y = [135237, 133613, 12567, 59427, 74381, 114261, 89190, 53851, 60563, 24941, 100992, 164211, 198402, 150675, 37194, 204395, 273116, 123757, 202845, 85407, -26260, 59873, 149557, 121648, 136090, 118846, 27268, 45542, 70479, 139296, 162423, 107090, 201866, 111480, 73319, 91881, 145638, 160008, 159586, 243821, 167490, 91210, 64375, 183146, 190109, 113667, 89855, 87959, 75635, 144099, 169180, 129400, 153729, 79908, 45220, 178997, 114297, 132119, 126461, 211775, 170614, 189477, 262329, 240440, 250921, 158708, 194235, 132810, 128122, 185957, 103106, 169230, 180512, 27148, 231216, 197061, 149225, 113510, 179027, 245643, 109966, 273132, 109063, 183094, 89317, 92089, 162332, 197720, 200130, 146093, 100747, 160927, 113610, 131321, 186123]
9227A86123J6948m3272n7823o2081J63614P5655j34326L5005j46106K1876j5594
9216D0019K28464j06422J5196k3125J1973M3207o4351j4380Q9853q256o3318P9647
9204B28507j629l3872m2105o8895k6353Q3811n687k017J29947p2768j2504J7424
9192A93859J55542j93433N5932o4067o7789R3952L3426q4208R9452r1572N1907
9181A83001J44449j05969M0453k477k8186M5663q4065J7385P1599j01162j4635
9170A66056N4412q3105l5718m526L09284j98331O0659j8274J1848j38000k5947
9159I8358J21006L3111j943K7613L8676o1785j04955K35772M155j95848R5365
9148B89525L9363J06833r8738N2134P6422k1147k61805J53429M8299p2046N1983
$$ y = [186123, 203071, 159799, 101976, 39895, 203509, 279164, 144838, 179843, 33737, 55613, 40019, 268483, 162061, 177257, 154132, 166105, 209312, 144961, 130581, 220434, 212178, 148860, 228507, 226878, 193006, 150901, 82006, 55653, 139464, 133777, 131760, 261707, 188939, 176435, 193859, 349401, 155968, 211900, 147833, 80044, 173996, 207422, 123214, 222666, 131094, 183001, 327450, 221481, 261934, 259457, 231271, 276934, 192869, 210254, 281853, 180691, 166056, 220468, 137363, 101645, 97119, 406403, 208072, 268731, 250457, 262305, 124305, 98358, 219364, 252475, 250532, 278145, 316821, 255036, 150081, 385853, 390008, 194160, 289525, 328888, 435721, 336983, 389117, 465539, 444392, 182587, 336016, 384315, 312269, 364252]
9137C64252J08586m5178p8339l0638L7668J33784p0394k7531o20J3306N9391L2895
9125D97182m7096p0786J27036J4941r169j2782m3548j4733M8588L2324P2166k7965
9113E66158r550j01445N0997J8966J84183k9477O4438P6538j17829P1478L3881
9102H08338J55905O2326Q5170j05204L36885k2257J77459p3755K56136O0282J24621
9091A865906K26211K46047K82422M4135R8280n0199j46892M4824k30750m0729
9081B339255m77m4874j05195j58040j75083o5749j12226j61108n3853k42273n4613
9070A165764n9902m4682j11445j36689J39673j85432k9539L7458o8393r8904q6899
9059E21010J17044j08509K9582l9204r6124l0463Q2060Q126Q581n7539l4597l2920
$$ y = [364252, 472838, 427660, 349321, 318683, 356351, 490135, 419741, 392210, 391590, 404896, 464287, 497182, 450086, 379300, 506336, 521277, 512108, 499326, 455778, 441045, 489633, 521957, 594123, 566158, 556608, 455163, 506160, 525126, 709309, 679832, 744270, 820808, 702979, 774457, 808338, 964243, 1026569, 1111739, 1006535, 1343420, 1321163, 1498622, 1424867, 1681003, 1741285, 1865906, 2092117, 2338164, 2620586, 2664721, 2763001, 2712802, 2565910, 2610734, 2379984, 2339255, 2338778, 2293904, 2188709, 2030669, 1855586, 1789837, 1677611, 1516503, 1462650, 1220377, 1165764, 1105862, 1061180, 949735, 813046, 952719, 767287, 737748, 775206, 706813, 607909, 521010, 638054, 529545, 559127, 519923, 423799, 393336, 475396, 483522, 492103, 434564, 399967, 367047]
9047C67047n7949P958J49226q0207l2725L1319j56868J91756J0364k5310o4690
9036C39921n2846q9479J13470k6787M3765m8126j22j19546J08875q024K7488p3162
9024B15427J8444L8885n7467J33671j08123L9603n0138j29318Q4184r767k6535
9013A48866j7365L7884O1882J4105J5230j37400J00521o5109L6849N0106o3712
9002A81857m8435m4252l7912K0306J01345j10043J06082R4018n3707K0057j11930
8991A17386M3676k5444k9688L9883J6831k6929l041j05641J7544M244K37098m6050
8979B39869j56842L4808N2900J1527k7391j9372L9872k8936q7293O5938J0321
8968A35401n162n3865Q93N1305N9765j05470j584P6219r913j47498M2998J28244
$$ y = [367047, 309098, 317056, 466282, 386075, 353350, 384669, 227801, 419557, 429921, 404611, 339921, 287075, 197596, 311066, 284279, 328044, 279918, 279796, 160250, 269125, 261101, 288589, 215427, 233871, 272756, 215289, 348960, 240837, 280440, 230302, 100984, 185168, 175401, 148866, 131501, 169385, 231267, 245372, 260602, 123202, 223723, 158614, 195463, 245569, 181857, 133422, 89170, 51258, 71564, 172909, 62866, 168948, 262966, 209259, 229316, 117386, 161062, 135618, 105930, 145813, 162644, 135715, 132674, 27033, 44577, 48821, 285919, 239869, 83027, 117835, 170735, 182262, 154871, 135499, 175371, 146435, 59142, 125080, 135401, 130239, 76374, 77267, 128572, 188337, 82867, 81283, 157502, 147589, 91, 43089, 171333]
8956A71333j01366L323l0233L4829m2450J32149p4426M2034j3211k1446J42360
8945B42896k6361K2800j56179N943j02044J40386P5856k00183J56895j05831J05166
8934A59344j03510k204o5467J12388K5620m6713m6325J06039q4009l0715J31964
8923A56412R1886j10196k725J41861k93198O5712J13425J5617j69924l9446Q7817
8912E7241L7578r8393P8149J24211j09779L8761m0643r3120J08108L3866M842
8901A40821j20278L4907j9109J15670K6838r6343L4691m9521P3735p0748k8932
8890D1731J8827P5745l3694M6147m8922n7594p9083q901J26364R740K154J13156
8878B05670j43547R0810r1398J09691M3828o0096p4398l62L9388j22680N6148
$$ y = [171333, 69967, 73290, 43057, 77886, 35436, 167585, 93159, 135193, 121982, 100536, 242896, 216535, 239335, 83156, 89099, -12945, 127441, 203297, 3114, 160009, 54178, 159344, 55834, 53630, -11837, 100551, 126171, 79458, 33133, 139172, 55163, 24448, 156412, 248298, 138102, 135377, 277238, -15960, 49752, 163177, 178794, 8870, -30576, 57241, 94819, -3574, 74575, 198786, 89007, 127768, 87125, -5995, 102113, 135979, 140821, 20543, 55450, 36341, 152011, 178849, 82506, 117197, 67676, 141411, 70663, 41731, 60558, 136303, 102609, 148756, 99834, 42240, -36843, -45744, 80620, 90360, 92514, 205670, 62123, 152933, 61535, 171226, 215054, 154958, 80560, 80198, 119586, -3094, 53054]
8867E3054o2901K18J0484J03715q8188P9645n7923J59151o5035q0969q460j5802
8855B6989N0548l7462N3314N4802p0579l7198m0508M6568N1615J25068j46750
8844G6407Q0676q5402j5336Q012o7965P4604K1281J1295J6676K8234r0845J12750
8832A70387k1608N9411k3870j07163J16686m3028q5740l3269Q7114J2314n8612
8821G2622M5184k5242M3424M0384J8921o8961J0325j26708J61885L4646n0043
8810A56437m1823L2434j33008J19706k8134l1727M6082K9434P614k0342j0628
8799A26045k4521k5256M1759l9212J02704J2199K438j85095J21493o2522J13948
8788A83980q0990J11726K4951j57891M0920l0055M6879M2104j5824j10576L4240
$$ y = [53054, -9847, -9629, 855, 104570, 16382, 96027, 38104, 197255, 132220, 51251, 42791, 26989, 77537, 40075, 93389, 148191, 77612, 40414, -94, 46474, 98089, 223157, 76407, 157083, 71681, 56345, 64357, -3608, 70996, 92277, 103572, 120248, 148482, 57637, 170387, 148779, 208190, 184320, 77157, 193843, 150815, 65075, 31806, 118920, 131234, 72622, 117806, 92564, 135988, 176372, 195293, 126332, 136657, 9949, 171834, 206480, 156437, 114614, 147048, 14040, 133746, 105612, 73885, 119967, 149401, 157015, 136673, 126045, 101524, 76268, 118027, 78815, 181519, 193718, 196156, 11061, 132554, 70032, 183980, 102990, 214716, 239667, 81776, 122696, 92641, 139520, 181624, 165800, 55224, 89464]
8777H9464K4571J9286O3300q4509o4096O3041K1955J06594j93748J35013L0308
8766B11179j33829O8933k2390m2181L8160O5628j5556r9133M6177j3708L6708
8755A39988n2441O233L9670n568Q1018j96409J24411r9237J34185o0008J9162
8744A31004m1818j0448j1446P9581K7872l336n1255O5549n9138N652j31890Q5996
8732H6323Q2610k5019l8636L5246j33044N2226O8516L9996l6326N2478J01108
8721B85478k41917l9760N0018Q3789o1695k1439j41139J56379R1301n1151P7041
8710A86905J8595j17674l9246L7295O718J01166o865n0813N1191r8413r7984K9232
8698B0107P6075j7093J59913o8833o1664n7027o756L1724q7J34778j26077L2172
$$ y = [89464, 114035, 133321, 196621, 112112, 48016, 111057, 133012, 239606, 45858, 180871, 211179, 77350, 146283, 123893, 81712, 119872, 185500, 169944, 70811, 116988, 103280, 139988, 87547, 93780, 133450, 127882, 208900, 12491, 136902, 37665, 171850, 111842, 131004, 89186, 78738, 67292, 146873, 174745, 171409, 120154, 185703, 126565, 132217, 327, 86323, 168933, 143914, 105278, 140524, 7480, 59706, 128222, 168218, 131892, 184370, 285478, 43561, 3801, 53819, 137608, 75913, 54474, -86665, 69714, 161015, 109864, 186905, 205500, 87826, 48580, 85875, 92593, 193759, 186894, 136081, 187272, 88859, -9125, 20107, 96182, 79089, 239002, 170169, 108505, 51478, 44722, 76446, 76359, 211137, 85060, 117232]
8686A17232n4553J50571l7621n7062J4148j2928J5018l3456K3045J8955l7211
8675A06138N0788L5858k3639q5769k6851m5002Q5525P9227j43281J20962M2972
8664A96928j63968J22940l2626P6099k9961M6286j19886m2569M3275J5467M0726
8653A52711L6976r3330j2106R988p547j18986K01735p4621P499L5757k3416O3012
8641A77672j8550n1060M6459m9571M318o255O0373p6389o2646n087J87856j62524
8629D4596J16211L6478k5823j8846k0437j10463J63700J9034L5542j18783j8139
8618A03070j3287l7208J28274L2279q8379n1270M9311J9238l1106J00385j25941
8607H5366K7655j4758K5376J12610n1617l4228O4184j63829J23173r8517J35466
$$ y = [117232, 62679, 213250, 175629, 118567, 132715, 119787, 134805, 101349, 124394, 143349, 106138, 156926, 192784, 169145, 83376, 56525, 11523, 97048, 176275, 32994, 153956, 196928, 32960, 155900, 123274, 199373, 169412, 215698, 95812, 53243, 96518, 111985, 152711, 189687, 96357, 84251, 94239, 86692, -32294, 169441, 94820, 102319, 138076, 114660, 177672, 159122, 108062, 154521, 104950, 109268, 103013, 163386, 86997, 24351, 19264, 207120, 44596, 160807, 197285, 171462, 152616, 132179, 21716, 185416, 204450, 239992, 121209, 103070, 89783, 52575, 180849, 213128, 124749, 73479, 122790, 142028, 110922, 211307, 85366, 113021, 98263, 123639, 236249, 184632, 150404, 214588, 50759, 173932, 75415, 210881]
8596B10881p2772Q3198j25579M6331L846j3719n699J9483p9817J0546J41905j20408
8584I8196O9272l0906o3732K9538R3374K814L5081l0727K3725p6739m9230q115
8572I2551n4570J49858j39213L5138n8819J32664M6601J8364k0541m8340n3271
8561A00422o4247J44377K0512m5800r8988M2119R6513m5271m8527K5657K6281
8550A53048K0070j63055K86097q3528q166l078k3214m1221k9626P9488N5863q6923
8538A55755j02223R2568O1921K775j774n7327l8273j83270K38546M3015j14184
8527I7529N9069o2540L2572O0164q0096j7564N1544J0411O2485Q8926k9130j54636
8515A18734P0770p4008Q5452r998l2506R2563r4554q3751Q9114n2900m0310N8624
$$ y = [210881, 138109, 221307, 95728, 142059, 145905, 132186, 126487, 145970, 66153, 76699, 218604, 98196, 167468, 136562, 72830, 102368, 195742, 198556, 233637, 202910, 226635, 149896, 100666, 92551, 37981, 187839, 48626, 83764, 24945, 157609, 204210, 222574, 202033, 153693, 100422, 36175, 180552, 201064, 155264, 56276, 98395, 194908, 149637, 101110, 126767, 153048, 173118, 10063, 296160, 212632, 204466, 201388, 178174, 136953, 107327, 186815, 242678, 155755, 53532, 146100, 208021, 210796, 209022, 151695, 113422, -69848, 168698, 211713, 97529, 156598, 94058, 126630, 186794, 106698, 89134, 140678, 151089, 213574, 302500, 273370, 118734, 189504, 115496, 200948, 190950, 158444, 251007, 156453, 72702, 161816, 108916, 68606, 127230]
8503A27230J19311R7340q2217M0389r7662j15131P807j1103K3266J73918q0429
8492B02719j03579R6418M6710k0902n9835Q4494P399p4829m669R0811J4921p9100
8480B00558J2401l1672n8395K0935J20843k1760q5314J3963n2271K6084q799N3115
8468A89688M1263j45840K54965k16490N4807L7612l1982M2725L3721K6709p3891
8457B13287o2312J44174N7756j86989O8686n8568q0541J08942N1809K3281j04337
8446A75188k9195O1744M5816r2261J53739n6229n5506O4198k9447O0534J4351
8435C12932j8184m3323N4003N712p2386R4748j22010j08569J01097R0456J1795
8424C06271n6313P7164j60581J2646m7475J16737R2549j31324N9787k592j2729
$$ y = [127230, 246541, 343881, 261664, 302053, 204391, 89260, 97067, 85964, 109230, 283148, 202719, 99140, 195558, 242268, 221366, 161531, 246025, 253424, 178595, 173926, 264737, 279658, 200558, 212959, 181287, 122892, 143827, 264670, 242910, 157596, 171559, 119288, 145372, 136573, 189688, 230951, 85111, 340076, 123586, 178393, 216005, 184023, 226748, 260469, 287178, 213287, 150975, 295149, 352905, 165916, 234602, 176034, 95493, 204435, 256244, 279525, 175188, 145993, 207737, 253553, 161292, 315031, 258802, 203296, 267494, 238047, 298581, 312932, 294748, 251425, 305428, 311140, 238754, 333502, 211492, 102923, 204020, 294476, 306271, 249958, 327122, 166541, 179187, 131712, 248449, 340998, 209674, 269461, 266869, 254140]
8413B54140J4167J03616l446j0958n0753N1854q6870K1078L8443j7903K8568m9165
8401B92771O0992M3554o8699o5516O222M9652n1854K7485n5411L9973L2760m9005
8389B62924R1407J33240j49457j04370R9009J45496j93981l3904J76135q6311
8379C40188Q4407j06248j0356K6443N3307r7707J10901j6557r9090P2301j55J1416
8367C68850K6609J0615R256N4800j71561N1999O4440J3210P6202j6479j5322j11652
8355C60967R1509R8624j3005n6804J2429l9730q098P1885K7151j1354j3587O1833
8343E81820l6184m8689J49263n5414n9644l4830P9124O7841m4864P2728n6310
8332F14841K2192o746m263O1719L2574O1205k5452o4226R7399N1386m3706l5680
$$ y = [254140, 268307, 371923, 368477, 357519, 306766, 358620, 271750, 292828, 331271, 313368, 341936, 292771, 353763, 397317, 328618, 263102, 269324, 318976, 267122, 294607, 239196, 279169, 311929, 262924, 354331, 487571, 338114, 233744, 332753, 478249, 284268, 250364, 426499, 340188, 424595, 318347, 307991, 334434, 387741, 290034, 400935, 384378, 285288, 357589, 357434, 368850, 395459, 406074, 415330, 470130, 298569, 350568, 415008, 428218, 504420, 487941, 472619, 360967, 452476, 551100, 538095, 481291, 493720, 453990, 445892, 517777, 544928, 533574, 519987, 581820, 545636, 496947, 646210, 590796, 531152, 496322, 575446, 643287, 598423, 671151, 614841, 637033, 630287, 626024, 687743, 720317, 781522, 756070, 691844, 789243, 840629, 796923, 761243]
8320G61243R7867q4243M5469N5070J28246m2362J7801k4763K13322j82872J63817
8309A148595K7411P1256j14345o6868J82694j56609J67763K2862J06191j42748
8299A246202Q2078l6590J16367P8609k7350j31201K12286p897j33755K03038j19637
8288A482150J06820l7860R1317p9621J44678J1327N4149j39761J5648K5702O8120
8277A742669J0236K0749j00909j42249J5241P7193l1279O9085k3957o0727J87131
8266A763183q7844j38119M3692L4665K7353q9338n917Q4276j2154o7751N5054
8255A607100m3955P042o6270J0982N5312n4519N2965o8089n9166j9840J71263
8244A592825q4306o6013O611j5922J9549j0846j33327K4409m3303P5530K6567
$$ y = [761243, 859110, 774867, 820336, 875406, 1003652, 961290, 979091, 954328, 1167650, 984778, 1148595, 1176006, 1247262, 1132917, 1066049, 1248743, 1092134, 1259897, 1282759, 1388950, 1246202, 1328280, 1291690, 1408057, 1486666, 1459316, 1328115, 1540401, 1532504, 1398749, 1601787, 1482150, 1588970, 1551110, 1642427, 1562806, 1707484, 1718811, 1772960, 1633199, 1648847, 1674549, 1742669, 1752905, 1773654, 1672745, 1530496, 1545737, 1622930, 1591651, 1660736, 1636779, 1576052, 1763183, 1675339, 1537220, 1580912, 1615577, 1642930, 1553592, 1547675, 1631951, 1619797, 1552046, 1607100, 1563145, 1570187, 1503917, 1514899, 1570211, 1515692, 1568657, 1500568, 1441402, 1421562, 1592825, 1508519, 1442506, 1449117, 1433195, 1452744, 1441898, 1308571, 1332980, 1289677, 1365207, 1391774]
8233A391774j95450J52350p7962j43062n7669P8427k5874Q2545m1712r9851j52036
8222I11480J15881r4993p743j00266Q3265L4522j53823o6368K7110Q2496j8815
8211H12746m4815L7018k01k0954m3147r9076j5502J23043n7755N5349p1910o4087
8199F10709j701J65006J7807l05614P6134J48666k07286L06054K89882n59277
8189E40380K8903m3347R0160l6113o0549J6809m7235J60420P349k17529k0567
8178D18681J22356m8258R6058k3202J1138m1018j30392J08473j6631R5156J7336
8167F09697j76401M8325q4091N8031J64000j81814M2477J756j90204Q1664J04521
8156D77961R635J2061l1021j65248J42243j6814J70183j71980R025K703q6234
$$ y = [1391774, 1196324, 1348674, 1270712, 1127650, 1069981, 1148408, 1122534, 1205079, 1163367, 1063516, 911480, 1027361, 932368, 924625, 824359, 907624, 942146, 788323, 721955, 749065, 831561, 812746, 767931, 804949, 804748, 783794, 740647, 641571, 626069, 749112, 691357, 746706, 674796, 610709, 609008, 774014, 791821, 486207, 562341, 711007, 503721, 809775, 1099657, 540380, 569283, 525936, 616096, 579983, 519434, 536243, 489008, 649428, 656777, 439248, 418681, 541037, 492779, 588837, 565635, 576773, 535755, 405363, 513836, 497205, 592361, 609697, 433296, 481621, 397530, 455561, 619561, 437747, 480224, 481980, 291776, 373440, 477961, 487596, 499657, 468636, 303388, 445631, 428817, 599000, 427020, 436045, 438748, 352514]
8145C52514P8533l1063n8023J6548P1455J6624m7666J26777o3519j3834q4218
8134C64128N2585q42O6844j7931J00660j61092p5356K05826m9659k5961p024k6109
8122D26069j7054M3668o7340J7370N2530M5592j18766M2137p534N6561n844j59861
8110C07528N6460M4284r7712K23950l4529j67586L6924Q3605m1923M498Q2506
8099D98005L0179p3466j21838J36935j21791L5423J27308l0909j07724j0416m8891
8088C12815P9056o6102J58758O2434q2449J2399L9953m0915M6721K7104p4912
8077D74862j9423J11665m8851m4402j40721J63145l0631q508J05552m2988O1011
8066E80711n5628q6659j62664J86613Q432m2610r001J19223k7283L7410m9886
$$ y = [352514, 431047, 399984, 341961, 358509, 429964, 446588, 398922, 525699, 462180, 448346, 364128, 416713, 415871, 482715, 464784, 565444, 404352, 328996, 534822, 485163, 459202, 452178, 426069, 409015, 452683, 385343, 402713, 455243, 500835, 382069, 424206, 416672, 473233, 467389, 307528, 363988, 408272, 310560, 534510, 499981, 332395, 369319, 452924, 411001, 415499, 498005, 528184, 454718, 332880, 469815, 348024, 383447, 510755, 479846, 372122, 361706, 312815, 391871, 325769, 484527, 546961, 464512, 476911, 516864, 475949, 522670, 549774, 474862, 455439, 567104, 518253, 473851, 333130, 496275, 465644, 457136, 562688, 519700, 580711, 525083, 438424, 275760, 462373, 470805, 428195, 419194, 538417, 511134, 548544, 498658]
8055D98658M0067j44819J22662o2545M8428k8494l4206m0132m1460L6729Q7660
8044D82548j08324J46067n544p7378q304J32869j59435l0258J54919N45l4878
8033D92827R5805m8289r4985O7176K6900p5478K1550O1744o5145L7326n5732J15790
8021E79489j07916p150K4296K4101l2091j5878R6971j01543Q543N6547L133J4512
8009E43014m6458L2745m4901Q2170k5652K9815j0810L4576k2961n7864O7735k9514
7997E51895k4206P879J6022j20678M2312J16537k0122n4262K33097j23008j09362
7986E16104O96J30800R047j95365P9671M2068Q8186k05192J88244m7073J084p456
7974F00814k8830K2950N5998L1004j30093Q816J02840k9448r2405M2965P8124
$$ y = [498658, 538725, 393906, 516568, 454023, 502451, 473957, 439751, 399619, 358159, 394888, 482548, 374224, 520291, 514747, 437369, 429065, 561934, 402499, 372241, 527160, 527705, 492827, 588632, 540343, 445358, 512534, 539434, 463956, 485506, 547250, 482105, 519431, 463699, 579489, 471573, 464423, 488719, 512820, 480729, 464851, 561822, 460279, 468822, 525369, 528502, 543014, 496556, 529301, 484400, 566570, 540918, 570733, 559923, 594499, 571538, 513674, 581409, 551895, 527689, 535568, 551590, 430912, 473224, 589761, 569639, 515377, 748474, 625466, 516104, 516800, 647600, 656647, 461282, 540953, 583021, 671207, 466015, 654259, 607186, 608270, 600814, 571984, 594934, 650932, 681936, 551843, 560659, 663499, 634051, 541646, 584611, 662735]
7963F62735M2574K9689L0039j12153J833k744J256L2375k5286N0528l5148k4764
7951F50934k1223P2483l284J5241L8214q0079r4107K11424J3368p9373j9322J21992
7939H26268j81742J06400n7006J4855N2492j5238K763O2122L0855k6458l5141
7928G80170q4640R6438m6662J08938r8172K749M0908N9986p9818o2670J41894
7917H59121j266q339K8683P0303n6722j4438J5497J35956j58054K2046k7721J43398
7905A008464j1166o4349J7170n8545R4003k7332N5848M8946j7787m9991q3084
7894I12177L2385l1661L8320J17404J17093q1663j22966k4194J27706M3648N5355
7883A183604l4912J7185j30867N6015N6378K3087N1256n7792Q8451j37394O6770
$$ y = [662735, 705309, 734998, 765037, 652884, 654717, 651973, 653229, 685604, 660318, 710846, 675698, 650934, 629711, 702194, 698910, 714151, 752365, 672286, 578179, 789603, 802971, 723598, 704276, 826268, 644526, 750926, 693920, 708775, 761267, 746029, 748792, 810914, 841769, 815311, 780170, 695530, 791968, 745306, 854244, 756072, 758821, 799729, 859715, 779897, 717227, 859121, 857855, 849516, 878199, 948502, 891780, 877342, 892839, 1028795, 870741, 892787, 865066, 1008464, 997298, 932949, 950119, 891574, 985577, 958245, 1014093, 1063039, 1045252, 995261, 912177, 944562, 912901, 951221, 1068625, 1185718, 1104055, 981089, 956895, 1084601, 1128249, 1183604, 1148692, 1165877, 1035010, 1091025, 1147403, 1170490, 1221746, 1163954, 1252405, 1115011, 1181781]
7872A181781j3364O6630j10479J26738j22250J94864o5065O4661n9451j3084N6665
7861A307646O3187n2995O65L5648Q484J25169K7048Q657J96227j111788O18433
7850A226381j2795K15552L748l1759L3695O2533l8072J7212J05039L4579r4112
7839A522001N474Q3850k91k6439J62222j17586J23009j10936R5911j8233N3021
7828A772003J3318K1236J4773j8427o5019J72794M6853O9899r9343K42712j06396
7817B064403R1492O4033N5358m0130j50160J16690n4219Q6629j4846J8597M4902
7806B282749J6290J8040o1465Q4163k1754R1596j14053R1769Q2293o9991N2504
7795B452141J988k2239k717J83722l9830O144M3372k13960R8825L3740O5036o2741
$$ y = [1181781, 1168417, 1235047, 1124568, 1251306, 1129056, 1323920, 1258855, 1323516, 1264065, 1250981, 1307646, 1370833, 1317838, 1318503, 1354151, 1362635, 1487804, 1514852, 1523509, 1719736, 607948, 1226381, 1213586, 1429138, 1432886, 1401127, 1434822, 1497355, 1459283, 1476495, 1581534, 1616113, 1522001, 1527475, 1611325, 1611034, 1584595, 1746817, 1629231, 1752240, 1641304, 1737215, 1718982, 1772003, 1785321, 1806557, 1821330, 1802903, 1737884, 1910678, 1957531, 2027430, 1928087, 2170799, 2064403, 2155895, 2219928, 2275286, 2235156, 2084996, 2201686, 2147467, 2234096, 2219250, 2237847, 2282749, 2299039, 2317079, 2255614, 2339777, 2318023, 2409619, 2295566, 2387335, 2469628, 2399637, 2452141, 2454129, 2431890, 2429173, 2612895, 2573065, 2579209, 2622581, 2408621, 2507446, 2541186, 2606222, 2543481]
7783B543481k5041m2057J01907j10928L9252o6225J5849j08504n0299L2680P7674
7772B407789N3035j77184n9099j5036k7875P2879m04j08581j705r254p3054K7733
7760B089244j2153J6870k5582L6166j48899o4603N190O9107m7320P6204q0124
7749A914100O9971l5239K3776j59933J0824j5267j238n6868J32205p7697J41634
7738A946268j34972k9121J5880J6346p1399O7471j28531n1334l9288N0281j3978
7727A627623j00254J0846J36218m921o3150q8510L5962J21033j05093p8430l211
7716A488113J44228j47002Q5812m0618j70607J11346J7933q0280K8346j13000
7706A324271N8803J4172N6369p345R897n3623n0400N3754N9305l7671j14399M8562
$$ y = [2543481, 2518440, 2476383, 2578290, 2467362, 2506614, 2440389, 2456238, 2347734, 2297435, 2330115, 2407789, 2460824, 2283640, 2224541, 2209505, 2181630, 2254509, 2254105, 2145524, 2143819, 2134565, 2061511, 2089244, 2077091, 2093961, 2068379, 2104545, 1955646, 1891043, 1896233, 1965340, 1918020, 1994224, 1914100, 1984071, 1948832, 1972608, 1812675, 1823499, 1808232, 1806994, 1750126, 1882331, 1804634, 1946268, 1811296, 1782175, 1798055, 1814401, 1743002, 1810473, 1681942, 1630608, 1591320, 1641601, 1627623, 1527369, 1538215, 1674433, 1669512, 1606362, 1517852, 1553814, 1674847, 1569754, 1491324, 1488113, 1632341, 1485339, 1571151, 1530533, 1359926, 1471272, 1489205, 1408925, 1437271, 1324271, 1383074, 1397246, 1453615, 1446270, 1456167, 1402544, 1352144, 1405898, 1465203, 1427532, 1313133, 1361695]
7694A361695j25378R9354r0788J31822K5798o8679J4216l5408M237o0575J05777
7683A362071o3674L4442j18450p7339J07739m3011O2387k8340R7911j70491Q4714
7672A247959j606O9810j01447k9706P475N3605M242k8675j3821M9039J1163j77554
7660A090484P399R2715o7768J1916Q4037k917m4855L5811j79577j2760J27549
7649A142034n4611L9336M0034m6705N104J6095l6558N1374L1276K7698m0364k0065
7637A154648j09532m6628J17354N9539j28941N5777l0373l2684j4021M2273Q3089
7626A150501l2413o5412j2297R207j12910J65473j2323r4503N9229M1647k6126
7615A070073n8847P3111o0310o8855k0785P1167J2077L6635M0986j69417J18173
$$ y = [1361695, 1236317, 1335671, 1244883, 1376705, 1402503, 1333824, 1348040, 1312632, 1316869, 1256294, 1362071, 1298397, 1332839, 1214389, 1137050, 1244789, 1201778, 1264165, 1235825, 1333736, 1163245, 1247959, 1246353, 1316163, 1214716, 1185010, 1192485, 1246090, 1250332, 1221657, 1207836, 1256875, 1268038, 1090484, 1097883, 1190598, 1122830, 1134746, 1218783, 1215866, 1171011, 1206822, 1027245, 1014485, 1142034, 1087423, 1126759, 1166793, 1120088, 1125192, 1141287, 1104729, 1156103, 1187379, 1215077, 1174713, 1154648, 1045116, 998488, 1115842, 1175381, 1046440, 1102217, 1071844, 1039160, 1025139, 1067412, 1150501, 1118088, 1052676, 1040379, 1049586, 936676, 1102149, 1089826, 995323, 1054552, 1096199, 1070073, 1011226, 1084337, 1024027, 955172, 934387, 1005554, 1017631, 1054266, 1095252, 925835, 1044008]
7604A044008q8889J51424N5570j36974M0528n2451j15096J44920L9182M2723j36513
7593I88432p8053J31998Q100P961n9823J4642P4723p7872o3385J03838J01937
7582A152498l46319J78009J4926P1406j26920j0666J23886n0172N09J4014n4109
7571I67062L7360N375m2711J14662n0609J8843j35699R5410L0484o8965K5915
7560I97127M1696o5871M5385k4899j0131R5112n8169j06790N4014m5210p5621
7549H46643J57895l3733O4755L0701P2906j06906o7362J6144q0380P3955j6168
7538I58450P8680r1717M3060J29442j40268l7373J24628r2963N2476j11318J08582
7527A021679l7002o6044l129O7949J007Q838L0021o4257K1696M3606q512l8886
$$ y = [1044008, 955119, 1106543, 1162113, 1025139, 1065667, 1013216, 898120, 1043040, 1082222, 1124945, 988432, 910379, 1042377, 1050477, 1058438, 998615, 1013257, 1087980, 1010108, 946723, 1050561, 1152498, 806179, 984188, 999114, 1070520, 943600, 932934, 1056820, 1006648, 1007157, 1021171, 967062, 1004422, 1009797, 967086, 1081748, 1031139, 1049982, 914283, 1009693, 1040177, 971212, 997127, 1038823, 972952, 1018337, 993438, 983307, 1078419, 1020250, 913460, 967474, 922264, 846643, 1004538, 970805, 1035560, 1066261, 1139167, 1032261, 964899, 981043, 900663, 974618, 958450, 1037130, 945413, 988473, 1117915, 977647, 940274, 1064902, 971939, 1024415, 913097, 1021679, 984677, 918633, 915504, 983453, 984460, 993298, 1023319, 959062, 980758, 1024364, 1015852, 976966]
7515I76966O082M6097l5367K9989k6561k3222N0253L3312k1310P9665k230j80916
7503I32758M6251P7975N7261l2105p7444l2047j9142J35556q4985j03257N1282
7492I52103O0751Q1899j01539O8117J294J3841N7515m0203l1537n4259l395o4339
7480I40248J39253j00999O3143l0273Q2785m5307n6187O7752o6577P6996j38733
7469I32101o9571N7002J12131L0044r1734J24369j00586o133Q6488k5932K3784
7458A071963n1272m1385M4728J4241k0137K7811J038P1312J6367j74397N2028
7447A012297L4687n3597r207O84J40511j26809q409J58552p0708J3389p6447r273
7435A005670P4324J17338j22877j7597O336p4190M6372N9731j53923M6446Q2206
$$ y = [976966, 983048, 1029145, 993778, 1023767, 997206, 973984, 1024237, 1057549, 1036239, 1115904, 1113674, 932758, 979009, 1056984, 1114245, 1082140, 1004696, 972649, 953507, 1089063, 1004078, 900821, 952103, 1012854, 1094753, 993214, 1061331, 1062625, 1076466, 1133981, 1093778, 1062241, 1007982, 1004587, 940248, 1079501, 978502, 1041645, 1011372, 1094157, 1048850, 992663, 1060415, 993838, 1070834, 932101, 862530, 919532, 1031663, 1061707, 969973, 1094342, 993756, 987623, 1074111, 1048179, 1071963, 1020691, 979306, 1024034, 1038275, 1018138, 1045949, 1046987, 1118299, 1134666, 960269, 1012297, 1046984, 993387, 984180, 984864, 1125375, 998566, 990157, 1148709, 1078001, 1091390, 1014943, 1005670, 1079994, 1197332, 1074455, 1056858, 1063194, 989004, 1035376, 1095107, 941184, 987630, 1069836]
7424A069836m9342Q676P7726M4502k4971j9132o2351R088J4501L6185N1230j03616
7412A052332O3349o6504o314N3075o3909J8733L9074K9771J3975o113l7160J00162
7400A190471K6536m6072m0780o4117J22421j51342J63976L9765p0388M2960l7825
7389A175605J7158l2130J25924j58198L4065k1649J6424M7419l7826L1609m3881
7378A154520Q3033J8997K0474R743q4878N1206J42373j03803k4421m7563P0164
7367A289845p0657L8454p8402J62877J3217r3369R1757o8618J46420k31750N7716
7356A257490J71204j03521L3219q1719j7532l8204J4134J29237p8310j5662J5033
7345A285369O951P5589N335J2989o5346O4449r0565k3322M6553n1696k8434O5909
$$ y = [1069836, 1020494, 1029170, 1106896, 1151398, 1126427, 1107295, 1044944, 1054032, 1068533, 1104718, 1155948, 1052332, 1115681, 1049177, 1042863, 1095938, 1032029, 1050762, 1089836, 1119607, 1133582, 1127469, 1090309, 1190471, 1217007, 1170935, 1130155, 1066038, 1188459, 1037117, 1201093, 1240858, 1170470, 1213430, 1175605, 1192763, 1160633, 1286557, 1128359, 1162424, 1140775, 1157199, 1204618, 1166792, 1198401, 1154520, 1237553, 1256550, 1277024, 1286767, 1201889, 1253095, 1395468, 1291665, 1267244, 1219681, 1289845, 1219188, 1257642, 1179240, 1342117, 1355334, 1261965, 1353722, 1285104, 1431524, 1199774, 1257490, 1428694, 1325173, 1358392, 1276673, 1259141, 1220937, 1235071, 1364308, 1285998, 1270336, 1285369, 1292320, 1367909, 1373244, 1386233, 1320887, 1385336, 1294771, 1271449, 1318002, 1266306, 1237872, 1303781]
7333A303781K6N3816k0688m6950M4640m1740L731m8731O9611J8338O1109j21076
7321A275867L0387M677p6769J03135m8124m0180J2436M9592k392q9121q337J40163
7309A351334j15822M8949O6933m1102p0121J9812l3166m0202J84691j65422o0293
7298A145591N3676J27761K9857m3426k3363j10082P9785j12228J34973L4684r6025
7287A221203m7493Q9880p484J32271m1468k2633n3440k4432K7967Q9435j81650
7276A182156N3354m5453J65786l4616j24302K7807q8925R5256O8085K208N563
7265A306919J002k8968o9958P7893Q6927n9307N0462j28658P0902M8994j44723
7254A211485P9815m4877n3311k7510J73768J13483j42546p0246P843r16J74306
$$ y = [1303781, 1303807, 1357623, 1336935, 1289985, 1334625, 1292885, 1296616, 1247885, 1317496, 1335834, 1396943, 1275867, 1306254, 1310931, 1234162, 1337297, 1289173, 1248993, 1261429, 1311021, 1308629, 1219508, 1211171, 1351334, 1235512, 1284461, 1351394, 1310292, 1240171, 1259983, 1226817, 1186615, 1371306, 1205884, 1145591, 1199267, 1327028, 1356885, 1313459, 1290096, 1180014, 1259799, 1147571, 1282544, 1317228, 1221203, 1173710, 1263590, 1256106, 1388377, 1346909, 1324276, 1270836, 1246404, 1274371, 1363806, 1182156, 1235510, 1190057, 1355843, 1321227, 1196925, 1224732, 1135807, 1231063, 1299148, 1301356, 1306919, 1307921, 1278953, 1208995, 1286888, 1373815, 1314508, 1364970, 1236312, 1307214, 1356208, 1211485, 1291300, 1246423, 1193112, 1165602, 1339370, 1452853, 1310307, 1240061, 1247904, 1246988, 1421294]
7243A421294n1513j6074o458j23206R9755J89419j51967L1444l4227N5767j21217
7232A293017K6560j5551P0728m0435l2407K6788n0415R7343N5003j38381N7234
7221A349484m5890J23234p3286j5233N9269q049L4493k2371N0126m0631n6100
7210A355046J12038l2751o149R18O7332j25125J24898O1445j66241J46638n1427
7199A486622r7245J81769j66637j00441J07893k832J00155K1794j2353K5800m8024
7188A496501R9164k195j01510j07609J33463L2217l3777K404j0452O8230p9455
7177A496981J36099j7308n8565o9338R0782J6468q3368n4966J18606J21270q4496
7166A612165n6032r339M9398m5528n3999K06422m9783q8238K9473j5965O4970
$$ y = [1421294, 1369781, 1353707, 1347249, 1224043, 1323798, 1513217, 1361250, 1392694, 1358467, 1414234, 1293017, 1319577, 1304026, 1374754, 1334319, 1301912, 1328700, 1278285, 1375628, 1430631, 1292250, 1349484, 1303594, 1426828, 1353542, 1338309, 1397578, 1389529, 1424022, 1401651, 1451777, 1411146, 1355046, 1467084, 1434333, 1428184, 1429102, 1496434, 1371309, 1496207, 1557652, 1391411, 1538049, 1486622, 1389377, 1571146, 1404509, 1304068, 1411961, 1409129, 1509284, 1531078, 1518725, 1544525, 1496501, 1595665, 1593470, 1491960, 1384351, 1517814, 1550031, 1516254, 1518658, 1508206, 1576436, 1496981, 1633080, 1615772, 1557207, 1487869, 1578651, 1595119, 1511751, 1456785, 1575391, 1696661, 1612165, 1556133, 1546794, 1596192, 1550664, 1496665, 1703087, 1653304, 1565066, 1594539, 1578574, 1643544]
7155A643544l7560o2057O2522L9379J7193O1369l5132j30599J00720k2137M8291
7144A685533Q918R887K073L6908J9342M6352q0103P5955j31947R3259J03124r9503
7132A769798l0318L0461R3064o9336q7092M7310O9142R335N4767L3127j72603
7121A747655N6097P9384M9485j08874M4151N0572n0558q247J2710L5947L0835
7110A939157j00503J21130P8999j07375m787M6731Q0237k07225R8767M1720J16706
7099B103557j66121M3686J9638R5109j02327N0388P0593J23843j58322M5408j2831
7088B112621p7967L8436K0439M3033l3568j0915P8993l5951j9260J02982n6060
7077B162783O2582l2290M8313m091O8445m5436O7571p6393N8528j2460j9211O7354
$$ y = [1643544, 1605984, 1543927, 1606449, 1645828, 1663021, 1724390, 1689258, 1558659, 1659379, 1637242, 1685533, 1694451, 1704338, 1706411, 1743319, 1762661, 1809013, 1728910, 1804865, 1672918, 1766177, 1869301, 1769798, 1739480, 1769941, 1863005, 1793669, 1706577, 1753887, 1823029, 1832364, 1887131, 1920258, 1747655, 1803752, 1883136, 1932621, 1823747, 1867898, 1918470, 1867912, 1859665, 1872375, 1908322, 1939157, 1838654, 1959784, 2038783, 1931408, 1926621, 1973352, 2053589, 1846364, 1945131, 1986851, 2103557, 1937436, 1981122, 2000760, 2095869, 1993542, 2043930, 2114523, 2238366, 2080044, 2125452, 2112621, 2034654, 2073090, 2093529, 2136562, 2102994, 2092079, 2171072, 2135121, 2115861, 2218843, 2162783, 2225365, 2193075, 2241388, 2237297, 2305742, 2260306, 2327877, 2251484, 2310012, 2297552, 2278341, 2345695]
7065B345695l5938l4033o6586K31424j77492J18575N1688q2836N0989o2420N6083
7054B395149R648l8592p317L0326J1242K0979O1035j05874J06299J8932M2591
7043B544418N856j27848J52710k06352Q2795P6071O200j4777l077O0687L2382
7032B609065q1159J39740k8667M4443m3709Q9764m8067P5628o9627N8886J5348
7021B761645M6682n8107Q0770J9165J6847r0429M7519N9206L2724Q5569K4406
7010C025997j37221N6217O762O423q574k3894P5748M4222m3620O7557J08014r333
6998C168298r3033J2746J04737m7754R7469q0920M9533R6962j36232J8202J02520
6987C292528L9366j2120q6350Q8769M2274r1599Q7615O0375J65305j51140j3713
$$ y = [2345695, 2309757, 2275724, 2209138, 2440562, 2263070, 2381645, 2433333, 2350497, 2401486, 2339066, 2395149, 2404797, 2366205, 2358888, 2389214, 2400456, 2421435, 2482470, 2376596, 2482895, 2501827, 2544418, 2550274, 2422426, 2575136, 2368784, 2451579, 2527650, 2533850, 2519073, 2515996, 2576683, 2609065, 2527906, 2667646, 2638979, 2683422, 2639713, 2729477, 2681410, 2757038, 2687411, 2746297, 2761645, 2808327, 2750220, 2830990, 2850155, 2867002, 2776573, 2824092, 2883298, 2916022, 3001591, 3025997, 2888776, 2944993, 2951755, 2958178, 2949604, 2925710, 3001458, 3045680, 3002060, 3069617, 3177631, 3168298, 3075265, 3088011, 3192748, 3144994, 3242463, 3161543, 3211076, 3308038, 3171806, 3190008, 3292528, 3331894, 3319774, 3233424, 3322193, 3364467, 3272868, 3360483, 3420858, 3586163, 3435023, 3421310]
6976C421310J13548j1899J1216j2546j11616O4361J00337N7693q8993R7129O5532
6965C706072q6313n0512P8415J14549k8368j4890R3754m8550p7599J51590k7892
6954C810256J71173O0797j18148R1633j32735Q9535M047J42589q6728o5042J98534
6943D165911J00396j10429J981J05812l4392l3778J15580R8916j26054L5294J51560
6932D470797m3977k3429J27182N1791l5971k3073P2860J02177K5051r110K6491
6921D740789j0704k344J16424M9190K4001J13656j02695L562J95859q5656R6311
6910E138393K0023M2695q1753Q5323J09075R9666K6775n6003K433N4513O1475
6899E502615o3517J35710L4072L5574N4501n7327J38702J10248q3814K5590K10056
$$ y = [3421310, 3534858, 3522959, 3534175, 3521629, 3410013, 3474374, 3574711, 3632404, 3543411, 3640540, 3706072, 3619759, 3569247, 3647662, 3762211, 3733843, 3718953, 3812707, 3764157, 3686558, 3838148, 3810256, 3981429, 4042226, 3924078, 4015711, 3882976, 3972511, 3976558, 4119147, 4032419, 3967377, 4165911, 4266307, 4155878, 4157859, 4263671, 4229279, 4195501, 4311081, 4409997, 4283943, 4319237, 4470797, 4426820, 4403391, 4530573, 4582364, 4546393, 4523320, 4596180, 4698357, 4723408, 4714298, 4740789, 4730085, 4727741, 4844165, 4893355, 4917356, 5031012, 4928317, 4931879, 5127738, 5042082, 5138393, 5158416, 5201111, 5119358, 5204681, 5313756, 5413422, 5440197, 5384194, 5386627, 5441140, 5502615, 5439098, 5574808, 5608880, 5644454, 5698955, 5641628, 5780330, 5890578, 5806764, 5832354, 6042410]
6888F042410n1423n0193L5013J85064P0529o6444J77289J25662j09321J8500L11796
6877F688882j12865M9899M1921O6449Q0363P4635L6675n2353J55893L8412R7521
6866G165432K5J26756o0687R3961J40004K1105Q4263P4021P8600n094Q0753J47230
6854G946369J78739o0973J69771J5702n9538Q0277J48753R3133P3183R3078J19285
6843H797779K2464L8787K23600n259K954J59097J89394J8171J23952o091J26580
6832I691428M1348J68666K0724J77056O7401J86444R5632K1750R8384J69533K088
6821A0740454J71975M8336J90017m0476J30871P9031J87106J83130M0366J67626
6811A1898436K06373Q0696J00651J93422L2485J75129K4491K38623J83563O505
$$ y = [6042410, 5990987, 5940794, 5975807, 6160871, 6231400, 6164956, 6342245, 6467907, 6358586, 6377086, 6688882, 6576017, 6625916, 6667837, 6734286, 6814649, 6889284, 6925959, 6873606, 7029499, 7067911, 7165432, 7165457, 7292213, 7231526, 7325487, 7465491, 7486596, 7570859, 7644880, 7723480, 7718386, 7799139, 7946369, 8125108, 8064135, 8233906, 8249608, 8190070, 8270347, 8419100, 8512233, 8585416, 8678494, 8797779, 8820243, 8859030, 9082630, 9077371, 9080325, 9239422, 9428816, 9446987, 9570939, 9564848, 9691428, 9732776, 9901442, 9922166, 10099222, 10166623, 10353067, 10448699, 10470449, 10568833, 10738366, 10740454, 10912429, 10960765, 11150782, 11110306, 11241177, 11320208, 11507314, 11690444, 11730810, 11898436, 12104809, 12185505, 12286156, 12479578, 12512063, 12687192, 12711683, 12950306, 13133869, 13140374]
6801A3140374J10984J62708K11391J46712K74281j3916K98165J50056J29130Q5214
6791A4695099K76707J41282J39124J75366K89472J17179J62673J41930L64823
6782A6503655R9874K43915J99008L24829J50155J90475P5363L40799K30818J16257
6772A8475148L04469L25071K82272J70458L63315L79282K56585K42832L26014
6763B1125446K67355K83367K78262M52404M28991K21812K89309L66223L60740
6754B4073909K73788N68800K62389L89814M30001L74543N37708L76465L27728
6745B7615145N35093L59350N69291M04000N38938N00901M33108N99226M57553
6736C2012605N76161M93269O46295N78577N34875O64795P06742P36659N77456
$$ y = [13140374, 13251358, 13414066, 13625457, 13772169, 14046450, 14032534, 14330699, 14480755, 14609885, 14695099, 14971806, 15113088, 15252212, 15427578, 15717050, 15834229, 15996902, 16138832, 16503655, 16603529, 16847444, 17046452, 17371281, 17521436, 17711911, 17787274, 18128073, 18358891, 18475148, 18779617, 19104688, 19386960, 19557418, 19920733, 20300015, 20556600, 20799432, 21125446, 21392801, 21676168, 21954430, 22406834, 22835825, 23057637, 23346946, 23713169, 24073909, 24347697, 24916497, 25178886, 25568700, 25998701, 26373244, 26910952, 27287417, 27615145, 28150238, 28509588, 29078879, 29482879, 30021817, 30522718, 30955826, 31555052, 32012605, 32588766, 33082035, 33728330, 34306907, 34841782, 35506577, 36213319, 36949978, 37527434]
6727C7527434O66757O42284P22054P31872O80699O96666Q32738P98273Q19899
6718D4118676Q85945Q73872J025741J009066R58084J060622J205551J143353J223128
6709E3504038J318732J312875J264955J349976J438383J448024J383138J468365
6701F4488486J398294J370876J561699J617168J675572J728439J739887J674771
6693G7255192J932080J866284K051277J909338K106207J979744K110155K256718
6685I3466995K253367K368772K433964K622022K512044K825713K990414L077556
6677A14550847L102638L459454L224691L597051L949383L881276M304107M354458
6669A44423905M519932N000276N195567N519176O018236O116756O753370P159410
$$ y = [37527434, 38194191, 38836475, 39558529, 40290401, 40971100, 41667766, 42500504, 43298777, 44118676, 45004621, 45878493, 46904234, 47913300, 48871384, 49932006, 51137557, 52280910, 53504038, 54822770, 56135645, 57400600, 58750576, 60188959, 61636983, 63020121, 64488486, 65886780, 67257656, 68819355, 70436523, 72112095, 73840534, 75580421, 77255192, 79187272, 81053556, 83104833, 85014171, 87120378, 89100122, 91210277, 93466995, 95720362, 98089134, 100523098, 103145120, 105657164, 108482877, 111473291, 114550847, 117653485, 121112939, 124337630, 127934681, 131884064, 135765340, 140069447, 144423905, 148943837, 153944113, 159139680, 164658856, 170677092, 176793848, 183547218, 190706628]
6661A90706628P539032Q129288Q841324R130107R871943J0274022J1157524J1748272
6653B67398140J2257977J2861106J3450574J3963901J4317315J4953445J5366916
6646C64569374J5676304J5919040J6078932J6118771J6136944J5780047J5415829
6639D75695241J4366227J2784337J0590103P934286N067885J982759j341462m356196
6631E22723180q118056j2081610j5764519j8527246k0230272k0834609k0747126
6624D06419742k0182187j9416662j8414861j7513456j6726455j6012224j5246656
6617B82907241j4774156j3698624j2957723j2325706j1362969j0558834r927091
6610A97302138r317891q573873p824474p512643o859881o421463o075078n547801
$$ y = [190706628, 198245660, 206374948, 215216272, 224346379, 234218322, 244492344, 255649868, 267398140, 279656117, 292517223, 305967797, 319931698, 334249013, 349202458, 364569374, 380245678, 396164718, 412243650, 428362421, 444499365, 460279412, 475695241, 490061468, 502845805, 513435908, 521370194, 526438079, 528420838, 527079376, 522723180, 514605124, 502523514, 486758995, 468231749, 448001477, 427166868, 406419742, 386237555, 366820893, 348406032, 330892576, 314166121, 298153897, 282907241, 268133085, 254434461, 241476738, 229151032, 217788063, 207229229, 197302138, 187984247, 179410374, 171585900, 164073257, 157213376, 150791913, 144716835, 139169034]
6602A39169034n089228m912276m649572m201650l937046l841421l316478l329014
6594A05892349l166281l103150k846847k754476k607137k568338k554445k266008
6586H4025667k397989k215032k314169k086129k278385k264091k124918j899697
6578F6445257k032035j967006j733969j711806j888838j542220j491007j462696
6570E2615680j523808j383310j288153j319954j245079j073511j096635r50031
6562D2735199r39463r31965r35237q70239p96852q70486p33215p03686n73800
6553C5380256q39746m87900o94385p08153m46126n15574n99466o94220n33050
6544B9861636o13297o26909n24455m95080n46235m10694n93300l43775m38279
$$ y = [139169034, 134079806, 129167530, 124517958, 120316308, 116379262, 112537841, 109221363, 105892349, 102726068, 99622918, 96776071, 94021595, 91414458, 88846120, 86291675, 84025667, 81627678, 79412646, 77098477, 75012348, 72733963, 70469872, 68344954, 66445257, 64413222, 62446216, 60712247, 59000441, 57111603, 55569383, 54078376, 52615680, 51091872, 49708562, 48420409, 47100455, 45855376, 44781865, 43685230, 42735199, 41795736, 40863771, 39928534, 39058295, 38261443, 37390957, 36657742, 35954056, 35380256, 34540510, 34052610, 33358225, 32650072, 32203946, 31688372, 31088906, 30394686, 29861636, 29248339, 28621430, 28096975, 27601895, 27055660, 26644966, 26051666, 25707891, 25269612]
6535B5269612n50388k86511l08016l37496l15345m39154k15283j52664l77428
6526B2287327j99643k12249j53867k06122j61032j55088k51999k82633l62661
6517B0302033k56717l36152l21472k40338k39350l78894m38796j81590m12510
6508A7496214k44768m28016j56680k81838j27992j74174o8777j74836j47967j71890
6498A5519276o2204m3701o313j12114J42350q6120j06662k17488q6466j94563
6488A4745995k44409r8813l39973o0130j44580l92133k21631j91260l89952k22304
6478A2440810j28235j78361k91169k13864q9105j50501k46906J5335k27129k72840
6468A0658035j477o2140l6940j66101m0838j04664k25186k97022o4434r776k26191
$$ y = [25269612, 24719224, 24432713, 24124697, 23787201, 23471856, 23032702, 22817419, 22664755, 22287327, 22087684, 21875435, 21721568, 21515446, 21354414, 21199326, 20947327, 20664694, 20302033, 20045316, 19709164, 19387692, 19147354, 18908004, 18529110, 18090314, 17908724, 17496214, 17251446, 16823430, 16666750, 16384912, 16256920, 16082746, 16013969, 15839133, 15691166, 15519276, 15457072, 15413371, 15407058, 15294944, 15437294, 15351174, 15244512, 15027024, 14940558, 14745995, 14501586, 14402773, 14062800, 14002670, 13858090, 13465957, 13244326, 13053066, 12663114, 12440810, 12312575, 12134214, 11843045, 11629181, 11540076, 11389575, 11142669, 11158004, 10930875, 10658035, 10656558, 10594418, 10557478, 10391377, 10350539, 10245875, 10020689, 9723667, 9659233, 9649457, 9423266]
6457I423266j67987j22412k46962j21324j14212o616k88053j85230m2337p0012
6447H058121j65497o1163j04297q7895k81222l5493j86654M4702j29428j08193
6437F942981o4103j75619j56053J8577o7635j70185j9669J1298j10159j69752
6427F039681p0502Q657j16002n6658l4183j39705j04524P0273M7577j14927q4544
6416E445143j07896P783L6738j85672q8776O5766o2047q3075q8195P4176j62324
6405D851621L3531p7221O6477Q9r4448M22j07169O5803k02566K11519m6346q8352
6393D613360j11551l5215J59598q6346j12390R9803n0641l2018l0891N3408J6434
6382D483551q6232j2197L9007j17188J18892J1203O7564j25929L8320r645O792
$$ y = [9423266, 9255279, 9132867, 8885905, 8764581, 8650369, 8643753, 8355700, 8170470, 8128133, 8058121, 7892624, 7831461, 7727164, 7639269, 7358047, 7322554, 7135900, 7180602, 7051174, 6942981, 6878878, 6703259, 6547206, 6565783, 6498148, 6327963, 6308294, 6319592, 6209433, 6039681, 5969179, 5977836, 5861834, 5805176, 5770993, 5631288, 5526764, 5597037, 5644614, 5529687, 5445143, 5337247, 5345030, 5381768, 5196096, 5107320, 5173086, 5111039, 5027964, 4939769, 5013945, 4851621, 4885152, 4807931, 4874408, 4874497, 4780049, 4780471, 4673302, 4739105, 4536539, 4748058, 4701712, 4613360, 4501809, 4466594, 4626192, 4539846, 4427456, 4527259, 4476618, 4444600, 4413709, 4467117, 4483551, 4397319, 4385122, 4424129, 4306941, 4425833, 4437036, 4504600, 4378671, 4416991, 4407346, 4414138]
6371D414138j154j4343l9895J25195j0191L0642j43750n131m0498J24696m3140
6360D396569o1881P4453M77m0826Q0542M322N2365M2550q9576J02184n5947Q6536
6348D591768J8209K6350O1163J5087N7102O3434Q6636j00990J20794k9544J7176
6337D927185R9149m4863R9142m8868M9942J55971K399N6321N2326P604j5609J30343
6325E471042J08201Q3871j3515J07459k8710J22423R2282n11J09334J02660K950
6314F157486Q6017J57770N3588J25205Q4680R6307N1268o0945J34783O9944O3674
6303G019777K00727P1183J21322J51623m5136O3913K30851l350J60681Q5692J0422
6292H067705J66809L8279N8177j2905K20120J58635N9675L8861L2417J48458J15791
$$ y = [4414138, 4412984, 4398641, 4358746, 4483941, 4473750, 4504392, 4360642, 4355511, 4315013, 4439709, 4396569, 4334688, 4409141, 4409618, 4368792, 4449334, 4453656, 4506021, 4548571, 4458995, 4561179, 4505232, 4591768, 4609977, 4636327, 4697490, 4712577, 4769679, 4833113, 4919749, 4818759, 4939553, 4910009, 4927185, 5026334, 4981471, 5080613, 5031745, 5081687, 5237658, 5240057, 5296378, 5348704, 5356308, 5340699, 5471042, 5579243, 5663114, 5649599, 5757058, 5728348, 5850771, 5943053, 5942542, 6051876, 6154536, 6157486, 6243503, 6401273, 6454861, 6580066, 6664746, 6761053, 6812321, 6751376, 6886159, 6956103, 7019777, 7220504, 7291687, 7413009, 7564632, 7519496, 7583409, 7814260, 7810910, 7971591, 8057283, 8067705, 8234514, 8272793, 8330970, 8318065, 8538185, 8696820, 8756495, 8795356, 8827773, 8976231, 9092022]
6281I092022J86831R0379J94914J18491Q4481L6801L2794J87187P6386k3256J03186
6270A0180216J35658J21236J93422J26988O3145J89662J01382P8721J95347J89338
6260A1575115J47879J40229J50321R9406K27576J38725K10106M9727J81629J74673
6250A3095386L01598J54541L60995J28181J64537J94110K71420K08131K43661
6241A5122560L22306J96739M01838L21760L90610K83686M15178M29990L28391
6232A8213058M64198N30470M54730N68195O11468N78920O01415Q35200R13990
6223B3771644P84836Q45904R07928J202218J108643J263029J305884J419195J560606
6214C4169887J723247J850318J887308K112871K194937K294206K448226K292721
$$ y = [9092022, 9278853, 9369232, 9564146, 9682637, 9767118, 9803919, 9836713, 10023900, 10100286, 10077030, 10180216, 10315874, 10437110, 10630532, 10757520, 10820665, 11010327, 11111709, 11190430, 11385777, 11575115, 11722994, 11863223, 12013544, 12112950, 12340526, 12479251, 12689357, 12739084, 12920713, 13095386, 13396984, 13551525, 13912520, 14040701, 14205238, 14399348, 14670768, 14878899, 15122560, 15444866, 15641605, 16043443, 16365203, 16755813, 17039499, 17454677, 17884667, 18213058, 18677256, 19207726, 19662456, 20230651, 20842119, 21421039, 22022454, 22857654, 23771644, 24556480, 25402384, 26310312, 27512530, 28621173, 29884202, 31190086, 32609281, 34169887, 35893134, 37743452, 39630760, 41743631, 43938568, 46232774, 48681000, 50973721]
6206E0973721K611939J902214J296687O78223L79194O62394O99296P37690J077266
6197F1018624J077605J156368J258454J477669J376161J496113J620806K049025
6189G2530825K029061J775317J519673J241970Q01597K39163l54590n04932n05402
6180G8772682p89826r51859j162416j182575j092350r67532j091863q66035p16378
6171F9951848m93724o50723k77737r0643J47840j14652j0622o24223j633133k311519
6161F3892712k147510k166431k057883k112955j886577j914682j941128j866205
6153D7799341j807275j708793j483140j335578j038421j030396j242429j123956
6145C7029353j154898j044544p96426r00950p54720q09076p68784n94010n24781
$$ y = [50973721, 53585660, 55487874, 56784561, 57462784, 57841978, 58504372, 59203668, 59941358, 61018624, 62096229, 63252597, 64511051, 65988720, 67364881, 68860994, 70481800, 72530825, 74559886, 76335203, 77854876, 79096846, 79898443, 80137606, 79783016, 79278084, 78772682, 77982856, 77030997, 75868581, 74686006, 73593656, 72626124, 71534261, 70668226, 69951848, 69458124, 68807401, 68529664, 68439021, 68586861, 68472209, 68461587, 67837364, 66204231, 63892712, 61745202, 59578771, 57520888, 55407933, 53521356, 51606674, 49665546, 47799341, 45992066, 44283273, 42800133, 41464555, 40426134, 39395738, 38153309, 37029353, 35874455, 34829911, 34033485, 33132535, 32377815, 31568739, 30799955, 30205945, 29681164]
6136B9681164m58348p24632o03568o87928m25090o19453l57148m52215o02543
6127B4750239n65727l21887n42980n34723m58794m73583n93848n27694m33745
6118B0297258m17783n65303m62049m06992n37949n14168m65698m80654l33170
6109A6113492n18715l30204n38444l68923j69186m60211j13695l53160k46784
6100A3014170l62353l67003l25848k25349j99343k18925l12755k50885k48929
6091A0502780j43822j95603k58272k21671j16721j37034k23830j37471k35037
6082H833319k05979q0808j42267j45471j37638j95321l6175k68421j46398o8825
6072G406016n8814k31599j48678j52114j00557k41008j40508j97574N2993k27176
$$ y = [29681164, 29222816, 28498184, 27894616, 27206688, 26781598, 26162145, 25804997, 25352782, 24750239, 24184512, 23862625, 23319645, 22784922, 22326128, 21852545, 21258697, 20731003, 20297258, 19879475, 19314172, 18852123, 18445131, 17907182, 17393014, 16927316, 16446662, 16113492, 15594777, 15264573, 14726129, 14357206, 14188020, 13727809, 13614114, 13260954, 13014170, 12651817, 12284814, 11958966, 11733617, 11534274, 11315349, 11002594, 10751709, 10502780, 10358958, 10163355, 9905083, 9683412, 9566691, 9429657, 9205827, 9068356, 8833319, 8627340, 8546532, 8404265, 8258794, 8121156, 7925835, 7889660, 7621239, 7474841, 7406016, 7347202, 7115603, 6966925, 6814811, 6714254, 6473246, 6332738, 6135164, 6188157, 5960981]
6062E960981j37800j6640j430j73576j9655m2574n9354k25456J0617N290j61215
6051E139188r383k35960J3104j23500p629p7119M4153m477j72980J7516j9715
6040D563198r7912m5263J24291n2682j43006k6448j14921O3820k9910m8717n400
6029D187050j24268K0089k2723J23010j05902j6892q5031Q1762m6462p595k16746
6018C786292J64832j90294R5643R6235M1858p5516j30305L4378N0178q3300J17347
6007C907348J1517j25113j07254Q7830l1428o2775L1529k4499J9983m0429L5562
5996C702271N9047L560q039N3659l6000L4701J777l5643k8241O8059j05713K12413
5984C921851q3739Q2042q9566J39619j15371Q4484M8437L3926j38949J58754q3605
$$ y = [5960981, 5823181, 5806541, 5805111, 5631535, 5611880, 5569306, 5509952, 5284496, 5295113, 5300403, 5139188, 5129805, 4893845, 4906949, 4783449, 4775820, 4698701, 4742854, 4738377, 4565397, 4582913, 4563198, 4465286, 4420023, 4544314, 4491632, 4348626, 4322178, 4207257, 4271077, 4241167, 4192450, 4187050, 4062782, 4082871, 4060148, 4183158, 4077256, 4060364, 3975333, 4057095, 4010633, 4003038, 3786292, 3951124, 3760830, 3856473, 3952708, 3994566, 3919050, 3788745, 3823123, 3873301, 3790001, 3907348, 3918865, 3793752, 3686498, 3774328, 3742900, 3680125, 3711654, 3687155, 3707138, 3666709, 3702271, 3761318, 3764878, 3756839, 3810498, 3774498, 3809199, 3810976, 3775333, 3747092, 3815151, 3709438, 3921851, 3838112, 3920154, 3830588, 3970207, 3854836, 3939320, 3987757, 4021683, 3882734, 4041488, 3957883]
5973C957883P3236r7600R5991J18585P5181l8831L0784R3979N7622m2277J73051
5962D497604q1828J16887l6510m3619J22224l3659J5404J52055J37663p1431J02896
5951D877686J14647j4924J57783R3642P7294k8289J64290R6798J18817j09787
5941E547957J57842J68898J62536K2659K18684J38674J12178Q2908J26282Q6567
5931F825185J72780K67743J36500J92300K69662Q8299L63791L06618L07367K66309
5921I196554M15724J96450M27707L18097L25865K21446M21354M78004M75379L34108
5911A2810688L86432L59361L58528K66879N54493L64304L18830J82902P081K19308
5901A5828806J17483J36923j1928L3589k36487n474o0250j57080m2480o5028j30929
$$ y = [3957883, 4031119, 3933519, 4029510, 4148095, 4223276, 4184445, 4215229, 4309208, 4366830, 4324553, 4497604, 4415776, 4532663, 4496153, 4452534, 4574758, 4541099, 4556503, 4708558, 4846221, 4774790, 4877686, 4992333, 4977409, 5135192, 5228834, 5306128, 5277839, 5442129, 5538927, 5657744, 5547957, 5705799, 5874697, 6037233, 6059892, 6278576, 6417250, 6529428, 6612336, 6738618, 6825185, 6997965, 7265708, 7402208, 7594508, 7864170, 7952469, 8316260, 8622878, 8930245, 9196554, 9612278, 9808728, 10236435, 10554532, 10880397, 11101843, 11523197, 12001201, 12476580, 12810688, 13197120, 13556481, 13915009, 14181888, 14736381, 15100685, 15419515, 15602417, 15609498, 15828806, 15946289, 16083212, 16071284, 16104873, 15868386, 15862912, 15802662, 15645582, 15603102, 15538074, 15407145]
5890A5407145r8781k35143j01130k12243j27427k50649k40296k09311k12431l02478
5880A3417256k7659k95283j93319j93382j39712k68474j64965p63m02458j22204
5870A1609037r5143n5890k53051Q2099j96658R9201k52747j83157n0635j09543
5860A0593513k55620k10492k13055k84114k10549k53602j44608k12326l01150
5851H507997j29985k72062j02660j64349k10672j20446j77092j49279j50270j85531
5841F845651k45844m5130j33807J1171j08805j88154o2774j90631q0917q4429
5831E716331p5544r9290N9829l1132k78306Q1168m5453J49703j42525p3363M4435
5820E305853j94017O318N5807o6638J6661j34199k3844M5570n8987K9540j9395
$$ y = [15407145, 15308364, 15073221, 14972091, 14759848, 14632421, 14381772, 14141476, 13932165, 13719734, 13417256, 13389597, 13094314, 12900995, 12707613, 12567901, 12299427, 12134462, 12133699, 11731241, 11609037, 11513894, 11458004, 11204953, 11287052, 11090394, 11189595, 10936848, 10753691, 10703056, 10593513, 10337893, 10127401, 9914346, 9630232, 9419683, 9166081, 9021473, 8809147, 8507997, 8378012, 8105950, 8003290, 7838941, 7628269, 7507823, 7330731, 7181452, 7031182, 6845651, 6599807, 6554677, 6420870, 6432041, 6323236, 6135082, 6072308, 5881677, 5800760, 5716331, 5640787, 5541497, 5601326, 5570194, 5291888, 5373056, 5327603, 5477306, 5334781, 5261418, 5305853, 5111836, 5118154, 5173961, 5107323, 5123984, 4989785, 4965941, 5011511, 4952524, 4982064, 4962669]
5809D962669m6699P47J9570Q4256O7618k65842M3501Q3943N4605j06953J54402
5798E051817j51090J12792N663J6910N7189j63138J47630N0642J77055m8250Q1052
5787E338272k6530J77411r7499J67416p4752N8517k5127K05575M6307J17699m2116
5776E845173M1605J02452J2892J26196J64825j9472J4856p6533J01539O4088P8677
5765F456298O5229l1867Q6743L6491J98962k0174O1099J9306J0684Q3216k6017
5754F939970J01007P0782J8794p3317J23395J18437L0218P625M7687j42376J8643
5743G260865N865J26913P3006P570r0802N8936K982j19152J96199j4973q0582
5732G426827J08119K4657P0165j30013j5673N5157Q011K2617l2081N0440r4323
$$ y = [4962669, 4915970, 4916717, 4936287, 5020543, 5088161, 4822319, 4865820, 4949763, 5004368, 4897415, 5051817, 4900727, 5013519, 5019182, 5036092, 5093281, 4930143, 5077773, 5128415, 5305470, 5257220, 5338272, 5311742, 5489153, 5391654, 5559070, 5484318, 5542835, 5517708, 5723283, 5769590, 5887289, 5845173, 5886778, 5989230, 6002122, 6128318, 6293143, 6273671, 6288527, 6211994, 6313533, 6377621, 6456298, 6521527, 6489660, 6576403, 6612894, 6811856, 6791682, 6852781, 6872087, 6882771, 6965987, 6939970, 7040977, 7111759, 7130553, 7057236, 7180631, 7299068, 7329286, 7336911, 7384598, 7242222, 7260865, 7266730, 7393643, 7466649, 7474219, 7383417, 7442353, 7445335, 7326183, 7522382, 7507409, 7426827, 7534946, 7559603, 7629768, 7499755, 7484082, 7539239, 7547250, 7569867, 7537786, 7588226, 7493903]
5721G493903n6564P4158N0381j7666m2040Q0758P4170j34626j2601J243L5565
5710G546681N5946q278j7750O5808J8723j25531J31936m3927L8642l4977J74886
5699G802159p4572K2105J098Q6416r4535J11699p1804R2234j285J36427l0265
5688G979677k950R9396l1774J08415J57341n0914K9452K07507N5478J00366o575
5677H645419J69256k1726J10203N131K09469J53225L4153R1298J03616J47181
5667I647225J43163K51013J31716O767J79643K41868Q0391K28983J38557J34225
5657A1183551J80245J44989J11071K09101J14122L08237O3316K29827J9136K95742
5647A2859337R9122K80316Q2346L47407K37379K98166J60429K66659K55559M08309
$$ y = [7493903, 7437339, 7511497, 7561878, 7544212, 7502172, 7582930, 7657100, 7522474, 7509873, 7511116, 7546681, 7602627, 7594349, 7576599, 7642407, 7661130, 7535599, 7667535, 7623608, 7662250, 7627273, 7802159, 7727587, 7749692, 7750790, 7837206, 7742671, 7854370, 7782566, 7874800, 7873515, 8009942, 7979677, 7976727, 8076123, 8044349, 8152764, 8310105, 8259191, 8288643, 8496150, 8551628, 8651994, 8645419, 8814675, 8792949, 8903152, 8908283, 9117752, 9270977, 9305130, 9396428, 9500044, 9647225, 9790388, 10041401, 10173117, 10179884, 10359527, 10601395, 10681786, 10910769, 11049326, 11183551, 11363796, 11508785, 11619856, 11828957, 11943079, 12251316, 12314632, 12544459, 12563595, 12859337, 12958459, 13238775, 13321121, 13668528, 13905907, 14204073, 14364502, 14631161, 14886720, 15295029]
5637A5295029K21187M84701J03000L80965K84993M23458K69683M54112L49795
5628A8266923K43123M49435L19342L79815L92013L49071L55197N40548M06509
5619B1701976L56971N29338M23552N48095N44831N44326N83939Q84887O28873
5610B6746788R51398P79177J089642R14849J102682J172348J158145J294516J451694
5601C6661239J570695J649250J715987K068076K069530K195748K280105K600354
5593E2810984K475482K809465K680516K692868K466700K339298J804479Q77747
5585G0957539M64057L81896M46982R30660J039674J181009J071952J164931J198255
5576G8836955J286043J608447J563280J713059J749380J677819J077412J261553
$$ y = [15295029, 15516216, 16000917, 16103917, 16484882, 16769875, 17193333, 17463016, 17917128, 18266923, 18510046, 18959481, 19278823, 19658638, 20050651, 20399722, 20754919, 21295467, 21701976, 22058947, 22588285, 23011837, 23559932, 24104763, 24649089, 25233028, 26117915, 26746788, 27698186, 28477363, 29567005, 30481854, 31584536, 32756884, 33915029, 35209545, 36661239, 38231934, 39881184, 41597171, 43665247, 45734777, 47930525, 50210630, 52810984, 55286466, 58095931, 60776447, 63469315, 65936015, 68275313, 70079792, 70957539, 71421596, 71803492, 72250474, 73181134, 74220808, 75401817, 76473769, 77638700, 78836955, 80122998, 81731445, 83294725, 85007784, 86757164, 88434983, 89512395, 90773948]
5568I0773948P48975P06252K03042m66557p82490j043788j029668j341288j055411
5559H6713015j038917q41130q26316p66580r37095o59486n24003l38571j58717
5550H0622200k45208l38544n70489p42339j286379k115768k312336k383816k208332
5541F8418989k078073j965409j958194j797166j817843j703142j909694j372136
5533E3817332j382458r55034r76885q78101q84677p73988q05312n26974n98063
5524D6035840l64995n08000n48752m95203l80624n02062k27753l93583m48120
5515D2166748k31369l14479l70132k76352l72845k67628l79814k82340k35438
5506C9436351j89688l26917j59936j82790k04512j57644j97986L5368j38801O9398
$$ y = [90773948, 91522923, 92229175, 92432217, 91965660, 91183170, 90139382, 89109714, 87768426, 86713015, 85674098, 84832968, 84006652, 83240072, 82302977, 81643491, 81119488, 80780917, 80622200, 80376992, 80038448, 79467959, 78725620, 77439241, 75323473, 73011137, 70627321, 68418989, 66340916, 64375507, 62417313, 60620147, 58802304, 57099162, 55189468, 53817332, 52434874, 51479840, 50502955, 49624854, 48740177, 47966189, 47160877, 46633903, 46035840, 45670845, 45162845, 44614093, 44118890, 43738266, 43236204, 43008451, 42614868, 42166748, 41935379, 41620900, 41250768, 40974416, 40601571, 40333943, 39954129, 39671789, 39436351, 39246663, 38919746, 38759810, 38577020, 38372508, 38214864, 38016878, 38052246, 37913445, 37982843]
5496C7982843k06316k92709l6781r4170r5914k8199j41910q5354o4490O498j57320
5485C6786178Q0808j90979j77058k26956j46369j99410l54392l40672m43273m73457
5475C4314420l99484l71366n28005n24171m64594l76150p05177m41570m27375
5466C0076528k72851m18629m04341o21966l84196k21588m31639k77552m08995
5457B6634771l74627l73897k96753k91861m09056k88428l81112n16324k71018
5448B3431695m93849k90307l45128l43957n21983l56608m15898l10270l66930
5439A9986765k98139m34018m06418m70596l68960m00901k17778k83990m15165
5430A6690800l74354k75443j69233l73164k85330k94708j55675k43195l09618
$$ y = [37982843, 37776527, 37483818, 37447037, 37352867, 37256953, 37228754, 37086844, 37001490, 36937000, 36943498, 36786178, 36866986, 36676007, 36498949, 36271993, 36125624, 35926214, 35571822, 35231150, 34787877, 34314420, 33914936, 33543570, 33015565, 32491394, 32026800, 31650650, 30945473, 30503903, 30076528, 29803677, 29385048, 28980707, 28358741, 27974545, 27752957, 27321318, 27043766, 26634771, 26260144, 25886247, 25589494, 25297633, 24888577, 24600149, 24219037, 23702713, 23431695, 22937846, 22647539, 22302411, 21958454, 21436471, 21079863, 20663965, 20353695, 19986765, 19688626, 19254608, 18848190, 18377594, 18008634, 17607733, 17389955, 17105965, 16690800, 16316446, 16041003, 15871770, 15498606, 15213276, 14918568, 14762893, 14519698, 14210080]
5421A4210080j08205q6590k12993j43743m8153j40802q6246k21552N991k34882
5411A2932905k02744p7717j12886j09101j01847j50188j66421o7876J9904k24644
5401A1739385m1589j54492M8105q3153O9697l0412p1305q58j50722M5067p0022
5390A1299701O2290L5917r0265M6006Q290J07818j02897Q4955P9209J18165m2124
5379A1607065N0932L6703J32501j9414Q0213Q2217P5755R5783N4059J65453M5313
5368A2406580M5361L9810J58236J29208M3206J42388J63842J44280j25914J03317
5358A3250314J9779J69149l8748J0020P0129l9255q8402Q6310j39736J51055l8868
5347A3411747l5036J5851J14333k05009J07762L7930l5723j14508o3162P5809
$$ y = [14210080, 14101875, 14015285, 13802292, 13658549, 13610396, 13469594, 13383348, 13161796, 13167787, 12932905, 12730161, 12652444, 12539558, 12430457, 12328610, 12178422, 12012001, 11944125, 11964029, 11739385, 11697796, 11543304, 11591409, 11508256, 11577953, 11547541, 11476236, 11475378, 11324656, 11369723, 11299701, 11361991, 11397908, 11307643, 11353649, 11361939, 11469757, 11366860, 11451815, 11531024, 11649189, 11607065, 11657997, 11694700, 11827201, 11807787, 11888000, 11970217, 12045972, 12141755, 12195814, 12361267, 12406580, 12451941, 12491751, 12649987, 12779195, 12822401, 12964789, 13128631, 13272911, 13146997, 13250314, 13270093, 13439242, 13400494, 13410514, 13480643, 13441388, 13352986, 13439296, 13299560, 13450615, 13411747, 13376711, 13392562, 13506895, 13301886, 13409648, 13447578, 13411855, 13297347, 13234185, 13309994]
5337A3309994q3167j6211p4896j02998p0602m5959j5749o9325K929r8310j19338
5326A2616368q5861M0584j9935o0677J00174j27412J0967J09308j3898k2670p6481
5315A2470467J62270j2076l0633j55537N6922q1920k09479J07712k14403j74815
5305A1918508j34488j21987m6827q2179k14816m7967r5427j53736k43881j66035
5295A0611165j61797p1679k34352k40265r7131j13764j67010j61939j94392j22052
5285I046784k41200k44603j31936j82430l11665j16368k74271n6912k87298j02170
5275G097931j16597k39773n3437k45954j36109n7536j58931j84173L1955k74494
5265E662882j39444k09238N8426j93403j40406N217n4985k62123o372o2788k2837
$$ y = [13309994, 13226827, 13210616, 13135720, 13032722, 12962120, 12916161, 12900412, 12831087, 12834016, 12735706, 12616368, 12530507, 12571091, 12551156, 12490479, 12590653, 12463241, 12474208, 12583516, 12569618, 12546948, 12470467, 12632737, 12620661, 12590028, 12434491, 12491413, 12409493, 12200014, 12307726, 12093323, 11918508, 11784020, 11662033, 11615206, 11533027, 11318211, 11270244, 11174817, 11021081, 10777200, 10611165, 10449368, 10377689, 10143337, 9903072, 9805941, 9692177, 9525167, 9363228, 9168836, 9046784, 8805584, 8560981, 8429045, 8246615, 7934950, 7818582, 7544311, 7487399, 7200101, 7097931, 6981334, 6741561, 6688124, 6442170, 6306061, 6248525, 6089594, 5905421, 5937376, 5662882, 5523438, 5314200, 5372626, 5179223, 5038817, 5044034, 4989049, 4726926, 4720554, 4657766, 4634929]
5254D634929j87199K3129j42098p4972r5804J02782j17511m6759k27005J61821
5244D031313j30992n2050k4344o0666l0695m7009o5595J5534o7483q3771m4416
5233C439826M37j36474j6037m6663N2978l6242K7899p1146L4647m8330r2976l6194
5221C071725l6757m9824J41839R678j25795K6143j2103k9733j03029R2549l7093
5210B947600J1882N1281j09653L3227o2326J94713j40327R7428l0811q9810M0627
5199B943831k7400O4868P4323K2218J5266j18233J76849l6266L7058O6113P7013
5188C295640k50149Q8196P1591J49590R4088k9386m3863j2367J24122N5283k3230
5177C519515L5221k539Q0439l1497J7980J01009m8913K1569J375j1540J44971
$$ y = [4634929, 4447730, 4470859, 4328761, 4253789, 4157985, 4260767, 4143256, 4096497, 3869492, 4031313, 3900321, 3848271, 3823927, 3763261, 3732566, 3685557, 3619962, 3635496, 3568013, 3484242, 3439826, 3440263, 3303789, 3287752, 3241089, 3294067, 3257825, 3285724, 3214578, 3249225, 3200895, 3107919, 3071725, 3034968, 2985144, 3126983, 3136661, 3010866, 3037009, 3024906, 2995173, 2892144, 2984693, 2947600, 2959482, 3010763, 2901110, 2934337, 2872011, 3066724, 2926397, 3023825, 2993014, 2903204, 2943831, 2916431, 2981299, 3055622, 3077840, 3093106, 2974873, 3151722, 3115456, 3152514, 3218627, 3295640, 3045491, 3133687, 3205278, 3354868, 3448956, 3419570, 3375707, 3363340, 3487462, 3542745, 3519515, 3554736, 3552197, 3632636, 3601139, 3619119, 3720128, 3671215, 3692784, 3694159, 3682619, 3827590]
5166C827590r1365Q1515p2071j11518M1500k042j17852J62983q6310m9134j39833
5155C443463q9181J6094J8475o2956k2753k5456J5061q7072j25826j19623Q4439
5144C044665j267q2164Q0301j3530r6916o7809p3448K6487J7085j11156m3537
5133B678711K541k9923j00514J24793j93490r9655M3847K7670q7284n1958N246
5122B319984p9547j6184l2622n1762P2668m3737n85o421j07982j05151O1038J6765
5110B026464j05565J44252j56812J57129j38310o8315O8848q831P5585j70295
5100A824150P2359l4488J5156O8968j88351M8970J20290j06840n1019O0446J27748
5089A957389j13785k3255q0024K8057J27206J120K2881j937j93901P7317r5712
$$ y = [3827590, 3736225, 3817740, 3745669, 3634151, 3675651, 3673609, 3555757, 3718740, 3632430, 3583296, 3443463, 3354282, 3370376, 3388851, 3325895, 3303142, 3277686, 3292747, 3205675, 3079849, 2960226, 3044665, 3043398, 2961234, 3041535, 3028005, 2931089, 2863280, 2789832, 2816319, 2833404, 2722248, 2678711, 2681252, 2651329, 2550815, 2675608, 2482118, 2382463, 2426310, 2453980, 2366696, 2314738, 2319984, 2240437, 2224253, 2191631, 2139869, 2212537, 2168800, 2168215, 2161794, 2053812, 1948661, 2009699, 2026464, 1920899, 2065151, 1908339, 2065468, 1927158, 1858843, 1927691, 1918860, 1994445, 1824150, 1896509, 1862021, 1877177, 1946145, 1757794, 1806764, 1927054, 1820214, 1769195, 1829641, 1957389, 1843604, 1820349, 1740325, 1768382, 1895588, 1896708, 1919589, 1917652, 1723751, 1801068, 1705356]
5078A705356J0232J45628k2870K8462O639j4511n3859P0717p0029N2101j4230
5067A843636K0848K7374P0538j6311m0700J9563k0992J91962o087j56279J01901
5056B035453r4747J80465q3593Q3890k9417m4695M5528J2343J34992m6681L6402
5045B229940L5636m344l0355O9420K6433r8806N6350L3005l1553L8347J06227
5034B430300K7011J03156Q5305l6049n870Q3410J55644L6225o4912M5501M3687
5023B903408J41k5517m8671J86311n5170L0767Q8274r3425J80114j11136N6684
5012C111780P9899k3776k28467J22918Q3749p510o1587J11352m5616J50800O6267
5001C359809P0003L9591l5739J52682m1993K0870K3689J01568J9486M3994K4904
$$ y = [1705356, 1715588, 1861216, 1838346, 1866808, 1873447, 1858936, 1805077, 1875794, 1805765, 1857866, 1843636, 1864484, 1891858, 1962396, 1946085, 1905385, 1924948, 1903956, 2095918, 2089831, 1933552, 2035453, 1940706, 2121171, 2037578, 2121468, 2092051, 2047356, 2092884, 2105227, 2240219, 2193538, 2229940, 2265576, 2261232, 2230877, 2300297, 2326730, 2227924, 2284274, 2317279, 2285726, 2324073, 2430300, 2457311, 2560467, 2645772, 2609723, 2603853, 2687263, 2842907, 2879132, 2814220, 2859721, 2903408, 2903549, 2878032, 2829361, 3015672, 2960502, 2991269, 3079543, 2986118, 3166232, 3055096, 3111780, 3191679, 3167903, 2939436, 3062354, 3146103, 3138593, 3077006, 3188358, 3142742, 3293542, 3359809, 3429812, 3469403, 3433664, 3586346, 3544353, 3565223, 3588912, 3690480, 3709966, 3753960, 3778864]
4990C778864n0660r058J43866j54o7204N1364N7914l2212j7954J6126K6211m193
4978C892910J8108M1787j6647J1883R0223r8486N7924R4839M1652P1082J8003
4967D223278J09268j0890P5790J09070j34399m25M8887K09430j28532R5225P5139
4956D671841J98489m0474R0475M1092M0871m1208o0210K24752r56R5959k2176
4945E198455J62520M1643J69586J16378R2886M2126L4440J82045J87217J36024
4935F363320R2027R9319K88784j868N0944J68417R5420J19109J91720J58903k6533
4924G599562J77125J50593K14023J01173K19799J47605J03622K19688J51156Q5943
4914I170289J23037J36946K46667J31776L28522K11090J79348J78804J59242K42700
$$ y = [3778864, 3728204, 3719146, 3863012, 3862858, 3795654, 3847018, 3904932, 3872720, 3854766, 3870892, 3897103, 3892910, 3911018, 3952805, 3936158, 3948041, 4038264, 3939778, 3997702, 4092541, 4134193, 4205275, 4223278, 4332546, 4321656, 4397446, 4506516, 4372117, 4371692, 4420579, 4630009, 4501477, 4596702, 4671841, 4870330, 4829856, 4920331, 4961423, 5002294, 4961086, 4900876, 5125628, 5124672, 5220631, 5198455, 5360975, 5402618, 5572204, 5688582, 5781468, 5823594, 5858034, 6040079, 6227296, 6363320, 6455347, 6554666, 6843450, 6841582, 6892526, 7060943, 7156363, 7275472, 7467192, 7626095, 7599562, 7776687, 7927280, 8141303, 8242476, 8462275, 8609880, 8713502, 8933190, 9084346, 9170289, 9293326, 9430272, 9676939, 9808715, 10137237, 10348327, 10527675, 10706479, 10865721, 11108421]
4904A1108421K10807J91464J63738J28414J31425K23763K13620J37494J56354
4895A2665500J59581L05240p2930L06066m982K28983K56254K66857K04410K64647
4885A4579626L07163K91437M38987M22707K50319M45747O45187N90297N20214
4876A8491684N52114O56073P24521Q44883J094675P34420N26931m1244l45954
4867B3238103k64294n7158l29965l53871k85769m41630o88010n70511o53750o61573
4857A8931572o13337o20609m05450n90454n45471m53443l96587l10885n20180
4848A4475156k64789k71403k41744k54389j58418l32352j62620l75226k12716
4839A2201499r0347j27923j87666j90797k46656k13804k76879j34924j01988k39195
$$ y = [11108421, 11319228, 11510692, 11674430, 11802844, 11934269, 12158032, 12371652, 12509146, 12665500, 12825081, 13130321, 13057391, 13363457, 13358475, 13587458, 13843712, 14110569, 14314979, 14579626, 14886789, 15178226, 15617213, 16039920, 16290239, 16735986, 17381173, 17971470, 18491684, 19043798, 19699871, 20424392, 21269275, 22363950, 23098370, 23625301, 23584057, 23238103, 22973809, 22916651, 22586686, 22232815, 21947046, 21505416, 20817406, 20246895, 19593145, 18931572, 18318235, 17697626, 17292176, 16701722, 16156251, 15702808, 15306221, 14995336, 14475156, 14210367, 13938964, 13697220, 13442831, 13284413, 12952061, 12789441, 12414215, 12201499, 12111152, 11983229, 11795563, 11604766, 11358110, 11144306, 10867427, 10732503, 10630515, 10391320]
4829A0391320j61419j83900l06720j7098j99633j90711j63798j46629j08581j64820
4819H748011m3797j05157m6072l75626p8297j10278j17214j24001k36450l577
4809G507542q4362j96743l5593j44535j36556k6948p2078m5625j18377q9780q0133
4798F476812q6798j31552m9829J00105o4137P669k6339j02538q900k4475O4360
4787F154378J03878J10256p7366K7675p2253j76246J86257J55762J08012P1384
4777F591737O4412P4067m9562k6401l1263M3554J43878k5233M7855k8260o8572
4766F736212J8780J21037k501L7652M7327M8719j43428K12419r173L1066k0443
4755G077667R4849L0804K00204P6024J37232J40898O8898J60803J13089J73154
$$ y = [10391320, 10229901, 10046001, 9739281, 9722183, 9522550, 9331839, 9168041, 9021412, 8912831, 8748011, 8704214, 8599057, 8552985, 8177359, 8099062, 7988784, 7871570, 7747569, 7511119, 7507542, 7423180, 7226437, 7190844, 7046309, 6909753, 6882805, 6810727, 6765102, 6646725, 6556945, 6476812, 6390014, 6258462, 6208633, 6308738, 6244601, 6252270, 6225931, 6123393, 6114493, 6090018, 6154378, 6258256, 6368512, 6291146, 6318821, 6246568, 6070322, 6256579, 6412341, 6520353, 6591737, 6656149, 6730216, 6680654, 6654253, 6622990, 6666544, 6810422, 6785189, 6833044, 6804784, 6736212, 6754992, 6876029, 6873528, 6911180, 6958507, 7007226, 6863798, 7076217, 7067044, 7098110, 7077667, 7172516, 7203320, 7403524, 7479548, 7616780, 7757678, 7826576, 7987379, 8100468, 8273622]
4745H273622M1689K50023K18921J95634J27933K12447K68682K46732J8403K69588
4735A0123674L7502K36430L30909L44099O7672K40990K83725L46252L11084K05864
4725A2528201K10565K79586K22077L37516L08539L08349K22046N32702P3033L71815
4715A5394429K97059L72383M02831K92483J89714L37030M09193M06666J93618
4706A8295406L97578K30156N49579J98364M53694M15650L13503K67153N60203
4697B1681286L42288L04164K87973L59009M05389M30347L21236M44010L25751
4688B4901453L04240L39259L62833L09954M42602K25822L68735L65922J60998
4679B7781818J55685L01974L77232J82684J07561K74483l1789P9702J57038N2678
$$ y = [8273622, 8315311, 8565334, 8784255, 8979889, 9107822, 9320269, 9588951, 9835683, 9854086, 10123674, 10161176, 10397606, 10728515, 11072614, 11140286, 11381276, 11665001, 12011253, 12322337, 12528201, 12738766, 13018352, 13240429, 13577945, 13886484, 14194833, 14416879, 14949581, 15022614, 15394429, 15691488, 16063871, 16466702, 16759185, 16948899, 17285929, 17695122, 18101788, 18295406, 18692984, 18923140, 19472719, 19671083, 20124777, 20540427, 20853930, 21121083, 21681286, 22023574, 22327738, 22615711, 22974720, 23380109, 23810456, 24131692, 24575702, 24901453, 25205693, 25544952, 25907785, 26217739, 26660341, 26886163, 27254898, 27620820, 27781818, 27937503, 28239477, 28616709, 28799393, 28906954, 29181437, 29149648, 29229350, 29386388, 29439066]
4669B9439066j75941p3645j7943j18062k53344q7494k94594j96452k72559l00537
4659B7648495k70511j63836l60015k37647n23848k91098l65289k69745n68518
4650B4597988l08100m85517m83237m57153l90238m03584n78644n80447n45044
4641B0366024l94208m38989m09548m72786n41826n18826m83434m24508l35372
4632A6346527m00504l64037l86697m69778l68596k15784l01069l62354k96202
4623A3181506l17492l76422l49870k79620k56643k02051l53895m15882k34668
4614A0394963j32222l56620k81941m7020l49345k08548j53896j82997k78437k20048
4604H183889k09904j35833j44658k94296j34902r0008l71820j09683o9865j14445
$$ y = [29439066, 29263125, 29189480, 29171537, 29053475, 28800131, 28712637, 28418043, 28221591, 27949032, 27648495, 27377984, 27214148, 26854133, 26616486, 26092638, 25801540, 25436251, 25166506, 24597988, 24289888, 23804371, 23321134, 22863981, 22473743, 22070159, 21491515, 20911068, 20366024, 19971816, 19532827, 19123279, 18650493, 18108667, 17589841, 17106407, 16681899, 16346527, 15946023, 15581986, 15195289, 14725511, 14356915, 14141131, 13840062, 13477708, 13181506, 12864014, 12487592, 12137722, 11858102, 11601459, 11399408, 11045513, 10629631, 10394963, 10262741, 9906121, 9624180, 9577160, 9227815, 9019267, 8865371, 8682374, 8403937, 8183889, 7973985, 7838152, 7693494, 7399198, 7264296, 7174288, 6802468, 6692785, 6622920, 6508475]
4594F508475j99383j35373j54761k64405j70417l4734L8686j87642o3677k16227
4584E120542k06794m1218q4537p5096j03621j71492q0191j8208j60331K6802q1636
4573D124220r8868j48794J5439j28949j26671m1424p5254p6161K68n9754n8785
4562C325267p5828r2919n8455n6894l9435n3372j0510m5675q3563m5358r7031
4551B666227Q7373n2922p0680M702p1856q2605M8844O889j09185j92522J09954
4540B344219p2619o0439L1978J2704R6568k83321k7175M833P2646K1982p030j48903
4528A985443N8138j37500K2480M859j7921k7674j46014j836k673M9976Q8883k6459
4516A849702m6473L3252q5692p9479m9326K4422K5516j63761J3287M8659l7587
$$ y = [6508475, 6309092, 6173719, 6018958, 5754553, 5584136, 5549402, 5588088, 5400446, 5336769, 5120542, 4913748, 4872530, 4787993, 4712897, 4609276, 4437784, 4357593, 4339385, 4179054, 4205856, 4124220, 4025352, 3876558, 3891997, 3763048, 3636377, 3594953, 3519699, 3443538, 3443806, 3384052, 3325267, 3249439, 3156520, 3098065, 3041171, 3001736, 2948364, 2937854, 2892179, 2808616, 2763258, 2666227, 2753600, 2700678, 2629998, 2634700, 2562844, 2480239, 2529083, 2535972, 2426787, 2234265, 2344219, 2271600, 2211161, 2243139, 2255843, 2352411, 2069090, 2041915, 2046748, 2119394, 2141376, 2134346, 1985443, 2043581, 1906081, 1928561, 1933420, 1915499, 1887825, 1741811, 1739975, 1737302, 1787278, 1876161, 1849702, 1803229, 1836481, 1750789, 1671310, 1621984, 1646406, 1671922, 1508161, 1521448, 1570107, 1532520]
4505A532520J23098j4425L7905k03287j8932j1774k7582m0305J0187M6859n4045
4494A380219k8659P1973n1015k9223l1552r024R3441r8340N745k5955J5662m3265
4482A250007j09889R1959P8548j03081q2223P9136j19698Q3240n4782R4077j30853
4471A076441J3014k1746Q7093j5378r8051O3320k7600O129K0438j09713J3515
4460A007462J4095r9151J24561O96M8496q0753J4164p7109k7725j0586J04551
4449A018701j47599j2879R4538O0158j49132m1349J26137J7650o823j410n8436
4438H99556l7832j23968K32488j12441L1480o8174k524Q8138p9184K367k253m2100
4426G85553J0735j4382j7146J31211j23323K5497l2925J5904m1033M4989m689
$$ y = [1532520, 1655618, 1641193, 1679098, 1475811, 1456879, 1445105, 1417523, 1377218, 1387405, 1434264, 1380219, 1351560, 1423533, 1372518, 1343295, 1311743, 1302719, 1396160, 1297820, 1303565, 1277610, 1293272, 1250007, 1140118, 1232077, 1310625, 1207544, 1125321, 1204457, 1084759, 1167999, 1113217, 1207294, 1076441, 1089455, 1067709, 1154802, 1139424, 1041373, 1104693, 1077093, 1083222, 1103660, 993947, 1007462, 1021557, 922406, 1046967, 1047663, 1096159, 1015406, 1029570, 952461, 924736, 914150, 1018701, 871102, 858223, 952761, 1012919, 863787, 822438, 948575, 966225, 959402, 957992, 899556, 861724, 737756, 970244, 857803, 889283, 821109, 818585, 906723, 827539, 829906, 827653, 785553, 796288, 781906, 764760, 895971, 772648, 798145, 765220, 781124, 740091, 785080, 780391]
4415G80391M5872q9291K1077k6240k2329J08863Q6405r1146j16487J06531O6164
4404H69810m0807j50020N9758k3709l6947M5628J30179l8347j00441k205O9490
4393G82389k32534R2475R8611J02842r4875P817o820j08428m2094Q6479J00784
4382G86646K7739m5284j33538J86818j05521j05881J58405J02728j31899o7507
4372F72706R9195p9878J0597J04707M3008j06680Q6619j33087p23R0866j5243
4361G72087p3372R7195M3575J1734k9267n8087m7574M3844m8494Q5743L7603P4006
4349I08993k1029j37350P6216R2618r5138N4370q354n2038J18068O7398o7406
4338I36348Q7960j17357q1310J58318k4354J49760K4160P4329j17600o8159P7513
$$ y = [780391, 826263, 736972, 758049, 731809, 709480, 818343, 904748, 813602, 697115, 803646, 869810, 829003, 678983, 738741, 715032, 678085, 723713, 853892, 815545, 715104, 712899, 782389, 549855, 642330, 740941, 843783, 748908, 756725, 749905, 641477, 599383, 685862, 786646, 814385, 769101, 635563, 822381, 716860, 610979, 769384, 872112, 740213, 672706, 771901, 692023, 702620, 807327, 850335, 743655, 830274, 697187, 696464, 787330, 772087, 698715, 795910, 839485, 851219, 821952, 763865, 716291, 760135, 711641, 797384, 834987, 908993, 887964, 750614, 826830, 919448, 824310, 878680, 870326, 818288, 936356, 1003754, 936348, 1024308, 906951, 825641, 983959, 959605, 1109365, 1133525, 1207854, 1090254, 1022095, 1099608]
4327A099608R2546j8816K4264j07444P1678M3508J09447N764O8253n222M8891
4316A432477J31830n7113r7528K67126J2123J02478p4720N7939N767r1694M5058
4305A733743M7738J03670K4732l683J4875J91646M801l0511L1203P552J00290
4294B226056P2618Q3524O4510J82061K0707J09246o683J65487O0056K33443R1366
4283C302391K07959J98444J94085J61554P3892N4042K89064L03032J47570M58294
4273E390327O3447J07164P608k0713l323K4929l9603O6766o2525r9526o9016K1274
4261E386809n7781l5330r288P7624l9533J63636J18769J71779K47905J07161J77903
4250F309654K23310L80034K94442M08341N05244O67260L43894j19208n5640k0202
$$ y = [1099608, 1192154, 1173338, 1197602, 1090158, 1161836, 1205344, 1314791, 1320555, 1388808, 1383586, 1432477, 1564307, 1507194, 1409666, 1676792, 1688915, 1791393, 1716673, 1774612, 1780379, 1688685, 1733743, 1781481, 1885151, 1909883, 1906200, 1921075, 2112721, 2117522, 2087011, 2118214, 2125766, 2226056, 2298674, 2382198, 2446708, 2628769, 2649476, 2758722, 2752039, 2917526, 2977582, 3211025, 3302391, 3510350, 3708794, 3902879, 4064433, 4138325, 4192367, 4481431, 4784463, 4932033, 5390327, 5453774, 5560938, 5568546, 5547833, 5544510, 5569439, 5529836, 5596602, 5534077, 5434551, 5365535, 5386809, 5329028, 5293698, 5284410, 5362034, 5322501, 5486137, 5604906, 5776685, 6024590, 6131751, 6309654, 6532964, 6912998, 7207440, 7615781, 8121025, 8788285, 9132179, 9012971, 8957331, 8937129]
4240H937129j44838j5633j45874m2476k28421k36550j53854m47966k70005m51327
4230F800185k29849j11822l11240N6473k85781j78355p4532n0855m7634p0268
4220E496322q5212j0667K15544J42628N0850j07664k52244j61338k08776l5425
4210E044018j42400j60369k13711j97642j44302j41115j00114l34511j84585l29029
4200C096240j02960j56954l5243j04565k11474l661j36131N1686j13473j42153
4190B141312j72688m8909n1012j20169j34726Q8221q1069m8254k10306M5736r9126
4179A309010j06080N7810o6057O4470K924m7726r3466p6352K4006N8826m1866
4168A085499j52263L3472m8254P6375j07311N5396r2251Q2707p4125p879n6739
$$ y = [8937129, 8792291, 8776658, 8630784, 8588308, 8359887, 8123337, 7969483, 7521517, 7251512, 6800185, 6570336, 6458514, 6147274, 6203747, 5917966, 5739611, 5665079, 5614224, 5566590, 5496322, 5411110, 5400443, 5615987, 5758615, 5809465, 5701801, 5449557, 5288219, 5079443, 5044018, 4901618, 4741249, 4527538, 4329896, 4185594, 4044479, 3944365, 3609854, 3425269, 3096240, 2993280, 2836326, 2801083, 2696518, 2485044, 2481383, 2345252, 2396938, 2283465, 2141312, 1968624, 1919715, 1868703, 1748534, 1613808, 1702029, 1620960, 1572706, 1362400, 1408136, 1309010, 1202930, 1260740, 1194683, 1259153, 1262077, 1214351, 1120885, 1044533, 1068539, 1127365, 1085499, 933236, 966708, 918454, 994829, 887518, 942914, 850663, 933370, 859245, 851366, 794627]
4157G94627n6766q3806J06138r0658j494L5211j17941J0206p0925Q6129r5679
4146E15042P4633l0712J7361k4273j11032J35376m3434L1993r7569r4614N3351
4135D26122q5274J68053q4722M5728M1595l6731o6642q2884J10460n6733l5709
4124C43263m2744O5633L8121q5869N1116J068o3125o1446J48136k2874j4208j67211
4112A89860P4367j1380K8620o695p800p5554R0434p2203n436L7042m3999p4169
4100A23087Q7354l6262L3981j9920Q674n5846M9391q3367j9454J8964K5277O1345
4088A93224N6598j49785K888k0124p4214P4931N4948o4193n5052q5237M4417J33487
4076A11888K879o9866P3405n0077r2466n5935J26075L7678p3555J2825k1098M7212
$$ y = [794627, 737861, 654055, 760193, 669535, 668041, 703252, 585311, 595517, 524592, 610721, 515042, 589675, 558963, 576324, 552051, 441019, 576395, 532961, 564954, 467385, 372771, 426122, 340848, 508901, 424179, 469907, 511502, 474771, 408129, 325245, 435705, 378972, 343263, 300519, 366152, 404273, 318404, 369520, 370588, 307463, 246017, 394153, 371279, 357071, 189860, 264227, 252847, 281467, 274772, 266972, 191418, 281852, 209649, 204213, 241255, 197256, 123087, 210441, 174179, 208160, 188240, 196914, 141068, 190459, 107092, 87638, 106602, 131879, 193224, 249822, 100037, 102925, 82801, 8587, 83518, 138466, 74273, 19221, -66016, -21599, 111888, 114767, 44901, 118306, 68229, -24237, -80172, 45903, 83581, 10026, 22851, 1753, 48965]
4064D8965P3699k8397L0630j35721L4902Q3373j26219L4151J1431j12333L7933
4053d7586j3615J17296j47366J17709K6322l7436l9120O8192p1177J03494l5589
4042D1124p2862r46R9253k9228j5104o6128n8825M5436N7734Q905L6201j8346
4030B7214q5852P2448k8837p8117m0637R2350P0769p1460O1176n159j2350n056
4018c511J64044l3912o7312k47271Q4651R7036n2944J53859j3474j06881K8701
4007B986q1850R2347K2757o4031L6745l1458n8279P3551L1911p7547j0903l207
3995f6978q962R1384J0766J2401L4341p1151j6611M0982O171l1303l5264P7486
3983D3262k9889k2689M0990p9033P4686K0414j04342J19768k3622k7579J31522
$$ y = [48965, 122664, 94267, 124897, -10824, 24078, 107451, -18768, 15383, 26814, -85519, -47586, -61201, 56095, -91271, 26438, 52760, 15324, -23796, 44396, -26781, 76713, 41124, -31738, -32684, 66569, 37341, 22237, -43891, -102716, -57280, 454, 9359, 45560, 27214, -58638, 13810, -15027, -93144, -133781, -41431, 29338, -42122, 19054, 13895, 1545, -3511, 160533, 126621, 59309, -187962, -103311, -6275, -59219, 94640, 81166, -25715, 2986, -78864, 13483, 36240, -27791, 8954, -22504, -80783, -7232, 24679, -52868, -63771, -66978, -75940, 15444, 26210, 38611, 72952, 1801, -14810, 26172, 32343, 1040, -34224, 43262, 13373, -9316, 31674, -47359, 27327, 47741, -56601, 63167, 39545, 11966, 143488]
3972A43488m6412m4313J06870n1872k572n8461M4810j23156J44616R953j04406
3961A8545L2677K4497j9270J03532k7360j44768J78270q8684J0533M0884j27824
3950A032N0698K167j8815J40440o3376K8764k8799M6891n1865j3342O4105j0293
3938A47607N693q7751P7144m1437N0296n8778o6771J17087o2679M6457l4837p1880
3926B0151Q3832m2020O7403n2280J45354r7497l2306m6950J07890J6457j81748
3915a1714J28611k488n5920J12708m5755J40642j28232l7898n1651j4233l5624
3904a554J2770J0854j35102L9793M5363R0668p2708Q0838o3362n1326N8783M5427
3892F0444k3669o6724M372j05082J27713k5161j2401p4719J2949j7577O0092N10
$$ y = [143488, 97076, 52763, 159633, 107761, 105189, 46728, 91538, -31618, 112998, 122951, 18545, 51222, 75719, 56449, 159981, 132621, -12147, 166123, 77439, 87972, 128856, 1032, 51730, 53897, 35082, 175522, 112146, 140910, 112111, 159002, 107137, 93795, 157900, 147607, 153300, 65549, 142693, 101256, 151552, 92774, 26003, 143090, 80411, 126868, 92031, 20151, 103983, 61963, 129366, 77086, 222440, 124943, 92637, 45687, 153577, 170034, -11714, 116897, 114409, 58489, 171197, 125442, 266084, 137852, 99954, 48303, 34070, -1554, 11216, 22070, -113032, -73239, -27876, 62792, -9916, 70922, 7560, -43766, 15017, 60444, 36775, -29949, -25577, -130659, -2946, -28107, -40508, -115227, -102278, -119855, -59763, -59253]
3880e9253M585j20454K06593j89525Q3594N3442l0225r3465l5830L0478n7638
3869b07698J68185j16023p2414P8802J129p687k079j1784M0319L74K879o6735
3857a92732o2229O5988q160Q9739p0692L5628j11601R6965k5087O9975o8689M9492
3845a31403j28743j5773O1446m3849j4766J62242p3912P0900j68392L4150Q5169
3834a62931n7505M5990n594o1154o5343L8427N3152n1081P3705l8579k408j6169
3822b49490M8008j16255j4784P2945M427J56607p2154r2027l1582m9801J48806
3811a95300j5246j7707M8330k1442q9070N4426J1787m5153l8559P5361M8794j54279
3799c38058J26158o3803R391j18374J69007N453O2659m1998k2392j12424m9209
$$ y = [-59253, -54668, -175122, 31471, -158054, -74460, -21018, -51243, -144708, -180538, -150060, -207698, -39513, -155536, -227950, -149148, -148019, -155706, -157785, -169569, -129250, -128876, -125997, -192732, -254961, -188973, -197133, -107394, -178086, -142458, -254059, -157094, -182181, -112206, -180895, -131403, -260146, -275919, -214473, -258322, -273088, -110846, -184758, -113858, -282250, -248100, -162931, -220436, -174446, -180040, -241194, -306537, -268110, -214958, -266039, -192334, -230913, -233321, -249490, -201482, -317737, -332521, -259576, -255149, -98542, -170696, -262723, -294305, -344106, -195300, -210546, -228253, -179923, -201365, -290435, -236009, -224222, -269375, -307934, -232573, -183779, -338058, -211900, -275703, -266312, -384686, -215679, -210226, -147567, -189565, -211957, -324381, -373590]
3788c73590J09626j1337j07474k3898J13797K1949J63214j48178n4009M4227j07992
3777c73665J36593O9075j45759M2559r6449l2966M3890K1822J26879R056o2122
3766b61087q5666R5468M4033r0491P6287N772j24298K5085R0111n1517Q6521j0554
3754b00336k6011q9373J7663J71004j85881J0531j9028M6563k7664O073m1655
3743c38114m8565L2891N6054o247J05440r8879o7205P3994k9807R2110m640n2356
3731b85324p2986J1197k9680J23914j52360M9104p3336J16992K2406j9137J05390
3720b03820j91040M7926Q3143l4507P5072o7797k9953m7455J63742l1891m4955
3709b81535K1771j5804j04053M9749J02937m1624o0345n059n854r269P8378l3816
$$ y = [-373590, -263964, -275301, -382775, -406673, -292876, -270927, -107713, -255891, -309900, -265673, -373665, -237072, -167997, -313756, -271197, -367646, -400612, -356722, -334900, -208021, -198965, -261087, -346753, -251285, -207252, -297743, -221456, -215684, -339982, -314897, -224786, -276303, -189782, -200336, -226347, -315720, -298057, -127053, -312934, -302403, -321431, -274868, -302532, -296459, -338114, -386679, -353788, -297734, -303981, -198541, -297420, -364625, -290631, -320438, -228328, -232968, -285324, -358310, -347113, -376793, -252879, -405239, -356135, -429471, -312479, -290073, -309210, -203820, -394860, -346934, -263791, -298298, -223226, -291023, -320976, -368431, -204689, -236580, -281535, -259764, -275568, -379621, -329872, -226935, -268559, -328904, -333963, -339817, -349086, -270708, -304524]
3697c04524P8648n9908q1471M5651J07287j38937O4925K7863l5363P6841j30035
3686c49023M3541j10005J92363m5516M386l5024p7578l0305N1810J78630k5690
$$ y = [-304524, -225876, -285784, -367255, -321604, -214317, -353254, -288329, -260466, -295829, -218988, -349023, -305482, -415487, -223124, -268640, -264254, -299278, -376856, -407161, -355351, -176721, -202411]
$$ [...]
##END NTUPLES=NMR SPECTRUM
##END=
