##TITLE=abcd
##JCAMPDX= 6.0         $$ Bruker NMR JCAMP-DX V2.0
##DATA TYPE= NMR FID
##DATA CLASS= NTUPLES
##ORIGIN= UXNMR, Bruker Analytische Messtechnik GmbH
##OWNER= root
$$ XWIN-NMR		Version 3.5
$$ Sat Jun 28 15:55:18 2025 Russian Standard Time (UT+4h)  servis@DPX200
##.OBSERVE FREQUENCY= 200.131235884673
##.OBSERVE NUCLEUS= ^1H
##.DELAY= (6, 6)
##.ACQUISITION MODE= SIMULTANEOUS
##.ACQUISITION SCHEME= undefined
##.AVERAGES= 32
##.DIGITISER RES= 18
##SPECTROMETER/DATA SYSTEM= spect
##.PULSE SEQUENCE= zg
##.SOLVENT NAME= CDCl3
##.SHIFT REFERENCE= (INTERNAL, CDCl3, 0, 16.5164)
##AUDIT TRAIL= $$ (NUMBER, WHEN, WHO, WHERE, WHAT)
$$ ##TITLE= Audit trail, XWIN-NMR		Version 3.5
$$ ##JCAMPDX= 5.01
$$ ##ORIGIN= Bruker BioSpin GmbH
$$ ##OWNER= servis
$$ F:\spectra/data/av/nmr/H1/1/audita.txt
$$ ##AUDIT TRAIL=  $$ (NUMBER, WHEN, WHO, WHERE, WHAT)
(   1,<2025-06-28 15:54:47.67 +0400>,<servis>,<DPX200>,
      <created by zg, POWCHK disabled, PULCHK disabled
       configuration hash MD5:
       00 E9 B6 7A A2 85 ED C7 34 08 36 98 17 FE 4E 26
       data hash MD5: 32K
       07 BD 9B 90 A7 84 11 28 38 E3 A7 51 3D C5 06 98>)
$$ ##END=
$$ 
$$ hash MD5
$$ CA 78 1F 91 F0 F2 43 3D CC 35 CB E7 E4 98 0A 8C
##$RELAX= 
##$RELAX= 
##$RELAX= 
##$RELAX= 
##$RELAX= 
##$RELAX= 
##$RELAX= 
##$RELAX= 
$$ Bruker specific parameters
$$ --------------------------
##$DU= <F:\spectra>
##$EXPNO= 1
##$NAME= <H1>
##$PROCNO= 1
##$TYPE= <nmr>
##$USER= <av>
##$AMP= (0..31)
100 100 100 100 100 100 100 100 100 100 100 100 100 100 100 100 100 100 
100 100 100 100 100 100 100 100 100 100 100 100 100 100 
##$AQSEQ= 0
##$AQ_mod= 1
##$AUNM= <au_zg>
##$AUTOPOS= <>
##$BF1= 200.13
##$BF2= 200.13
##$BF3= 200.13
##$BF4= 200.13
##$BF5= 500.13
##$BF6= 500.13
##$BF7= 500.13
##$BF8= 500.13
##$BYTORDA= 1
##$CFDGTYP= 0
##$CFRGTYP= 5
##$CHEMSTR= <none>
##$CNST= (0..31)
1 1 145 1 1 1 1 1 1 1 1 1 1 1 1 1 1 1 1 1 1 1 1 1 1 1 1 1 1 1 1 1 
##$CPDPRG= <>
##$CPDPRG1= <>
##$CPDPRG2= <>
##$CPDPRG3= <>
##$CPDPRG4= <mlev>
##$CPDPRG5= <mlev>
##$CPDPRG6= <mlev>
##$CPDPRG7= <mlev>
##$CPDPRG8= <mlev>
##$CPDPRGB= <>
##$CPDPRGT= <>
##$D= (0..31)
0 2 0 0 0 0 0 0 0 0.06 0 0 0 0 0 0 0.0002 0 0 0 0 0 0 0 0 0 0 0 0 0 0 
0 
##$DATE= 1751111687
##$DBL= (0..7)
120 120 120 120 120 120 120 120 
##$DBP= (0..7)
150 150 150 150 150 150 150 150 
##$DBP07= 0
##$DBPNAM0= <>
##$DBPNAM1= <>
##$DBPNAM2= <>
##$DBPNAM3= <>
##$DBPNAM4= <>
##$DBPNAM5= <>
##$DBPNAM6= <>
##$DBPNAM7= <>
##$DBPOAL= (0..7)
0.5 0.5 0.5 0.5 0.5 0.5 0.5 0.5 
##$DBPOFFS= (0..7)
0 0 0 0 0 0 0 0 
##$DE= 6
##$DECBNUC= <off>
##$DECIM= 32
##$DECNUC= <off>
##$DECSTAT= 4
##$DIGMOD= 1
##$DIGTYP= 9
##$DL= (0..7)
0 120 120 120 120 120 120 120 
##$DP= (0..7)
150 150 150 150 150 150 150 150 
##$DP07= 0
##$DPNAME0= <>
##$DPNAME1= <>
##$DPNAME2= <>
##$DPNAME3= <>
##$DPNAME4= <>
##$DPNAME5= <>
##$DPNAME6= <>
##$DPNAME7= <>
##$DPOAL= (0..7)
0.5 0.5 0.5 0.5 0.5 0.5 0.5 0.5 
##$DPOFFS= (0..7)
0 0 0 0 0 0 0 0 
##$DQDMODE= 0
##$DR= 18
##$DS= 0
##$DSLIST= <SSSSSSSSSSSSSSS>
##$DSPFIRM= 0
$$ [...]
##$SUBNAM0= <"">
##$SUBNAM1= <"">
##$SUBNAM2= <"">
##$SUBNAM3= <"">
##$SUBNAM4= <"">
##$SUBNAM5= <"">
##$SUBNAM6= <"">
##$SUBNAM7= <"">
##$SUBNAM8= <"">
##$SUBNAM9= <"">
##$SW= 20.6817932712277
##$SWIBOX= (0..15)
0 0 3 0 0 0 0 0 0 0 0 0 0 0 0 0 
##$SW_h= 4139.07284768212
##$TD= 32768
##$TD0= 1
##$TE= 0
##$TE2= 300
##$TE3= 300
##$TEG= 300
##$TL= (0..7)
0 120 120 120 120 120 120 120 
##$TP= (0..7)
150 150 150 150 150 150 150 150 
##$TP07= 0
##$TPNAME0= <>
##$TPNAME1= <>
##$TPNAME2= <>
##$TPNAME3= <>
##$TPNAME4= <>
##$TPNAME5= <>
##$TPNAME6= <>
##$TPNAME7= <>
##$TPOAL= (0..7)
0.5 0.5 0.5 0.5 0.5 0.5 0.5 0.5 
##$TPOFFS= (0..7)
0 0 0 0 0 0 0 0 
##$TUNHIN= 0
##$TUNHOUT= 0
##$TUNXOUT= 0
##$USERA1= <user>
##$USERA2= <user>
##$USERA3= <user>
##$USERA4= <user>
##$USERA5= <user>
##$V9= 5
##$VALIST= <valist>
##$VCLIST= <CCCCCCCCCCCCCCC>
##$VD= 0
##$VDLIST= <DDDDDDDDDDDDDDD>
##$VPLIST= <PPPPPPPPPPPPPPP>
##$VTLIST= <TTTTTTTTTTTTTTT>
##$WBST= 1024
##$WBSW= 30
##$XGAIN= (0..3)
0 0 0 0 
##$XL= 0
##$YL= 0
##$YMAX_a= 1577033
##$YMIN_a= -1304306
##$ZGOPTNS= <>
##$ZL1= 120
##$ZL2= 120
##$ZL3= 120
##$ZL4= 120
##$ABSF1= 10
##$ABSF2= 0
##$ABSG= 5
##$ABSL= 3
##$ALPHA= 0
##$AQORDER= 0
##$ASSFAC= 0
##$ASSFACI= 0
##$ASSFACX= 0
##$ASSWID= 0
##$AUNMP= <proc_1d>
##$AZFE= 0.1
##$AZFW= 0.1
##$BCFW= 1
##$BC_mod= 2
##$BYTORDP= 0
##$COROFFS= 0
##$CY= 19
##$DATMOD= 1
##$DC= 2
##$DFILT= <>
##$DTYPP= 0
##$F1P= 11.0000007629395
##$F2P= -0.999999237060547
##$FCOR= 0.5
##$FTSIZE= 0
##$FT_mod= 4
##$GAMMA= 1
##$GB= 1
##$INTBC= 1
##$INTSCL= 1
##$ISEN= 128
##$LB= 0.05
##$LEV0= 0
##$LPBIN= 0
##$MAXI= 10000
##$MC2= 0
##$MEAN= 0
##$ME_mod= 0
##$MI= 0
##$NCOEF= 0
##$NC_proc= 0
##$NLEV= 6
##$NOISF1= 0
##$NOISF2= 0
##$NSP= 1
##$NTH_PI= 0
##$NZP= 0
##$OFFSET= 16.51637
##$PC= 1
##$PHC0= -273.2733
##$PHC1= 1.101538
##$PH_mod= 0
##$PKNL= yes
##$PPARMOD= 0
##$PSCAL= 4
##$PSIGN= 0
##$REVERSE= no
##$SF= 200.13
##$SI= 16384
##$SIGF1= 0
##$SIGF2= 0
##$SINO= 400
##$SIOLD= 16384
##$SREGLST= <1H.CDCl3>
##$SSB= 0
##$STSI= 0
##$STSR= 0
##$SW_p= 4139.07284768211
##$SYMM= 0
##$S_DEV= 0
##$TDeff= 0
##$TDoff= 0
##$TI= <>
##$TILT= no
##$TM1= 0
##$TM2= 0
##$TOPLEV= 0
##$USERP1= <user>
##$USERP2= <user>
##$USERP3= <user>
##$USERP4= <user>
##$USERP5= <user>
##$WDW= 1
##$XDIM= 8192
##$YMAX_p= 0
##$YMIN_p= 0
$$ End of Bruker specific parameters
$$ ---------------------------------
##NTUPLES= NMR FID
##VAR_NAME=  TIME,          FID/REAL,        FID/IMAG
##SYMBOL=    X,             R,               I
##VAR_TYPE=  INDEPENDENT,   DEPENDENT,       DEPENDENT
##VAR_FORM=  AFFN,          ASDF,            ASDF
##VAR_DIM=   16384,         16384,           16384
##UNITS=     SECONDS,       ARBITRARY UNITS, ARBITRARY UNITS
##FACTOR=    0.0002416,     1,               1
##FIRST=     0,             0,               0
##LAST=      3.9581328,     0,               0
##MIN=       0,             -1304306,        0
##MAX=       3.9581328,     1577033,         0
$$ Real data points
##PAGE= N=1
##DATA TABLE= (X++(R..R)), XYDATA
0@%%%%%%%%%%%%%%%%%%%%%%%Ok2L8m4M9n9O4o4O4p0Q0q7R4j03J11j22J37j52J66
$$ 0 0 0 0 0 0 0 0 0 0 0 0 0 0 0 0 0 0 0 0 0 0 0 0 6 -16 22 -22 27 -32 32 -32 32 -38 42 -45 49 -54 57 -65 72 -80 86
42H6j82J98k13K30k53K81l04L31l68M08m48M97n64O36p25Q40r74J149j388J719
$$ 86 -96 102 -111 119 -134 147 -157 174 -194 214 -234 263 -301 335 -390 450 -524 625 -763 956
62I56k185K868l945N785r310J7321m2370K58993J348920m98572j683935l18921
$$ 956 -1229 1639 -2306 3479 -5831 11490 -30880 228113 1577033 1078461 -605474 -924395
74i24395R87576L55383o58278j10833Q65311L39974r44145q10812N44747R40757
$$ -924395 63181 418564 -239714 -350547 514764 854738 -89407 -900219 -355472 585285
84E85285r8305p24161q0260M73091J367m35316P0416N75477M0528o91503l13819
$$ 585285 486980 -237181 -317441 155650 157017 -278299 -207883 367594 408122 -283381 -597200
95e97200O15858N47477l87539n91788K22352N69469j46085o08262K7611O45451
$$ -597200 18658 566135 178596 -413192 -190840 378629 232544 -375718 -348107 297344
105B97344J68437n59560k85154M61982L30201m49589m49172M04043O23928k33550
$$ 297344 465781 -93779 -378933 83049 413250 -36339 -485511 -81468 542460 308910
115C08910p23716K690P05201J72266o98255m10411O08910O93424l23038q26469
$$ 308910 -414806 -412116 293085 465351 -232904 -643315 -34405 659019 335981 -490488
125d90488m6365P23070K88651n34146l80535M08632M87368k26075n34951q969
$$ -490488 -536853 186217 474868 -59278 -439813 -31181 456187 230112 -304839 -313808
135c13808M27212J35661k58480q3065K29589L3874l07173j14304L07286K03831
$$ -313808 113404 249065 -9415 -92480 137109 170983 -136190 -250494 56792 260623
145B60623k39784k28180K00542K44375k05703l35030J51659M43333r719m85681
$$ 260623 20839 -207341 -6799 237576 31873 -303157 -151498 291835 282116 -203565
155b03565j71044M25394L12267k91052l54338J77327L40225j30383l55918J06504
$$ -203565 -374609 50785 363052 72000 -282338 -105011 235214 104831 -251087 -144583
165a44583M48602J1969n05973j98527M54103L51325l34485m34790K03765M69586
$$ -144583 304019 315988 -189985 -388512 65591 416916 82431 -352359 -148594 320992
175C20992q1771m86320n7172M52552J72326m02229k85771L10528L77158j61901
$$ 320992 239221 -247099 -304271 148281 320607 -81622 -367393 -56865 320293 158392
185A58392l80781J9277K88393K2642k02814K3847K26889j5791k75631o2068K63876
$$ 158392 -222389 -203112 85281 107923 -94891 -71044 155845 140054 -135577 -197645 66231
196F6231J24418k24978j41852K26798J85331k32795k78914J69124L49986n7340
$$ 66231 190649 -34329 -176181 50617 235948 3153 -275761 -106637 243349 186009
206A86009l61081m9075L34019J30957k99391k09339K43654K74102j63446l09633
$$ 186009 -175072 -224147 109872 240829 -58562 -267901 -24247 249855 86409 -223224
216b23224O8287L02088J4647k59998n6649K31521Q5979k30357j45757K17332K48136
$$ -223224 -154937 147151 161798 -98200 -154849 76672 162651 -67706 -213463 3869 252005
227B52005j14019k85107k5081K05242P3635j13580k9456J15233J4854j69175r9829
$$ 252005 137986 -147121 -172202 33040 106675 -6905 -36361 78872 93726 -75449 -175278
238a75278J37877J71281l9084j48089j6574Q6897l204p3628L1441J07248j6895
$$ -175278 -37401 133880 94796 -53293 -69867 17030 13826 -59802 -28361 78887 61992
249F1992j36994k5206J50322Q6678j35501j54754P7248J89664N30j71981m7787
$$ 61992 -75002 -100208 50114 136792 1291 -153463 -76215 113449 113979 -58002 -105789
260a05789J43103P0344j31108j06936J10846J59891n0576j85299k7572J61677
$$ -105789 37314 107658 -23450 -130386 -19540 140351 89775 -95524 -123096 38581
270C8581P5879j24605r7644R1024J05702o7035j15579M2083J29428m293j30443
$$ 38581 114460 -10145 -107789 -16765 88937 21902 -93677 -51594 77834 73541 -56902
281e6902l3971J17206O2244r3315o6297Q8242P5880r1691j10015O5531J37623
$$ -56902 -90873 26333 88577 -4738 -71035 17207 93087 1396 -108619 -43088 94535
292I4535j2603j29792k9907R9016L5960q8226l4175J00852N3947j05213q3098
$$ 94535 81932 -47860 -77767 21249 57209 -31017 -65192 35660 89607 -15606 -98704
303i8704R2174J05344p2506j25487M5302J44631m869j52730m3923J39317Q2011
$$ -98704 -6530 98814 26308 -99179 -53877 90754 85885 -66845 -110768 28549 110560
314A10560j14065j03317R1579J21170o2851j32055K8416J32492R453j19544m1587
$$ 110560 -3505 -106822 -15243 105927 43076 -88979 -60563 71929 81382 -38162 -79749
325g9749R4811N8515p1269o1493N3158N1108n4905m8056O6104O4858o3088q8673
$$ -79749 15062 73577 2308 -59185 -6027 45081 -9824 -57880 8224 73082 9994 -78679
337g8679L9185J02432k927r4021k1951P8727L1951p1815l9987O8070M9179o2672
$$ -78679 -39494 62938 60011 -34010 -55961 22766 54717 -17098 -57085 10985 60164 -2508
349b508n9815N0338O6540l4535o7697K1264P0660o237p3746r463P5815K7607p3258
$$ -2508 -62323 -11985 54555 20020 -47677 -26413 44247 38010 -35736 -45199 30616 58223 -15035
362a5035m6922O0302N8450m3707o4664K2848O3750j660n5176j3932M3525K3109
$$ -15035 -61957 -1655 56795 13088 -51576 -28728 35022 33362 -21814 -35746 7779 30888
374C0888k9842k0026K4839J3273k8172j0585L4852J4940m0768k8791L5435M3622
$$ 30888 1046 -18980 5859 19132 -9040 -19625 15227 30167 -10601 -39392 -3957 39665
386C9665k1019n6045j870N9363K8125m6979m3897K7628M6643r175l9324k156L1089
$$ 39665 18646 -37399 -39269 20094 48219 1240 -42657 -15029 31614 22439 -16885 -19041 12048
399A2048P837k8185j6773K4059K5431j8456l2059J0643L4598k503l2153j837L2924
$$ 12048 19885 -8300 -25073 -1014 24417 5961 -26098 -15455 19143 16640 -15513 -17350 15574
412A5574R369l4324k2153L2928L9116k5131n7316O527O5357J6128o1716l8391
$$ 15574 24943 -9381 -31534 1394 40510 15379 -41937 -35410 29947 46075 -15641 -54032
424e4032M4849N1455k0586m9155N498M2448p94m0088K172M6200L22n6037j0876
$$ -54032 -9183 42272 21686 -27469 -21971 20477 19683 -20405 -18233 27967 28289 -27748 -38624
437c8624O0187K4245o1793m1885N6640O3071m1538q1380J8669R1944R006q9383
$$ -38624 21563 45808 -15985 -57870 -1230 61841 20303 -61077 -42408 49536 58542 -30841
449c0841l0517Q0182M5925o9525o0037N5428P1441l7264q0234J4666P7976J520
$$ -30841 -61358 18824 64749 -4776 -64813 -9385 62056 24792 -55442 -40776 37200 38720
461C8720p1345o716P2887J2489q0060k6901Q6070N3600p5737p9792M9356R2390
$$ 38720 -32625 -39341 33546 46035 -34025 -60926 25144 78744 3007 -76785 -27429 64961
473F4961k0141r3092n581Q5367K1732p6479l3736O7110M3123n5384m6559M7407
$$ 64961 44820 -48272 -53853 31514 53246 -23233 -56969 10141 53264 -2120 -48679 -1272
485a272N1547m1737o1363L2482P4849j4857q3550q700P9843K6129p1750l8566
$$ -1272 50275 8538 -52825 -20343 54506 39649 -43901 -52601 27242 53371 -18379 -56945
497e6945O4048N2500n1817o7004L2100P7408m520p2804j7912N8910K7187m7212
$$ -56945 7103 59603 7786 -59218 -27118 50290 45770 -27034 -44946 13964 41151 -6061
509f061k9860L9393L1206l5154l6328K7816M0996j9943m6044J1448N6119O130
$$ -6061 -35921 3472 34678 -476 -36804 -8988 32008 12065 -33979 -22531 33588 39718
521C9718n8963k8443M8715M4418k9404m6540J2572M1392m146m0494n282M0746
$$ 39718 -19245 -47688 1027 45445 16041 -30499 -17927 23465 19319 -21175 -26457 14289
533A4289J7600l7731l0036L0428L9417j8435m1075R111M1616k62m4580j3927M3190
$$ 14289 31889 -5842 -35878 -5450 33967 15532 -25543 -16432 25184 24922 -19658 -33585 9605
546I605L1089l4854m5207K0519M9392j1214n2943L218O1614J6736o0686m2025
$$ 9605 40694 5840 -39367 -18848 30544 19330 -33613 -30395 31219 47955 -12731 -54756
558e4756M3637N8590j7937n6600L755M9229m414n4794%O5767J7082o6823l9998
$$ -54756 -11119 47471 29534 -27066 -23311 25918 21504 -33290 -33290 32477 49559 -17264 -57262
571e7262N2865N3532l6404n8447K7249O8189j5000p9644n043Q1472K6338p3345
$$ -57262 -4397 49135 12731 -45716 -18467 49722 34722 -44922 -49965 31507 57845 -15500
583a5500m2354O0348N1759m9176o1672L8213P3630k1527q3686N57Q7481K3677
$$ -15500 -57854 2494 54253 5077 -56595 -18382 55248 33721 -49965 -49408 38073 61750
595F1750p8884m0277O5799M8263n6775n8674M5976P2596k8009q4143J339Q2446
$$ 61750 -17134 -57411 8388 56651 -124 -58798 -12822 59774 31765 -52378 -51039 31407
607C1407K1479p2657l5915O2244M7071m7232n1845L2890N1880k2573n2927J4026
$$ 31407 52886 -19771 -55686 6558 53629 6397 -45448 -12558 39322 16749 -36178 -22152
619b2152N8988j092o4370j8345N9414L4226m7688m2756L5215M7617k1784m9520
$$ -22152 36836 35744 -28626 -46971 12443 46669 -1019 -43775 -8560 39057 17273 -32247
631c2247Q066M9103O371m5635k0070L8705K9240l0113l5543J9301L6316r704l4906
$$ -32247 -24181 24922 31293 -14342 -34412 4293 33533 3420 -32123 -12822 23494 13790 -21116
644b1116R01L3881J0757k8789k0312K0489K6158j1417k5700Q507K6812o717l4953
$$ -21116 -20215 13666 24423 -4366 -24678 -4189 21969 10552 -15148 -6641 20171 13454 -21499
657b1499o690L5589K6723k1018l8347j277L2381J3690k0023j1548J7590Q896k1070
$$ -21499 -28189 7400 34123 13105 -25242 -26519 5862 19552 -471 -12019 5571 14467 -6603
670f603j4302K0531K3569j1940k9350O91K8247O024k7386j0048K8323J6046k7455
$$ -6603 -20905 -374 23195 11255 -18095 -17404 10843 16867 -10519 -20567 7756 23802 -3653
683c653k2250K4124K9190j6755l4062Q093L7545K702l9286j5846L4174K4479k6612
$$ -3653 -25903 -1779 27411 10656 -23406 -15313 22232 24934 -14352 -30198 3976 28455 1843
696A843k8205J8727K7855j3817k6993J0191K8955m061l0045k014L0944Q814l0679
$$ 1843 -26362 -7635 20220 6403 -20590 -10399 18556 14495 -15550 -17564 13380 22194 -8485
709h485j4982K9863K1378k7458k9645J8050L2747n256k7430j049K0840r11k2487
$$ -8485 -23467 6396 27774 316 -29329 -11279 21468 16212 -11218 -12267 8573 7662 -14825
722a4825J494L0786R048l0253k0620J7898J8399j1061j0417J5432J1372k0066
$$ -14825 -13331 17455 26503 -3750 -24370 -6472 11927 866 -9551 5881 17253 -2813
734b813k2296J3198K9174p61k5994m059K3682O799k2895j1218J8526J3950j2416
$$ -2813 -25109 -11911 17263 16502 -9492 -13551 10131 16930 -5965 -17183 1343 15293 2877
747B877j1992R395R644j0675j3637Q412J6866l949j6883K889J8380r29k0358m381
$$ 2877 -9115 280 9924 -751 -14388 -5976 10890 6941 -9942 -7053 11327 10398 -9960 -14341
761a4341J8482R602j2147j0271Q169R048q514j1990O004J4404j355j2822J37J1369
$$ -14341 4141 13743 1596 -8675 -506 8542 28 -11962 -5958 8446 7091 -5731 -5594 5775
775E775M20j0090j839P450K454m139L4N629m18j0697p194P948J2237k26q867l284
$$ 5775 6195 -3895 -5734 1716 4170 31 65 5694 5276 -5421 -12615 -4667 7570 7344 -1523 -4807
791d807K804J328m9L33l56J372M187J109n354n526L26M461K352j618n57L707l49
$$ -4807 -2003 -675 -724 -391 -747 625 4812 5921 567 -4959 -4633 -172 2180 562 5 3712 3363
808C363q607m134Q909P972m704o004M450M804n810p396L498Q821r50r283N51J2053
$$ 3363 -5244 -9378 -469 7503 2799 -3205 1245 6049 239 -7157 -3659 5162 4212 -5071 -4520 7533
824G533j48j7144o115J7891J3660j0953j4568M915J2015j814j0029J018R730j284
$$ 7533 7385 -9759 -15874 2017 15677 4724 -9844 -4929 7086 5272 -4757 -3739 5991 4707
838D707j0962J328J3807j203j8316l079J8573Q281j5184j0329J2092J2496q853
$$ 4707 -6255 -4927 8880 7677 -10639 -13718 4855 13136 -2048 -12377 -285 12211 3358
851C358j4725N445J6447j547j7095j044J7016K691j6895o386J3111P729p812m564
$$ 3358 -11367 -5922 10525 8978 -8117 -9161 7855 10546 -6349 -12735 376 8105 293 -4271
865d271P284K750j0681o220J3557J4057j0554j9227M845J9310j666j8300j607
$$ -4271 3013 5763 -4918 -11138 2419 16476 5922 -13305 -8460 10850 9184 -9116 -10723
878a0723J5925M213j2933n271J0177N361j0378n877J3404J1059j3579j6014J0229
$$ -10723 5202 9415 -3518 -8789 1388 6749 -3629 -9506 3898 14957 1378 -14636 -4407
891d407J8078o634j8252L718J7755n84j8253m791J6552J0163j3456j3057J0999
$$ -4407 13671 7037 -11215 -7497 10258 9674 -8579 -13370 3182 13345 -111 -13168 -2169
904b169J5334q047j5595M841J4204k476j1560J733J0034k700j2641m51J5962O715
$$ -2169 13165 5118 -10477 -5636 8568 6092 -5468 -3735 6299 3599 -9042 -9493 6469 13184
918A3184j5671j3108J2316J7284o526j6921J175J4481L706j0272o230N760N937
$$ 13184 -2487 -15595 -3279 14005 7479 -9442 -8267 6214 9920 -352 -6582 -822 5115
931E115m489o421L715P220k764p841J288P094O63n096k179L710M796l63o121k963
$$ 5115 626 -5795 -2080 5140 2376 -5465 -4177 2917 3580 -1516 -3695 15 4811 4448 -1673 -4636
947d636N352L715n281m862N025P505k531j0854l833J0812J0700o252j2953K690
$$ -4636 716 4431 -850 -5712 -687 6818 4287 -6567 -10400 412 11112 4860 -8093 -5403
961e403J2772n85j1987j059J0824K109j0363l829J0791N964j2763j1228J2740
$$ -5403 7369 6784 -5203 -6262 4562 6671 -3692 -7521 3270 9234 -3529 -14757 -2017
974b017J7880r084k1633M377K3591J776k3365q073K0564J4025j6117j8147J1451
$$ -2017 15863 6779 -14854 -10477 13114 14890 -8475 -16548 4016 18041 1924 -16223 -4772
987d772J9941q842k2849M985K5282P38k4543n840K1575J0102j8128j2613J6153
$$ -4772 15169 6327 -16522 -11537 13745 14483 -10060 -15900 5675 15777 -2351 -14964 1189
1000A189J5808j4164j9904J0660K3642o682k6667q0K6186P195k2129j2231J6814
$$ 1189 16997 2833 -17071 -6411 17231 10549 -16118 -16198 9988 17183 -4946 -17177 -363
1013c63J5089j1387j5321R010J6107p697j8163N240K0184j676k1151l915J8787
$$ -363 14726 3339 -11982 -2972 13135 5438 -12725 -7485 12699 11023 -10128 -14043 4744
1026D744Q493j5306j1803J1936J4851p786j6423L558J7313Q12j5355m051J2260
$$ 4744 13237 -2069 -13872 -1936 12915 5129 -11294 -7736 9577 10389 -4966 -9017 3243
1039C243N265r912o869O715Q379l675q759K4P587J681n298j05N036l96n949j046
$$ 3243 8508 -1404 -8273 -1558 6821 3146 -5613 -5589 1998 3679 -1619 -1724 3312 2916 -3033 -4079
1055d079O094M417l581p530j675O704N517m017o547R49N405P32l670j267M210
$$ -4079 2015 6432 2851 -4679 -6354 350 5867 1850 -4697 -3748 1657 2389 -1281 -2548 1662
1070A662L134m476n482M291Q015l563j0425J057J1044J779j0528n413Q661P757
$$ 1662 4796 320 -5162 -871 7144 3581 -6844 -5787 5257 7036 -3492 -8905 -244 7513
1084G513o595r606O062J2479m048j4868J469J6074K072j5942n878J4116R324j1985
$$ 7513 918 -8688 -2626 9853 5805 -9063 -7594 8480 10552 -5390 -11268 2848 12172 187
1098A87j3288Q180J5880m414j6678J715J7180N08j7067k119J7907N338j7448j0427
$$ 187 -13101 -4921 10959 6545 -10133 -8418 8762 9270 -7797 -9916 7991 13329 -4119 -14546
1112a4546J4517J4475r990j7086N190J7317l456j7610K689J9827J54k1224n165
$$ -14546 -29 14446 4456 -12630 -7440 9877 6421 -11189 -8500 11327 11481 -9743 -14908
1125a4908K0432J1787j5593j6469R653J7828n008j8635J425J8445J353j8072m429
$$ -14908 5524 17311 1718 -14751 -5098 12730 7722 -10913 -9488 8957 10310 -7762 -12191
1138a2191J6015P294j2825r191J0235J1883o671j3642K962J4393K67j4331k991
$$ -12191 3824 11118 -1707 -10898 -663 11220 4549 -9093 -6131 8262 8529 -5802 -8793
1151h793J2652M373j1077o019Q522P532n279q577K151R679J683q725m250O552
$$ -8793 3859 8232 -2845 -8864 -342 7190 1911 -6666 -4515 5164 6847 -1878 -6128 424
1165D24M944l918l752J538J696j399j482R39K494O91m205l193N014O408k700q222
$$ 424 5368 1450 -2302 -764 932 -467 -1949 -1010 1484 2175 -2030 -5223 -209 6199 3499 -4723
1181d723o37P956M948n111q473J554R396P26j0817k999J1352O083j0282r307P022
$$ -4723 -5360 2596 7544 2433 -6040 -4486 4910 5636 -5181 -8180 3172 9255 -1027 -10334 -3312
1196c312J1495k174j1385j044J1513L632j1529o178J0915P192j0466q670R688
$$ -3312 8183 6009 -5376 -6420 5093 8725 -2804 -8982 1933 9125 -1341 -10011 -323
1209c23J0084q209j2966N341J5893J98j6878n347J6050R915j2939j2292R365J1812
$$ -323 9761 1552 -11414 -6073 9820 10018 -6860 -12207 3843 13758 819 -11473 -2108 9704
1223I704o689j1192M676J0754l471j1979R32J3428K636j3689n348J3610Q639j2198
$$ 9704 3015 -8177 -3501 7253 3782 -8197 -7265 6163 8799 -4890 -10238 3372 12011 -187
1237a87j1030R220J2606n441j3387J197J2817K100j2215o187J0501R277o714r516
$$ -187 -11217 -1997 10609 5168 -8219 -7022 5795 7895 -4320 -10507 -6 9271 2557 -6959
1251f959L500P395j245m365J449L193j751l883R13M285m0n091j728N025K786l688
$$ -6959 -3459 3936 2691 -1674 -225 2968 1217 -2666 -1753 2532 2492 -2599 -4327 698 3484 -204
1267b04k861J778J934R9P13j74j989o36K091J416j506k028K04J798n0k677K16
$$ -204 -3065 -1287 647 746 1459 1285 -704 -1340 751 2167 661 -1367 -1163 635 585 -2092 -1876
1284a876L332J34l708j01M471N90m037m52L768N74m163j328M680K585n554o240
$$ -1876 1456 1590 -2118 -2219 2252 2842 -1195 -1647 2121 2695 -1468 -2796 1884 4469 -1085 -7325
1300g325N336R381l417j1176K01J1481L461r205n687O586P063m323p273K962P001
$$ -7325 -1989 7392 3975 -7201 -7000 4481 7942 -1263 -6950 -364 6699 2376 -4897 -1935 5066
1315E066k788q102K118Q840j346q833k51Q796J817p631l147O659M656n298n707
$$ 5066 2278 -5824 -3706 5134 3788 -5045 -5296 3500 5317 -2314 -5461 1198 5854 556 -5151
1330e151N067O490m915p996L701Q035k194p887P82P096K88o435j132O638L371
$$ -5151 -84 6406 1491 -6505 -2804 5231 3037 -4850 -4068 3028 3316 -3119 -4251 2387 5758
1345E758o709m689O455O435o008q047L398Q655o12p459k234M543K946k656j912
$$ 5758 -951 -5640 815 7250 1242 -6805 -3407 5248 4636 -2823 -5057 -514 2432 -224 -2136
1360b136K648K117l202j922L635K161l866k130L985J948l847k725K456K836j729
$$ -2136 512 2629 -573 -2495 1140 3301 -565 -2695 1290 3238 -609 -3334 -878 1958 229
1375B29l047J463M020n45m728k91M984J196l513r01K215m00j763Q08J619j385
$$ 229 -2818 -1355 2665 2120 -2608 -2899 2085 3281 -232 -1133 1082 682 -1081 -273 1346 -39
1391c9k148L70K766P62k833j571L299K134k819j832L572J221m521j188N018K291
$$ -39 -2187 -1817 949 1711 -1122 -2693 606 2740 -79 -1911 1661 2882 -1639 -2827 2191 4482
1407D482n461m506L681O463j864p527j71Q317J725q195k605Q742M055p838n703
$$ 4482 -979 -5485 -1804 4659 2795 -4732 -4903 3414 5139 -3056 -5661 3081 7136 -702 -6405
1422f405N739O532l397p178J239P034m84p355j70P801N40p907k29Q956J593r805
$$ -6405 -666 5866 2469 -4709 -3470 3564 3080 -4275 -4445 3356 3896 -4011 -4240 4716 6309 -3496
1438c496l964Q846P523o137r729K389R923n96j0097j306R987L048q686l798O981
$$ -3496 -7460 1386 8909 2772 -6957 -4568 5355 4759 -5338 -6644 3343 6391 -2295 -6093 888
1453H88M694n351n533M379P058k138q095l63P192J236p042j439O761K134o041
$$ 888 5582 231 -5302 -923 6135 3997 -4098 -4461 2731 3967 -3075 -4514 2247 4381 -1660
1468a660l537M107M945r10m840r78M066K311k750k472R39R51l22R46J54k143q48
$$ -1660 -5197 -1090 3855 2945 -1895 -2873 1193 3504 754 -1718 -779 172 -150 796 950 -1193 -2041
1485b041J663J230n93m78p8j67R89J402m08j935j523J048L365L37m835j978M997
$$ -2041 -378 852 259 -219 -297 -464 525 1927 1519 -416 -1939 -891 2474 2811 -2024 -4002 995
1502I95L488n584n209M805P135j857p704o59P344L245o741n312N741O679m715
$$ 995 4483 -1101 -6310 -1505 5630 3773 -3931 -4590 2754 5999 -742 -6054 -313 6366 1651
1517A651o975L338O034l593o408L730Q526j709j0207j664J1067N517r792q614
$$ 1651 -5324 -1986 4048 455 -5953 -2223 6303 4594 -5613 -7277 3790 9307 -485 -9099
1531i099P923J0541n325j1125J578R860N13q110j832P064K786p014l476P010N342
$$ -9099 -1176 9365 4040 -7085 -5507 4353 4866 -3244 -5076 1988 4774 -2240 -5716 1294 6636
1546F636o676o070O248O930n415q305L451R332q16j0100k819Q909O094o985p601
$$ 6636 -40 -6110 138 7068 1653 -6652 -3201 6131 5315 -4785 -7604 1305 7399 414 -7187
1561g187M380P984j296o489m9M319M13k590j61K195m64l419M4M141J355m983l025
$$ -7187 -2807 5177 3881 -2608 -2657 1662 2075 -515 -676 1519 1055 -2364 -2320 1821 3176 -1807 -4832
1578d832M270M614j896m290j84K927K013r64k667o69K161J592j206k316j022J611
$$ -4832 -562 4052 2156 -2134 -2318 609 2622 1658 -1009 -1678 483 2075 869 -1447 -2469 -858
1594h58K523l56l152m68L590J196k814j598K147J583r80n63N60p52k276Q1L809
$$ -858 1665 1309 -1843 -2311 1279 2475 -339 -1937 210 1793 813 250 810 58 -2218 -2137 1672
1611A672K164m536n094L820P449j717q455o56Q049L756n717n521L337N412j879
$$ 1672 3836 -700 -5794 -1974 5475 3758 -4697 -5353 2696 6452 735 -4786 -1449 3963 2084
1626B084n255J148M901j476n176J860N630j931o481J310P635J302p683l942P079
$$ 2084 -3171 -2023 2878 1402 -3774 -1914 3716 1785 -4696 -3386 4249 5551 -2132 -6074 1005
1641A005O498o136q446L860R452j568r387j041P825K326n636k600M254K978l850
$$ 1005 7503 1367 -7079 -3219 6233 4665 -4722 -5763 2062 4388 -1248 -3848 406 3384 -466
1656d66k590M431L543n486n422N406P531m071r083J074Q568J950p280l947N120
$$ -466 -3056 1375 4918 -568 -5990 -584 6947 2876 -6207 -5133 3435 5385 -1895 -5842 -722
1671g22N467k939n133J600M785j291m068J641L336j713l567J362L358q22l931
$$ -722 4745 1806 -3327 -1727 3058 1767 -2301 -660 2676 963 -2604 -1242 2116 1294 -2637
1686b637o44M501K546l963l911L036M903j398m306m16L081J670j145k252j392
$$ -2637 -3281 1220 3766 -197 -4108 -1072 3831 2433 -1873 -2289 792 2462 1317 -935 -2327
1701b327J309K170K16j684j711K60K149J825j436k477Q43J993l6r20N22m32j790
$$ -2327 -1018 1152 1368 -316 -2027 -1767 382 2207 771 -1706 -863 1130 1094 174 696 264 -1526
1718a526N07K553L0l216j535K947L486j865n005O10O318J116o165k482N412L502
$$ -1526 -1019 1534 1564 -1652 -3187 -240 3246 1381 -3624 -3014 3304 4420 -1745 -4227 1185 4687
1734D687m161m356K347M141j089m151N48M064o64m716J155O220l61p496p22P901
$$ 4687 526 -3830 -1483 2658 1569 -2582 -2034 2030 1366 -3350 -2195 4025 3664 -3832 -4554 3347
1750C347L210p040o174M856P782k159q535p30P707K509o345k726N115K564m170
$$ 3347 6557 -483 -6657 -1801 5981 3822 -4713 -5443 2264 4773 -1572 -4298 817 3381 -789
1765g89j998L897K566l503l390L069M380k828n811J376O775r7p017j550O392L094
$$ -789 -2787 1110 3676 173 -3217 -148 4232 1404 -4407 -3031 3744 3647 -3370 -4920 1472 4566
1781D566m553m059K738M490l13l811r09K647M45j997K88J739j419k436J656L292
$$ 4566 13 -4046 -1308 3182 2869 -942 -1851 796 1241 -756 -468 1271 -148 -2584 -928 2364
1797B364j102l561l88L403K188j601k778o9K521O72j405q20j30m9J244J293j963
$$ 2364 1262 -2299 -2687 716 2904 1303 -1475 -1544 977 1649 244 -576 -706 -755 489 1782 -181
1814a81k637J070L667L39l533j299K860K953j793l897N61L832M55k997j062K011
$$ -181 -2818 -1748 1919 2258 -1275 -2574 286 3239 1446 -2451 -1890 1942 2397 -600 -1662 349
1830C49j78j397R32J563j260k254J083L832L93m758k534M635M988l498n934J283
$$ 349 171 -1226 -294 1269 9 -2245 -1162 2670 3063 -1695 -4229 406 5394 1896 -4038 -2755
1846b755N268K56m372j331L079J617k087j090J898J009k312j216L507J998l984
$$ -2755 2513 2769 -1603 -2934 145 1762 -325 -1415 483 1492 -820 -2036 1471 3469 -515
1861e15k883L461L800k757m862R16N006J145m533k704L387L327j687l024J007
$$ -515 -3398 63 3863 1106 -3756 -2840 2166 3311 -1222 -3926 -539 2788 1101 -1923 -916
1876i16J956k95m69R42n51k446P1L040J697l256l712J859N037l49m783j271M306
$$ -916 1040 745 276 1218 667 -1779 -1708 1332 3029 -227 -3939 -2080 2957 2608 -2175 -3446 860
1893H60K449k616k368J002J560k73m40K40r9j411l41K045J083k777j910K983L517
$$ 860 3309 693 -1675 -673 887 614 174 414 315 -1096 -1437 608 1691 -1086 -2996 -13 3504
1910C504k593l956J163M236O75l318j743J785K044j132j912O01P98j004n8K598
$$ 3504 911 -3045 -1882 2354 3029 -289 -2032 -247 1797 665 -1247 -646 152 -852 -910 1688
1926A688j66l720q32M287K778l144m194J433M604O55m602k386L289K611j834k301
$$ 1688 1522 -2198 -3030 1257 4035 891 -3303 -1870 2734 3389 -1213 -3599 -310 2301 467 -1834
1942a834J109R96r40K19J556l61k099K1L022J464l314l302K249M954j239n537
$$ -1834 -725 271 -669 -450 1106 745 -1354 -1333 1689 3153 -161 -3463 -1214 3740 2501 -3036
1958c036n56M968J771l650k488J842K682k04j461j38P36q08p22K333J509l214
$$ -3036 -3592 1376 3147 -503 -2991 -1149 1533 1329 -132 -270 466 -342 -1064 1269 2778 -436
1974d36l021K818M150j865n002r5M653K281l001l296J485L232j96k177j80J442
$$ -436 -3457 -639 3511 1646 -3356 -3451 1202 3483 482 -2814 -1329 1903 1707 -470 -650 792
1990G92l95r60J329K67k356q04K314K323j705l399L61L723J369l225k568K563
$$ 792 397 -563 766 1033 -1323 -2127 187 2510 805 -2594 -2233 1490 2859 -366 -2934 -371
2006c71L096q90k649n95Q95R04N99o8k054j027J497K345L23l087j820K531L665
$$ -371 2725 1835 -814 -1409 -514 390 989 921 -1133 -2160 -663 1682 2005 -1082 -2902 -371 3294
2023C294j218m029l6L016R55j904j027N07J89j58N75O90j031j823Q33L483M73
$$ 3294 2076 -1953 -1989 1027 1982 78 -949 -442 -253 -411 164 854 -177 -2000 -1167 2316 2789
2040B789m346j927M269L841l708m628J719M752Q1m156k201L027K602j729j994
$$ 2789 -1557 -3484 785 4626 918 -3710 -1991 2761 2842 -1314 -3515 -488 2114 385 -1609
2055a609J557J240k084m74L110Q83l863k051L930L832k916n640M08O103J958n397
$$ -1609 -52 1188 -896 -1370 1740 2623 -1240 -3291 639 4471 1555 -4085 -3677 2426 4384 -1013
2071a013l659L885M211j968l728Q92K734l1j588J7J106o17j779R11K698p09l736
$$ -1013 -4672 -787 3424 1456 -2272 -1380 1354 1323 -265 -248 858 241 -1538 -627 2071 1362 -2374
2088b374k01M168J257l904k344K818L708r57l536r85K501K104j151j889k00N12
$$ -2374 -2575 1593 2850 -1054 -3398 -580 3128 2171 -1365 -2350 151 2255 1104 -785 -985 -473
2104d73N74P67j88j999q74K207K099j061k358k83J984J519q77j900j70J262O13
$$ -473 101 868 680 -1319 -2193 14 2113 1052 -1306 -1589 395 1914 1037 -863 -1033 229 842
2121H42k70n63j122o22J847J888j343k971N89L344J005k940k547K186L570o50
$$ 842 572 9 -1113 -1735 112 2000 657 -2314 -1725 1619 2624 -316 -2863 -677 2893 2243
2137B243l950o54K965J087k166q24J470J60j119K13J808j14k758n04L781K273
$$ 2243 -1707 -2361 604 1691 -475 -1299 171 331 -788 -575 1233 1119 -1639 -2143 1638 3911
2153C911l532m188K385M932q73n056p65L909K005k649k495J455K184n59j532J067
$$ 3911 379 -3809 -1424 3508 2635 -2421 -3186 723 2728 79 -2416 -961 1223 664 -868 199
2169A99J184j623j642K504K080k347l152J613L813n31m360j217L905K934k855
$$ 199 1383 -240 -1882 622 2702 355 -2797 -1184 2629 2098 -2262 -3479 426 3360 505
2184E05l495J453L645k51k632j13J116L72n03K46K55j107j086J103K203o40l105
$$ 505 -2990 -1537 2108 1857 -775 -888 228 600 97 343 598 -509 -1595 -492 1711 1071 -2034
2201b034m48L544J613k661k326J662K432l27j786o55P51O82k02l69L2n33l41J174
$$ -2034 -2482 1062 2675 14 -2312 -650 1782 1455 -331 -986 -235 447 245 -124 -92 -625 -966 208
2219B08J207j514j852J289K581k44k603n10J654J389r00j740r9J538L32p71r8
$$ 208 1415 -99 -1951 -662 1919 1675 -928 -1438 216 1605 705 -1035 -1134 404 736 -35 -133
2236a33k22q99O35K082J30k643q85K403K001j543k786J50K901J231k724j866J558
$$ -133 -355 -1254 -619 1463 1593 -1050 -1935 468 2469 926 -1860 -1710 1191 2422 -302 -2168 -610
2253f10J658j017r23J046K56j000J89J334K83j903r05K059K098j830l297Q76L860
$$ -610 1048 31 -892 154 410 -590 -401 933 1216 -687 -1592 467 2565 735 -2562 -1686 2174
2270B174o4l734r66L071J661j771j930P26J719j31j146M02J238j203j654J577
$$ 2174 2110 -1624 -2590 481 2142 371 -1559 -833 886 755 -391 11 1249 46 -1608 -31
2286c1K196j915l006J217L593jl433j288K626K509j373k812N81K635n5k070j46
$$ -31 2165 250 -2756 -1539 2054 2053 -1380 -2668 -42 2467 1094 -1718 -1137 1498 1443 -627 -773
2303g73J331l34r38M95R60r19j228P56J807l4j985q23K348J687j825k260R62J923
$$ -773 558 224 -714 -219 741 -178 -1406 -650 1157 1123 -862 -1685 663 2350 525 -1735 -773 1150
2321A150n4j312n89L57K42N40J6o28o18K30J015J168j082j982O77K396J75k505
$$ 1150 1096 -216 -805 -448 -206 334 350 -278 -896 -666 349 1517 435 -1547 -870 1526 1701 -804
2339h04p03J638Q31q66p02nN41k1r3N23J04j104l75J923J113k257j860K032K419
$$ -804 -1507 131 962 96 -606 -611 -70 -91 -184 339 443 -661 -1036 887 2000 -257 -2117 -85 2334
2358B334j319k957J08K766J005k313j774J751J718r74j506J169J192j273j003
$$ 2334 1015 -1942 -1834 932 1937 -376 -2150 -399 1319 345 -1161 8 1200 -73 -1076
2373a076J651J222j675k264J238K924k85l323j184L242K212k645k508J620K574
$$ -1076 575 1797 122 -2142 -904 2020 1735 -1588 -2772 470 2682 37 -2471 -851 1723
2388A723o12j857J4J209K69r21j31R23k32j530J58K063r4k326n86K801J203k092
$$ 1723 1111 -746 -732 477 746 -175 -306 617 385 -1145 -987 1076 982 -1344 -1930 871 2074 -18
2406a8j816J192K140J94k117q92J418J127r13r50J32J04j08Q22M50r43q91Q24
$$ -18 -1834 -642 1498 1692 -425 -1317 101 1228 315 -635 -503 -399 -507 315 765 -178 -1069 -245
2424b45J208o2j197o10J025J038m76j174mN14j27j35P00m25j023L39J678N5j606
$$ -245 963 901 -296 -906 119 1157 681 -493 -497 17 -110 -245 455 30 -993 -654 1024 1079 -527
2443e27q81J458J925r26k430j32K599O55k313j130J450J236q02q63M24L26l88
$$ -527 -1408 50 1975 1049 -1381 -1513 1086 1741 -572 -1702 -252 984 182 -681 -257 69 -319
2460c19n3J138M58j600j436J997K176j732l031P25L368M75l216j233K030K051
$$ -319 -372 766 1224 -376 -1812 185 2361 629 -2402 -1677 1691 2166 -1050 -2283 -253 1798
2476A798j197j984N05J880o2j727N94J325q00j413Q38J674p99k083j7K204Q56
$$ 1798 601 -1383 -878 1002 940 -787 -193 1132 332 -1081 -243 1431 632 -1451 -1468 736 1592
2493A592k090j746J742K434j011k282K86K037J64j231j76M41j69m72L49P70m96
$$ 1592 -498 -2244 -502 1932 921 -1361 -1075 962 1126 -105 -281 160 -9 -481 -132 638 142
2510A42j426R9K243O33k445j285K135J898j152j955J06J539P88j160j056K83P71
$$ 142 -1284 -1185 1058 1691 -754 -2039 96 1994 842 -1113 -1007 532 1320 160 -896 -613 158
2527A58O8m29J22l55k08P68R90p25j432O27J355J37j274o50M99J162j87j010l66
$$ 158 226 -203 -81 -436 -644 124 1114 389 -1043 -416 939 1076 -198 -848 -349 813 626 -384 -750
2546g50P44J27l32M58O0j097K10J560L00j436j086Q81J774j92j857p44J431Q86
$$ -750 -6 121 -211 247 307 -790 -580 980 1280 -156 -1242 -361 1413 1221 -636 -1380 51 937
2564I37j239p21Q78N36q59J91Q69M7j468j2J681P99j675j880J351K488p43k959
$$ 937 -302 -1023 -145 391 -468 -277 592 639 -829 -841 840 1639 -36 -1916 -565 1923 1180 -1779
2582a779k86L016J000k447j339J646J542p18j241K13J260l34r98L22J182q01j868
$$ -1779 -2065 951 1951 -496 -1835 -189 1353 635 -606 -393 867 533 -465 -143 1039 238 -1630
2599a630Q95K446n24k790k90K655J121j835j781J120K307k85k293k18J803K12
$$ -1630 -735 1711 1187 -1603 -1893 762 1883 48 -1733 -613 1694 1409 -884 -1102 701 913
2615I13j557Q5J057j60j095L5J250J84j286o54J488J333j029j931P25J945k00
$$ 913 -644 -559 498 338 -757 -722 528 712 -574 -1228 260 1593 564 -1367 -642 1303 1103
2632A103j527n17Q59P10k93p95j68M02M34J6L3k84n80N53J009j32j152l12J126
$$ 1103 -424 -941 -82 628 335 -460 -628 -226 208 224 257 -27 -607 -54 955 823 -329 -641 485
2651D85L81q25n84J23L84K08k36L0m5r9P1N35L66j089o58J354R40j023j508N29
$$ 485 866 41 -543 -420 -36 172 -64 -34 -79 -178 -107 428 794 -295 -953 401 1341 318 -1190 -661
2671f61J719l09j554n21J379J050j247q80Q90J016r27o28J175O45j325j036J050
$$ -661 1058 749 -805 -1326 53 1103 -144 -1024 -134 882 -45 -673 502 1147 -178 -1214 -164
2688a64J734j183j883K18K187O44k261j126K000J551j391j577Q43J435m83j083
$$ -164 1570 387 -1496 -1278 909 1553 -708 -1834 166 1717 326 -1251 -408 1027 544 -539
2704e39J00J046l8j022k09J196L1j581L3J648N75j833p03J526J038r30j320M60
$$ -539 -439 607 569 -453 -662 534 565 -1016 -983 665 1240 -593 -1296 230 1268 338 -982 -522
2722e22J394K33j513n65J075M00q95NO52n1q25J77R40J6r27k20Q55Q42o35j297
$$ -522 872 1105 -408 -973 102 502 -393 -388 264 213 -612 -435 505 521 -406 -626 229 1071 436 -861
2742h61L60J207j19j195K47N32k69k06J14K06l18J00L10N63k24r50R2J217R3j436
$$ -861 -501 706 587 -608 -361 171 -98 -304 -190 16 -302 -202 108 671 447 -503 -411 806 899 -537
2762e37m83J252O62r27q44N54O52k15k99l3N82j13m94J92R40o81j168N97J419
$$ -537 -1020 232 894 -33 -877 -323 329 114 -185 -218 364 251 -243 -51 889 208 -960 -363 1056
2781A056k83j794j69J509M80r41q87P45R56j10r00N9R95m12p63M64Q74r47r08
$$ 1056 773 -1021 -1190 319 799 -142 -1029 -284 672 562 -338 -279 716 304 -459 5 879 -68 -976
2800i76O29J182l99j329j57J492P02j240j178J054J526p08j339L00R07q3o08O6
$$ -976 -347 835 436 -893 -1050 442 1144 -96 -1274 -220 1306 598 -741 -441 466 383 -225 -159
2818a59L91j63o49L11Q07k53j054j90J597P73j659r75J224J243o78j297J00R55
$$ -159 232 69 -580 -269 538 285 -769 -959 638 1411 -248 -1223 1 1244 566 -731 -631 324
2836C24K01q15l54M33N91o59j73R35k0j059J44J214J35j348k45P04R84n81j303
$$ 324 525 -290 -644 -211 380 -279 -452 483 463 -596 -452 762 897 -451 -696 8 992 411 -892
2855h92K34R88K94q40l44N10J74k39L26J10n23k48N73P54l46j056j02R08O01j047
$$ -892 -658 330 624 -216 -560 -50 124 -115 211 321 -202 -450 123 877 531 -525 -627 281 882 -165
2875a65r12P73J014m33p80K69M71k31J01K17k8l35l83N55O54n58j312K46J672
$$ -165 -1077 -304 710 277 -503 -234 237 6 107 324 296 -39 -422 133 787 229 -1083 -837 835
2894H35Q5j750n51J619Q31r61r75N99Q82r5q62J04P56k17r17M44J078p26j355
$$ 835 920 -830 -1381 238 1069 108 -867 -268 614 519 -343 -239 517 300 -617 -173 905 179 -1176
2913a176L20J666J24j497o13J354J296r97j536M16J505R1j385k96J067J21r15
$$ -1176 -856 810 934 -563 -1176 178 1474 477 -1059 -643 862 953 -432 -728 339 460 -455
2930d55j01O00J59o83R5P93J77p12o44Q71J194q41j422N15J168J63j252m57P02
$$ -455 -556 44 203 -480 -385 408 585 -127 -771 100 1294 453 -969 -454 714 877 -375 -832 -130
2949a30M09q6n40J30J22j9M9O36l25p04J01R47J26r45m47O33N77l86o56j15O68
$$ -130 279 193 -347 -217 -95 -114 -65 571 246 -458 -357 590 716 -229 -676 -43 534 148 -508 -623 45
2970D5J91k57j03K09j79o1L75L97n47q04P73Q37n00j050q9J002O51j145q69R94
$$ 45 236 -21 -124 85 -94 -155 220 617 70 -734 39 876 376 -674 -763 239 890 -255 -1124 -130
2990a30J055n84p97J66P86l46n09M23N44n65o36J90J026j47j208l50J387Q48j268
$$ -130 925 341 -456 -290 496 150 -359 64 608 43 -593 -403 623 476 -732 -1082 305 1153 -115
3009a15j166J194J109m97r17P2Q69o4p01j61O72j02p74j3J131j24j152j6J363
$$ -115 -1281 -87 1022 525 -392 -320 549 485 -216 -377 295 193 -581 -594 537 413 -739 -755 608
3028F08L81j146p68Q70J203o52j162j15J223M73j148n23Q00J22l20k4L43k23l20
$$ 608 989 -157 -925 -55 1148 496 -666 -781 442 915 -233 -756 44 166 -154 -178 165 -58 -378
3047c78J51O69O7p55l49O25Q23o76r02K11J067j6j164J13P28j12p5j77L12M2k04
$$ -378 -227 442 509 -246 -595 30 853 177 -725 -514 553 537 -627 -514 214 102 27 -150 162 204 0
3068@r4M41P2o72k69R62L14r53o76O58O67k59o39R3N29R1k23n6L07j11l48K58
$$ 0 -94 347 419 -253 -522 440 754 -199 -875 -217 450 191 -448 -355 174 265 42 -14 293 182 -166 92
3090I2N83m65r16K55R93Nj089l39Q84O49n62p21K48R55L5r71o9Q11p8n28K25L73
$$ 92 675 210 -706 -451 542 547 -542 -881 3 652 90 -631 -383 572 607 -364 -433 378 300 -228 -3 370
3112C70l79m36K36N67k24n93j65J019N99r06j070R92J042n16j180J93R41k10o90
$$ 370 -9 -445 -209 358 134 -459 -624 395 994 88 -982 10 1052 536 -644 -451 490 280 -410
3131d10R5L38J47n07rP21J81q22m82J087O30j023q05O87R87l11j040n9O83N03
$$ -410 -315 23 170 -337 -346 375 556 -266 -748 339 969 -54 -859 -172 815 504 -536 -595 88 591
3151E91q01m17O48K96m08l2L35J5o01J48P03l4o53l87O60N40l92r65K2J206P3
$$ 591 -210 -627 21 317 -91 -123 212 227 -374 -226 477 443 -210 -597 63 603 211 -754 -732 474 547
3172E47p52m58P95J81j62j87K39j71n6J35P7po21J6N46M62q10m65P30N65m93o80
$$ 547 -205 -663 132 313 151 -36 203 32 -24 111 188 181 -440 -424 122 584 -226 -691 39 604 111 -569
3194e69L01P56j30n12K0L12J02m27k6M64q9q72J70Q69L14j207l09R48O38l78r94
$$ -569 -268 488 358 -154 -134 178 280 -147 -173 291 202 -670 -500 369 683 -524 -833 115 753 375 -619
3215f19L90P22Q1p02k40N18J64n49m2N30j66p25K50Q69N2q10l96P11Q66n37j185
$$ -619 -229 493 574 -128 -368 150 314 -235 -277 253 87 -638 -388 481 533 -277 -673 38 904 367 -818
3236h18K65J188K2j137j82O03L35l84k23K25M4l2L4K69O1m60k5M93M14p38o23
$$ -818 -553 635 657 -480 -662 -59 276 -108 -331 -106 -62 -94 -60 209 270 -190 -215 278 692 -46 -669
3257f69M60P09j89o71j37N14K53k33k62K30J41j97J42L83j69p06J44P91m7q41
$$ -669 -209 500 311 -360 -497 17 270 37 -225 5 146 -51 91 474 305 -401 -257 534 487 -354
3277c54m19Q25M82l42o69m7Q40L08o64j81M39Q9l39J9L16m12l53L84M60j28p75
$$ -354 -773 52 534 192 -477 -524 316 624 -40 -221 218 307 -32 -13 303 -109 -462 -78 382 254 -521
3298e21l39J035N56o64r35M26J260j28j108r3O69K20l91l11L21J94l84r9M97J10
$$ -521 -860 175 731 67 -868 -442 818 690 -418 -511 158 378 -13 -324 -3 191 -193 -292 205 315
3318C15o79k38Q06N19p84p59O51R17k77p80k28O00N03l81o99L40K28j18j7L48
$$ 315 -364 -602 204 723 -61 -820 -169 748 471 -309 -537 63 566 185 -514 -174 54 -64 -81 267
3338B67k09m10O9P35R0o52m47O83N86l26q43k18R98O4n74l38M81J32j51J79K2
$$ 267 58 -352 -283 452 542 -110 -557 126 712 386 -457 -675 323 387 -187 -525 -44 88 -63 116 138
3359A38k27p2Q6O87k49o51j74P01M07p13p72M64Q91k09o65j05N87J84j64j92O7
$$ 138 -89 -161 -75 612 363 -288 -462 239 646 -67 -839 -375 516 307 -358 -463 124 308 144 -48 19
3380A9J45k13j0M93q1q31NP71L90q97n69N72O42q4o79k62O15N72n69l60L95K37
$$ 19 164 -49 -59 434 353 -478 -473 298 688 -209 -778 -206 436 352 -327 -589 26 598 29 -331 64 301
3402C01j62k11P6M5n32J79O61r8l84m66O66N67l22q46Q3Q85K19q00k77M82O5r3
$$ 301 139 -72 4 49 -483 -304 357 259 -125 -591 75 642 320 -526 -443 442 661 -139 -416 66 131 38
3424C8j77N7q0r1P8N75j39n53k81P44O87o68q99M93P72k75o15j92M20M27l37k91
$$ 38 -139 -82 -162 -253 -175 400 261 -292 -573 171 858 190 -709 -216 556 281 -334 -526 -106 321 -16 -307
3446c07K18K79k80q4L69J25o23k3N90M45p63p48P19N36k18o26l14Q97M96o09o25
$$ -307 -89 190 -90 -174 195 320 -303 -326 264 709 -54 -802 -83 453 235 -391 -705 192 688 79 -546
3467e46M54L70j97k5J36j36k00O4L63K6n01k48L92N92l64q34K04O99L64n50m10
$$ -546 -92 278 81 56 192 56 -144 -80 283 309 -192 -440 -48 544 180 -654 -450 249 613 63 -347
3488c47M00K13j44j43n5P6m4R6J78q5m95j69O88M50p09n65N86P84l22o86J8M09
$$ -347 53 266 122 -21 -76 0 -44 52 230 145 -350 -519 169 619 -90 -655 -69 715 393 -293 -275 134
3510A34L09l29l61L06J8k79M3M30j24o68L41O19J18p33n15P05P99l96q68n0R00
$$ 134 443 114 -247 59 77 -202 -159 271 147 -521 -180 439 557 -176 -691 14 813 417 -451 -501 399
3531C99K81q76k94N02J40k15j85J93R0j94J07K90J89m69m18M53P57k91j237M09
$$ 399 680 -196 -490 12 152 -63 -248 -55 35 -159 -52 238 427 -42 -460 -7 750 459 -778 -369
3551c69P37K93q60m97N65N13j48l78n3K56P1o2L3K99o56q9N76K04l76q32O02N34
$$ -369 368 661 -199 -696 -131 382 234 -144 -197 59 130 68 101 400 -256 -345 231 435 59 -773 -171 363
3573C63Q8p01k07K68N39n4n68K33J54l9j07J21k13j99J39O37j97n39k19N62L41
$$ 363 451 -250 -457 -189 350 296 -272 -39 115 76 -31 90 -123 -322 -183 454 257 -282 -501 61 402
3594D02j58q02J8Q58K00n03l41L60P9q4OJ4k21k55L13L72j9n00l83P55O59n63
$$ 402 244 -558 -540 318 518 15 -326 34 113 29 35 49 -172 -427 -114 258 239 -261 -644 111 770 207
3616B07r53L98R94k02n97l16M13L40j42m97m3M89k89NL46R7m88k87P35L90n81
$$ 207 -746 -348 646 444 -153 -469 -56 284 142 -355 -398 91 -198 -193 153 250 -238 -525 210 600 19
3637A9o46N34O18k6q81l03P32M86m19n67K07L94o3j60L29j47k29K8M26M1l58m31
$$ 19 -627 -93 525 499 -382 -685 47 533 114 -453 -246 148 85 -75 254 107 -122 -94 332 373 15 -416
3659d16K78O19j96q04j19O33M61m95m04K57K78J36j58j01n5j53L00Q4K0l56l34
$$ -416 -138 481 285 -519 -638 -5 456 -39 -443 -186 92 228 70 -31 -86 -239 61 145 165 -191 -525
3680e25N82M82m56p93K36P67K00n31l25L51K63L0k61k04J48p7R0K97j32o22J44
$$ -525 57 539 83 -710 -474 293 493 -38 -363 -12 251 281 20 -184 -36 -113 -23 274 142 -480 -336
3701c36M79K73p36l51O42M96n3n67k18M54K85l91k40K00J51k65J19J99j93l30
$$ -336 143 416 -320 -671 -29 467 414 -153 -371 83 368 -23 -263 -63 88 -177 -58 141 -52 -382
3721c82J76M31K07o94j27L78N60j43r29J34P04K99p70k44L65K32k07q2J55j35
$$ -382 -206 225 432 -262 -389 -11 549 406 -523 -389 315 614 -156 -400 -35 197 -10 -92 63 -72
3741g2o1j33N78J44n41n04O63O17m03r65K32R75p6o08l96L88N00q4m79J25K52
$$ -72 -133 -266 312 456 -85 -589 74 691 288 -677 -445 530 454 -154 -550 -162 338 254 -225 -100 152
3762A52K6j83J73Q3l70m6K93K53l61n45K04O26j1n58l47O19K99k10l64J37J18
$$ 152 178 -5 168 251 -119 -165 128 381 20 -525 -321 305 294 -264 -611 8 307 97 -267 -130 -12
3783a2K43j63J00k04o7J4J40J75l81k91L73L85r7n18l2O34J16k76j42j56J96Q7
$$ -12 231 68 168 -36 -103 -89 51 226 -155 -446 -73 312 215 -303 -335 299 415 139 -3 -159 37 124
3805A24P1k07k11L9J31L47j30n88j08P42L65n17o25L90N35j5m28k85K95L44k00
$$ 124 195 -12 -223 -184 -53 294 164 -424 -532 210 575 58 -567 -177 358 343 -85 -370 -75 269 69
3826F9l39K08J76l19k0L97l3n06Q6O15K55m71n53J65P34J65r77j56O16L95o66
$$ 69 -270 -62 114 -205 -225 172 139 -367 -281 334 589 118 -435 -270 464 629 -348 -504 112 507 -159
3847a59k81L28K95k49k0J84j40P7k06M75J50l96o19K90P41l0r17o9O84L00m61
$$ -159 -440 -112 183 -66 -86 98 -42 35 -171 304 454 58 -561 -271 470 440 -477 -546 138 438 -23
3868b3l82M2M87J49k34j87N7L12j91J01ql90r7N48J72k36n70R2M67J70l66k14
$$ -23 -405 -363 124 273 39 -148 -91 221 30 131 123 -267 -364 184 356 120 -450 -358 109 279 -87 -301
3890c01L53L11j45l96J30J84k65J12K53l43j52o1M84O9l74k51K24N13O3o66j87
$$ -301 52 363 218 -178 -48 136 -129 -17 236 -107 -259 -320 164 233 -141 -392 -168 345 408 -258 -445
3911d45O65K64m99k22J86J33r4J14j85r4j00J00K75J21l36l43N02N48k87p18O3
$$ -445 220 484 -15 -237 -51 82 -12 102 -83 -177 -277 -177 98 219 -117 -460 42 590 303 -415 -352
3932c52Q03j2n20l40K45K55P7l08j05J66J24j23L25J7m93%M81K26m51m98K52N62
$$ -352 451 439 -81 -421 -176 79 156 -152 -257 -91 33 -90 235 252 -241 -241 240 466 15 -483 -231 331
3954C31M4n97k69M06N40k78m84J32K90j39J2K13q4l29R7L15J29k61n96K48O73
$$ 331 375 -222 -491 -85 455 177 -307 -175 115 -24 -12 201 117 -212 -115 200 329 68 -528 -280 393
3975C93r8p41p0O25K95l82j79J54J58N7k07l6J11j05l5K69J7m57j80L16N55l00
$$ 393 295 -446 -516 109 404 22 -157 -3 155 212 5 -31 80 -25 -60 209 226 -231 -411 -95 460 160
3997A60o31K34M65K12k75l94R2M69M0m70k06L06P2j75J53P3m21n7M38J69j56m65
$$ 160 -471 -237 228 440 165 -229 -137 332 372 -98 -304 2 74 -101 52 125 -296 -353 85 254 98 -367
4019c67J72N36J1m36l53M35L03k51k28m4K64j56K29Ok06j49K04K63K11n08l76
$$ -367 -195 341 352 -84 -437 -2 301 50 -178 -222 42 -114 115 121 -85 -234 -30 233 444 -64 -440
4040d40K92N36k9p08J36N28O2m25k36J39J65%N6j25Q0j81O6L87O2n33k62M86M61
$$ -440 -148 388 359 -349 -213 315 377 -48 -284 -145 20 20 76 -49 31 -150 -84 303 365 -168 -430 56 517
4063E17k90p12J30M85K19m43k77L40K01J0l74N5J83Lp6J20K79m86k46M87J72k03
$$ 517 227 -485 -355 130 349 -94 -371 -31 170 180 -194 -139 44 47 -29 91 370 -116 -362 125 297 94
4085I4m47P8M03L29n16n27M94N42k85k81K4J90pJ16j84j37m6P3J72N7p2m62J68
$$ 94 -353 -275 128 457 -59 -586 -92 450 165 -116 -92 98 91 207 23 -114 -160 -87 85 142 70 -392 -224
4108b24M91m1m93n0N49J16k67j69j36K44J57j00k47J17l3J01K12n8l98j55N43
$$ -224 267 226 -267 -317 232 348 81 -88 -224 20 177 77 -170 -53 -86 15 227 169 -229 -384 159
4129A59K84k84l37rL86P9k35l63J35M82j73l21J22K6n9O3J71L7k90j87N03K50
$$ 159 443 159 -178 -187 199 278 43 -320 -185 297 124 -197 -75 -49 -108 -45 126 163 -127 -314 189 439
4151D39m64l77J89O14O4o56l17L86M59k32l02K3J51P6m1J4J20k15n9K82J98l40
$$ 439 -25 -402 -213 401 465 -191 -508 -122 337 105 -197 -174 -23 53 12 26 146 -69 -128 154 352 12
4173A2m00J35N89r4o54P0K83M15j68m38P4L51J54j48k08O5p9j15J74J55k87l10
$$ 12 -388 -253 336 242 -412 -342 -59 356 188 -250 -176 175 329 181 -27 38 -41 -156 18 173 -114 -424
4195d24L34M34k91k95j01M91K33k51n31L34L86r8k04j14J30j60K05J3q7j97j39
$$ -424 -90 344 53 -242 -343 148 381 130 -401 -67 319 221 17 -97 33 -127 78 91 4 -193 -332
4216c32L69J88j73k66p1N62J69n96j85M53R9j79j02j50J78jj6r7O2l8Q7Q7J66
$$ -332 37 225 52 -214 -285 277 446 -150 -335 118 217 38 -64 -214 -36 -37 -53 -150 -88 -126 -39 48 214
4239B14k15l15K79M30j65m21j16M41Q9j64l99P8K55J46k27K2P4p7p7L25J48n81
$$ 214 -1 -316 -37 393 228 -193 -309 132 221 57 -342 -264 -9 137 -90 -68 6 -71 -148 177 325 -256
4261b56O9J80L89l01m04K9L91K80m05m34K48M60j88k57J53J14k9JK36k21j36j26
$$ -256 -187 -7 382 81 -323 -294 97 377 -28 -462 -214 246 58 -199 -46 68 39 40 276 55 -81 -207
4283b07J93L65k03n21PO80J40o77k59M77L37k22k36L8P6K32n5k68R4N1k02N9J94
$$ -207 -14 351 148 -373 -366 314 454 -223 -482 -5 332 110 -126 -88 -12 220 165 -103 -9 42 -160 -101 93
4306I3q9m13K64K68R9k37k42M09J92k56k47N8K21K35l79j71L5J59KJ53j08k95
$$ 93 4 -409 -145 123 222 -15 -257 152 344 88 -159 -101 120 355 -24 -195 -160 -1 1 154 46 -249
4328b49K09J30K56j81k75j65M20K48k86l86K04K43j19k01J16r1J0K15o7m5j71
$$ -249 -40 90 346 165 -110 -275 145 393 107 -279 -75 168 49 -152 -36 -127 -117 98 31 -14 -185
4349a85J52J36R3j95m09J60O19j44m48j51L35K37j80l17R3K79L7j49M0R8j09q9
$$ -185 -33 103 196 1 -408 -248 371 227 -221 -372 -37 200 20 -297 -204 75 112 -37 3 101 -8 -97
4371i7J77K00k78l28J99M21o1m41j20L29L84k42l86K4M92q3l72J73M6rL2k6J8
$$ -97 80 280 2 -326 -127 294 233 -208 -328 1 385 143 -243 -219 273 190 -182 -9 37 28 60 34 52
4394E2j30j55J24K56m5l33j00M31K91m62l80L85K23J49k53j92J50J09M1k65j14
$$ 52 -78 -233 -109 147 102 -231 -331 100 391 -71 -451 -66 157 306 53 -139 11 120 161 -104 -218
4415b18J42m3J22J97k02j75J00N07q2l99j77K76Q9L9k05j81J49K26r9q4j0l8K2
$$ -218 -76 -119 3 200 -2 -177 -77 430 348 -51 -228 48 137 176 -29 -210 -61 165 66 -18 -28 -66 -44
4438d4Q6K31l44j56L55K78j90l58j81M28K99k43m40N4L50J46l02p9P8q1J53J18
$$ -44 42 273 -71 -227 128 406 216 -142 -323 105 404 161 -279 -225 125 271 -31 -110 -32 -113 40 158
4460A58k2k09j6J96K66j40l64k30N07J96l58k87J86L30O0l71n3M5K06J11p9j60
$$ 158 136 -73 -89 107 373 233 -131 -361 146 342 -16 -303 -117 213 273 -98 -151 -106 100 211 132 -28
4482b8o4nK8L86l87j53j11L66L40n32k36L78J62J49l83o5L05J3n3k55N0L1pJ47
$$ -28 -92 -97 -69 317 -70 -223 -334 32 372 -160 -396 -18 144 293 -90 -155 150 163 110 -145 -95 -64 -71 76
4506G6L7j81k16O4M12O3l48j03K45M43m17k99N0K30J58j97j61L1N1N0J25j47%
$$ 76 113 -68 -284 -220 192 255 -93 -196 49 492 75 -224 -174 56 214 17 -144 -113 -62 -12 113 -34 -34
4529c4q4J79K03k8l71p4M25J14k90l25K17L32j08j74k89K61J27J46l68J39J29
$$ -34 -118 61 264 236 -135 -209 216 330 40 -285 -68 264 156 -18 -307 -46 81 227 -141 -2 127
4550A27k28R6K72j45m11J78L22l6l49j6O1K11M5l49KK68R6p1q5j19J03J46N9J07
$$ 127 -101 -5 267 122 -289 -111 211 175 -174 -190 -129 82 127 -222 -220 48 144 73 -12 -131 -28 118 177 284
4574B84l17j75J86J58n5k38k36L32L11j93l43K58J92k5J7j60p6P0J7R5q0j90j8
$$ 284 -33 -208 -22 136 81 -157 -393 -61 250 57 -286 -28 164 139 156 -4 -80 -10 7 102 22 -168 -186
4597a86J45J86j6m05M4L69J73l82j62L04O8J12q3k73O9Q0%r0k9L8o2J77O8j96
$$ -186 -41 145 129 -276 -232 137 310 -72 -234 70 138 250 167 -106 -37 43 43 -47 -76 -38 -100 77 145 -51
4621e1j87R5K91J36l18j48J15J99J00k79r4J76Jk1J4j51jJ73J0M2k88O9Q3K68
$$ -51 -238 -143 148 284 -34 -182 -67 132 232 -47 -141 35 36 15 29 -122 -123 50 60 102 -186 -117 -34 234
4645B34N1m41k14M01J18j07l56K27J68N6j87q7M5L0L0Q1K7r3q6J19L51j79l92
$$ 234 285 -156 -370 31 149 42 -314 -87 81 137 -50 -137 -92 -62 -32 49 76 -17 -103 16 367 188 -204
4668b04J6L12R0l07j32J18K98j67k7j7QJ32L8n3q0o1n7J86Q7j56l06N2M50k4l38
$$ -204 -188 124 214 -93 -225 -107 191 24 -3 -20 -12 120 158 105 25 -36 -93 93 180 24 -282 -230 220 196 -142
4693a42j97K61L86j03l11LP1K88j14k32J99k4q9J82j01j05n1K3L07M6m09k10M61
$$ -142 -339 -78 308 205 -106 -103 -32 256 142 -90 109 85 -4 178 77 -28 -79 -56 251 297 -112 -322 139
4716A39K43k92k48L9J42J72j81k34R5K51p7j4j05L4o3J17J87r8k88L6K31O7p6
$$ 139 382 90 -158 -119 23 195 14 -220 -125 126 49 35 -70 -36 -99 18 205 107 -181 -145 86 153 77
4739G7l39J61K45J1j98k69J78K02k3N7k29j2NK63N5j41j18M8K58j00k25k82L24
$$ 77 -262 -101 144 155 -43 -312 -134 68 45 102 -127 -139 -134 129 184 43 -75 -27 231 131 -94 -376 -52
4762e2K56j20k29M8K46m9r0oj45J63N4R9j28j05p8J58J91l02j17r3M05k5l3j65
$$ -52 204 84 -145 -97 149 100 10 4 -141 22 76 175 47 -58 -136 22 213 -89 -206 -299 106 81 48 -117
4786a17j1K37J13k37q3O1P0R4p0J3j28j78K54J07j32j11n8M13r0k03j63J0L95
$$ -117 -128 109 222 -15 -98 -37 33 127 57 70 -58 -236 18 125 -7 -118 -176 237 147 -56 -219 -209 186
4809A86Q2l94l4R0L02k76p9N6Q3l8l2L04l49n6J09J14R5j44k40K91J44j05j57
$$ 186 268 -126 -160 -70 232 -44 -123 -67 16 -22 -54 250 -99 -155 -46 68 163 19 -221 70 214 109 -48
4832d8q8J98N0r6m3k6j15K19k2n6j2m9Q5Q9J11m29L6K78K09k77k79K03M8K36j81
$$ -48 -136 62 112 16 -27 -53 -168 51 29 -27 -39 -88 -3 86 197 -232 -196 82 291 14 -265 -62 -14 222 41
4857D1k95J52J96n1oj37O6m4K34K17l66j87J12J06O2j54k02J68J38J9q0j92J59
$$ 41 -254 -102 94 43 37 -100 -34 -78 156 373 7 -180 -68 38 100 -54 -256 -88 50 69 -11 -203 -44
4880d4K94k73k6J49j67O1J62o7p6k12J77K20m6k89q8J47K55j28k91P1L40j27N7
$$ -44 250 -23 -49 100 -67 -6 156 89 13 -199 -22 198 152 -137 -225 -78 177 49 -242 -171 169 42 99
4903I9k20L2K23o4j34Q5j43pj9K59N3l24JJ53J11j33p3m8L10K2j08k72J22J64
$$ 99 -121 -89 134 70 -64 21 -122 -129 -148 111 164 -160 -159 -6 105 -28 -101 -149 161 183 75 -197 -75 89
4927H9m9j37J10l9j86K49K09l78Rl6L06K7k93K9p3L03j3j80L6o8Q1O1j10j21J46
$$ 89 40 -97 13 -26 -212 37 246 -132 -123 -159 147 174 -119 -90 -163 140 127 -53 -17 -85 -4 57 -53 -174 -28
4952b8P9J65j28l0j04j4K97n6k86j53K72J03j84p4L5N9J33nj91P1POJ55j33Q4
$$ -28 51 216 88 58 -46 -60 237 181 -105 -258 14 117 -67 -141 -106 -47 86 81 -110 -39 -32 -26 129 -4 80
4977H0k17P3K78j51k99rJ92J46j35j56J67J27J13j97k3J31k3R0j20M1j16k27K30
$$ 80 -137 -64 214 63 -236 -245 -53 93 -42 -198 -31 96 209 12 -11 120 97 187 67 108 -8 -235 -5
5000eK85k93r4Q8J49J37k85r2J62J54J47l19r6pP5L0k8m6o1J88m9j7j34m0M5J83
$$ -5 280 -13 -107 -19 130 267 -18 -110 52 206 353 34 -62 -69 6 36 8 -38 -99 89 40 23 -111 -151 -106 77
5026G7oj51j52K42K64j72k15o8J38J25p7m6q2O1J34o1kj39J25K8J17q2j47N3R0
$$ 77 71 -80 -232 10 274 102 -113 -181 -43 82 5 -41 -123 -62 72 11 9 -130 -5 23 140 58 -89 -36 54
5051E4P2j71j57M6J49K18j98k16J97N5j01J40k8j52M3Q1J08n2k57J33J89r6j06
$$ 54 126 -45 -202 -156 -7 211 13 -203 -6 49 -52 88 60 -92 -49 32 140 88 -169 -36 153 57 -49
5074d9k30pL90M8k20j8J21l3m3Q1j19R3N8L3j50o7nL2J45j2j73l8K41k4J8k34
$$ -49 -279 -286 104 152 -68 -86 35 2 -41 40 -79 14 72 105 -45 -112 -117 -85 60 48 -125 -163 78 54 72 -162
5100a62J23O4O8M1j56J7J25j35l8M8j3n6L2O9M7k10kJ74N4j00j33J96J77l0j95
$$ -162 -39 25 93 134 -22 -5 120 -15 -53 -5 -18 -74 -42 27 74 -136 -138 36 90 -10 -143 53 230 200 5
5125Em7qR1j0k6j12J00j09J74j4p1P1p3J16J54k80j55J79P7j0j91LJ54k1M6k06
$$ 5 -42 -50 41 31 5 -107 -7 -116 58 44 -27 44 -29 87 241 -39 -194 -15 62 52 -139 -136 18 -3 43 -163
5151a63j8K58l7K02j36o8l9M8K38n1k44nO4J73j37k36N2J08k7N8q4L7Q3p5l3L6
$$ -163 -181 77 40 242 106 38 -1 47 285 234 -10 -15 49 222 85 -151 -99 9 -18 40 -44 -7 76 1 -32 4
5177Dn2j34J71J81k12j40O3J58J04j86j32K9K10J62j81k14J64J01n7lm4q3N3P7
$$ 4 -48 -182 -11 170 -42 -182 -119 39 143 -43 -175 -146 64 226 45 -169 -5 96 39 36 -8 -91 -38 39
5201C9J45k12ln4J60Q3k26L3K0J31j72M2m4k4J14p6J4plm9O4o0lj63K80N6l7k04
$$ 39 184 -28 -31 -85 75 158 -68 -35 -15 116 -56 -14 -58 -82 32 -44 -30 -37 -40 -89 -25 -85 -88 -251 29 85 48 -156
5229a56N2O7J66jk62N9J06Pk9r5q4K93N9k31o2M8N6J27Rj05j01l0K34P3j53k62
$$ -156 -104 -37 129 128 -134 -75 31 38 9 -86 -170 123 182 -49 -111 -63 -7 120 129 24 -77 -107 127 200 47 -215
5255b15J23L50j33k40n8N9M3Q6kn0P5J3J3k5j7r7k1J44L8j12l8k2J88K0k65Q6
$$ -215 -92 258 125 -115 -173 -114 -71 15 13 -37 38 51 64 39 22 -75 -96 48 86 -26 -64 -86 102 122 -143 -57
5281e7Q7J23o8k03J20P3J67p8j24J0j06J15J6j27q7m3K14J26j24j39n2K00K7r0
$$ -57 30 153 85 -118 2 75 242 164 40 50 -56 59 75 -52 -139 -182 32 158 34 -105 -157 43 70 -20
5305b0l4L7R3m5O6j18P9n1M2N8r9j55n5K93J41j67k51J17L13j25j13j10R4L9k1
$$ -20 -54 -17 76 31 97 -21 58 7 49 107 8 -147 -202 91 232 65 -186 -69 244 119 6 -104 -10 29 8
5330Hn7l4l2M5P8pM5q9p5K16P5j65q3M7L23k70r4j4qJ52m1n6r4K16Qj00J21q9
$$ 8 -49 -83 -115 -70 8 1 46 -43 -118 98 173 8 -75 -28 295 25 -69 -83 -91 61 20 -36 -130 86 94 -6 115 26
5358B6k69K62J17j5j53n8J00O9k9k65rJ53J28q0j23J10k8J8K6KN8j19J27N2p8
$$ 26 -243 19 136 121 -32 -90 10 79 50 -215 -224 -71 57 -23 -146 -36 -64 -46 -20 -18 40 -79 48 100 22
5383B2j44o1K09R5o2j47L1K15q1q5Nl2n8K1M1l6R6J7l6o1n0l5K2K82o5j61n8P4
$$ 22 -122 -183 26 121 59 -88 -57 158 77 -8 -3 -35 -93 -72 -31 -67 29 46 10 -51 -101 -136 -114 168 103 -58 -116 -42
5411d2R7L5k02p2J23J52l8j96N1q2J23Q8j36J83k10J11pQ5j6k06J20Q9Rk42J44
$$ -42 55 90 -112 -184 -61 91 53 -143 -92 -174 -51 37 -99 84 -126 -15 -22 63 47 -159 -39 50 59 -183 -39
5436c9M6J53k47l0P4K8M2N0L6j21R4j14J97j75M9j21J77m5m3k36J55J67m4j52
$$ -39 7 160 -87 -117 -43 -15 27 77 113 -8 86 -28 169 -6 43 -78 99 54 11 -225 -70 97 53 -99
5460i9p0J90j5k0o4NN7M1p2Q5j20JP2R7p3p0p3K62k8k3l4j55J74M5j55n5QM2M9
$$ -99 -169 21 6 -14 -78 -73 -16 25 -47 38 -82 -81 -9 88 15 -55 -128 134 106 83 49 -106 68 113 -42 -97 -89 -47 2
5489BM6m5M3p2m0J08q8P4r4r3K58k6k68J45J44J07k63nJ9J04j74J22q9N2N3R8
$$ 2 48 3 46 -26 -66 42 -46 28 -66 -159 99 73 -195 -50 94 201 -62 -67 -48 56 -118 4 -85 -33 20 118
5515A18r9p9M2j26J83k1j29O3P1J74n0j23j07Q4P2J7r8j37J57J20r2po5j07J26
$$ 118 19 -60 -18 -144 39 18 -111 -48 23 197 147 24 -83 1 73 90 -8 -145 12 132 40 33 -32 -139 -13
5540a3M0J12j55p0P9J62k4k38m2J59R1k1k93M8J62J35j07kj88J86Q9m6r2r0J37
$$ -13 27 139 -16 -86 -7 155 131 -107 -149 10 101 80 -213 -165 -3 132 25 23 -165 21 110 64 -28 -118 19
5565A9j4J44p5k10PK09n7j11O9K4R5j1j55J11o5J11q6J55j08j14m3J66M8j27p7
$$ 19 5 149 74 -136 -129 80 23 -88 -19 5 100 89 -66 45 -20 91 5 160 52 -62 -105 61 109 -18 -95
5590i5j1J90Mr9j93J5L68n6j46j12J09K8o8J27j71J8L7Q7j18N9rMJ22Rj30L2n
$$ -95 -106 84 88 -11 -204 -189 179 123 -23 -135 -26 2 -66 61 -110 -92 -55 32 -86 -27 -36 -32 90 99 -31 1 -4
5617dJ50j46j45J91q5M5L3p1o1qJ18pm1J17j88J11K25j76j13P3R3k7j46m8J1n4
$$ -4 146 0 -145 46 -39 6 39 -32 -93 -101 17 10 -31 86 -102 9 234 58 -55 18 111 84 -62 -110 -99 -153
5643a53J61r2l0jJ00J03q2M5j63M7J88j5j89k2j7J82m3j39M0J6J15R8j56o9R7
$$ -153 8 -84 -114 -115 -15 88 6 51 -112 -65 123 108 -81 -103 -120 62 19 -120 -80 -64 51 149 -7 -76 21
5668B1Q1Q1o4jj78K2K15p9j48jOJ34q1j34O2J34J01j92j09J86pP0p0j32O2M2j00
$$ 21 102 183 119 118 -60 -38 177 98 -50 -51 -45 89 8 -126 -64 70 171 -21 -130 56 49 119 49 -83 -21 21 -79
5695g9J97j31j39Q5LJ01n3j19K0J72N4K2j61R4j9nj20J03L2l6R6q0O1j83K3J26
$$ -79 118 -13 -152 -67 -64 37 -16 -135 -115 57 111 133 -28 66 47 42 -78 25 57 21 117 37 98 -85 -62 64
5721F4M6k2j14J45j8K0k61K0J70J40k08o1lL9M1k2J08k1j25J08J17j25k5QP3m
$$ 64 110 88 -26 119 101 121 -140 -120 50 190 -18 -79 -82 -43 -2 -24 84 63 -62 46 163 38 13 21 94 90
5747I0J5l05J62J47pj8j37O3J19k5r7M2j76R8L1j56R3L5j04R4J24p2o2J62j31
$$ 90 105 -200 -38 109 102 84 -53 10 129 104 7 49 -127 -29 2 -154 -61 -26 -130 -36 88 16 -46 116 -15
5772a5J80l24N5L8J31J2M0k08K9J34Ko0o0J9k0J45q2r7lR5J35k8j49J0QP4K9j30
$$ -15 165 -159 -104 -66 65 77 117 -91 -62 72 74 14 -46 -27 -47 98 16 -81 -84 11 146 118 -31 -21 -13 61 90 -40
5800d0N9p2kK11k06l8N2n0J29p1j4Q7j41J65m2l8JR3J16k36q4J27p1J86jk11k1
$$ -40 19 -53 -55 156 -50 -88 -36 -86 43 -28 -42 45 -96 69 27 -11 -10 83 199 -37 -121 6 -65 121 120 -91 -112
5827a12K30m4j35J2j6O6K35j69l3j90K03j21J11j03j24J06J45l0j5j43J34j3m6
$$ -112 118 74 -61 -49 -65 1 236 67 34 -156 47 -74 37 -66 -190 -84 61 31 16 -127 7 -6 -52
5850e2M6R8k05J15J25o2j05j01J29R1%q2j10J44J71j89j56J61r6J37k5K8j17N1
$$ -52 -6 92 -113 2 127 65 -40 -141 -12 79 79 -3 -113 31 202 13 -143 18 -78 59 34 62 -55 -4
5874dJ35j6j30J00j50M2K30j23p1j67J58J75k82K3K0K9n0M1l0J25K5p6R0j69j99
$$ -4 131 115 -15 85 -65 -23 207 84 13 -154 4 179 -103 -80 -60 -31 -81 -40 -70 55 80 4 94 -75 -274
5899b74J30J95O2j03r4mR1J06j86O9N3L3j06N2j43J24l9JO7j36N2Q8J6O0j08K
$$ -274 -144 51 113 10 -84 -88 3 109 -77 -8 45 78 -28 24 -119 5 -34 -33 34 -102 -50 38 54 114 6 8
5925Hl3J81n5j79P4O6M4j10r0J50Nojj26j03K55j05K07j55K2j6J9M9j40r9oL17
$$ 8 -25 156 101 -78 -4 62 106 -4 -94 56 61 55 54 -72 -175 80 -25 182 27 49 33 52 101 -39 -138 -144 173
5952A73j30o4j41J30N7J40j55p8J8O5J10j31Q7j25J17J09j39m6j38K18k4j12M5
$$ 173 43 -21 -162 -32 25 165 10 -68 -50 15 125 -6 81 -44 73 182 43 -3 -141 77 53 -59 -14
5975a4j17Q2J44O7j75j7Q7O3p1n6q8O1m4J94m5j43p5J81J15j90P9j81J67L0N0
$$ -14 -131 -49 95 162 -13 -30 57 120 49 -7 -95 -34 -78 116 71 -72 -147 34 149 -41 38 -143 24 54 104
6000A04j17NN3K0O2k44L8pR7J18j45k4k8J06l0K02k98j36K96L3j62j09J0K24J74
$$ 104 -13 -8 45 65 127 -117 -79 -86 11 129 -16 -40 -68 38 8 210 -88 -224 72 105 -57 -166 -156 68 242
6025B42k12j47Q0N9n4k6R9k68J81j0J64j09n9J9J51p1n4j37J16J83j3j56j23P3
$$ 242 30 -117 -37 22 -32 -58 41 -227 -46 -56 108 -1 -60 -41 110 39 -15 -152 -36 147 134 -22 -145 -72
6049g2O0k5M0o0L7N5J46j01q7jrQ1R8k69l8J72J64j01m0k14J71J0O4J5j34K5J28
$$ -72 -12 -37 3 -57 -20 35 181 80 -7 -8 -17 64 162 -107 -145 27 191 90 50 -164 7 17 81 96 -38 -13 115
6076A15l8l7m6n4P7N3j3r1r3J49J54j64j9k3n3K88j88m1k3J58j19R5J7k23R4O9
$$ 115 77 40 -6 -60 17 70 57 -34 -127 22 176 12 -7 -30 -83 205 17 -24 -47 111 -8 87 104 -119 -25 44
6102D4P2j57q1J4J32P5j4j03O6N3M0j64l9J88q8P5o1l2p8J74m9p9l2j50K61O7
$$ 44 116 -41 -122 -108 24 99 85 -18 48 101 141 -23 -62 126 38 113 52 20 -58 116 67 -12 -44 -194 67 134
6128A34pj20K6J2m6J01q0j05L1N5N2j00O0q6Q1J25j02l8j73J98L0j34M5l3O0N1
$$ 134 127 7 33 45 -1 100 20 -85 -54 1 53 -47 13 -73 8 133 31 -7 -180 18 48 -86 -41 -74 -14 37
6154C7j5j32OL0K22o3j12rO9M0K9j97N7k6K73r8m7j03M4J8K6m0j32P6O8nm0l1
$$ 37 22 -110 -104 -74 148 85 -27 -36 33 73 102 -95 -38 -64 209 111 64 -39 5 23 49 9 -123 -47 21 16 -24 -55
6182e5P6Pjn3l8l6J53J7R1k52K3P5KN3p4j49J11Q0J15j29r1n1L07j20p7O0L1q7
$$ -55 21 28 27 -26 -64 -100 53 70 161 -91 -68 7 9 62 -12 -161 -50 30 145 16 -75 -126 181 61 -16 44 75 -12
6210a2M4j28N7J09j22J36q3k8q9J08J12p6j29M6J42k4J42k84jP5J45q0l7n0m0
$$ -12 32 -96 -39 70 -52 84 1 -27 -116 -8 104 28 -101 -55 87 63 205 -79 -80 -5 140 60 23 -27 -67
6235f7J07P1q1r6N0J28J2q2j23o2J81P1k32Q1K7M8L1j4j33J33J4N1o0j7j71J09
$$ -67 40 111 30 -66 -16 112 124 42 -81 -143 38 109 -123 -42 -15 33 64 50 -83 50 64 115 55 38 -133 -24
6261b4Q5j6j45K1M9NJ1q1m0K19j00j8k6j48J72N8O6j24r3lJ57K7Jj50k8J09J20
$$ -24 61 45 -100 -79 -30 -25 -14 -95 -135 84 -16 -34 -60 -208 -36 22 88 -36 -129 -132 25 52 53 -97 -125 -16 104
6288A04j63K5po9K15j07m7J0q0K73j46qq8j0R9N4p2Q6q8K9J78k63N4K9l7J18q7
$$ 104 -59 -34 -41 -110 105 -2 -49 -39 -119 154 8 0 -88 -98 1 55 -17 69 -19 10 188 -75 -21 8 -29 89 2
6315Bq2RL5J90j79j18Q8L6KN0j12l5L3K38j34p2O1j06J67k2p4p0J0J92j39j21
$$ 2 -80 -71 -36 154 -25 -143 -55 -19 -17 33 -79 -114 -81 157 23 -49 12 -94 73 51 -23 -93 -83 109 -30 -151
6341a51J96j26J7K10j87m4N4Q5o2j0r6J10L0P0j1j17q1O4J52j39l2j6J88k30J52
$$ -151 45 -81 -64 146 -41 -85 -31 54 -8 -18 -114 -4 26 96 85 -32 -113 -49 103 -36 -68 -84 104 -126 26
6366B6o9J19j02L1j2K2q3L1J15j36J52k73J00K16J3j90PlJ56o2o0O2n6N5j44J88
$$ 26 -43 76 -26 5 -7 15 -68 -37 78 -58 94 -179 -79 137 150 -40 -33 -36 120 58 -2 60 4 59 -85 103
6392A03k04J74j27O7K0n7j7N0Q1j20J8M7OJ65j95j48M5n7J82Q3j52r7O3L1J31
$$ 103 -101 73 -54 13 33 -24 -41 9 90 -30 -12 35 41 206 11 -137 -92 -149 33 116 -36 -133 -70 -39 92
6417I2j4o5O7k9L3j09L7n2M1P8j86M7o9J26P9l3k8j15O1O5%J00j79N0Q4K9Qk54
$$ 92 78 13 80 51 84 -25 12 -40 1 79 -107 -60 -129 -3 76 43 15 -100 -39 26 26 126 -53 -3 81 110 118 -136
6445a36J74m6P9l8J14r5N3N3j27n2j3R6n5m8J62k45Q1K35n0j57J3o5K58j28k26
$$ -136 38 -8 71 33 147 52 105 158 31 -21 -34 62 7 -41 121 -124 -43 192 142 -15 -2 -67 191 63 -163
6470a63L9J61L0p6M0r6k0O6L9Qj87J03m4J07Q6j61J9P5q3J90k54j4J11J05r7n1
$$ -163 -124 37 67 -9 31 -65 -85 -19 20 28 -159 -56 -100 7 93 -68 -49 26 -57 133 -121 -135 -24 81 -16 -67
6496f7O9q6K26k1j82N7r0Q3J14k41M1J03J73j57l5k3R5Qk5Mp0j3J59K8j58r3K1
$$ -67 2 -84 142 121 -61 -4 -94 -11 103 -138 -97 6 179 22 -13 -36 59 67 42 46 -24 -37 122 150 -8 -101 -80
6523h0O8J02r8k08M6Q7J45Mp2L8r6J65j87k5L3J29o8m0j09J2L1K40l9j35R4q6
$$ -80 -12 90 -8 -216 -170 -83 62 66 -6 32 -64 101 -86 -111 -78 51 -17 -57 -166 -154 -123 117 78 -57 37 -49
6549d9J31M0j03l5mJ08M0j64j15J1OJ07l9J11r4L6K0M5n8PJ4n8R4rj29K6O7k4
$$ -49 82 122 19 -16 -20 88 128 -36 -151 -140 -134 -27 -66 45 -49 -13 7 52 -6 1 15 -43 51 42 -87 -61 6 -18
6577a8J9j35Q7K12k20J39j23K00k16J38K9n1j2j1L5j1k67J00J20J30n2j13l2k8
$$ -18 1 -134 -47 165 -55 84 -39 161 -55 83 112 61 49 38 73 62 -205 -105 15 145 93 -20 -52 -80
6601h0J36m6N7j27M7M8j14J70n4n3j4J19j4o3k9K5p5P2j12Q8qJ30l2%j31R8m1
$$ -80 56 10 67 -60 -13 35 -79 91 37 -16 -30 89 75 12 -17 8 -67 5 -107 -19 -27 103 71 71 -60 38 -3
6628cJ4l7r9K29q4q3J03p7J17p5m7R7o0m4J34oj96j6P4K02o6p4j01J37k6O1j9
$$ -3 11 -26 -125 104 20 -63 40 -37 80 5 -42 55 -5 -49 85 79 -117 -133 -59 143 77 3 -98 39 13 74 55
6655E5j00rL7J19q2m6o7l2Q4O7K4j25L5O6j07L8M1pl7P1jp8L0J14n3l8M9j33M5
$$ 55 -45 -54 -17 102 20 -26 -93 -125 -41 26 50 -75 -40 26 -81 -43 -2 -9 -46 25 24 -54 -24 90 37 -1 48 -85 -40
6684d0R9m0j5K5k8K39k27Nm3J16jmm6L2p2L9Jj6j33R9J44j15j5r6J05N9o4p0m1
$$ -40 59 19 4 29 1 240 13 18 -25 91 90 86 40 72 0 39 40 24 -109 -10 134 19 4 -92 13 72 8 -62 -103
6713a03RK32j58q1kL6J47j49L3j3J00k9lp5N8l6nm0R4n6p1Q5j0R4j23L5N9q0J17
$$ -103 -94 138 -20 -101 -103 -67 80 -69 -36 -49 51 22 19 -56 2 -34 -39 -79 15 -41 -112 -27 -37 57 -66 -31 28 -52 65
6742F5k0m1j16J54J0m3NM6q1K2J35k24L9N9Q1j62r3J79k3L5l4n1Q1r9J90j32l2
$$ 65 45 4 -112 42 52 9 14 60 -21 1 136 -88 -49 10 91 -71 -164 15 -8 27 -7 -58 23 -76 114 -18 -50
6769e0N1q2J83q4L6j70J56k9M9o7j13j3J54rp8PpJ20PJ0r1p4R0J08j61O6n9R4
$$ -50 1 -81 102 18 54 -116 40 11 60 -7 -120 -133 21 12 -66 -59 -66 54 61 71 -20 -94 -4 104 -57 9 -50 44
6797D4J4l5J8j23J03P8J29k27j8j70K11oo7K3M7k1Q9j03R2p6m6M8p9R9r0N0J45
$$ 44 58 23 41 -82 21 99 228 1 -17 -187 24 18 -49 -26 21 0 89 -14 78 2 -44 4 -75 24 -66 -16 129
6824A29n0j52j2J35j8J8k03J43K5Qr9R7p4Jp8K08k7j27N9O5L5j09o2L6K1J21j56
$$ 129 79 -73 -85 50 32 50 -153 -10 15 23 -76 21 -53 -52 -130 78 51 -76 -17 48 83 -26 -88 -52 -31 90 -66
6851f6R7J5l5l4l9J04m1L8q7N4m6K6K8q1J00j62J01nJ50q1j4K4n4k7J15j04M6
$$ -66 31 46 11 -23 -62 42 1 39 -48 6 -40 -14 14 -67 33 -129 -28 -33 117 36 22 46 -8 -35 80 -24 22
6878B2p2m7J17N9k8l4j6J4p2m0J16k2L7m9L0KL1o5J09k66Q2J10J4k2L8m9n6J12
$$ 22 -50 -97 20 79 51 17 1 15 -57 -97 19 -3 34 -15 15 17 48 -17 92 -174 -92 18 32 10 48 -1 -57 55
6906E5j33N0n6O9L6mm3R0j08l9J59rj04O3m8J49j00P8j26L1K9qJ23j66N2n6M3
$$ 55 -78 -28 -84 -15 21 17 -26 64 -44 -83 76 67 -37 26 -22 127 27 105 -21 10 39 31 154 -12 40 -16 27
6933B7J3j53K49k23Q0PQ6j38J13m8m2j4O4m3N8j52J09k9KR8l0j32Q9m9l5J20m6
$$ 27 40 -113 136 -87 -7 0 86 -52 61 13 -29 -43 21 -22 36 -116 -7 -36 -34 64 34 -98 -9 -58 -93 27 -19
6960a9L9N4p0j49J72j71J73q4N6K0m3N0l4R2k31J13J10o9l4K4J8ML5k4n5K2q4
$$ -19 20 74 4 -145 27 -144 29 -55 1 21 -22 28 -6 86 -145 -32 78 9 -25 -1 17 21 56 32 -23 -1 -85
6987h5k5K46j26Oj17J02mN9Qr7m4L9O9J13j38m5J3O9j08l7OJ29lq7L6L5J7K5M0
$$ -85 -110 136 10 16 -101 1 -3 56 64 -33 -77 -38 31 144 6 -39 -26 43 -65 -102 -96 33 30 -57 -21 14 31 56 96
7016I6j90J55k7q7k3Q2n6R1Pl4%p2L9L9M5p2j21J11J17l9m4j08J29j32Q1O0l7
$$ 96 -94 61 34 -53 -76 6 -50 41 48 14 14 -58 -19 20 65 -7 -128 -17 100 61 17 -91 38 -94 -13 47 10
7043A0L1r6L3J48j20n0J05q1Op2Q2R2j19M6R2k10L8J65j29jO2Q2l9q1K3n8L6L8
$$ 10 41 -55 -22 126 6 -44 61 -20 -14 -86 -4 88 -31 15 107 -103 -65 100 -29 -30 32 114 75 -6 17 -41 -5 33
7071C3N2j1j31J7Q0oL2n5q3K3M5Q3j38N8M3N8q1m8M8Jl6N2L9q5o8lJ87k09J04
$$ 33 85 74 -57 -40 40 34 66 11 -72 -49 -4 79 -59 -1 42 100 19 -29 19 20 -16 36 75 -10 -78 -81 106 -103 1
7100Ap0K1P5j56J03N8N2j70Q2om7o5J48kn9j1K30j92P3P3p2n8M6q5l7P6n6L0J22
$$ 1 -69 -48 27 -129 -26 32 84 -86 -4 -10 -57 -122 26 24 -35 -46 184 -8 65 138 66 8 54 -31 -68 8 -48 -18 104
7129A04r3J09j12O3q1J6Q6j22M8l5N7j28N5O4P0p6M3j21M4J1qR9p3P4n1j24k1
$$ 104 11 120 8 71 -10 6 92 -30 18 -17 40 -88 -33 31 101 25 68 -53 -9 2 -6 93 20 94 43 -81 -102
7156a02M8P3O6r6k2P6k6p8%J45m1n7%L7Mk6m2J72j53J5l7L9J7J6n0LN7Om5Lr7
$$ -102 -54 19 85 -11 -33 43 17 -61 -61 84 43 -14 -14 23 27 1 -41 131 -22 -7 -44 -5 12 28 -22 -19 38 44 -1 2 -95
7187i5P5l5M2P7j13o3R0j2jJ13j20J11j15J09l6l8M0m5n1K5nL0J07j27O9r6K7
$$ -95 -20 -55 -13 64 -49 -112 -22 -34 -35 78 -42 69 -46 63 27 -11 29 -16 -67 -42 -47 -17 90 -37 32 -64 -37
7214c7J23j38J26j15J7J41j56J18J43l70J15mk7L0lO1j25Q5m1K6m0K5M8oRq7J40
$$ -37 86 -52 74 -41 -24 117 -39 79 222 -148 -33 -37 -64 -34 -37 24 -101 -16 -57 -31 -71 -46 2 -4 5 -82 58
7241E8l2j57K65j16J8j06J31k04J91l4Mk12J20mP7L2L6qj30M2p9Q5K1o0QRO9Q0
$$ 58 26 -131 134 18 36 -70 61 -143 48 14 18 -194 -74 -78 -1 31 67 59 -71 -29 -108 -23 -2 -62 -54 -45 24 104
7269A04j48N0l9L9R6j46J44j05M2k7k8m7J65j09j3R4r3N1p4Q4o4K0m3m9R2m4M9
$$ 104 -44 6 -33 6 102 -44 100 -5 37 10 -18 -65 100 -9 -22 72 -21 30 -44 40 -24 -4 -47 -96 -4 -48 1
7296Ak8M7j66L0M7N7J49o6J5j36m8J10q2N3MP4j22L6k4M7nN4k9M0k7J18r8J5M3
$$ 1 -27 20 -146 -116 -69 -12 137 71 86 -50 -98 12 -70 -17 -13 61 -61 -25 -49 -2 -7 47 18 58 31 149 51 66 109
7325A09j68rM7L0ln2J57j80J28m8Q0r9O5m4o6O0j52L3J52q7n7J56j17P7l8j9K8
$$ 109 -59 -68 -21 9 6 -46 111 -69 59 11 91 -8 57 13 -53 7 -145 -112 40 -47 -104 52 -65 12 -26 -45 -17
7352a7n6L5J32j28K0M6M9p9k1j8P1n3j5q1P0OK7p6O8k0O7n0n5Q8j3m3n3K3P5p1
$$ -17 -73 -38 94 -34 -14 32 81 2 -19 -37 34 -19 -34 -115 -45 -39 -12 -88 -20 -40 27 -23 -78 10 -3 -46 -99 -76 -1 -72
7382g2J54j12Q0k3oM8j45K4P4p1k9P6j58L07j59K0n6Q6m4m8P8N3j71J15R9o2n3
$$ -72 82 -30 50 27 21 69 -76 -52 22 -49 -78 -2 -160 147 -12 8 -48 38 -6 -54 24 77 -94 21 120 58 5
7409EM1J5l8L4RK6j12Q0qpp8j78Q9N3Q5K1oj00Q6m4o0J5Q4j8R0n0j13L3O9Rj30
$$ 5 46 61 23 57 66 92 -20 60 52 45 -33 -211 -122 -69 16 37 31 -69 17 -27 -87 -72 12 -6 84 34 -79 -46 23 32 -98
7440i8M0L3L1p1M5n0N7J7L8j40K54m5j95J02J2l4n3N5lNJ6m9O4PK9k08J67N5j53
$$ -98 -58 -25 6 -65 -20 -70 -13 4 42 -98 156 111 -84 18 30 -4 -57 -2 -5 0 16 -33 31 38 67 -141 26 81 -72
7469g2j21J60J88j75N8r6O5Lj05O6k1J2J21j43L1n9j8J40j12J40k6j6L3j14l0
$$ -72 -193 -33 155 -20 38 -58 7 10 -95 -29 -50 -38 83 -60 -29 -88 -106 34 -78 62 36 20 53 -61 -91
7494i1O0l3l2J04j42K12n7mp2N0L8l3j06Q4m2rM5k4N0R6m8Jnj11N1MMN1m4m3J33
$$ -91 -31 -64 -96 8 -134 78 21 17 -55 -5 33 0 -106 -22 -64 -73 -28 -52 -2 94 46 47 42 -69 -18 -14 -10 41 -3 -46 87
7525H7p5J18k4j32J7L1N3J55k98O9l7N4l5K8m4nQ6j40P3M4J5Q1q6q4J13j85J90
$$ 87 12 130 106 -26 -9 22 75 230 -68 1 -36 18 -17 11 -33 -38 48 -92 -19 25 40 121 35 -49 64 -121 69
7552F9j00%RJ3l1R6p9N0o9N6o6J08PMm2N0k2r7P3l7N9j9M5j16Q6jq2RL4M3J0j08
$$ 69 -31 -31 -22 -9 -40 56 -23 27 -42 14 -52 56 63 67 25 75 53 -44 29 -8 51 32 77 -39 47 46 -36 -27 7 50 60 -48
7584d8Q2j4n7jL4n8mQN1M3lRJ8Pj2j00J56j15k2N7j76J48N6j9km7j0J6j14N0L8
$$ -48 34 20 -37 -38 -4 -62 -66 -58 -7 36 33 42 60 67 55 -45 111 -4 -26 31 -145 3 59 40 38 -9 -19 -3 -117 -67 -29
7615b9R2m7k8j6J4j4j9L4N6K2k6L2n3OO0q2l9qQ7Jo6L6J0k4m2k9P1k1J02o1np2
$$ -29 63 16 -12 -28 -14 -28 -47 -13 43 65 39 71 18 24 84 2 -37 -45 42 43 -23 13 23 -1 -43 -72 -1 -22 80 19 14 -58
7647e8j7J4K8QMK9M9pj1L6r1Q8J5j36l2P5J2l5M3k8j7K3j6M1M3j46J13p6N1j27
$$ -58 -75 -61 -33 -25 -21 8 57 50 39 75 -16 72 87 -49 -81 -6 6 -29 14 -14 -31 -8 -24 17 60 -86 27 -49 2 -125
7677a25M9J9P3q5L9J1L6l7J62j21r4J12j61J24R8j67K6N8j05O2P0j4m0O1N5o0
$$ -125 -76 -57 16 -69 -30 -19 17 -20 142 21 -73 39 -122 2 100 -67 -41 17 -88 -26 44 30 -10 51 106 46
7703D6Mj9o2m3N6J02o7m1p2M1l5J09J3N9j34O7nM4j6k0q8O4l2K1k3L0M6Kj04N2
$$ 46 50 31 -31 -74 -18 84 17 -24 -96 -55 -90 19 32 91 -43 24 19 63 47 27 -61 3 -29 -8 -31 -1 45 47 -57 -5
7733eJ07r6n5N1N9j12L6m6J06Lj4J6j67J98j69K27r0j64O6O0J8n0K7l3J47q6r7
$$ -5 102 6 -49 2 61 -51 -15 -61 45 48 34 50 -117 81 -88 139 49 -115 -49 11 29 -21 6 -27 120 34 -63
7760f3L5n7J20m6nJ0P5j16l6Q2Lp5M1L8l7J1j8J34k5j62L4J6p4M9J07j50J57j9
$$ -63 -28 -85 35 -11 -16 -6 69 -47 -83 -1 2 -73 -32 6 -31 -20 -38 96 71 -91 -57 -41 -115 -66 41 -109 48 29
7788B9j11J3J9P7q2J9J21J5k04K00r2o8J58p9lJ1kk9l2M7P7%n2l4K5m4J16j44
$$ 29 -82 -69 -50 27 -55 -36 85 100 -104 96 4 -64 94 15 12 23 21 -8 -40 7 84 84 32 -2 23 -21 95 -49
7816d9P5l8p3Q6l1K3j12P8j4J29j17J01j39J5N2m5J04j02R4Kk6J45r9K6l9n5L1
$$ -49 26 -12 -85 1 -30 -7 -119 -41 -55 74 -43 58 -81 -66 -14 -59 45 -57 37 39 13 158 59 85 46 -9 22
7843B2k9ojR5j05R2o3J2rJ49j65m0K0K36q0l7l4q4R3j68j3Q4J3j5P7n0j00L2J06
$$ 22 -7 -13 -14 81 -24 68 5 17 8 157 -8 -48 -28 208 128 91 57 -27 66 -102 -115 -31 -18 -33 44 -6 -106 -74 32
7872C2O6j29oQ0q9R0j82K35j61R3m1l1Q5j36K59k68R7N1m6o7Q6q3L5K1L2o7m7
$$ 32 98 -31 -37 43 -46 44 -138 97 -64 29 -12 -43 42 -94 165 -103 -6 45 -1 -68 18 -65 -30 -9 23 -44 -91
7899i1l9J27o4L5M2lj3L3O6K3k19J07O6j54j6J02j37Q1m6j7Q5M5o3J7J0R8r5L2
$$ -91 -130 -3 -67 -32 10 7 -6 27 93 116 -103 4 70 -84 -100 2 -135 -54 -100 -117 -32 13 -50 -33 -23 75 -20 12
7927A2j22K9PJ26j60J93j12p9L1J01J20j53kPM5j25O8l9J56j71N0j8N0J0%P1P
$$ 12 -110 -81 -74 52 -108 85 -27 -106 -75 26 146 -7 -9 -2 43 -82 -14 -53 103 -68 -18 -36 14 24 24 95 102
7954A02q2J9j13P4p4J66p7p2k1K7nL3K1M3po6J0m7QR8o0o0pN3J9J5N3o9pM2rR
$$ 102 20 39 -74 0 -74 92 15 -57 -78 -51 -56 -23 -2 41 34 -32 -22 -69 -61 37 -23 -83 -90 -37 -18 -3 50 -19 -26 16 7 16
7986A6n1P6r1L3M0j5Qj8j3l2j01J86j16J02K4l5Ln5q8J80K8j22J42j44K9J08j22
$$ 16 -35 41 -50 -17 23 8 16 -2 -15 -47 -148 38 -78 24 48 13 16 -39 -127 53 81 -41 101 -43 -14 94 -28
8013b8Q6j82K04j23J13j1q0N3k06K19n2k4R0l6j06J45j44O2K8L6j47J10J6l4j3
$$ -28 58 -124 80 -43 70 59 -21 32 -174 45 -7 -31 59 23 -83 62 -82 -20 8 44 -103 7 23 -11 -24
8038b4k9P8l0J08j25J97j62K6j31N3n9J04Q3%j59l4nM3Q6q9m8J07M2q4J15j19
$$ -24 -53 25 -5 103 -22 175 13 39 -92 -39 -98 6 89 89 -70 -104 -109 -66 20 -69 -117 -10 32 -52 63 -56
8064e6M2q5K18r6q9J3O0q7J38k9l6l1p2Q0N6q0o1M2JPK8J09l3M1j87J04m6J21
$$ -56 -14 -99 119 23 -66 -53 7 -80 58 29 -7 -38 -110 -30 26 -54 -115 -73 -72 -65 -37 72 39 80 -107 -3 -49 72
8092G2j46J11k2n6O0J20j85k2P8j04O3R9o2j9j12J49n6j4O3j01J99l4j03p3J1
$$ 72 -74 37 15 -41 19 139 -46 -68 10 -94 -31 68 6 -13 -125 24 -32 -46 17 -84 115 81 -22 -95 -84
8117h4m1J31q8J00j05n1J08j7j1K3J94j59k3jk7Q0mR0k53NP6Q0on2PK8n2N1j5
$$ -84 -125 6 -82 18 -87 -138 -30 -47 -58 -35 159 0 -23 -24 -51 29 25 115 -138 -133 -57 23 17 -35 -28 0 -52 -1 -16
8146a6K6q7L0L5rn8J4rJ8M8m7J9L3k9N0q9O4J45j10K2l0r5K4J23p5j11J74o6M6
$$ -16 10 -77 -47 -12 -21 -79 -65 -74 -56 -8 -55 -36 -3 -32 18 -71 -7 138 28 50 20 -75 -51 72 -3 -114 60 -6 40
8175D0r7J11n0Rm3K8J01j32j6Q7n4K2J8%M8qk5l6l3j2P6oj09nL6J5n2J46j60J
$$ 40 -57 54 4 13 -30 -2 99 -33 -49 38 -16 6 24 24 72 64 39 3 -30 -42 34 28 -81 -86 -50 -35 -87 59 -101 -100
8205a00jKQ7j7l4R4p7J34n2l0n3L5R7j60P8j17J34nj20R2j19J77j33L0j7J13j23
$$ -100 -101 -99 -12 -29 -63 31 -46 88 36 6 -47 -12 85 -75 3 -114 20 15 -105 -13 -132 45 -88 -58 -75 38 -85
8232h5P9p6J15J1n1M1%q6L5M2M7j09qPJ61j41J03m5m5k5k3R0n3K0p4K5J34o0j40
$$ -85 -6 -82 33 44 -7 34 34 -52 -17 25 72 -37 -45 -38 123 -18 85 40 -5 -30 -53 37 -16 4 -70 -45 89 29 -111
8261a11K07m7m2m5l1k9J33M1j8j40N3l3R7j22J24q4j18J67J07k00J03j02L1J53
$$ -111 96 49 7 -38 -69 -98 35 76 58 -82 -29 -62 35 -87 37 -47 -165 2 109 -91 12 -90 -59 94
8285I4j24M3pj2R7j19P7k0j1P0Nj87J31j13J86p2j04kK6J6m2o2j5J58M2m8j02
$$ 94 -30 13 6 -6 91 -28 49 29 18 88 93 -94 37 -76 110 38 -66 -68 -42 -26 -68 -130 -145 13 55 7 -95
8312i5J53j15J18o4J05j07o1J03Q8k11N4q0R5M0j43M7l8Q9Q9j60J16k9P6j19L0
$$ -95 58 -57 61 -3 102 -5 -66 37 125 -86 -32 -112 -17 23 -120 -73 -111 -22 67 -93 23 -6 70 -49 -19
8337a9N9q2J28r7K3J0j28M7r7Q2L7q8j7K76j22l9n6O2K2q2N5J0j01QJ53m4j32
$$ -19 40 -42 86 -11 12 22 -106 -59 -156 -74 -37 -125 -142 134 12 -27 -83 -21 1 -81 -26 -16 -117 -109 44 0 -132
8364a32J18o1R1J12k22m9J00K7L1j54Q9M6R4j22p6P2n1J87j05J47k50N2R3J3m8
$$ -132 -14 -75 16 128 -94 -143 -43 -16 15 -139 -50 -4 90 -32 -108 -36 -87 100 -5 142 -108 -56 37 50 2
8389Bl8j5O1j3m7l3l6J34N2L2k36J12J1J29j86L0m8J11ML0j81J00L4k7J8j56P8
$$ 2 -36 -51 10 -3 -50 -83 -119 15 67 99 -137 -25 -14 115 -71 -41 -89 22 26 56 -125 -25 9 -18 0 -156 -78
8416g8L1nJ65j91L8J32j0q4K8l7r8M1JJ67j4j69L1K6m0O4K4o5R1p7m4k3M7O7o2
$$ -78 -47 -52 113 -78 -40 92 82 -2 26 -11 -109 -68 -67 100 86 -83 -52 -26 -66 -2 22 -43 48 -29 -73 -96 -49 18 -44
8445d4R0j0j46J50j33k0K09k80J19M1k5lp3J24K8j10n4k9J37Q1l2o1k1K0J95q1
$$ -44 46 36 -110 40 -93 -113 96 -184 -65 -24 -49 -52 -125 -1 27 -83 -137 -166 -29 52 20 -41 -62 -42 153 72
8471G2j35J44l6n9r0J58k16J72P7Qm7q1M4J23Nk12J3m5O9J20j47K8K28k06Nq8
$$ 72 -63 81 45 -14 -104 54 -162 10 87 95 48 -33 11 134 139 -73 -60 -105 -36 84 -63 -35 193 -13 -8 -96
8497i6L8L3oR4j4n5j52J39M1j6m3O0L9M1j10k0j40J34lo7Q6L6j13O9N1m1o3k0
$$ -96 -58 -25 -31 63 49 -6 -158 -19 22 6 -37 23 62 103 -7 -27 -167 -33 -36 -103 -17 19 -94 -25 26 -15 -78 -98
8525i8J30j3Nn1J20l8J8l7j00J05m3Q4p7j03j4J12O8l4j01n1M4%Q3n4l1J5NL1
$$ -98 32 19 24 -27 93 55 73 36 -64 41 -2 82 5 -98 -112 0 68 34 -67 -118 -74 -74 9 -45 -76 -61 -56 -25
8553b5K7k8j15J47N5o5r5J52j5k9L8j27N8L2j19P8Q4j01R1L7o6j06Q7J09r4mM1
$$ -25 2 -26 -141 6 61 -4 -99 53 38 9 47 -80 -22 10 -109 -31 53 -48 43 80 14 -92 -5 104 10 6 47
8580D7Jk4Qqj48J13l7J1J06K4r0p6J64m0k4j85J40K8J7m7k4k2J24kn7m2J2M3R
$$ 47 48 24 32 24 -124 -11 -48 -37 69 93 3 -73 91 51 27 -158 -18 10 27 -20 -44 -66 58 56 -1 -43 -31 12 21
8609B1m7p9K8Q9N9q0O2k2L2k5K2p3j5p2R9pn3j3J55p2k5J05j84M0J17l0p9oj4
$$ 21 -26 -105 -77 12 71 -9 53 31 63 38 60 -13 -28 -100 -1 -8 -61 -74 81 9 -16 89 -95 -55 62 32 -47 -53 -67
8638f7J7M1O5j86J8O1P6j25J9l9J9O6o4K9q0J73J8l4m9M8K3r9K02j94J18J8k00
$$ -67 -50 -9 56 -130 -112 -51 25 -100 -81 -120 -101 -35 -99 -70 -150 23 41 7 -42 6 29 -70 132 -62 56 74 -126
8665a26J85K1l8k1k6j24J30J4r1R5qP3j43Q0Nl7L8m3m6J15o6Q1j02O4QK7r2l3
$$ -126 59 80 42 21 -5 -129 1 15 -76 19 11 84 -59 21 26 -11 27 -16 -62 53 -13 68 -34 30 38 65 -27 -60
8693f0M3o4J11n4j0J9M1l5J02n1j91J7Q4l9J75j74j19J81Q6K6j04l0ON1m9J07
$$ -60 -17 -81 30 -24 -34 -15 26 -9 93 42 -149 -132 -48 -87 88 -86 -205 -24 62 88 -16 -46 -40 11 -38 69
8719F9n3o5R2N0j27J7n1J73J8m7k30Q2M9J09k36J84L4j92K06l3j92J66o9J59Q
$$ 69 16 -49 43 93 -34 -17 -68 105 123 76 -154 -72 -23 86 -150 34 68 -124 82 49 -143 23 -46 113 121
8744A21k34Q2Q5Jl3p5O1K6k7J63k66O0J06j1J46k24o9O1rO9M1r8J47j88K5Q7l1
$$ 121 -113 -31 54 55 22 -53 8 34 7 170 -96 -36 70 59 205 -19 -88 -27 -36 33 74 -24 123 -65 -40 47 16
8771A6k0N3k9l8J03L9j04K6r0j02J09k1J18j75M2R8j31J96Rk1j75J41o3O9n6r0
$$ 16 -4 49 20 -18 85 124 20 46 -44 -146 -37 -58 60 -115 -73 25 -106 90 99 78 -97 44 -19 50 -6 -96
8797i6P6oJ25o5j43L8J73p9J9N1j4j16L7J75k44k9J13L1m2L9L9k3k2L2M4j99J68
$$ -96 -20 -26 99 34 -109 -71 102 23 42 93 79 -37 0 175 -69 -98 15 46 4 43 82 59 37 69 113 -86 82
8824H2j00N1j1nq0J45L8o1j06L0M0j1K9j39Q5K3K0j8nK1q5J13J4q5j3Lm2J21L7
$$ 82 -18 33 22 17 -63 82 120 59 -47 -17 23 12 41 -98 -13 10 30 12 7 28 -57 56 70 -15 -28 -25 -67 54 91
8853I1p1j57J80L2K0r3%J26j54JJ2n5J53J5q1q8K5J03p7k4n3J25o5J24j51L0M1
$$ 91 20 -137 43 75 95 2 2 128 -26 -25 -13 -68 85 100 19 -69 -44 59 -18 -42 -95 30 -35 89 -62 -32 9
8880Im6Rr9QMJ27N2M9j67R6j31J73j65R4j42J50Q4j09N3j35Q6J8o7P6o0%n8P6
$$ 9 -37 -28 -127 -119 -115 12 64 113 -54 42 -89 84 -81 13 -129 21 105 -4 49 -86 0 18 -49 27 -33 -33 -91 -15
8908a5jL2m5oN9O7k00J39O0n7l1q9J82j58R7m0L1o0L2J16j87N3l6K5J36q1%p2
$$ -15 -16 16 -29 -35 24 91 -109 30 90 33 2 -87 95 -63 34 -6 25 -35 -3 113 -74 -21 -57 -32 104 23 23 -49
8936d9p8J42l7p8J3j8K79q7j02pN8r5L4O7j28JJ47M9j00M%j37J16R2o7n5P5m5
$$ -49 -127 15 -22 -100 -87 -105 174 87 -15 -22 36 -59 -25 42 -86 -85 62 111 11 15 15 -122 -6 86 19 -36 39 -6
8964fo9lJ33j1j74J39Oj08O2J48k2J03j21j22J58j12k0j6m1k0J34j02L9Lj8N0
$$ -6 -75 -78 55 44 -130 9 15 -93 -31 117 95 198 77 -45 113 1 -19 -35 -76 -96 38 -64 -25 -22 -40 10
8990A0J06j89K4P0N2j5p6l2r2K68o8K7j47J01o2Q9r4mJ0J5%j49J07m9O5K7J29
$$ 10 116 -73 -49 21 73 58 -18 -50 -142 126 58 85 -62 39 -23 66 -28 -32 -22 -7 -7 -156 -49 -98 -33 -6 123
9017A23j52O4q2J23r3j23J29r3R1J00j95P0Q9l2L9q8k2O0n0O5j6j28L4J13n1P
$$ 123 -29 35 -47 76 -17 -140 -11 -104 -13 87 -108 -38 51 19 58 -30 -52 8 -42 23 7 -121 -87 26 -25 -18
9043a8K9q1N2j2J6J6J8jj42J63M7j30k6J27o8O2q9M5pJ5J1j09K10k8q2j07J64
$$ -18 11 -70 -18 -30 -14 2 20 19 -123 40 87 -43 -69 58 -10 52 -37 8 1 16 27 -82 128 100 18 -89 75
9070G5j45N9O2j08n2k4J25r0M5L1o8J06M1m8j09M3KL6k1L3j41J01O9j03R5J39
$$ 75 -70 -11 51 -57 -109 -133 -8 -98 -53 -22 -90 16 57 9 -100 -57 -55 -19 -40 -7 -148 -47 22 -81 14 153
9096A53j53O5N8j56J15j16J23n0m6J10k6o0Q6j77M8p4Q2O6n4O3n9J22p8r7J29
$$ 153 0 65 123 -33 82 -34 89 39 -7 103 77 17 103 -74 -26 -100 -18 48 -6 57 -2 120 42 -55 74
9121G4PL8rj22j6n9J1N9n0nJ68qM8K8j74l6j0J68j51J27Pr4jq5O9J07j14M4j24
$$ 74 81 119 110 -12 -28 -87 -76 -17 -67 -72 96 88 136 164 -10 -46 -56 112 -39 88 95 1 0 -85 -16 91 -23 21 -103
9150a03K14j67Rj3J05j7n4P3N4O3k5n6j00l7M5j6N4j04K0O6r5P8n1L2R8q8r7K47
$$ -103 111 -56 -47 -60 45 28 -26 47 101 164 139 83 -17 -54 -9 -25 29 -75 -55 11 -84 -6 -57 -25 73 -15 -112 135
9178A35j78j26J74O7j63j24K67j8r7O7n0l9L1j8N8o5K4N6M3o1r1J17M4m3J8m0
$$ 135 -43 -169 5 72 -91 -215 52 34 -63 4 -46 -85 -54 -72 -14 -79 -55 1 44 -17 -108 9 53 10 28 -12
9204a2k7Q4mr8J5P5j09Q1J3j18K38k52R2K7o1P4JkK9j57l8N7J00O8o0j10N8jJ0
$$ -12 -39 45 41 -57 -42 33 -76 5 18 -100 138 -114 -22 5 -56 18 19 17 46 -111 -149 -92 8 76 16 -94 -36 -37 -27
9233b7K4O1n0o9M8j07OJ25MO6N6m8j00j9M4J2n5J84m7j26q3k7O5K1J19j00P0K4
$$ -27 -3 58 8 -61 -13 -120 -114 11 15 81 137 89 -11 -30 14 26 -29 155 108 -18 -101 -128 -63 -42 77 -23 47 71
9261G1p2N7j77J50j31j2J41r1P5n6k5J61k5n1l6o8J28k3r8m2Q6K3j8Q7j23P6p5
$$ 71 -1 56 -121 29 -102 -114 27 -64 11 -45 -70 91 66 15 -21 -89 39 16 -82 -124 -38 -15 -33 54 -69 7 -68
9288f8K2J43m0j27P5OO8%j56J78Pj21P6r3k4O8R7j62O1N6k3o2o4K9l3J77o4n1
$$ -68 -46 97 57 -70 5 11 79 79 -77 101 108 -13 63 -30 -54 14 111 -51 10 66 43 -19 -83 -54 -87 90 26 -25
9316b5omkJ7Qn8j8p3J62Q2j92J00p9L4o8k9J02k4P2O6j3K9r6m3L00k49o5P8M2
$$ -25 -31 -35 -37 -20 -12 -70 -88 -161 1 83 -109 -9 -88 -54 -122 -151 -49 -73 -1 65 52 81 -15 -58 242 -7 -72 6 48
9345D8M8j31N3m0o4J0j10J91O7j27K7%l5K8%M7j7L8k9l6j2N6j03J21k08K23n2
$$ 48 96 -35 18 -22 -86 -76 -186 5 72 -55 -28 -28 -63 -35 -35 12 -5 33 4 -32 -44 12 -91 30 -178 45 -7
9372go7J21j07QR3Mn3k8nJ50j65pNO4p3O6l4l1J41L6O2k15k2J36M0j49J14p8o
$$ -7 -74 47 -60 -52 41 45 -8 -36 -41 109 -56 -63 -58 6 -67 -1 -35 -66 75 111 173 -42 -64 72 112 -37 77 -1 -7
9401g%jN6r4QM6J26k02K5O3j27K02o9k2j06J87l1j2n5J6O5J2j89M4k1P6R7r8L3
$$ -7 -7 -8 48 -46 -38 8 134 -68 -43 20 -107 95 26 4 -102 85 54 42 -13 3 68 80 -109 -65 -86 -10 87 -11 22
9430B2q6K00n7j26j1oJ51k3j3q7L4J5R7k8j07Oj08J67N6o5K2j9j3P1j04M7n8P6
$$ 22 -64 136 79 -47 -58 -64 87 64 51 -36 -2 13 110 82 -25 -19 -127 40 96 31 53 34 21 92 -12 35 -23 53
9458E3r2j0J23j28J5R9M1j50o8R5J50j88J11q3q0J73l7k9n8M9k1l2R4k9j4P2R
$$ 53 -39 -49 74 -54 -39 60 101 -49 -117 -22 128 -60 51 -32 -112 61 24 -5 -63 -14 -35 -67 27 -2 -16 56 65
9485F5j75J96j22N4q1P9n5O6PM3q7J14p8j11J43j19J54p3n2Q5p2J16j69J01p8
$$ 65 -110 86 -36 18 -63 16 -39 27 34 77 -10 104 26 -85 58 -61 93 20 -32 53 -19 97 -72 29 -49
9510d9N3l9mM9K4J1j04L9l0P0LK0j07Q6k2j9oj4j31K04J33k14J8j3N4km9j26M7
$$ -49 4 -35 -39 10 34 45 -59 -20 -50 20 23 43 -64 22 0 -19 -25 -39 -170 34 167 -47 -29 -42 12 10 -39 -165 -118
9539a18J88Qr7K3n2O0O2m5q7KJ82j2k8J3j9j25L6k3j2N4r2Q8O2n6n0l6L5j4MN4
$$ -118 70 78 -19 4 -48 12 74 29 -58 -56 126 114 86 99 80 -45 -9 -32 -44 10 -82 6 68 12 -38 -74 -39 -53 -49 5
9569Ej1Q6j83O5Kj00J75n7J4O8o8O3Qj19K5K5mj7L8N0o8k2l1O7mj26K7O9P2k5
$$ 5 -6 80 -103 -38 -36 -136 39 -18 -4 64 -4 59 67 -52 -27 -2 -6 -23 15 65 -3 -25 -56 11 7 -119 -92 -23 49 24
9599B4j25l9K02m2J3j41nJ00K7K5O3j06l8J04n0L4k8j12J11m2j2j27J55j6jK6
$$ 24 -101 -140 62 20 33 -108 -113 -13 14 39 102 -4 -42 62 12 46 18 -94 17 -25 -37 -164 -9 -25 -26 0
9625@j59J23P9j03ml6k1J26j24J86k8j0k1K1l5M9j17J13P0k4j18j22J15P4r9L
$$ 0 -159 -36 43 -60 -64 -100 -121 5 -119 67 39 29 8 29 -6 43 -74 39 109 85 -33 -155 -40 34 -65 -62
9651f2M1jM6J1O8j20P2LJ7j32NN0O5o2J5J1M4Kn7j59K17J1R0l7j13n6j6M6J59
$$ -62 -21 -22 24 35 103 -17 55 58 75 -57 -52 -2 63 1 16 27 71 73 16 -143 74 85 175 138 25 -31 -47 -1 158
9680A58r2j12j4K8L6K1J0l8N6r2N6J12j74O6N2q2q2L4N3m7J10J3j40P5k5r7K02
$$ 158 66 -46 -60 -32 4 25 35 -3 53 -39 17 129 -45 21 73 -9 -91 -57 -4 -51 59 72 -68 7 -18 -115 87
9707H7n4n8o1K59j94L1r2O5q1J96q1j8l5m6p7J34O7p9J43j0M0j94l6J51j3l9n1
$$ 87 33 -25 -86 173 -21 10 -82 -17 -98 98 17 -1 -36 -82 -159 -25 42 -37 106 96 136 -58 -94 57 44 5 -46
9734d6NJ51K4j10m9r9J06K02j19m5LJ2q5M0n4ll7M9nK7l1M5M8j4j03P5k9J3J26
$$ -46 -41 110 134 24 -25 -124 -18 184 65 20 23 35 -50 -10 -64 -67 -104 -55 -60 -33 -64 -19 29 15 -88 -13 -42 -29 97
9763I7k06R2k7J2n7J01J7k2J08j15J45j91Q3P7j24l9r6J48K0M1j05Q3o4j1J28
$$ 97 -109 -17 -44 -32 -89 12 29 7 115 0 145 -46 37 114 -10 -49 -145 3 23 64 -41 42 -22 -33 95
9788I5k0q9l2M1n4J22k45P0J29j32J58Kn2O3p6m4J58j65o5L4J59k34J84j6k3R2
$$ 95 75 -14 -46 -5 -59 63 -182 -112 17 -115 43 45 -7 56 -20 -64 94 -71 -136 -102 57 -177 7 -9 -32 60
9814F0n9M0j88J67P0j62j2J04r2J16OJ4j44J89p5M2o6j1k6M8M0j33J2P5k8l0R7
$$ 60 1 41 -147 20 90 -72 -84 20 -72 44 50 64 -80 109 34 76 10 -1 -27 21 61 -72 -60 15 -13 -43 54
9841E4r0J24j66P6R0j57M3O8o6Q4r5O4l0J07p4p3lR6j99K03L5j96J16m0J04q1
$$ 54 -36 88 -78 -2 88 -69 -26 42 -24 60 -35 29 -1 106 32 -41 -44 52 -147 56 91 -105 11 -29 75 -6
9867fk3nK9R0j56J4J21j08J28rj76O2J2J96q2L7j25J18j20N1J3j2K4M9r3r3N6
$$ -6 -29 -34 -5 85 -71 -57 64 -44 84 75 -101 -39 -27 169 87 124 -1 117 -3 48 61 49 73 122 29 -64 -8
9894hP0o2K0q7l2P9L9N5q1O4j31J68o6n3OL6K7m6M2p0J00l4no9J80k18J12j6K3
$$ -8 62 0 20 -67 -99 -20 19 74 -7 57 -74 94 28 -25 -19 17 44 -2 40 -30 70 36 31 -38 142 -76 36 20 43
9923D3O9j30O6N6Pk74J32P0J20k6j78j0Q4m5J1m5k8j1J12K6m1q2l5R7L9J5j13
$$ 43 112 -18 48 104 111 -163 -31 39 159 133 -45 -55 29 -16 -5 -50 -78 -89 23 49 8 -74 -109 -12 27 42 -71
9950g1L9l1rK0l8N7r1J55J6q2j08K34p0PP9j42K4j4P8J0j47J36N9j08O7r0j0R7
$$ -71 -32 -63 -72 -52 -90 -33 -124 31 47 -35 -143 91 21 28 107 -35 -11 -25 53 63 -84 52 111 3 70 -20 -30 67
9978F7q9J40k21J5J88p0M2q3L6j54K82k54j3N4m4K68r6p4k3l3L7N4j87J38k2j4
$$ 67 -22 118 -103 -88 100 30 72 -11 25 -129 153 -101 -114 -60 -104 164 68 -6 -29 -62 -25 29 -158 -20 -42 -56
10004e6P7r3l9rJ01N0K0j55M2Q7J25j05j24K3J00J9L5m6q0k3N3J04k09N6M1k1
$$ -56 21 -72 -111 -120 -19 31 51 -104 -62 25 150 45 -79 -56 44 63 98 52 -28 -51 2 106 -103 -47 -6 -27
10030b7K6L7jk0J24Q1k70n9K27k00kLM8j14J36N4r7M9q6J54m2J00q1l9n5M5J05
$$ -27 -1 36 35 15 139 220 -50 -109 118 -82 -84 -81 -33 -147 -11 43 -54 -5 -91 63 21 121 40 1 -54 -9 96
10057I6pk22K1K11j6o8l8J48n3j74P5O4N0m0j16J04q7R0o3Q8l0q3J54K7p8r4J33
$$ 96 89 -133 -112 99 83 15 -23 125 72 -102 -27 37 87 47 -69 35 -52 38 -25 63 33 -50 104 131 53 -41 92
10084I2j92J06J2m1M8Mj04K6J16n4%kj4J20q1r8J1J23K7l2j20k2k0J21M3N0j61
$$ 92 -100 6 18 -23 25 29 -75 -49 67 13 13 11 -3 117 36 -62 -51 72 99 67 -53 -75 -95 26 69 119 -42
10111d2J2J24p7rm3J7L6R0r5r1M3L6o3L5q2R5M9J22j47mol6J6n0J08m9m2R3P6
$$ -42 -30 94 17 8 -35 -18 18 108 13 -78 -35 1 -62 -27 -109 -14 35 157 10 6 0 -36 -20 -70 38 -11 -53 40 116
10140A16q8r3Q6Q7j96R8n9J8J45j6j77p1nK17o7k7l6J0R9m7J11j04J7J9q9J37
$$ 116 28 -65 21 108 -88 10 -49 -31 114 98 -79 -150 -155 62 -5 -32 -68 -58 41 -6 105 1 18 37 -52 85
10166H5j77J05M6Mj02o3J7O2OJ31j87M0M4O5o7q6P3P5l4j62J38j08L4J09k9j37
$$ 85 -92 13 59 63 -39 -102 -85 -23 -17 114 -73 -33 11 76 9 -77 -4 71 37 -125 13 -95 -61 48 19 -118
10192a18l3J01M9Q3O6j62OJ4N5o6O3j11K0L2q5Rk4K24p6j74J00m2J45o3l7m0O9
$$ -118 -151 -50 -1 82 148 -14 -8 6 61 -5 58 -53 -33 -1 -86 -77 -101 123 47 -127 -27 -69 76 13 -24 -64 5
10219EL3P8j17Q2q8j3M8J35p9j41p2J51Om8nK7K0J42q3k21K1J52P0n8k31M9J57
$$ 5 38 116 -1 81 -7 -20 28 163 84 -57 -129 22 28 -20 -25 2 22 164 81 -140 -119 33 103 45 -186 -137 20
10246B0l0kl7k0PJ35m1l6n5M9M7p6N6m1l8J02L5K1j44Q2m4J20o8j66J28J46j53
$$ 20 -10 -12 -49 -69 -62 73 32 -4 -59 -10 37 -39 17 -24 -62 40 75 96 -48 34 -10 110 42 -124 4 150 -3
10273cP0q9p2J48K0r3o0%K6J01j1j90P4P0R8o5l6j24J10K6K1r6J08o1M9N7j42
$$ -3 67 -22 -94 54 74 -19 -79 -79 -53 48 37 -153 -79 -9 89 24 -12 -136 -26 0 21 -75 33 -28 21 78 -64
10300f4J8P3m9N0P9j85O5k6Oj4N2N1q5J78j26N3j33O3j9Q2j9R8j00J6k0J5L1k14
$$ -64 -46 27 -22 28 107 -78 -13 -39 -33 -47 5 56 -29 149 23 76 -57 6 -13 69 50 148 48 64 44 59 90 -124
10328a24J85p3r1l2J26K06k98J52mn9QK2n3j0lJ56n5l7j34RJ74m3O6r2j2R7M5
$$ -124 61 -12 -103 -135 -9 197 -101 51 47 -12 -4 18 -35 -45 -48 108 53 16 -118 -109 65 22 88 -4 -16 81 126
10355A26o4j08K5l2J81r3j29k8K28N4p7p3j37K26q8k3M1l8L8kJ5j7l6N3j29J10
$$ 126 62 -46 -21 -53 128 35 -94 -122 106 160 83 10 -127 99 11 -12 29 -9 29 27 42 25 -11 42 -87 23
10381B3j15M6q1J64N4K3k50J52p4O5J9l8l2j1J0P7L4q2m7jO2n5RL4L0p9L5J20
$$ 23 -92 -46 -127 37 91 114 -136 16 -58 7 26 -12 -44 -55 -45 32 66 -16 -63 -64 -2 -57 -48 -14 16 -63 -28 92
10409I2j21J00J3n2p1l3Q2K0K4j1p0J6n7L0K6J0P9p6L2o0m5L0J14J12k03K6p6
$$ 92 -29 71 84 32 -39 -72 10 30 54 43 -27 -11 -68 -38 -12 -2 77 1 33 -27 -72 -42 72 184 -19 7 -69
10436f9J46J6j50J8K9m5R1k3j51R1pm2J09j15O1Q8ol0P4p1P6m0j10L2m6R5m9R3
$$ -69 77 93 -57 -39 -10 -55 36 13 -138 -47 -54 -96 13 -102 -41 47 41 11 85 14 90 50 -60 -28 -74 21 -28 65
10464F5r5M6n2J03o3J2l2jr3J58Nq8l6M2J23Jr2j39K40J9P1k47n5Q5K8k6n8l6
$$ 65 -30 16 -36 67 4 16 -16 -17 -110 48 53 -35 -71 -29 94 95 3 -136 104 123 194 -53 -108 -23 5 -21 -79 -115
10492a15J22j7N5j07Q4R9m5J7p3n5L5P1j6k4jj51K30r1q4P5L8j18N0P8n9j50L39
$$ -115 7 -10 45 -62 22 121 76 93 20 -35 0 71 55 31 30 -121 109 18 -66 9 47 -71 -21 57 -2 -152 187
10519A87j47J3j29N4k1K9k0m9J19j45J22L0r4M4P0j11R0L1p0k9J8K2N5l0J8o6
$$ 187 40 53 -76 -22 -43 -14 -34 -83 36 -109 13 43 -51 -7 63 -48 42 73 3 -26 -8 14 69 39 57 -9
10545iJ30j08J4OR8Qj53j22MJ22R1l0m9M3j0k4q8m8rP1M3J23j23R1p9J6j8N4n3
$$ -9 121 13 27 33 131 139 -14 -136 -132 -10 81 51 2 45 35 11 -77 -125 -134 -63 -20 103 -20 71 -8 8 -10 44 -9
10574ir8m6J93k7j0m8JkN5o6Qj0K02j29K2j28K7J15Jq9j04J15J75p6p8R1l9jQ8
$$ -9 -107 -153 40 13 3 -45 -44 -46 9 -57 -49 -59 143 14 36 -92 -65 50 51 -38 -142 -27 148 72 -6 85 46 45 133
10603A33j5j33J16J5o2k1J07j00n2NJ28p8o9L0M8j00N6k8%J75k25J24n2n3n2R0
$$ 133 118 -15 101 116 54 33 140 40 -12 -7 121 43 -26 4 52 -48 8 -20 -20 155 -70 54 2 -51 -103 -13
10629a3Lj10N4J17l3Jo1J8K9L0j3n3P2L9l0L5j76K6l9J43j00O9j5Q9q4PO3r4Q
$$ -13 -10 -120 -66 51 18 19 -42 -24 5 35 22 -31 41 80 50 85 -91 -65 -104 39 -61 8 -7 82 -2 5 68 -26 -18
10658a8J81r7j17QmM5K6J3k03K12l6K7L1j33J05O0j18R1K4j14M4l3p7K0mJ14l
$$ -18 163 66 -51 -43 -47 -2 24 37 -166 46 10 37 68 -65 40 100 -18 73 97 -17 27 -6 -83 -63 -67 47 44
10685D4kK6o7p9J11p2P1n3j2J2N9K8q7k1J24K4k8p0RM0m7Q1j01K9J8j1k5O8n9
$$ 44 42 68 1 -78 33 -39 32 -21 -33 -21 38 66 -21 -42 82 106 78 8 17 57 10 91 -10 19 37 26 1 69 10
10714A0k8J24j32M2k8j01K27j53j5k4r5K52j00R7j03j6J9K5o9k9J30K1J12j06
$$ 10 -18 106 -26 16 -12 -113 114 -39 -54 -78 -173 79 -21 76 -27 -43 -24 1 -68 -97 33 54 166 60
10738F0n3m1J13k4j83J95q2k4J83k14J27m6j20K37N0m2q3q4J4J35j15Jk1j4Q9
$$ 60 7 -34 79 55 -128 67 -15 -39 144 -70 57 11 -109 128 178 136 53 -31 -17 118 3 4 -17 -31 58
10763E8q8LQ0j01J4k2j3M6j0pJ02j31j5P2L2l9J4M7n3L6N4p9k5J03j19J05K9j26
$$ 58 -30 -27 53 -48 -34 -56 -69 -23 -33 -40 62 -69 -84 -12 20 -19 -5 42 -11 25 79 0 -25 78 -41 64 93 -33
10791c3N9J4p4mJ52o8q6K32k28L3l3R4m8K7n1m2J77j29nQ6j86K4J03j05O9J7o9
$$ -33 26 40 -34 -38 114 46 -40 192 -36 -3 -36 58 10 37 -14 -56 121 -8 -13 73 -113 -89 14 -91 -22 -5 -74
10818g4JJ97r8k08J09J69j95J39r5J34k4l5m6m9N6PkN9j5j42Q4n6J04p4J6L4k1
$$ -74 -73 124 26 -182 -73 96 -99 40 -55 79 55 20 -26 -75 -19 -12 -14 45 30 -112 -28 -84 20 -54 -38 -4 -25
10845b5M5q7kJ09j7R7r5%O3l3k0m2J4nM1o0j3n6J08k2j1l4l5K1P1Nj06MRJ19o0
$$ -25 20 -67 -69 40 23 120 25 25 88 55 35 -7 7 2 43 -17 -30 -86 22 0 -11 -45 -80 -59 12 17 -89 -85 -76 43 -17
10876a7K10j73p8lJ34k4j1j43m6J42K3j21O8K0j2N2m3K0r7K60j97L9J1lM4J12
$$ -17 193 20 -58 -61 73 49 38 -105 -151 -9 14 -107 -39 -19 -31 21 -22 -2 -99 161 -36 3 14 11 55 167
10902A67j08o1m6N6K5K9J12k01J48q2j11j34K06j01J86rr0J6j08K1Q7k9l9Q3K4
$$ 167 59 -2 -48 8 33 62 174 -27 121 39 -72 -206 0 -101 85 76 -14 2 -106 -85 2 -27 -66 17 41
10927D1o1K5j26K10j48J12J2m2r7J69q1l9j7n5L0J34j62J25k4j11K56j85O4j7
$$ 41 -20 5 -121 89 -59 53 65 23 -74 95 14 -25 -42 -97 -67 67 -95 30 6 -105 151 -34 30 13
10951A3m7QJ18j42O2rK2j21j5O3JR1%l8L9l2m6O1N0kr0j03J33m0m9Q5M4L0kOn9
$$ 13 -34 -26 92 -50 12 3 25 -96 -111 -48 -47 44 44 6 45 13 -33 28 78 76 -14 -117 16 -24 -73 12 56 86 84 90 31
10982C1j7n8Q3n9N5o4P5K8O2j94Q6j6j80K00q8K7nQ5K5k09J88p6J6Nq0Q3qPl1
$$ 31 14 -44 39 -20 35 -29 46 74 136 -58 28 12 -168 32 -56 -29 -34 51 76 -133 55 -21 -5 0 -80 3 -5 2 -29
11011b9M9K2j4o4R4q3Q1J2j06o7N2K0R7J24j62nm9j07P1k5J23j2J08j11k00K67
$$ -29 20 42 28 -36 58 -25 56 68 -38 -105 -53 -33 64 188 26 21 -28 -135 -64 -89 34 22 130 19 -181 86
11037H6rq3K7n2O1K2k9q7L9k2k4J43j42Q7j31m8J26q3R4L3l5JQ2p9L3j01O7J78
$$ 86 77 -6 21 -31 30 52 23 -64 -25 -47 -71 72 -70 17 -114 -162 -36 -119 -25 8 -27 -26 56 -23 10 -91 -24 154
11065A54j24m6m9j8N3J26j86J12J15j80R2m9m5O0n8N8l3J13r9P6l7j9Nj14nJ7
$$ 154 30 -16 -65 -83 -30 96 -90 22 137 -43 49 0 -45 15 -43 15 -18 95 -4 72 35 16 21 -93 -98 -81
11091h1O2J31q1kO7m6m3o0Q9j05J1J6Mp0J26k7R7j43j05Q8L2L7Lll5n0q5J24J7
$$ -81 -19 112 31 29 96 50 7 -53 36 -69 -58 -42 -38 -108 18 -9 88 -55 -160 -72 -40 -3 0 -3 -38 -88 -173 -49 -32
11120c2l2k5J59j27Kj09J14J04l3K6n1MJ81j88%l7m6R9q1Q9p5J3J34j29K0L3n2
$$ -32 -64 -89 70 -57 -55 -164 -50 54 21 47 -4 0 181 -7 -7 -44 -90 9 -72 17 -58 -45 89 -40 -20 13 -39
11147c9K7q6J17n3J15j72J65Rn8L0j19J4P6j07J0Q6n5l1j7M3M0n1J62j21m9O1
$$ -39 -12 -98 19 -34 81 -91 74 83 25 55 -64 -50 26 -81 -71 15 -40 -71 -88 -45 -5 -56 106 -15 -64 -3
11173cm0K71l46J66q7J25j02om8m3J85Lk2L5n0j41J05N6J4l5l8J9n5n2J08r0M6
$$ -3 -43 228 -118 48 -39 86 -16 -22 -70 -113 72 75 53 88 38 -103 2 58 72 37 -1 18 -37 -89 19 -71 -25
11200b5K4m4o6J20m2J7J12j93N7L1k4Qk1L6K2p4O8j69J23Mk8O1O8o9J39j47L4
$$ -25 -1 -45 -111 9 -33 -16 96 -97 -40 -9 -33 -25 -46 -10 12 -62 6 -163 -40 -36 -64 -3 65 -4 135 -12 22
11227B2m7N1L9m9P6j44L3o4J37N6r5r3j1K21j01j57Q1N1j7k5QPn7J16O7k20p5
$$ 22 -25 26 65 16 92 -52 -19 -83 54 110 15 -78 -89 132 31 -126 -45 6 -11 -36 -28 -21 -78 38 105 -115 -190
11254a90K07K0j7j8m3J17k9m6JQ5j07K5J1R7r1j13P4L2K9j00N8K5O8k2o7P0j2
$$ -190 17 37 20 2 -41 76 47 1 2 87 -20 5 16 113 22 -91 -17 15 44 -56 2 27 95 73 6 76 64
11281F4q2j6ORl8J36p0k8k5O2p1J23o7l0K5q8J39k3p4K0o9K13j23Qr4M1l5j1N8
$$ 64 -18 -34 -28 -19 -57 79 9 -19 -44 18 -53 70 3 -27 -2 -90 49 26 -48 -28 -97 116 -7 1 -93 -52 -87 -98 -40
11310d0P2J2r6J22r7O1O0Nm1nK0k32J73M8j09J39j58J40p3q7J5J9J02lMn7P6N6
$$ -40 32 44 -52 70 -27 34 94 99 58 53 73 -159 14 62 -47 92 -66 74 1 -86 -71 -52 50 47 51 -6 70 126
11338A26j63J71k02R0m4J01j66N2m5J04Oq0J38r2L1p2K8J04Mj45N3j74J54q6Q9
$$ 126 -37 134 -68 22 -22 79 -87 -35 -80 24 30 -50 88 -4 27 -45 -17 87 91 -54 -1 -175 -21 -107 -18
11363a8Q0pN1j39j4Q4mLp6R3m6J25j98Q0k3P4l0K7L9j39O4o7K9nJ47j03j26J03
$$ -18 62 55 106 -33 -47 37 33 36 -40 53 7 132 -66 14 -9 65 35 62 101 -38 26 -41 -12 -17 130 27 -99 4
11391DqP5p5p8L2J5j0k1K9L9j3LN0LQr6M4l2L7j05L9N8o4O3N1j33J01J91l18K07
$$ 4 -4 71 -4 -82 -50 -35 -45 -66 -37 2 -11 -8 42 45 53 -43 1 -31 6 -99 -60 -2 -66 -3 48 -85 16 207 -111 96
11421I6q6p0k3P7P1j15J9J03l8m3P6j95J58j13O3j22K11j09m2q0L01k2k48Q4j1
$$ 96 10 -60 -83 -6 65 -50 -31 72 34 -9 67 -128 30 -83 -20 -142 69 -40 -82 -162 139 117 -131 -47 -58
11446e8J4J33j80J5J08m8M7Q4k81K48L1j11J07j83K0J6M3n0Q8j10J15PK0j44j3
$$ -58 -44 89 -91 -76 32 -16 31 115 -166 82 113 2 109 -74 -54 -38 5 -45 43 -67 48 55 75 -69 -82
11471h2P7O6q2N7K3j27K1k7J24k3p5j7J21l3j03J41r5J68k43nJ76k29K29n6j18
$$ -82 -5 61 -21 36 59 -68 -47 -74 50 27 -48 -65 56 23 -80 61 -34 134 -109 -114 62 -167 62 6 -112
11496a12L3P4n9M3o4R4K0J2P3j86j1P7L4p6L1%M1j0m4jm9L1J09n0NQ1o8O9j65
$$ -112 -79 -5 -64 -21 -85 9 29 41 114 -72 -83 -6 28 -48 -17 -17 24 14 -30 -31 -80 -49 60 10 15 96 28 97 -68
11525f8J37Kj06J80q4k21L1L4O8QJ12j61J32q8K5L8k1l2l7J25p6q4l9M2K7J19
$$ -68 69 71 -35 145 61 -160 -129 -95 -27 -19 93 -68 64 -24 1 39 18 -14 -51 74 -2 -86 -125 -83 -56 63
11551F3J3J32k82J72k9j39kpO0J26j23Nj00K38k94R3J27j18J15m8J24k0k33K13
$$ 63 76 208 -74 98 69 -70 -72 -79 -19 107 -16 -11 -111 127 -167 -74 53 -65 50 2 126 106 -127 86
11575H6j83kJ82j94l8L19j47o0LK5o8K38j27n8L4o7J62j06l2k9R4q9J64j34o8
$$ 86 -97 -99 83 -111 -149 170 23 -37 -34 -9 -77 161 34 -24 10 -57 105 -1 -33 -62 32 -57 107 -27 -95
11600i5J2J36j31L8J46j38j6Q8j25J9P5j0m4o7J34m2J33j77N0L2j00J54n5Pk9
$$ -95 -83 53 -78 -40 106 -32 -48 40 -85 -66 9 -1 -45 -112 22 -20 113 -64 -14 18 -82 72 17 24 -5
11625ej73J49J17J16k70O1K3rK2q3Jk3k4L1J39j93J05j52J47%l2j2J55j74J02
$$ -5 -178 -29 88 204 -66 -5 18 9 31 -52 -51 -74 -98 -67 72 -121 -16 -168 -21 -21 -53 -65 90 -84 18
11650A8j02J40o6lO8q8pK6J0M6j1l8L2j08J11q0J10kr2Q8j78J43N3J3q8M0l3j4
$$ 18 -84 56 -10 -13 55 -33 -40 -14 -4 42 31 -7 25 -83 28 -52 58 56 -36 52 -126 17 70 83 -5 35 2 -12
11678a2kO8l7p5M9p7J72r4O4J2r3J7m8k2N0j1Q7k9j38J41m2Q4j19P4m3p3%N2J88
$$ -12 -14 54 17 -58 -9 -86 86 -8 56 68 -25 -8 -56 -78 -28 -39 48 19 -119 22 -20 64 -55 19 -24 -97 -97 -45 143
11707A43j99rR3j12P1Oqj2J8R4j03N3k6J81j99o7M8O5qq7j0M8o3R7q6L2J12j47
$$ 143 -56 -65 28 -84 -13 -7 -15 -27 -9 85 -18 35 9 190 -9 -76 -28 37 29 -58 -68 -20 -83 14 -72 -40 72 -75
11735g5m3J26P3r6l6M4R8l6j14J96j28j08J2J48o8j21J68q9L7n2Q8L2L0j46J24
$$ -75 -118 8 81 -15 -51 -7 91 55 -59 137 9 -99 -87 61 -7 -128 40 -49 -12 -64 24 56 86 -60 64
11760F4R6j93J7j13J37q9R7l4k8Q5%J5j30P2jK7o2N1q8k7j11J76Q1k6p7K3r4R0
$$ 64 160 -33 -16 -129 8 -81 16 -18 -46 39 39 54 -76 -4 -5 22 -40 11 -77 -104 -215 -39 42 16 -61 -38 -132 -42
11788d2Rm5p5Q5J19p7p0J49j06J32r7N2o3mK8L3J22q3o0J6j24J75L6q0l1O2j14
$$ -42 -33 -78 -153 -68 51 -26 -96 53 -53 79 -18 34 -29 -33 -5 28 150 67 7 23 -101 74 110 30 -1 61 -53
11815e3J64j07J12j31O4K0Qr9k6J39m1m2p9Q4j59J62j10M7qJ84k21J36j39N7O1
$$ -53 111 4 116 -15 49 69 77 -22 -48 91 50 8 -71 13 -146 16 -94 -47 -55 129 -92 44 -95 -38 23
11840B3j15P7l1l3J21N5j06j4J41j88k4J23M9m8n9K0Q6p3M3j58J92j1j15L5k0
$$ 23 -92 -15 -46 -79 42 97 -9 -23 118 -70 -94 29 78 30 -29 -9 77 4 47 -111 81 70 -45 -10 -30
11865c0R8lj30N2R3l9nPp0j0J42j14o0k9J49O5K0j71k3L7l0QmoN4o8P9ln7O0n0
$$ -30 68 65 -65 -13 80 41 36 43 -27 -37 105 -9 -69 -98 51 116 136 -35 -58 -21 -51 -43 -47 -53 1 -67 12 9 -48 12 -38
11896c8J63n4jj63J51r1J5o5N1J48j24p1Q1%J0j8N1k8n5J08n5j59K4K05nj4r6
$$ -38 125 71 70 -93 58 -33 -18 -83 -32 116 -8 -79 2 2 12 -6 45 17 -38 70 15 -144 -120 85 80 66 -30
11923c0L4jM9K6p0q8L9%l3N8qM1K9K4q8m1j13m0K11mj7n9M8R6o2m3K7J15r5j67
$$ -30 4 3 52 78 8 -80 -41 -41 -74 -16 -24 17 46 70 -18 -59 -172 -212 -1 -5 -22 -81 -33 63 1 -42 -15 100 5 -162
11953a62J42j6J12l3p6qmk6J83j04n4l2J25K6j02O5j3n0jO6j38J75r4n2rl9J04
$$ -162 -20 -36 76 43 -33 -41 -45 -71 112 8 -46 -78 47 73 -29 36 23 -27 -28 38 -100 75 -19 -71 -80 -119 -15
11980a5N7M1j67j9M9O2K7r8M3K5p7M6n1N2P7j27J45j76N3J6J37k6k7o9O5n9Mm9
$$ -15 42 83 -84 -103 -54 8 35 -63 -20 5 -72 -26 -77 -25 52 -75 70 -106 -53 -37 100 74 47 -22 43 -16 -12 -61
12008f1J37j01P5j85L9J65j04k5l1N3k8N2m7j44J90m5%P7q2L7K8j12R3L9o8r8
$$ -61 76 -25 50 -135 -96 69 -35 -60 -91 -38 -66 -14 -61 -205 -15 -60 -60 17 -65 -28 0 -112 -19 20 -48 -146
12034a46J46l3J5J11j54J30j41O4l6J26J10p6j17j10J45J2L4r9j09L8Q6J19j72
$$ -146 0 -33 -18 93 -61 69 -72 -8 -44 82 192 116 -1 -111 34 46 80 -19 -128 -90 -4 115 -57
12057e7J03nk3m7L9o4j03J96j73K11j72J05k7j8r8R6Q3q4JKk5Q0k0L2q4rL0J15
$$ -57 46 41 18 -29 10 -54 -157 39 -134 77 -95 10 -17 -35 -133 -37 46 -38 -37 -35 -60 20 0 32 -52 -61 -31 84
12085H4J2n3nr6J99j23K1r1L4N5R0Lr6m8m2Q8K2l4n4K1J64K5k98J01Rq9J7J6J07
$$ 84 96 43 38 -58 141 18 39 -52 -18 37 127 130 34 -14 -56 32 54 20 -34 -13 151 176 -122 -21 -12 -101 -84 -68 39
12114C9q9L8k1J6n5q0J07P8o5P8P2j27Q8r3MqJ08j89J38Nq5J94j22Ll0q3N3P5
$$ 39 -50 -12 -33 -17 -72 -152 -45 33 -32 46 118 -9 79 -14 -10 -18 90 -99 39 44 -41 153 31 34 4 -79 -26 49
12142D9P5j42M7j19L3J40j47N3n0l3K00n8m4j2Q5q9qk3o1J31l2m8Q2n5j4J2l7
$$ 49 124 -18 29 -90 -57 83 -64 -11 -61 -94 106 48 4 -8 77 -12 -20 -43 -104 27 -5 -53 29 -26 -40 -28 -65
12169f5j07O8O8J79j97K1Kp5K16p9j1m7l0l4J33j4k2o6p2K1L8P8Nj10J24K5j5
$$ -65 -172 -104 -36 143 -54 -33 -31 -106 110 31 20 -27 -57 -91 42 28 6 -60 -132 -111 -73 5 10 -100 24 49 34
12196C4o7J16j05N7LN0q9J21j55JP9l8j5k7R0p8O6q3O3K0k8j44J77j20Q6l8Q4
$$ 34 -33 83 -22 35 38 88 -1 120 -35 -34 45 7 -8 -35 55 -23 43 -40 23 43 15 -129 48 -72 14 -24 60
12223F0j28J26n6q3J56j19J8K2Q8j02R6j9m9p5Q3q5nj7Q6P9j49O5M0j05J13r7
$$ 60 -68 58 2 -81 75 -44 -26 -4 84 -18 78 59 10 -65 18 -67 -72 -89 -3 76 -73 -8 32 -73 40 -57
$$ [...]
16383a
##END NTUPLES=NMR FID
##END=
