##TITLE=abcd
##JCAMPDX= 6.0         $$ Bruker NMR JCAMP-DX V2.0
##DATA TYPE= NMR SPECTRUM
##DATA CLASS= NTUPLES
##ORIGIN= UXNMR, Bruker Analytische Messtechnik GmbH
##OWNER= root
$$ XWIN-NMR		Version 3.5
$$ Wed Sep  3 18:31:02 2025 Russian Standard Time (UT+4h)  servis@DPX200
##.OBSERVE FREQUENCY= 200.131235884673
##.OBSERVE NUCLEUS= ^1H
##.ACQUISITION MODE= SIMULTANEOUS
##.ACQUISITION SCHEME= undefined
##.AVERAGES= 32
##.DIGITISER RES= 18
##SPECTROMETER/DATA SYSTEM= spect
##.PULSE SEQUENCE= zg
##.SOLVENT NAME= CDCl3
##.SHIFT REFERENCE= (INTERNAL, CDCl3, 0, 16.4885)
##AUDIT TRAIL= $$ (NUMBER, WHEN, WHO, WHERE, WHAT)
$$ ##TITLE= Audit trail, XWIN-NMR		Version 3.5
$$ ##JCAMPDX= 5.01
$$ ##ORIGIN= Bruker BioSpin GmbH
$$ ##OWNER= servis
$$ F:\spectra/data/av/nmr/H1/1/pdata/1/auditp.txt
$$ ##AUDIT TRAIL=  $$ (NUMBER, WHEN, WHO, WHERE, WHAT)
(   1,<2025-09-03 18:29:25.39 +0400>,<servis>,<DPX200>,
      <created by zg, POWCHK disabled, PULCHK disabled
       configuration hash MD5:
       00 E9 B6 7A A2 85 ED C7 34 08 36 98 17 FE 4E 26
       data hash MD5: 32K
       B0 10 BB 2A A3 6F 0D 2F 56 C5 82 04 D5 28 E5 70>)
(   2,<2025-09-03 18:30:26.04 +0400>,<servis>,<DPX200>,
      <Start of raw data processing
       efp BC_mod = 2 LB = 0.05 FT_mod = 6 PKNL = 1 PHC0 = -261.8114 PHC1 = -12.69845 SI = 16K 
       data hash MD5: 16K
       58 D1 9C 67 12 29 6E 49 75 92 48 B6 0F F1 8A 25>)
$$ ##END=
$$ 
$$ hash MD5
$$ 1A DB DC 71 29 CE C8 8F E7 D3 6B AE D2 21 74 E2
##$RELAX= 
##$RELAX= 
##$RELAX= 
##$RELAX= 
##$RELAX= 
##$RELAX= 
##$RELAX= 
##$RELAX= 
$$ Bruker specific parameters
$$ --------------------------
##$DU= <F:\spectra>
##$EXPNO= 1
##$NAME= <H1>
##$PROCNO= 1
##$TYPE= <nmr>
##$USER= <av>
##$AMP= (0..31)
100 100 100 100 100 100 100 100 100 100 100 100 100 100 100 100 100 100 
100 100 100 100 100 100 100 100 100 100 100 100 100 100 
##$AQSEQ= 0
##$AQ_mod= 1
##$AUNM= <au_zg>
##$AUTOPOS= <>
##$BF1= 200.13
##$BF2= 200.13
##$BF3= 200.13
##$BF4= 200.13
##$BF5= 500.13
##$BF6= 500.13
##$BF7= 500.13
##$BF8= 500.13
##$BYTORDA= 1
##$CFDGTYP= 0
##$CFRGTYP= 5
##$CHEMSTR= <none>
##$CNST= (0..31)
1 1 145 1 1 1 1 1 1 1 1 1 1 1 1 1 1 1 1 1 1 1 1 1 1 1 1 1 1 1 1 1 
##$CPDPRG= <>
##$CPDPRG1= <>
##$CPDPRG2= <>
##$CPDPRG3= <>
##$CPDPRG4= <mlev>
##$CPDPRG5= <mlev>
##$CPDPRG6= <mlev>
##$CPDPRG7= <mlev>
##$CPDPRG8= <mlev>
##$CPDPRGB= <>
##$CPDPRGT= <>
##$D= (0..31)
0 2 0 0 0 0 0 0 0 0.06 0 0 0 0 0 0 0.0002 0 0 0 0 0 0 0 0 0 0 0 0 0 0 
0 
##$DATE= 1756909764
##$DBL= (0..7)
120 120 120 120 120 120 120 120 
##$DBP= (0..7)
150 150 150 150 150 150 150 150 
##$DBP07= 0
##$DBPNAM0= <>
##$DBPNAM1= <>
##$DBPNAM2= <>
##$DBPNAM3= <>
##$DBPNAM4= <>
##$DBPNAM5= <>
##$DBPNAM6= <>
##$DBPNAM7= <>
##$DBPOAL= (0..7)
0.5 0.5 0.5 0.5 0.5 0.5 0.5 0.5 
##$DBPOFFS= (0..7)
0 0 0 0 0 0 0 0 
##$DE= 6
##$DECBNUC= <off>
##$DECIM= 32
##$DECNUC= <off>
##$DECSTAT= 4
##$DIGMOD= 1
##$DIGTYP= 9
##$DL= (0..7)
0 120 120 120 120 120 120 120 
##$DP= (0..7)
150 150 150 150 150 150 150 150 
##$DP07= 0
$$ [...]
##$SUBNAM4= <"">
##$SUBNAM5= <"">
##$SUBNAM6= <"">
##$SUBNAM7= <"">
##$SUBNAM8= <"">
##$SUBNAM9= <"">
##$SW= 20.6817932712277
##$SWIBOX= (0..15)
0 0 3 0 0 0 0 0 0 0 0 0 0 0 0 0 
##$SW_h= 4139.07284768212
##$TD= 32768
##$TD0= 1
##$TE= 0
##$TE2= 300
##$TE3= 300
##$TEG= 300
##$TL= (0..7)
0 120 120 120 120 120 120 120 
##$TP= (0..7)
150 150 150 150 150 150 150 150 
##$TP07= 0
##$TPNAME0= <>
##$TPNAME1= <>
##$TPNAME2= <>
##$TPNAME3= <>
##$TPNAME4= <>
##$TPNAME5= <>
##$TPNAME6= <>
##$TPNAME7= <>
##$TPOAL= (0..7)
0.5 0.5 0.5 0.5 0.5 0.5 0.5 0.5 
##$TPOFFS= (0..7)
0 0 0 0 0 0 0 0 
##$TUNHIN= 0
##$TUNHOUT= 0
##$TUNXOUT= 0
##$USERA1= <user>
##$USERA2= <user>
##$USERA3= <user>
##$USERA4= <user>
##$USERA5= <user>
##$V9= 5
##$VALIST= <valist>
##$VCLIST= <CCCCCCCCCCCCCCC>
##$VD= 0
##$VDLIST= <DDDDDDDDDDDDDDD>
##$VPLIST= <PPPPPPPPPPPPPPP>
##$VTLIST= <TTTTTTTTTTTTTTT>
##$WBST= 1024
##$WBSW= 30
##$XGAIN= (0..3)
0 0 0 0 
##$XL= 0
##$YL= 0
##$YMAX_a= 162902
##$YMIN_a= -137317
##$ZGOPTNS= <>
##$ZL1= 120
##$ZL2= 120
##$ZL3= 120
##$ZL4= 120
##$ABSF1= 0
##$ABSF2= 0
##$ABSG= 0
##$ABSL= 0
##$ALPHA= 0
##$AQORDER= 0
##$ASSFAC= 0
##$ASSFACI= 0
##$ASSFACX= 0
##$ASSWID= 0
##$AUNMP= <proc_1d>
##$AZFE= 0.1
##$AZFW= 0.1
##$BCFW= 0
##$BC_mod= 2
##$BYTORDP= 0
##$COROFFS= 0
##$CY= 18.4799938201904
##$DATMOD= 1
##$DC= 0
##$DFILT= <>
##$DTYPP= 0
##$F1P= 9.9274215381318
##$F2P= -0.165520771350173
##$FCOR= 1
##$FTSIZE= 16384
##$FT_mod= 6
##$GAMMA= 0
##$GB= 0
##$INTBC= 1
##$INTSCL= 4.127829e-11
##$ISEN= 128
##$LB= 0.05
##$LEV0= 0
##$LPBIN= 0
##$MAXI= 10000
##$MC2= 0
##$MEAN= 0
##$ME_mod= 0
##$MI= 50
##$NCOEF= 0
##$NC_proc= -9
##$NLEV= 6
##$NOISF1= 3.799351
##$NOISF2= 2.8
##$NSP= 0
##$NTH_PI= 0
##$NZP= 0
##$OFFSET= 16.48848
##$PC= 4
##$PHC0= -261.8114
##$PHC1= -12.69845
##$PH_mod= 1
##$PKNL= yes
##$PPARMOD= 0
##$PSCAL= 4
##$PSIGN= 0
##$REVERSE= no
##$SF= 200.130005582386
##$SI= 16384
##$SIGF1= 3
##$SIGF2= 2
##$SINO= 400
##$SIOLD= 16384
##$SREGLST= <1H.CDCl3>
##$SSB= 0
##$STSI= 16384
##$STSR= 0
##$SW_p= 4139.07284768211
##$SYMM= 0
##$S_DEV= 0
##$TDeff= 32768
##$TDoff= 0
##$TI= <>
##$TILT= no
##$TM1= 0
##$TM2= 0
##$TOPLEV= 0
##$USERP1= <user>
##$USERP2= <user>
##$USERP3= <user>
##$USERP4= <user>
##$USERP5= <user>
##$WDW= 1
##$XDIM= 16384
##$YMAX_p= 440303648
##$YMIN_p= -7550663
$$ End of Bruker specific parameters
$$ ---------------------------------
##NTUPLES= NMR SPECTRUM
##VAR_NAME=  FREQUENCY,     SPECTRUM/REAL,   SPECTRUM/IMAG
##SYMBOL=    X,             R,               I
##VAR_TYPE=  INDEPENDENT,   DEPENDENT,       DEPENDENT
##VAR_FORM=  AFFN,          ASDF,            ASDF
##VAR_DIM=   16384,         16384,           16384
##UNITS=     HZ,            ARBITRARY UNITS, ARBITRARY UNITS
##FACTOR=    0.252644378177508, 1,           1
##FIRST=     3299.83951724647, 0,            0
##LAST=      -839.233330435636, 0,           0
##MIN=       -839.233330435636, -7550663,    0
##MAX=       3299.83951724647, 440303648,    0
$$ Real data points
##PAGE= N=1
##DATA TABLE= (X++(R..R)), XYDATA
$$ [...]
5719A731649K585233k982324L042893j729596o62404n61084R13341J451556j224192
$$ 1731649 4316882 1334558 4377451 2647855 1985451 1424367 2337708 3789264 2565072
5710B565072k8654n08208J904777m64008q39123O8107M67972L9458Q76274p42701
$$ 2565072 2536418 2028210 3932987 3468979 2629856 2697963 3165935 3205393 4081667 3338966
5700C338966j698848J023389J296386l80801Q01784O5663j144804j48799L62425
$$ 3338966 1640118 2663507 3959893 3579092 4380876 4446539 3301735 3152936 3515361
5691C515361L72494k38394j042139P13273j102301J167363L41988j26914n62511
$$ 3515361 3887855 3649461 2607322 3320595 2218294 3385657 3727645 3600731 3038220
5682C038220Q58010r72464n24945k85641R44104N4365j352686Q14686k20200O24592
$$ 3038220 3896230 2923766 2398821 2113180 3057284 3111649 1758963 2573649 2353449 2978041
5672B978041j080172J462574K72549N683o97102J54833O63474m32304P39920m83758
$$ 2978041 1897869 3360443 3632992 3638675 2941573 3096406 3759880 3327576 4067496 3583738
5662C583738k066868J741642P23704j227725L95004L4256o21711j49252O15936
$$ 3583738 1516870 3258512 3982216 2754491 3149495 3183751 2562040 2412788 3028724
5653C028724O24714k61885K25918K02335q17529m22161m17137J04103J706085
$$ 3028724 3653438 3391553 3617471 3819806 3002277 2580116 2162979 2267082 3973167
5644C973167j065170J28930J90599J507691k150798r51311K157957k054992J353212
$$ 3973167 2907997 3036927 3227526 4735217 2584419 1633108 3791065 1736073 3089285
5635C089285J92824k64507O47421p91176J049783n55436p15285j64665M57079
$$ 3089285 3282109 3017602 3665023 2873847 3923630 3368194 2652909 2488244 2945323
5626B945323J934726k618995J108736m1998J595050j980913K33101l95986j075789
$$ 2945323 4880049 2261054 3369790 3327792 4922842 2941929 3175030 2779044 1703255
5617A703255J130968J237743o04166M9626j98397J168342l430900K334262Q75887
$$ 1703255 2834223 4071966 3467800 3517426 3319029 4487371 1056471 3390733 4266620
5608D266620r96982j149587Q2762P60207l23364o42361M00663L37892R61586r3743
$$ 4266620 3269638 2120051 2202813 2963020 2639656 1997295 2397958 2735850 3697436 3603693
5598C603693j088535Q59202j333786J411367o07453K22441P39595K23653j189418
$$ 3603693 2515158 3374360 2040574 3451941 2844488 3066929 3806524 4030177 2840759
5589B840759J847537j330337j426139P37136m23669N70245M33288o75077j1480
$$ 2840759 4688296 3357959 1931820 2668956 2245287 2815532 3248820 2573743 2562263
5580B562263Q41869N9236l88662J97740k07973J32429K93843j298365Q98500K57364
$$ 2562263 3404132 3463368 3074706 3272446 3064473 3196902 3490745 2192380 3090880 3348244
5570C348244p50481L90022O2562o17161M12262q90935J345980N96262j862900
$$ 3348244 2597763 2987785 3050347 2433186 2845448 1954513 3300493 3896755 2033855
5561B033855J062222N285n30483r46119J480320j96120k97008j049505R68104
$$ 2033855 3096077 3101362 2570879 1624760 3105080 2908960 2611952 1562447 2530551
5552B530551P83392j516164J752625o40715L27949r46939J029871q92082m13730
$$ 2530551 3313943 1797779 3550404 2909689 3237638 2290699 3320570 2428488 2014758
5543B014758q83499K242768l43745K7517O3602l43452J342811o47395K17789j398283
$$ 2014758 1131259 3374027 3030282 3057799 3121401 2777949 4120760 3473365 3691154 2292871
5533B292871J541294j19624k161952J217450P17428j972966K089055j506140J031216
$$ 2292871 3834165 3714541 1552589 2770039 3487467 1514501 3603556 2097416 3128632
5524C128632m35503m5014N38228j384m45419L91056l17107J63899o37074m57750
$$ 3128632 2693129 2648115 3186343 3184959 2739540 3130596 2813489 2977388 2340314 1882564
5514A882564J763327j57048k402957J959941j390808q4577J065053J116689j358596
$$ 1882564 3645891 3488843 1085886 3045827 1655019 1570442 2635495 3752184 2393588
5505B393588J960131j950243J064450J87859j11796l37791n33295M1951R20867
$$ 2393588 4353719 2403476 3467926 3655785 3543989 3206198 2672903 2714854 3635721
5496C635721n87347P65229o18791N11779J27129O20039j109396p29964n53649
$$ 3635721 3048374 3813603 3194812 3706591 3833720 4453759 3344363 2614399 2060750
5487B060750L131096j266787n84557L62356N33600k51726L40245L572j065891
$$ 2060750 5191846 3925059 3340502 3702858 4236458 3984732 4324977 4328549 3262658
5478C262658O49423m37354j023419K930803j251775j26057Q11742p98726N63861
$$ 3262658 3912081 3474727 2451308 5382111 4130336 4004279 4816021 4017295 4581156
5469D581156j098449J390389j165004o0717P16263k21294P52872J383737j895205
$$ 4581156 3482707 4873096 3708092 3647375 4363638 4142344 4895216 6278953 4383748
5460D383748j75763J122507r51786J463376p76197K61567p32060J090307M67401
$$ 4383748 4207985 5330492 4378706 5842082 5065885 5327452 4595392 5685699 6153100
5451F153100k910291M198075k873574K069169r22879o55235j159810K74271K29456
$$ 6153100 3242809 7440884 4567310 6636479 5713600 5058365 3898555 4172826 4402282
5442D402282k36500J874745Q44886j886590K23378J93106J615236j047355k164076
$$ 4402282 4165782 6040527 6885413 4998823 5222201 5415307 7030543 5983188 3819112
5433C819112K331917J651738n10244j843587Q06316q23542L61015P73460O62778
$$ 3819112 6151029 7802767 7292523 5448936 6255252 5431710 5792725 6566185 7228963
5424G228963J39221q00085m73721L62265l60629K35320j314283m53100M64913
$$ 7228963 7368184 6568099 6094378 6456643 6096014 6331334 5017051 4563951 5028864
5415E028864j30541J163354r11942M15425J263353M95755p91630J54177M55249
$$ 5028864 4898323 6061677 5149735 5565160 6828513 7324268 6532638 6686815 7142064
5406G142064j025425k73812J684989R45893n21665J717672j800626n2406n38962
$$ 7142064 6116639 5842827 7527816 8473709 7952044 9669716 7869090 7816684 7277722
5397G277722k61035O9566M56339j173126J76776J375804q54217m45559K522553
$$ 7277722 7016687 7086253 7542592 6369466 6546242 7922046 7067829 6622270 9144823
5388I144823j580730P40060N95356j823863J394411m66972K482090R3562q12940
$$ 9144823 7564093 8304153 8899509 7075646 8470057 8003085 10485175 10578737 9765797
5379I765797m59748R85043j409078j551177l81985K735454k383044j080956M74643
$$ 9765797 9306049 10291092 8882014 7330837 6948852 9684306 7301262 6220306 6694949
5370F694949J721p16748P69796J361106l14776J46322J346931j445359j402516
$$ 6694949 6696670 5979922 6749718 8110824 7796048 7942370 9289301 7843942 6441426
5361F441426J984378J15731q80084J107004r65777R70867j026559O24538j580978
$$ 6441426 8425804 8541535 7661451 8768455 7802678 8773545 7746986 8371524 6790546
5352F790546R92610j481606j726082K488240j260766p36530j60219Q33134j747440
$$ 6790546 7783156 6301550 4575468 7063708 5802942 5066412 4906193 5739327 3991887
5343C991887P77101J38879k86596J914541j134102j99156o7341J295024j244189
$$ 3991887 4768988 4907867 4621271 6535812 5401710 5202554 5135213 6430237 5186048
5334E186048J249666p87404Q49447j737991J070394n80720j14694L95920j003676
$$ 5186048 6435714 5648310 6497757 4759766 5830160 5249440 5134746 5530666 4526990
5325D526990N16355o07718l38669J566918j466695n42921N64683r45478J557243
$$ 4526990 5043345 4435627 4096958 5663876 4197181 3654260 4218943 3273465 4830708
5316D830708Q37973j486919p6815O05042j702257J530524J391287j598451L27615
$$ 4830708 5668681 4181762 4104947 4709989 3007732 4538256 5929543 4331092 4658707
5307D658707n05255j81479N79980o54038j17500m35322J048555q1437J102595
$$ 4658707 4153452 3971973 4551953 3897915 3780415 3345093 4393648 4312211 5414806
5298E414806n50653j288817J551785r71355P66619J9718Q44868j109945j49002
$$ 5414806 4864153 3575336 5127121 4155766 4922385 4942103 5786971 4677026 4528024
5289D528024l65961K435479j900543J95715j119920J058142P3638q1685k16845
$$ 4528024 4162063 6597542 4696999 4892714 3772794 4830936 4904574 4822889 4606044
5280D606044J528004j427641Q14501J1539l49266N06621J551588p56776J99056
$$ 4606044 6134048 4706407 5520908 5532447 5183181 5689802 7241390 6484614 6683670
5271F683670M1340K86319j316769J686885j299094J896534j693653J708240o9303
$$ 6683670 6725010 7011329 5694560 7381445 6082351 7978885 6285232 7993472 7924169
5262G924169j34421l64816K53388r08836Q98941M65030L1199M63052j405551P76172
$$ 7924169 7789748 7424932 7678320 6769484 7668425 8133455 8164654 8627706 7222155 7998327
5252G998327k58719J790416l524902K069925j638346K39732P4782p77357R88186
$$ 7998327 7739608 9530024 6005122 8075047 6436701 6676433 6751215 5973858 6962044
5243F962044r54012O19575J131478p57127M55621L68322L56765R90546p28430
$$ 6962044 6008032 6627607 7759085 7001958 7457579 7825901 8182666 9173212 8444782
5234H444782j360043J207850l24117m22315J108578J73230J29841L36049J39961
$$ 8444782 7084739 8292589 7968472 7546157 8654735 8827965 8957806 9293855 9433816
5225I433816j22751Q27388J557881j584399J083755j096816K399443O21042q91897
$$ 9433816 9311065 10138453 11696334 10111935 11195690 10098874 12498317 13119359 12227462
5216A2227462k41961K051445n94872l79647K26373j215182R39155j237667q25573
$$ 12227462 11985501 14036946 13442074 13062427 13288800 12073618 13012773 11775106 10949533
5207A0949533q7312k146804J034929j973323J471770l25674j42271L95173n58791
$$ 10949533 10862221 8715417 9750346 7777023 9248793 8923119 8780848 9176021 8617230
5198H617230K05850M69441j252605R17196L63034o45957P54664l29593p52888
$$ 8617230 8823080 9292521 8039916 8957112 9320146 8674189 9428853 9099260 8346372
5189H346372K153795L17749j752978K27808J209525j710814J775715J232944K30820
$$ 8346372 10500167 10817916 9064938 9292746 10502271 8791457 10567172 11800116 12030936
5180A2030936J06794M05980j286523R78752K124245r05651J63134J476336n37745
$$ 12030936 12137730 12543710 11257187 12235939 14360184 13454533 13617667 15094003 14556258
5171A4556258O29278j817454J878877q67775j362768j56691m9475n19215K3418
$$ 14556258 15185536 13368082 15246959 14379184 13016416 12859725 12810250 12291035 12314453
5162A2314453p75478L91735M34059j175285n69637j106310K424036r51459m33884
$$ 12314453 11538975 11930710 12364769 11189484 10619847 9513537 11937573 10986114 10552230
5153A0552230r81233J406487Q93040j547071K22826K147563j136249l05416q20605
$$ 10552230 9570997 10977484 11870524 10323453 10546279 12693842 11557593 11252177 10431572
5144A0431572J441672J424968n74757J328248j814664J014554q14814L65634k61269
$$ 10431572 11873244 13298212 12723455 14051703 12237039 13251593 12436779 12802413 12541144
5135A2541144P68643J145220j264897J901873j12012j722776J548766M6838O94822
$$ 12541144 13309787 14455007 13190110 15091983 14979971 13257195 14805961 14852799 15547621
5126A5547621j285949Q48555M65775j20339j34319O17479j318078K647644p11813
$$ 15547621 14261672 15110227 15576002 15455663 15321344 15938823 14620745 17268389 16556576
5117A6556576M12534O68995K304369j218214J080987K62896R28529L88779m32724
$$ 16556576 16969110 17638105 19942474 18724260 19805247 20068143 20996672 21385451 20952727
5108B0952727J925301j338370K008623O55037N33812K665600J054519n66564Q51254
$$ 20952727 22878028 21539658 23548281 24203318 24737130 27402730 28457249 27890685 28741939
5099B8741939K118501j322030R99571L304280J442939J446932L91169K759034
$$ 28741939 30860440 29538410 30537981 33842261 35285200 36732132 37123301 39882335
5091C9882335J226446M01339q21092l444797k76772k713025k839204m11406j989719
$$ 39882335 41108781 41510120 40689028 37244231 36967459 34254434 31415230 31003824 29014105
5082B9014105k56064o75866J38513P47500J018225J0175J459908j09015K279249
$$ 29014105 28758041 28082175 28220688 28968188 29986413 29996588 31456496 31347481 33626730
5073C3626730j78799J774831J361241j74340K325643J223378K006286J022817
$$ 33626730 33447931 35222762 36584003 36409663 38735306 39958684 41964970 42987787
5065D2987787J261328L575439J182255K962564K765634L978473K402147M141653
$$ 42987787 44249115 47824554 49006809 51969373 54735007 58713480 61115627 65257280
5057F5257280J393287J31359M231207L706605L950234L585506O841405M303045
$$ 65257280 66650567 66781926 71013133 74719738 78669972 82255478 89096883 93399928
5049I3399928O911074L209833k401074m103521p385184o841103o543921n148741
$$ 93399928 100311002 103520835 101119761 97016240 89631056 82789953 76246032 71097291
5041G1097291m721101l679889k684804k335127j270375q41556p15082p40618L05057
$$ 71097291 66376190 62696301 60011497 57676370 56405995 55564439 54849357 54108739 54413796
5032E4413796K14327m83999k29001L919507K435874O30829K396510Q86920M518248
$$ 54413796 54628123 54144124 53915123 57834630 60270504 60901333 63297843 64184763 68703011
5023F8703011K973598K70650J501011J447670M150312L914301N785332M190749
$$ 68703011 71676609 71947259 73448270 74895940 79046252 82960553 88745885 92936634
5015I2936634L120208M300971j124240m475330o297080j0117239m995033o762909
$$ 92936634 96056842 100357813 99233573 94758243 88461163 78343924 73348891 66585982
5007F6585982o442807m299413o291458l634099m468068r95852r14204l209555
$$ 66585982 60143175 55843762 49552304 45918205 41450137 40454285 39540081 36330526
4999C6330526j522601l02656j976959m10581N35379j504790k088443P55381N66247
$$ 36330526 34807925 34505269 32528310 32117729 32653108 31148318 29059875 29815256 30381503
4990C0381503o09714L4695o75700L09988K459962j859453R28589J512450J920733
$$ 30381503 29771789 29806484 29130784 29440772 31900734 30041281 30969870 32482320 34403053
4981C4403053M17678j491024p04588L084446o34764n663K149981L529454j383777
$$ 34403053 34820731 33329707 32625119 35709565 35074801 35069138 37219119 40748573 39364796
4972C9364796L344052R6231m76201M95043o240337k520122k719319l50871k808009
$$ 39364796 42708848 42805079 42328878 42823921 36583584 34063462 31344143 30993272 28185263
4963B8185263j564966k401413N97825j812675j209401L04710J119813j264533
$$ 28185263 26620297 24218884 24816709 23004034 21794633 22099343 23219156 21954623
4955B1954623j990802k00951p40933M54572Q93761l65681p21368L0993j022135
$$ 21954623 19963821 19762870 19021937 19476509 20370270 20004589 19283221 19314214 18292079
4946A8292079r0828k79827K601242j550756N62179j3998q00500O74788J18836
$$ 18292079 18201251 17921424 20522666 18971910 19534089 19520091 18719591 19394379 19513215
4937A9513215k04615J335280o5632k64828j381803K485430j282915N80002P50045
$$ 19513215 19308600 20643880 20578248 20313420 18931617 21417047 20134132 20714134 21464179
4928B1464179M56737k446092J675420O06061M55292J469367l168231K220878j77627
$$ 21464179 21920916 19474824 21150244 21756305 22211597 23680964 20512733 22733611 22555984
4919B2555984q7361J97594Q39426n52091M48383J224546J319068p06212L08901
$$ 22555984 22468623 22666217 23505643 22953552 23401935 24626481 25945549 25239337 25548238
4910B5548238n99976n15063J166151j374371j83349m60663j366226k34141j596240
$$ 25548238 24948262 24433199 25599350 24224979 24041630 23580967 22214741 21980600 20384360
4901B0384360j154783J79599K4110o61702K26867j852398L25094j693951K25747
$$ 20384360 19229577 19409176 19433286 18771584 18998451 17146053 17471147 15777196 16002943
4892A6002943k484155J989508j001922J531844k638885P28919L65805l23286j629334
$$ 16002943 13518788 15508296 14506374 16038218 13399333 14128252 14494057 14170771 12541437
4883A2541437j04533j529500R07412j952648K135419J51937K73837j222104R92897
$$ 12541437 12436904 10907404 11814816 9862168 11997587 12149524 12423361 11201257 12194154
4874A2194154l4268j690946L51381J444492q67067o42159J916456j032947k50825
$$ 12194154 12159886 10468940 10820321 12264813 11397746 10755587 12672043 11639096 11388271
4865A1388271j034761k81751P41165K43801p56873P73189q67322K02082L7990
$$ 11388271 10353510 10071759 10812924 11056725 10299852 11073041 10205719 10407801 10445791
4856A0445791m50629M40012j1156J181833r81345J361295j395090r02240J70061
$$ 10445791 9995162 10435174 10424018 11605851 10624506 11985801 10590711 9688471 9858532
4847I858532j179298L49255K94320J267113L42065n7844j745314L80465j18328
$$ 9858532 8679234 9028489 9322809 10589922 10931987 10874143 9128829 9509294 9390966
4838I390966l12907Q07308p33304J039698J095680o46375r42669R35148r0733
$$ 9390966 9078059 9885367 9152063 10191761 11287441 10641066 9698397 10633545 10542812
4829A0542812j282936J334117m01880R99745o22183M13839n63118p4840M91444
$$ 10542812 9259876 10593993 10192113 11191858 10569675 10983514 10420396 10345556 10837000
4820A0837000r71942o1686K079523n29286L47179j784081J713043m52763n96955
$$ 10837000 9865058 9803372 11882895 11353609 11700788 9916707 11629750 11176987 10580032
4811A0580032K05715J691214K5326j649835m86977K5131P41322K46053Q83869
$$ 10580032 10785747 12476961 12502287 10852452 10365475 10390606 11131928 11377981 12261850
4802A2261850o28481j572702J079370j137492J783014J735357m304603L745497
$$ 12261850 11633369 10060667 11140037 10002545 11785559 13520916 9216313 12961810
4794A2961810k619356J932435M55073j83475R51608j215128P41139M24124m39500
$$ 12961810 10342454 12274889 12729962 12546487 13498095 12282967 13024106 13448230 13008730
4785A3008730R11627j103807o4429n00474q6904P93414j862127r2070N1380n61597
$$ 13008730 13920357 12816550 12752121 12251647 12164743 12958157 11096030 11003960 11055340 10493743
4775A0493743l81970O8664n21443J159052k83690L75274o45593J170848J376351
$$ 10493743 10111773 10180437 9658994 10818046 10534356 10909630 10264037 11434885 12811236
4766A2811236o38665n93760L07753J171551K79847j430431O58786R56108j583759
$$ 12811236 12172571 11578811 11886564 13058115 13337962 11907531 12566317 13522425 11938666
4757A1938666r81370K87534J646740Q05352k143517J97665o18400j918494J633112
$$ 11938666 10957296 11244830 12891570 13696922 11553405 11751070 11132670 9214176 10847288
4748A0847288J57158m12371k033521J77142N4167R3453p32291J660397k128211
$$ 10847288 11004446 10592075 8558554 8735696 8789863 8883316 8151025 9811422 7683211
4739G683211J570890k72502n49853J148821q05576r4840N44947K018202j913142
$$ 7683211 9254101 8981599 8431746 9580567 8774991 8680151 9225098 11243300 9330158
4730I330158n861k66388J076610j914043J784799k449924R14854J233171l84154
$$ 9330158 9324297 9057909 10134519 8220476 10005275 7555351 8470205 9703376 9319222
4721I319222l73426N8976R82643l287930N97594R67180K86696q64946J523312
$$ 9319222 8945796 9004772 9987415 6699485 7297079 8264259 8550955 7686009 9209321
4712I209321n92616n5249o58523L88803K12582J035544j523514P90679K07453
$$ 9209321 8616705 8561456 7902933 8291736 8504318 9539862 8016348 8807027 9014480
4703I014480q91731J174310J184018k855970J602267p46416q25886K094824k027075
$$ 9014480 8122749 9297059 10481077 7625107 9227374 8480958 7655072 9749896 7722821
4694G722821N82359Q6164P83319K09557k6941n90416L53521J737660l430925P79124
$$ 7722821 8305180 8391344 9174663 9384220 9357279 8766863 9120384 10858044 7427119 8206243
4684H206243P81051m37754j218017L30805q32387L63575K461707q58391r60877
$$ 8206243 8987294 8549540 7331523 7662328 6829941 7193516 9655223 8796832 7835955
4675G835955m25201j12117K88122J040679j583940N47610J036354q03221m3700
$$ 7835955 7410754 7298637 7586759 8627438 7043498 7591108 8627462 7824241 7780541
4666G780541J361082j019588n22637K104461j212631J177819o54875r91908j51919
$$ 7780541 9141623 8122035 7599398 9703859 8491228 9669047 9014172 8022264 7870345
4657G870345Q40803o79749l58590j05749o15706J057182j30223p32654J540995
$$ 7870345 8711148 8031399 7672809 7567060 6951354 8008536 7878313 7145659 8686654
4648H686654k077698J027119P20538N3892K89270j241652J555831m46664k05025
$$ 8686654 6608956 7636075 8356613 8410505 8699775 7458123 9013954 8567290 8362265
4639H362265j194092M68562L70851J121051j401114P94506j71815J551326m025423
$$ 8362265 7168173 7636735 8007586 9128637 7727523 8522029 8350214 9901540 5876117
4630E876117Q93313N03338o25428J907587j694171n5617k85604O32695n90996
$$ 5876117 6769430 7272768 6647340 8554927 6860756 6805139 6519535 7152230 6561234
4621F561234J439329o28502l26926j91487N72689l23755P59059j08137j720811
$$ 6561234 8000563 7372061 7045135 6853648 7426337 7102582 7861641 7753504 6032693
4612F032693P85737r05586J556426O48833j458288K60072J420067j332882l97444
$$ 6032693 6818430 5912844 7469270 8118103 6659815 6919887 8339954 7007072 6609628
4603F609628R34390m04820o21131q53729J409473r96061J361477j067540J180466
$$ 6609628 7544018 7139198 6518067 5664338 7073811 6077750 7439227 6371687 7552153
4594G552153j346587m42454J643813j99613j133580M77844m87626J308877p74914
$$ 7552153 6205566 5763112 7406925 7207312 6073732 6551576 6063950 7372827 6597913
4585F597913L88074p23485J129248k49510L29021N74121j664827j530826K385837
$$ 6597913 6985987 6262502 7391750 7142240 7471261 8045382 6380555 4849729 7235566
4576G235566l68395L52769K00937k84656j041558J626906o9063M43973k089124
$$ 7235566 6867171 7219940 7420877 7136221 6094663 7721569 7652506 8096479 6007355
4567F007355J45481J017448M76697o69912J61133L03955j141685J314766l14433
$$ 6007355 6152836 7170284 7646981 6977069 7138202 7442157 6300472 7615238 7300805
4558G300805j749150J416568J749598k186320R68243j040947n27015J219179N36399
$$ 7300805 5551655 6968223 8717821 6531501 7499744 6458797 5931782 7150961 7687360
4549G687360J768585p46291m31256N73019n74544p20052R05132J67375O09639
$$ 7687360 9455945 8709654 8278398 8851417 8276873 7556821 8461953 8629328 9238967
4540I238967j226545L00348M33060j079986J250787j643228L084728j918840m81760
$$ 9238967 8012422 8312770 8745830 7665844 8916631 7273403 10358131 8439291 7957531
4531G957531p1893J368023j37500n90330j017596J308875J43473L26270M874J52366
$$ 7957531 7885638 9253661 9116161 8525831 7508235 8817110 8960583 9286853 9291727 9444093
4521I444093j02826R68733j137029J087495K63129J65242l49452p93132J764960
$$ 9444093 9341267 10310000 9172971 10260466 10523595 10688837 10339385 9546253 11311213
4512A1311213j789007K60861P00781k55992L80968n92907J69118J208284K73392
$$ 11311213 9522206 9783067 10483848 10227856 10608824 10015917 10185035 11393319 11666711
4503A1666711j947605J698616j055117p06040K86224K02077J200950k045352J412359
$$ 11666711 9719106 11417722 10362605 9656565 9942789 10144866 11345816 9300464 10712823
4494A0712823P90465j122821N68078o73289J283471p74094K05432O89850O95741
$$ 10712823 11503288 10380467 10948545 10275256 11558727 10784633 10990065 11679915 12375656
4485A2375656j464164p91935J488422m14908J274344l67174Q633N703N9536J048941
$$ 12375656 10911492 10119557 11607979 11193071 12467415 12100241 12108874 12114577 12174113 13223054
4475A3223054j792578J976099o33233j134743J506019n08482Q15728o33012p99422
$$ 13223054 11430476 13406575 12773342 11638599 13144618 12636136 13451864 12818852 12019430
4466A2019430j110420P23989o57852Q28162K0641R27605r00085O09713K70796
$$ 12019430 10909010 11632999 10975147 11803309 11823950 12751555 11851470 12461183 12731979
4457A2731979n19741k06756J392383j377452K63082q88110P39959J486828R3536
$$ 12731979 12212238 12005482 13397865 12020413 12283495 11395385 12135344 13622172 13715708
4448A3715708j41118N91157n68516k88562p17035l97470J518010Q10122j284355
$$ 13715708 13574590 14165747 13597231 13308669 12591634 12194164 13712174 14522296 13237941
4439A3237941J012257j242826O25375q29674N14532J618827j220934r39506J575342
$$ 13237941 14250198 13007372 13632747 12803073 13317605 14936432 13715498 12775992 14351334
4430A4351334r67781m85316m96905o23984N52330J400079r0692n7086m46801J61191
$$ 14351334 13383553 12898237 12401332 11777348 12329678 13729757 13639065 13581979 13135178 13296369
4420A3296369j7230N92937J845777p10113j178187n12081O92324m46963j469610
$$ 13296369 13279139 13872076 15717853 15007740 13829553 13317472 14009796 13562833 12093223
4411A2093223K847399p22029L18633j135823J711769j295336L08667K14999M15840
$$ 12093223 14940622 14218593 14537226 13401403 15113172 13817836 14126503 14341502 14757342
4402A4757342p96217j308487j6444M42010R58044K4667l64548O91551q21938j705995
$$ 14757342 13961125 12652638 12636194 13078204 14036248 14060915 13696367 14387918 13565980 11859985
4392A1859985K556207q74447j039878l97846R76024K42080k10259k021737L700941
$$ 11859985 14416192 13541745 12501867 12104021 13080045 13322125 13111866 11090129 14791070
4383A4791070j771023J987884p79590J313933j347295k05416K51328K53142r80422
$$ 14791070 13020047 15007931 14228341 15542274 14194979 13989563 14240891 14494033 13513611
4374A3513611J322247j313231J111439q22084j683694N30464M67902j37442k97290
$$ 13513611 14835858 13522627 14634066 13811982 12128288 12658752 13126654 12989212 12691922
4365A2691922M40908J225083p60737P16694l9471j092581R50993j497975O57161
$$ 12691922 13132830 14357913 13597176 14313870 14274399 13181818 14132811 12634836 13291997
4356A3291997J287570K84183j638651J394274J061091N1921j67326J66016K70713
$$ 13291997 14579567 14863750 13225099 14619373 15680464 15732385 15565059 15731075 16001788
4347A6001788N49501j383893K729486l83543j092384O51498Q87470K55832K63982
$$ 16001788 16551289 15167396 17896882 17513339 16420955 17072453 17959923 18215755 18479737
4338A8479737K865699k965685J130911N99959Q39206j578965j755464J356391
$$ 18479737 21345436 18379751 19510662 20110621 20949827 19370862 17615398 18971789
4330A8971789r62788J056760j086909J428817n77703K24137j542932K40157J068074
$$ 18971789 18009001 19065761 17978852 19407669 18829966 19054103 17511171 17751328 18819402
4321A8819402l77971M25169J060541J47324j795492M41007O86711O12735L4292
$$ 18819402 18441431 18866600 19927141 20074465 18278973 18719980 19406691 20019426 20053718
4312B0053718P4265J816986P51872p03876Q69884o74454k42069J60874o9108q30237
$$ 20053718 20127983 21944969 22696841 21992965 22862849 22188395 21946326 22107200 22038092 21207855
4302B1207855q70103M22487r30035k468P99386j32368K087189k65980p85873k72509
$$ 21207855 20337752 20760239 19830204 19827736 20627122 20494754 22581943 22315963 21530090 21257581
4292B1257581M19732p94927j009368J955926r75434M9418l21482j132658J558260
$$ 21257581 21677313 20882386 19873018 21828944 20853510 20902928 20581446 19448788 21007048
4283B1007048J682541k51069k94172j11924j125504J124478j10202l82111J523054
$$ 21007048 22689589 22438520 22144348 22032424 20906920 22031398 21921196 21539085 23062139
4274B3062139n33248K36663J021786j424478J265703P86643j215204K093952J57820
$$ 23062139 22528891 22765554 23787340 22362862 23628565 24415208 23200004 25293956 25451776
4265B5451776K10218L45148j948791J153568M95840k710635m78079K069195j093859
$$ 25451776 25661994 26007142 24058351 25211919 25707759 22997124 22519045 24588240 23494381
4256B3494381J01126k39891N2970p06529o0016j099338J825348j700945j457517
$$ 23494381 23595507 23355616 23408586 22702057 22642041 21542703 23368051 21667106 20209589
4247B0209589J249504K099446q52598n62599o7285K10434q570p15618O7017J102037
$$ 20209589 21459093 23558539 22705941 22143342 22076057 22286491 22277921 21562303 21629320 22731357
4237B2731357l159552K991625j27306r87717k91475J58349j293528K24130J382564
$$ 22731357 19571805 22563430 22436124 21448407 21156932 21315281 20021753 20245883 21628447
4228B1628447R16021M83062j227137Q81639o72934j281978Q36585L75107m62944
$$ 21628447 22544468 23027530 21800393 22682032 22009098 20727120 21563705 21938812 21475868
4219B1475868j49054r92800J226112o02865J523998j344186J940925r11223j150995
$$ 21475868 21326814 20334014 21560126 20957261 22481259 21137073 23077998 22166775 21015780
4210B1015780J524666j0466p05225O94702q51780j703500o44227K149553q01709
$$ 21015780 22540446 22529980 21824755 22519457 21667677 19964177 19319950 21469503 20667794
4201B0667794N78639L51449l00129Q73909j096244n55038o82346K309036l67836
$$ 20667794 21246433 21597882 21297753 22171662 21075418 20520380 19838034 22147070 21779234
4192B1779234n08786p02360J134330l55567j41576p51323P83223J511812j006270
$$ 21779234 21270448 20568088 21702418 21346851 21205275 20453952 21237175 22748987 21742717
4183B1742717j346693M182304k945122N46066n85190M13770R34017k030002R4014
$$ 21742717 20396024 24578328 21633206 22179272 21594082 22007852 22941869 20911867 21005881
4174B1005881j81036J551616j177765L2455P47439K215370j959528R54915o48763
$$ 21005881 20824845 22376461 21198696 21231151 21978590 24193960 22234432 23189347 22540584
4165B2540584l13836J563787P22059J17359n45457M79968L78546j57194N81560
$$ 22540584 22226748 23790535 24512594 24629953 24084496 24564464 24943010 24785816 25367376
4156B5367376k91064J840406M93524o02441k009578j273965J845110j296303l69467
$$ 25367376 25076312 26916718 27410242 26807801 24798223 23524258 25369368 24073065 23703598
4147B3703598M092j035276K01152j082558R29695j235439J75057J165035o49164
$$ 23703598 23707690 22672414 22873566 21791008 22720703 21485264 21660321 22825356 22176192
4138B2176192J620088l53146N71159o53975J67482j98807m39463J075039L06511
$$ 22176192 23796280 23443134 24014293 23360318 23527800 23328993 22889530 23964569 24271080
4129B4271080P18960K03472Q03315J54227N66434O44101J004444o81085J213742
$$ 24271080 24990040 25193512 25996827 26151054 26717488 27361589 28366033 27684948 28898690
4120B8898690K44483R60926O34288K59233K843954M33J064468J766442o26482
$$ 28898690 29143173 30104099 30738387 30997620 33841574 33842007 34906475 36672917 36046435
4111C6046435L079862m82829J030163J328944M3194O40499J300564R65671Q81243
$$ 36046435 39126297 38643468 39673631 41002575 41045769 41686268 42986832 43952503 44833746
4102D4833746K120706J275874J16142J441250n19512K819913L739638L013764
$$ 44833746 46954452 48230326 48346468 49787718 49268206 52088119 55827757 58841521
4094E8841521J176202L081623Q70806k552284k800787o545780j501211m844164
$$ 58841521 60017723 63099346 63970152 61417868 58617081 52071301 50570090 45725926
4086D5725926n54181k342294j564167o52984j610558k38949l01334j027386n68366
$$ 45725926 45171745 42829451 41265284 40612300 39001742 38762793 38461459 37434073 36865707
4077C6865707J257199l51865J055666J913702O3409J116266P73095M32996K019930
$$ 36865707 38122906 37771041 38826707 40740409 40803818 41920084 42693179 43126175 45146105
4068D5146105K568144L97641J10311L118293K195731J312940J582155L995986
$$ 45146105 47714249 48111890 48222201 51340494 53536225 54849165 56431320 60427306
4060F0427306J854631K628021M202832K447830K629623J148951J473353J653329
$$ 60427306 62281937 64909958 69112790 71560620 74190243 75339194 76812547 78465876
4052G8465876N528006P176602N256629N535332M749007J652336n150152m699199
$$ 78465876 83993882 91170484 96427113 101962445 106711452 108363788 103213636 98514437
4044I8514437j0138243o741114o027816n602611n365685l481696l165755l699319
$$ 98514437 88376194 81635080 75607264 70004653 64638968 61157272 57991517 54292198
4036E4292198k223362r89459l176658j142625n71723j100783J137002k879431
$$ 54292198 52068836 51079377 47902719 46760094 46188371 45087588 46224590 43345159
4028D3345159j9030m23005j123778M66997R90127j169361O40661J194498o78062
$$ 43345159 43326129 42903124 41779346 42246343 43236470 42067109 42707770 43902268 43224206
4019D3224206J60568J470180m21290n3037o3896k47905K037885J370008Q11851
$$ 43224206 43384774 44854954 44433664 44380627 44316731 44068826 46106711 47476719 48288570
4010D8288570N96611J00695J019140J254984J123925Q2382J43120J461690N74168
$$ 48288570 48885181 48985876 50005016 51260000 52383925 52466307 52609427 54071117 54645285
4001E4645285J482383J72825J808678K279255J188545l77818L587873J118503
$$ 54645285 56127668 56300493 58109171 60388426 61576971 61199153 64787026 65905529
3993F5905529K635796J811668J694704J393819M063056K580892J638249K113864
$$ 65905529 68541325 70352993 72047697 73441516 77504572 80085464 81723713 83837577
3985H3837577M207315K956290M734398L505346L738713N127099K853935O805378
$$ 83837577 88044892 91001182 95735580 99240926 102979639 108106738 110960673 117766051
3977A17766051L839601L716254P210606P941444N541736P808337L507070r76208
$$ 117766051 121605652 125321906 132532512 140473956 146015692 153824029 157331099 156354891
3969A56354891N7148k990110k698813n448098l995769k666601l189850j756916
$$ 156354891 156412039 153421929 150723116 145275018 141279249 138612648 135422798 133665882
3961A33665882r49378p52985p09950M3340R02940m81154J630663R33142j917563
$$ 133665882 132716504 131963519 131253569 131296909 132199849 131718695 133349358 134282500 132364937
3952A32364937K718137k54362O84455l73565J825153M20215L216744K09709J307592
$$ 132364937 135083074 134828712 135513167 135139602 136964755 137384970 140601714 140811423 142119015
3943A42119015K678411K108245M053976L265398K181808M303056L099344M386293
$$ 142119015 144797426 146905671 150959647 154225045 156406853 160709909 163809253 168195546
3935A68195546L318407N573665N133490O283723M590242Q516168N477859Q267190
$$ 168195546 171513953 177087618 182221108 188504831 193095073 201611241 207089100 215356290
3927B15356290M350671M366756p79252o25800k248738m291277m590507m965105
$$ 215356290 219706961 224073717 223294465 222668665 220419927 216128650 211538143 206573038
3919B06573038p654381m690855n005769p211283k577218n381206l895299m508978
$$ 206573038 198918657 194227802 189222033 182010750 179433532 174052326 170157027 165648049
3911A65648049l944458k281821m043742l310393q58974j102804j887128p11817
$$ 165648049 161703591 159421770 155378028 152067635 151208661 150105857 148218729 147506912
3903A47506912l35171j057487L51874R83099P99622o4724J861219J150557j914829
$$ 147506912 147171741 146114254 146466128 147449227 148248849 148184125 150045344 151195901 149281072
3894A49281072J327323j164639o39048q25998l786360j474274j533875l950848
$$ 149281072 150608395 149443756 148804708 147978710 144192350 142718076 141184201 137233353
3886A37233353j407706m319781l482391k697155m220771k572499m376470m569445
$$ 137233353 135825647 131505866 128023475 125326320 121105549 118533050 114156580 109587135
3878A09587135k879691k712077l952061k518380k459797j883042j952217j829753
$$ 109587135 106707444 103995367 100043306 97524926 95065129 93182087 91229870 89400117
3870H9400117l189933q4315r91710j878097k26332j767374j990772N63068k79951
$$ 89400117 86210184 86125869 85134159 83256062 83029730 81262356 79271584 79834652 79554701
3861G9554701L95830j509229N47844q75014L7587O59041n77109k381707o07898
$$ 79554701 79950531 78441302 78989146 78114132 78151719 78810760 78233651 75851944 75244046
3852G5244046j876338J062201k286745j152287j631497J99791k174753r86229
$$ 75244046 73367708 74429909 72143164 70990877 69359380 69559171 67384418 66398189
3844F6398189q15308j350950L91590o55584k630337J283940k107204J804691n34351
$$ 66398189 65582881 64231931 64623521 63967937 61337600 62621540 60514336 62319027 61784676
3835F1784676j303399o59121K03958O30662p2067M98311N12277j490182L84382
$$ 61784676 60481277 59822156 60026114 60656776 60584709 61083020 61595297 60105115 60489497
3826F0489497J209135L43972n47382j21395K037379J093732j089781J566296j32046
$$ 60489497 61698632 62042604 61495222 61373827 63411206 64504938 63415157 64981453 64849407
3817F4849407K396876k97930J267656J728801J420590P15413J425667J541326
$$ 64849407 67246283 66948353 68216009 69944810 71365400 72080813 73506480 75047806
3809G5047806K073825l79974K970827K055904K592303K027987J355402J729743
$$ 75047806 77121631 76741657 79712484 81768388 84360691 86388678 87744080 89473823
3801H9473823N08892N401297K172899K907727R04569M083908L059288K586694
$$ 89473823 89982715 95384012 97556911 100464638 101369207 105453115 108512403 111099097
3793A11099097L324463J818910K311218K857041M396506K062262N6537L736503
$$ 111099097 114423560 116242470 118553688 121410729 125807235 127869497 127926034 131662537
3785A31662537P89528K307065R81043K301989J032271J341069K319112K250669
$$ 131662537 132452065 134759130 135740173 138042162 139074433 140415502 142734614 144985283
3777A44985283M01453K194708J662281K052188J048709J927704K407696K430817
$$ 144985283 145386736 147581444 149243725 151295913 152344622 154272326 156680022 159110839
3769A59110839r01927K12657m31280J470299j233261j258554k167009j939763
$$ 159110839 158208912 158421569 157990289 159460588 158227327 156968773 154801764 152862001
3761A52862001k222497m321683l368896l391190j388552l555511l868531j595888
$$ 152862001 150639504 146317821 142948925 139557735 138169183 134613672 130745141 129149253
3753A29149253k398450k079286k169771q49864k530177n02634k297201j055591
$$ 129149253 126750803 124671517 122501746 121651882 119121705 118619071 116321870 115266279
3745A15266279j775673j534466M25026m712881o66197j397966l527880L07927
$$ 115266279 113490606 111956140 112381166 107668285 107002088 105604122 102076242 102384169
3737A02384169n528033j249537k610606k076815k638974n607521L10437k427441
$$ 102384169 96856136 95606599 92995993 90919178 88280204 82672683 82983120 80555679
3729H0555679k905026k73743l694200r98083j181698p00080j215394k393149l23234
$$ 80555679 77650653 77376910 73682710 72684627 71502929 70802849 69587455 67194306 66871072
3720F6871072j736513r71826N70197k075883k651453n30246J187643J66913j736667
$$ 66871072 65134559 64162733 64732930 62657047 60005594 59475348 60662991 60829904 59093237
3711E9093237j140937m54430j3966j026991K309929j341622N08018n18050j158809
$$ 59093237 57952300 57497870 57483904 56456913 58766842 57425220 57933238 57415188 56256379
3702E6256379J103555k900295J212460O99092Q8120J929539k814603J000585R69260
$$ 56256379 57359934 54459639 55672099 56371191 56459311 58388850 55574247 56574832 57544092
3693E7544092N83868L56983J921557R02573j573638J861643J383498N18147J974623
$$ 57544092 58127960 58484943 60406500 61309073 59735435 61597078 62980576 63498723 65473346
3684F5473346L483266j032852J513960K703971K306728J844050K535603J761808
$$ 65473346 68956612 67923760 69437720 72141691 74448419 76292469 78828072 80589880
3676H0589880L087642L657124M48815K017466J766539L497203K595712J549730
$$ 80589880 83677522 87334646 87783461 89800927 91567466 95064669 97660381 99210111
3668I9210111o7548l30159J337402o43423J472667j263186P47985j468784K361223
$$ 99210111 99142563 98812404 100149806 99506383 100979050 99715864 100463849 98995065 101356288
3659A01356288j069380K452828J03597K70279K377182J083474K276330L393737
$$ 101356288 100286908 102739736 102843333 103113612 105490794 106574268 108850598 112244335
3651A12244335K728342L658184R45552L563923M114688K419832M452803K274617
$$ 112244335 114972677 118630861 119576413 123140336 127255024 129674856 134127659 136402276
3643A36402276L640202L111193N22213K04609J583594O53831l673301j595867
$$ 136402276 140042478 143153671 143675884 143880493 145464087 146117918 142444617 140848750
3635A40848750k870221l761808m241863k651427l553114k755379l427581j694057
$$ 140848750 137978529 134216721 129974858 127323431 123770317 121014938 117587357 115893300
3627A15893300k359718p66809j868598k338536R59123J01098L96141N04401q65959
$$ 115893300 113533582 112766773 110898175 108559639 109518762 109619860 110016001 110520402 109654443
3618A09654443Q38691M71523p46015P30538J315312p9689j152888O71385j430265
$$ 109654443 110493134 110964657 110218642 110949180 112264492 112184803 111031915 111703300 110273035
3609A10273035m39229k617767j058914l853624l803110k881176l416415l971107
$$ 110273035 109833806 107216039 106157125 102303501 98500391 95619215 92202800 88231693
3601H8231693j951383j732036n143341k899219j194953j550239j230824k146827
$$ 88231693 86280310 84548274 79404933 76505714 75310761 73760522 72529698 70382871
3593G0382871k891409L38657k029613j092151p11231k962283J134222j874991
$$ 70382871 67491462 67830119 65800506 64708355 63997124 61034841 62169063 60294072
3585F0294072k680176m86018j069317J08416p39468k354192M30952J74935k11674
$$ 60294072 57613896 57127878 56058561 56166977 55427509 53073317 53504269 53679204 53467530
3576E3467530k042529J51091M8980o04729j467072k61900J48593n18189n11546
$$ 53467530 51425001 51576092 51625072 51020343 49553271 49291371 49439964 48921775 48410229
3567D8410229j295903J131814O24808o27194j667541Q3197l05502O79640l65474
$$ 48410229 47114326 48246140 48870948 48243754 46576213 46659410 46353908 47033548 46668074
3558D6668074j738211P85460K18260m73944o79804j28174K09538j623077J26326
$$ 46668074 44929863 45715323 45933583 45459639 44779835 44651661 44861199 43238122 43364448
3549D3364448O02743K62760p97909L06833L65389j704687Q21478P04057p62462
$$ 43364448 43967191 44229951 43432042 43738875 44104264 42399577 43221055 43925112 43162650
3540D3162650k03410J207891p11178j460520l29585N45087l60536J581210k99435
$$ 43162650 42959240 44167131 43455953 41995433 41665848 42210935 41850399 43431609 43132174
3531D3132174j786536M84414J46498R13352r99947N15787p83819o52255N04289
$$ 43132174 41345638 41830052 41976550 42889902 41889955 42405742 41621923 40969668 41473957
3522D1473957J1013q40999j51480j84j166647J0891J03454j355370M14344L9877
$$ 41473957 41484970 40643971 40492491 40492307 39325660 39336551 39440005 38084635 38498979 38538856
3512C8538856k62087j736307O51438O67290l631l68663n51777p68307J739227
$$ 38538856 38276769 36540462 37191900 37859190 37855559 37486896 36935119 36166812 37906039
3503C7906039j896244K102385j005589m84084J243596j141731n90293J658554
$$ 37906039 36009795 38112180 37106591 36622507 37866103 36724372 36134079 37792633
3495C7792633j99881m35202J666270N1732p85887N53454J375432p08767P87870
$$ 37792633 37592752 37157550 38823820 38875552 38089665 38643119 40018551 39309784 40097654
3486D0097654K96943J287758J271970R7570P83041Q88582J132488j227800O27480
$$ 40097654 40394597 41682355 42954325 43051895 43834936 44723518 45856006 44628206 45255686
3477D5255686j18196M96204m26357k50514n06435L21698j64940K63331j713837
$$ 45255686 45137490 45633694 45207337 44956823 44450388 44772086 44607146 44870477 43156640
3468D3156640L506040j863371K518435J285884P41837J964218J224745R63643
$$ 43156640 46662680 44799309 47317744 48603628 49345465 51309683 52534428 53498071
3460E3498071N72870N27061M058806J694724J933266J952163J127436K801642
$$ 53498071 54070941 54598002 58656808 60351532 62284798 64236961 65364397 68166039
3452F8166039L338231K708016P21631K997524L338942K670511J203571M582330
$$ 68166039 71504270 74212286 74933917 77931441 81270383 83940894 85144465 89726795
3444H9726795K652356K238829K401256K334202P25218N341962j53450N43954K844220
$$ 89726795 92379151 94617980 97019236 99353438 100078656 105420618 105267168 105811122 108655342
3435A08655342L017035P73748J713463J577402Q97907K929763K733252K932601
$$ 108655342 111672377 112446125 114159588 115736990 116634897 119564660 122297912 125230513
3427A25230513J859447K241913N719037K933733K641185R88800K698665K912348
$$ 125230513 127089960 129331873 135050910 137984643 140625828 141614628 144313293 147225641
3419A47225641R5288K382670p74910O19547k39053j835943k132596k322538k646798
$$ 147225641 147320929 149703599 148928689 149548236 149309183 147473240 145340644 143018106 140371308
3410A40371308l169479l209992j051289l729693r7949l633316j144789l007449
$$ 140371308 137201829 133991837 132940548 129210855 129112906 125479590 124334801 121327352
3402A21327352j126435k79131l258264k119943j496247j113785j296004j736208
$$ 121327352 120200917 119921786 116663522 114543579 113047332 111933547 110637543 108901335
3394A08901335m006404k415139l085864k858172k286479l443637k034606l874939
$$ 108901335 104894931 102479792 99393928 96535756 94249277 90805640 88771034 84896095
3386H4896095l402396n07849k250799l356410k875807o81978k327389j030870
$$ 84896095 81493699 80985850 78735051 75378641 72502834 71820856 69493467 68462597
3378F8462597q89164k319399j550575k27309k700423M7210o26683M51985k829057
$$ 68462597 67573433 65254034 63703459 63476150 60775727 60822937 60196254 60648239 57819182
3369E7819182K47947j32399j68726k35194k764249J142673k251676r77590l12211
$$ 57819182 58067129 57934730 57766004 57530810 54766561 55909234 53657558 52679968 52367757
3360E2367757N8354j93577j469379P5408o42839K148256j998332j584634j05191
$$ 52367757 52426111 52232534 50763155 50838563 50195724 52343980 50345648 48761014 48655823
3351D8655823J627608j161356q27087L8044R52138p45920m41552r19536L9312
$$ 48655823 50283431 49122075 48294988 48333032 49285170 48539250 48097698 47178162 47217474
3342D7217474k76755k49079N20854j987409O22690k63888J190379j175513j98542
$$ 47217474 46940719 46691640 47212494 45225085 45847775 45583887 46774266 45598753 45400211
3333D5400211j684471R71682L61911j227103J134570J346056j262499p17245n72878
$$ 45400211 43715740 44687422 45049333 43822230 44956800 46302856 45040357 44323112 43750234
3324D3750234k26847M22206M45102p26255j252631o14691o88072M43932Q23665
$$ 43750234 43523387 43945593 44390695 43664440 42411809 41797118 41109046 41552978 42376643
3315D2376643r75991m10551j214966j15375k70284j082380J149609j118894k39927
$$ 42376643 41400652 40990101 39775135 39659760 39389476 38307096 39456705 38337811 38097884
3306C8097884n49979p4247P40200j900613P77757k037234R20703M52318j216277
$$ 38097884 37547905 37473658 38213858 36313245 37091002 35053768 35974471 36426789 35210512
3297C5210512Q74436k693408J828335J96012Q2244k856151Q2327j500823M67412
$$ 35210512 36084948 33391540 35219875 35415887 35498131 32641980 32724307 31223484 31690896
3288C1690896j84156K66738J490869k530117j09289j192074M91827j611816J203676
$$ 31690896 31506740 31773478 33264347 30734230 30624941 29432867 29924694 28312878 29516554
3279B9516554N67396j757901J245418k051831J430657J162858j44923j908231
$$ 29516554 30083950 28326049 29571467 27519636 28950293 30113151 29968228 28059997
3271B8059997L12496R9237J469815j827335M87393J339240r15894k641M6597M00361
$$ 28059997 28372493 28471730 29941545 28114210 28601603 29940843 29024949 29022308 29068905 29469266
3261B9469266R35586j368434m45603J756598j487171m2400N67611l81436K01527
$$ 29469266 30404852 29036418 28590815 30347413 28860242 28817842 29385453 29004017 29205544
3252B9205544Q31656p85718K34640R64236O7027J010446r89273m55226J400646
$$ 29205544 30037200 29251482 29486122 30450358 30517385 31527831 30538558 30083332 31483978
3243C1483978p63522K55821J484960j426191L22244J81022l26262J412912k19165
$$ 31483978 30720456 30976277 32461237 31035046 31357290 31538312 31212050 32624962 32405797
3234C2405797k25643J25443j133356K460828L04591j511996N10888O38220J11679
$$ 32405797 32180154 32305597 31172241 33633069 33937660 32425664 32936552 33574772 33686451
3225C3686451o6089N33360J05215K257618j318088J592248P09752j14304J619907
$$ 33686451 33620362 34153722 34258937 36516555 35198467 36790715 37500467 37386163 39006070
3216C9006070r58705k88649J350786j20479O17625J342525J295586r7339J413754
$$ 39006070 38047365 37758716 39109502 38989023 39606648 40949173 42244759 42147420 43561174
3207D3561174J643986L24776K55318K319995M97798L31712K22270J089516L743433
$$ 43561174 45205160 45529936 45785254 48105249 48603047 48934759 49157029 50246545 53989978
3198E3989978j84659J428453k93186L269658K002166P92238J601317J192281J016838
$$ 53989978 53805319 55233772 54940586 58210244 60212410 61004648 62605965 63798246 64815084
3189F4815084K001381j50414K866816K074897J055636L16524L233861m0780J393834
$$ 64815084 66816465 66666051 69532867 71607764 72663400 72979924 76213785 76173005 77566839
3180G7566839J108065J066326J626051K536882k5452k70825L411920J948850J514837
$$ 77566839 78674904 79741230 81367281 83904163 83878711 83607886 87019806 88968656 90483493
3171I0483493L542018J313101J2904N469233L224671O18398M632040L547341K391795
$$ 90483493 94025511 95338612 95351516 100820749 104045420 104663818 109295858 112843199 115234994
3162A15234994L158494M288503J823421L260170M819279J038752J894093K721957
$$ 115234994 118393488 122681991 124505412 127765582 132584861 133623613 135517706 138239663
3154A38239663J522120n48932q22603J305897J838498K26764J36301O67954M02200
$$ 138239663 139761783 139212851 138390248 139696145 141534643 141761407 141897708 142565662 142967862
3145A42967862K328096J677248K362161K690883M108777N519769N837098O448700
$$ 142967862 145295958 146973206 149335367 152026250 156135027 161654796 167491894 173940594
3137A73940594O563880J0074780R684916O384271R627894N318594L416619N576399
$$ 173940594 180504474 190579254 200264170 206648441 216276335 221594929 225011548 230587947
3129B30587947N892639J1948962J0097498J1545640J0266359M478790N870009
$$ 230587947 236480586 248429548 258527046 270072686 280339045 284817835 290687844
3122B90687844R228411J3012330M193267p218312k702084J6253551L8845016L7253791
$$ 290687844 299916255 312928585 317121852 309903540 307201456 323455007 362300023 399553814
3114C99553814K0469190J7994987j4598482k1285970l5095129m4234804l5341159
$$ 399553814 420023004 438017991 423419509 402133539 367038410 322803606 287462447
3107B87462447k7992745k4461777j6312999j3583973j4405232q904892q141125
$$ 287462447 259469702 235007925 218694926 205110953 190705721 181800829 173659704
3100A73659704p351047n369180n646107l387331m597211m698743o234549l354475
$$ 173659704 166308657 160939477 155293370 151906039 147308828 142610085 136375536 133021061
3092A33021061m990986n624506m398209l540591m737031l370598k415888k694334
$$ 133021061 128030075 122405569 118007360 114466769 109729738 106359140 103943252 101248918
3084A01248918m065336r85006j313496m002922j477005j052206k340959k21152
$$ 101248918 97183582 96198576 94885080 90882158 89405153 88352947 86011988 85790836
3076H5790836l178679r54314J558051k415437l06924k192648J095786k330080
$$ 85790836 82612157 81657843 83215894 80800457 80493533 78300885 79396671 77066591
3068G7066591K125029k902023N00569M58560P59329j019097j520306K119932l58929
$$ 77066591 79191620 76289597 76790166 77248726 78008055 76988958 75468652 77588584 77229655
3059G7229655J931252M92394p62971K084743N90621O31464K892582J576208o16330
$$ 77229655 79160907 79653301 78890330 80975073 81565694 82197158 85089740 86665948 86049618
3050H6049618L232480J948467K419606M319366K837541M729148J152991J0672538
$$ 86049618 89282098 91230565 93650171 97969537 100807078 105536226 106689217 117361755
3042A17361755R525360P752600J18033l886582o391567o879880o598741j0095920
$$ 117361755 126887115 134639715 134757748 130871166 124479599 117599719 111000978 100905058
3034A00905058r859307o890903p218560o049109m990638l021749l191100m877943
$$ 100905058 91045751 84154848 76936288 70887179 65896541 62874792 59683692 54805749
3026E4805749j730412L94936k746628j777761j504132m22489j552277J212786
$$ 54805749 53075337 53470273 50723645 48945884 47441752 47019263 45466986 46679772
3018D6679772k101621k488346J420353j036976n81847P76705J563781j204894
$$ 46679772 44578151 42089805 43510158 42473182 41891335 42668040 44231821 43026927
3010D3026927j489245Q96598k150666o21803k504783j573434q17263J82536N67712
$$ 43026927 41537682 42434280 40283614 39661811 37157028 35583594 34766331 34948867 35516579
3001C5516579j956794r4857L50309j818130K902340j201146r35955r75914P50661
$$ 35516579 33559785 33464928 33815237 31997107 34899447 33698301 32762346 31786432 32537093
2992C2537093k50016L08366o35572k5849o90414j555533K156307r75811j098317
$$ 32537093 32287077 32595443 31959871 31934022 31243608 29688075 31844382 30868571 29770254
2983B9770254Q26350J394078j163721j475656J071995j334752J355963o52924
$$ 29770254 30596604 31990682 30826961 29351305 30423300 29088548 30444511 29791587
2975B9791587o50208K065994r32495p48654j38628l38957R97320m33573K207516
$$ 29791587 29141379 31207373 30274878 29526224 29387596 29048639 30045959 29612386 31819902
2966C1819902k92916k130683J158733n09947j43227L1871J026278q6444J30773
$$ 31819902 31526986 29396303 30555036 30045089 29901862 29933733 30960011 30873567 31004340
2957C1004340p06145J584255r84724R91770q29378J509325l44953J101346r2020
$$ 31004340 30298195 31882450 30897726 31889496 31060118 32569443 32224490 33325836 33233816
2948C3233816p15649N36734j041910L081714j252652n18316p51103J957338m3772
$$ 33233816 32518167 33054901 32012991 35094705 33842053 33323737 32572634 34529972 34486200
2939C4486200P20629j67073R08949l88984J864239J511850k467821K136428J075455
$$ 34486200 35206829 35039756 35948705 35559721 37423960 38935810 36467989 38604417 39679872
2930C9679872l99351P98746J583984P86907j62773J659412K075299r09372j59892
$$ 39679872 39280521 40079267 41663251 42450158 42287385 43946797 46022096 45112724 44952832
2921D4952832M39839K514736J080622J004327P94537Q40668J817872K103891m42880
$$ 44952832 45392671 47907407 48988029 49992356 50786893 51627561 53445433 55549324 55106444
2912E5106444J265691K666838J351491L426012P20893N27851L004887J954543
$$ 55106444 56372135 59038973 60390464 63816476 64537369 65065220 68070107 70024650
2904G0024650K067681K063622M79763K330157K694892L030517K389326J053675
$$ 70024650 72092331 74155953 74635716 76965873 79660765 82691282 85080608 86134283
2896H6134283L186087J470853K687862K358908K947350J631331L398976K490851
$$ 86134283 89320370 90791223 93479085 95837993 98785343 100416674 103815650 106306501
2888A06306501K180056K417383K530391K272101N167385K303109J556272L139544
$$ 106306501 108486557 110903940 113434331 115706432 120873817 123176926 124733198 127872742
2880A27872742L601590K730137L143254K002112N946649J479965J477231L985398
$$ 127872742 131474332 134204469 137347723 139349835 145296484 146776449 148253680 152239078
2872A52239078J466577M697939L871325K603989M371410L696052L615219K808136
$$ 152239078 153705655 158403594 162274919 164878908 169250318 172946370 176561589 179369725
2864A79369725M115713J618335M855534K812325M784565K832244L027686L216564
$$ 179369725 183485438 185103773 189959307 192771632 197556197 200388441 203416127 206632691
2856B06632691J836815M165897L464092N306755K935021M463747O026660J925569
$$ 206632691 208469506 212635403 216099495 221406250 224341271 228805018 234831678 236757247
2848B36757247N614308K988671N489209L712038K168154M036936O03105J736248
$$ 236757247 242371555 245360226 250849435 254561473 256729627 260766563 261369668 263105916
2840B63105916R12452P95905r6387k532181J187773j975802k497985L31196j755294
$$ 263105916 264018368 264814273 264717886 262185705 263373478 261397676 258899691 259230887 257475593
2831B57475593r20707k759133k082910q49250k162573o98911l927380J8592l184834
$$ 257475593 256554886 253795753 251712843 250863593 248701020 248002109 244074729 244093321 240908487
2822B40908487j867192l602598k328259m144417m735651l131560m829714n930594
$$ 240908487 239041295 235438697 233110438 228966021 224230370 221098810 216269096 210338502
2814B10338502p394979p855384k803078p527132n090282n542227l545359o818458
$$ 210338502 202943523 195088139 192285061 184757929 179667647 174125420 170580061 163761603
2806A63761603k129198o350490o41418m256407n185981l325824l775271j759412
$$ 163761603 161632405 155281915 154640497 150384090 145198109 141872285 138097014 136337602
2798A36337602k874424m046644k417914k409599l763320m663372j593533m419491
$$ 136337602 133463178 129416534 126998620 124589021 120825701 116162329 114568796 110149305
2790A10149305k317951j508722m180680k507038m036704j921352j469623l130459
$$ 110149305 107831354 106322632 102141952 99634914 95598210 93676858 92207235 89076776
2782H9076776j887351k737301j122682l765448o97443l319360N67215j588972
$$ 89076776 87189425 84452124 83329442 79563994 78866551 75547191 76114406 74525434
2774G4525434j969725k122743j761405j207553k599855j075161j428345N79987
$$ 74525434 72555709 70432966 68671561 67464008 64864153 63788992 62360647 62940634
2766F2940634l174033q77032m53022k477663q52313k199327R12411k314522Q44800
$$ 62940634 59766601 58889569 58436547 55958884 55106571 52907244 53819655 51505133 52349933
2757E2349933j642540j942229o19260k389632j64497J461535k108474j600527
$$ 52349933 50707393 48765164 48145904 45756272 45591775 47053310 44944836 43344309
2749D3344309p04665r8517j092592l36254l48839k502853q61460J001595m98890
$$ 43344309 42639644 42541127 41448535 41112281 40763442 38260589 37399129 38400724 37901834
2740C7901834r49695J153508j405480j99137K57018r04515q91136N67591J25198
$$ 37901834 36952139 38105647 36700167 36501030 36758048 35853533 34962397 35529988 35655186
2731C5655186l77206M0301L99697j384469l53130j06752J44570l84913m76400
$$ 35655186 35277980 35318281 35717978 34333509 33980379 33873627 34018197 33633284 33156884
2722C3156884L81473j78961p8437j716854J591276l12388m88360J157865j437796
$$ 33156884 33538357 33359396 33280959 31564105 33155381 32842993 32354633 33512498 32074702
2713C2074702J37674j111548Q08195J68696J32760K14702m95875J457448j341903
$$ 32074702 32212376 31100828 31909023 32077719 32210479 32425181 31929306 33386754 32044851
2704C2044851l99035L62975J13404J144363k98162J567544j070377k2877n71898
$$ 32044851 31645816 32008791 32122195 33266558 32968396 34535940 33465563 33442686 32870788
2695C2870788J089944m35694M25217O31439j016886J868839K298076j422532j49923
$$ 32870788 33960732 33525038 33950255 34581694 33564808 35433647 37731723 36309191 36159268
2686C6159268m88239K746829Q24681j731541N78969m54449N76823O55849Q14936
$$ 36159268 35671029 38417858 39242539 37510998 38089967 37635518 38212341 38868190 39683126
2677C9683126J185699P40446Q4683k68212J828392K31956P74763O96281J946467
$$ 39683126 40868825 41609271 41693954 41425742 43254134 43486090 44260853 44957134 46903601
2668D6903601R94889p0494K141994J337804J956753K469328M90988L813589P64719
$$ 46903601 47898490 47827996 49969990 51307794 53264547 55733875 56224863 60038452 60803171
2659F0803171K677680L454542J411652L498224L497270M474161K757625L489275
$$ 60803171 63480851 66935393 68347045 71845269 75342539 79816700 82574325 86063600
2651H6063600O144183M970262N520270N645444O566249P551129R516300Q768054
$$ 86063600 92207783 97178045 102698315 108343759 114910008 122461137 131977437 140745491
2643A40745491Q691624O128885Q008357O369359P577901O155524R197028P993205
$$ 140745491 149437115 155566000 163574357 169943716 177521617 183677141 192874169 200867374
2635B00867374R180392R844005J0010907J0715324J1209201J1112862R850434
$$ 200867374 210047766 219891771 229902678 240618002 251827203 262940065 272790499
2628B72790499J0327499J0695876J8891034K1057817J8253193J1060792M317805
$$ 272790499 283117998 293813874 312704908 333762725 352015918 363076710 367394515
2621C67394515p932948j7107607k1967594k8301291k6436567k8299051k3589977
$$ 367394515 359461567 342353960 320386366 292085075 265648508 237349457 213759480
2614B13759480k1203536j9036859j5481774j3728957j0314755j0402921r551954
$$ 213759480 192555944 173519085 158037311 144308354 133993599 123590678 114038724
2607A14038724o389978p141765m612433m975760l876667j556610m245292k936706
$$ 114038724 107648746 100506981 95894548 90918788 87042121 85485511 81240219 78303513
2599G8303513j322356o49147k559250k01860k840483L4108J160532k351897J876972
$$ 78303513 76981157 76332010 73772760 73570900 70730417 70764525 71925057 69573160 71450132
2590G1450132k522727O25272R66763M45805j302861J682420O36966L0398j587494
$$ 71450132 68927405 69552677 70519440 70965245 69662384 71344804 71981770 72012168 70424674
2581G0424674K29708M49606K842341R50380r3628k00352l9848J36217j32310j757508
$$ 70424674 70654382 71103988 73946329 74896709 74803081 74602729 74562881 74699098 74566788 72809280
2571G2809280Q47919k088282l713094j269749k252398k930091o84520k950854
$$ 72809280 73657199 71568917 67855823 66586074 64333676 61403585 60719065 57768211
2563E7768211l168876n72821k92131j682448r63427k161221j57083j693490J57094
$$ 57768211 54599335 54026514 53734383 52051935 51088508 48927287 48770204 47076714 47233808
2554D7233808k45841O06954k574415Q68670J258163N31026j321188N93003j82193
$$ 47233808 46987967 47594921 45020506 45889176 47147339 47678365 46357177 46950180 46767987
2545D6767987j472384L14216n09456L57244k160021j78125J056793J77324K96664
$$ 46767987 45295603 45609819 45100363 45457607 43297586 43119461 44176254 44353578 44650242
2536D4650242Q93129L2445m02126p45064M21500K318142O25231K389513J331939
$$ 44650242 45543371 45575816 45173690 44428626 44850126 47168268 47793499 50183012 51514951
2527E1514951k182744r7105J793636j99585R28683l85575R94618R33576Q40637
$$ 51514951 49332207 49235102 51028738 50829153 51757836 51372261 52366879 53300455 54141092
2518E4141092L51618J038937O65267p9301J235017J117737Q35602P42715J691862
$$ 54141092 54492710 55531647 56196914 56117613 57352630 58470367 59305969 60048684 61740546
2509F1740546J245811J419779J984206K799115M27763K827238K471770J967672
$$ 61740546 62986357 64406136 66390342 69189457 69617220 72444458 74916228 76883900
2501G6883900J826102K955553L378193L155978K240559N233657N380809O015911
$$ 76883900 78710002 81665555 85043748 88199726 90440285 95673942 101054751 107070662
2493A07070662N468334K750425J742288P83528N15301p79902J194k306973k621479
$$ 107070662 112538996 115289421 117031709 117815237 118330538 117550636 117551830 115244857 112623378
2484A12623378n69312l275774j055372k110777j320886N9699K150744j405366
$$ 112623378 112054066 108778292 107722920 105612143 104291257 104350956 106501700 105096334
2476A05096334L621348K768682J857244M333200K240832M125110L901882K733834
$$ 105096334 108717682 111486364 113343608 117676808 119917640 124042750 127944632 130678466
2468A30678466L268815J0191258J0862837J1835346O465978N19756k598765o922682
$$ 130678466 133947281 144138539 155001376 166836722 173302700 173822456 171223691 164301009
2460A64301009q534319j2930711r047243o800423q207050o239652m513039n599744
$$ 164301009 155766690 142835979 133788736 126988313 118781263 112541611 108028572 102428828
2452A02428828k464225m360927k239807J984778l409162P7406N57102j550403
$$ 102428828 99964603 95603676 93363869 95348647 91939485 92016891 92573993 91023590
2444I1023590J324896J994754q64931m69073Q6920j204404N72256R97435K485154
$$ 91023590 92348486 94343240 93478309 93009236 93096156 91891752 92464008 93461443 95946597
2435I5946597J318136k135806l65282l988121k780730n059262m943446j885160
$$ 95946597 97264733 95128927 94763645 90775524 87994794 82935532 77992086 76106926
2427G6106926n022473l969544j650792l741952q49354j297339k248703M23140
$$ 76106926 71084453 67114909 65464117 61722165 60872811 59575472 57326769 57749909
2419E7749909j056204j620972k73087r29903O67133j578104q43448J941707q20900
$$ 57749909 56693705 55072733 54799646 53869743 54536876 52958772 52115324 54057031 53236131
2410E3236131Q63702K344963J565003p56839j444550K003988m49242J471952k091436
$$ 53236131 54099833 56444796 58009799 57252960 55808410 57812398 57363156 58835108 56743672
2401E6743672J899764J199498r83275J801629J706724J083530J398914L869392
$$ 56743672 58643436 59842934 58859659 60661288 62368012 63451542 64850456 68719848
2393F8719848J167629K348368L144001J445517J085485M34357L216732K974302
$$ 68719848 69887477 72235845 75379846 76825363 77910848 78345205 81561937 84536239
2385H4536239M299308M185210N419532J229379O53367l637884m185238j643108
$$ 84536239 88835547 93020757 98440289 99669668 100323035 96685151 92499913 90856805
2377I0856805q164330l180766l455616m169511l414483j962796m210295k401898
$$ 90856805 82692475 79511709 76056093 71886582 68472099 66509303 62299008 59897110
2369E9897110q42161m294474N38461j640664N83705o73425o77875k497691J90794
$$ 59897110 59054949 54760475 55298936 53658272 54241977 53568552 52890677 50392986 50583780
2360E0583780o86029l148101P59915j585970K020221j158616M46718j012321R18227
$$ 50583780 49897751 46749650 47509565 45923595 47943816 46785200 47231918 46219597 47137824
2351D7137824k271424j382419K323008L810j141926j819954M73936k467384j014888
$$ 47137824 44866400 43483981 45806989 45810799 44668873 42848919 43322855 40855471 39840583
2342C9840583n89364j303274o36561j032757o50258J214471k637472J373821r30828
$$ 39840583 39251219 37947945 37311384 36278627 35628369 36842840 34205368 35579189 34648361
2333C4648361l38009j632361r58661q07811J114224j823035j402016M06882r15350
$$ 34648361 34310352 32677991 31719330 30911519 32025743 30202708 28800692 29207574 28292224
2324B8292224N17600J373164j639296K371348m58789l01913J421769p07199o04118
$$ 28292224 28809824 30182988 28543692 30915040 30456251 30154338 31576107 30868908 30264790
2315C0264790N20240l3078o33598K350520l490026J005423o51433Q45166k080095
$$ 30264790 30785030 30751952 30118354 32468874 28978848 29984271 29332838 30178004 28097909
2306B8097909N564P55674p73169j828130J405778j699050m04113n046k308987
$$ 28097909 28103473 28859147 28085978 26257848 27663626 25964576 25560463 25555417 23246430
2297B3246430p44765k097584R86620j01131j7529k34377J529606n07175q98923
$$ 23246430 22501665 20404081 21390701 21289570 21272041 21037664 22567270 22060095 21161172
2288B1161172o78073Q58338o3552J69091r45150R32606n84511J74066m95254K00758
$$ 21161172 20483099 21341437 21277885 21446976 20501826 21434432 20849921 21023987 20528733 20729491
2278B0729491j746509Q922j143741n80077r54381o22303o91899l1966j323948
$$ 20729491 18982982 18991904 17848163 17268086 16313705 15691402 14999503 14967537 13643589
2269A3643589l48244j50198K20929o40068K11346j769444L71805J017253k019527
$$ 13643589 13295345 13145147 13366076 12726008 12937354 11167910 11539715 12556968 10537441
2260A0537441j07387M94323r97040J25912K94224K82078r62865Q26137j523668
$$ 10537441 10430054 10924377 9927337 10053249 10347473 10629551 9666686 10492823 8969155
2251H969155J620870j107610O11773j476995J42648k84814Q32614j638998R41960
$$ 8969155 10590025 9482415 10094188 8617193 8759841 8475027 9307641 7668643 8610603
2242H610603q15909l49939q1561O65295k48900M74986o28959k34783p24909K73684
$$ 8610603 7794694 7444755 7363194 8028489 7779589 8254575 7625616 7390833 6665924 6939608
2232F939608j20084P48025j990034J352646J022368n27786j24636K15521r79957
$$ 6939608 6819524 7567549 5577515 6930161 7952529 7424743 7300107 7515628 6535671
2223F535671K264953k002321j094111j94300o6194J513339j129412K54661m05390
$$ 6535671 8800624 6798303 5704192 5509892 5443698 6957037 5827625 6082286 5676896
2214E676896M55273L89738q33605K404908j160520Q68772j260538J118287k204695
$$ 5676896 6132169 6521907 5688302 8093210 6932690 7801462 6540924 7659211 5454516
2205E454516K226368j460407l11098R12283j507487l22409J777009j248390q80992
$$ 5454516 7680884 6220477 5909379 6821662 5314175 4991766 6768775 5520385 4639393
2196D639393M64557O98937K58473l60931j64349J017917O09564j974358J324605
$$ 4639393 5103950 5802887 6061360 5700429 5536080 6553997 7163561 5189203 6513808
2187F513808j083721M14731q00064R53192j334033J151942J54963O00196j093493
$$ 6513808 5430087 5844818 5044754 5997946 4663913 5815855 5970818 6571014 5477521
2178E477521J647083j666427K12049n76340N81707k553101K994987j273059p59046
$$ 5477521 7124604 5458177 5670226 5093886 5675593 3122492 6117479 4844420 4085374
2169D085374r6539R61208j523466K633460K09322n5827q99656l65874R83069j567878
$$ 4085374 3988835 4950043 3426577 6060037 6269359 6213532 5313876 4948002 5931071 4363193
2159D363193k9725P52247j006467Q80772p66380J554946j663162K29683K00798
$$ 4363193 4333468 5085715 4079248 4960020 4193640 5748586 4085424 4315107 4515905
2150D515905r05471P39330j448665K313581r60481M85990p07875P04646K76207
$$ 4515905 3610434 4349764 2901099 5214680 4254199 4740189 4032314 4736960 5013167
2141E013167O797m05580L30715p62350R92378P59279k201536j23506J525781M13979
$$ 5013167 5019964 4614384 4945099 4182749 5175127 5934406 3732870 3609364 5135145 5549124
2131E549124q25294q21239Q25788j090245N75794O6671q3066n3958q80095J872678
$$ 5549124 4723830 3902591 4728379 3638134 4213928 4280599 4197533 4143575 3263480 5136158
2121E136158M13650j443391n09965N37775k02859J500924J23764J1160j254323
$$ 5136158 5549808 4106417 3596452 4134227 3931368 5432292 5556056 5567216 4312893
2112D312893J225482j596345j244929J629481J979432j774323J212280j58722
$$ 4312893 5538375 3942030 2697101 4326582 6306014 4531691 5743971 5585249
2104E585249j31181J99053j43691j934720J582812K42544M75965j079940J204325
$$ 5585249 5454068 5653121 5509430 3574710 5157522 5400066 5876031 4796091 6000416
2095F000416k165182J387492l04608K248733j713707N21423p80968M87583l51269
$$ 6000416 3835234 5222726 4918118 7166851 5453144 5974567 5193599 5681182 5329913
2086E329913J093559Q07566j923825N33659K29272k008298Q62337Q59022J98550
$$ 5329913 6423472 7231038 5307213 5840872 6070144 4061846 4924183 5783205 5981755
2077E981755o04651l47131n80736J827125k586382J715667J273805j078602j404844
$$ 5981755 5377104 5029973 4449237 6276362 3689980 5405647 6679452 5600850 4196006
2068D196006n23833L6162R05747J29161N55485k06867l39963j68179O48327q75286
$$ 4196006 3672173 3708335 4614082 4743243 5298728 5091861 4751898 4583719 5232046 4356760
2058D356760O76680J141707j126095Q00743r10621K67803R9148k806504J648051
$$ 4356760 5033440 6175147 5049052 5849795 4939174 5206977 5306125 2499621 4147672
2049D147672q21997L10331K18245J053924o51450R0590j036763J398235j415523
$$ 4147672 3325675 3636006 3854251 4908175 4256725 4347315 3310552 4708787 3293264
2040C293264o0914n44050K50578r61265J220203l03961J011435j68437r14123
$$ 3293264 3232350 2688300 2938878 1977613 3197816 2893855 3905290 3736853 2822730
2031B822730l23306L79714O19955m99884R61305p44793l42754J15326o98548Q32357
$$ 2822730 2499424 2879138 3499093 2999209 3960514 3215721 2872967 2988293 2289745 3122102
2021C122102j014520L6651J46554q378k99406J648456k59383j156359N48203p55145
$$ 3122102 2107582 2144233 2290787 2282409 1983003 3631459 3372076 2215717 2763920 2008775
2011B008775l27279N1408j72309J247587j934039L81971J616020j409654J497271
$$ 2008775 1681496 1732904 1560595 2808182 874143 1256114 2872134 1462480 2959751
2002B959751j830577J294564k77903R13594j095112P49769j852621J310451j276926
$$ 2959751 1129174 2423738 2145835 3059429 1964317 2714086 861465 2171916 894990
1993H94990J295395n57340R68127j401165J014400j225967o30707J191507N03092
$$ 894990 2190385 1633045 2601172 1200007 2214407 988440 357733 1549240 2052332
1984B052332J776359j826268J13749o82234R71287L42874n69566J10139L57702
$$ 2052332 3828691 2002423 2116172 1433938 2405225 2748099 2178533 2288672 2646374
1975B646374n1978k435556J439776J850699l464009L88900L94096J019987K62612
$$ 2646374 2594396 158840 1598616 3449315 -14694 374206 768302 1788289 2050901
1966B050901j003312J308407p49759M42614j249614J572718j193067J311615p95869
$$ 2050901 1047589 2355996 1606237 2048851 799237 2371955 1178888 2490503 1694634
1957A694634k47436m6953M51754Q64015r15877J41394m66912M43301R76861r43041
$$ 1694634 1447198 1400245 1851999 2716014 1800137 1941531 1474619 1917920 2894781 1951740
1947A951740O31449j967465J773981q77198L10590J516430q55681j078498k65435
$$ 1951740 2583189 615724 2389705 1512507 1823097 3339527 2483846 1405348 1139913
1938A139913M91898m40553N11084q22116k93167m93828J228025o97124R08984
$$ 1139913 1631811 1191258 1702342 880226 587059 93231 1321256 624132 1533116
1929A533116J65577o93743Q12880m81090M14304L20040N16666j815076R95628
$$ 1533116 1698693 1004950 1817830 1336740 1751044 2071084 2587750 772674 1768302
1920A768302R18766k390223K008650k249579L211883m46659k573128N9200J218125
$$ 1768302 2687068 296845 2305495 55916 3267799 2821140 248012 307212 1525337
1911A525337p55678R45159o95706P92119O93549p35891q33074Q36961m33091O19304
$$ 1525337 769659 1714818 1019112 1811231 2504780 1768889 935815 1772776 1339685 1958989
1901A958989K37792j6358j130199j380487J206251J96449k01431K08274P67979
$$ 1958989 2196781 2180423 1050224 -330263 875988 1072437 871006 1079280 1847259
1892A847259j05509o04982N80067j387523J059111N60710M59543k954314J727610
$$ 1847259 1741750 1136768 1716835 329312 1388423 1949133 2408676 -545638 1181972
1883A181972m92727N91465Q91303k205025K885160j910840K89392M91450n32359
$$ 1181972 689245 1280710 2172013 -33012 2852148 941308 1230700 1722150 1189791
1874A189791N35358N6597q45959j96081l27028O1538J594731j564118R68733P0587
$$ 1189791 1725149 1781746 935787 739706 412678 474216 2068947 504829 1473562 1544149
1864A544149p60992J63549j364827K450138j423886R55625j027829J773805j030190
$$ 1544149 783157 946706 -418121 2032017 608131 1563756 535927 2309732 1279542
1855A279542r15341K18534J136983k36981R42969m57117j405664K066754j124653
$$ 1279542 364201 582735 1719718 1482737 2425706 1968589 562925 2629679 1505026
1846A505026m94299k78711K84991j327535O2643Q60329J243110j14787l32910
$$ 1505026 1010727 732016 1017007 -310528 -247885 612444 1855554 1740767 1407857
1837A407857l13110N21119p70710J110201n86240K70600l51315K35100j010103
$$ 1407857 1094747 1615866 845156 1955357 1369117 1639717 1288402 1523502 513399
1828E13399M02819j248337K421051j6336j669793M50671J491433j796627J446041
$$ 513399 916218 -332119 2088932 2072596 402803 853474 2344907 548280 1994321
1819A994321k387263J897995j104760m28353J451542l28323L46437m70861O83282
$$ 1994321 -392942 1505053 400293 -28060 1423482 1095159 1441596 970735 1654017
1810A654017j042742P48567P52998j519720J958205j990401J834662k161733K091337
$$ 1654017 611275 1359842 2112840 593120 2551325 560924 2395586 233853 2325190
1801B325190k705237J208668J597832n47767j31116j452563J251662J593988k455714
$$ 2325190 -380047 828621 2426453 1878686 1747570 295007 1546669 3140657 684943
1792F84943k41236Q52171K7051j774113J40619J477385J318692k417803J184955
$$ 684943 443707 1295878 1322929 -451184 -310565 1166820 2485512 67709 1252664
1783A252664R44274k767434J504326o30507J037040p73183j36147l29331J611431
$$ 1252664 2196938 -570496 933830 303323 1340363 567180 431033 101702 1713133
1774A713133k564498K016101R6298N88931n99695K62142j445534K893262j676739
$$ 1713133 -851365 1164736 1261034 1849965 1250270 1512412 66878 2960140 1283401
1765A283401r46666l24948N37318K48222L47866J243590j324406k2165m3782J088926
$$ 1283401 336735 11787 549105 797327 1145193 2388783 1064377 1042212 998430 2087356
1755B087356k924452J602066J505416n41246j42808n27171Q14256j167221M76557
$$ 2087356 -837096 764970 2270386 1729140 1586332 1059161 1873417 706196 1182753
1746A182753J318145p36585q23266L31454L75294j225004J516774r95213O01823
$$ 1182753 2500898 1764313 941047 1272501 1647795 422791 1939565 944352 1546175
1737A546175j250599M18148r22330K36320J305991o78367J056001j69709r3677
$$ 1546175 295576 713724 -208606 27714 1333705 655338 1711339 1541630 1447953
1728A447953j10381J531198j827493k48455J17480J741090j768073l51076J865733
$$ 1447953 1337572 2868770 1041277 792822 910302 2651392 883319 532243 2397976
1719B397976j233033j18918l025625K665721J216184j499332L65822K90767q13292
$$ 2397976 1164943 1046025 -1979600 686121 1902305 402973 768795 1059562 246270
1710B46270J176379l5860k40472j71832r60686K4993J139202N89394r93678n52531
$$ 246270 1422649 1386789 1146317 974485 13799 38792 1177994 1767388 773710 221179
1700B21179P54852O78774l26773j309832L44392n6847n5938Q56492q56224l63474
$$ 221179 976031 1654805 1328032 18200 362592 305745 249807 1106299 250075 -113399
1690a13399M52887P24201j395577J877460l42924p98868N1038q54042J846598
$$ -113399 339488 1063689 -331888 1545572 1202648 403780 454818 -399224 1447374
1681A447374p76703l05838O11547r36918N73379l01852R64371k271717J042977
$$ 1447374 670671 364833 976380 39462 612841 310989 1275360 -996357 46620
1672D6620J389880q59635L14963m59866M45051r69975P08792J654444q82648o53880
$$ 46620 1436500 576865 891828 431962 877013 -92962 615830 2270274 1387626 733746
1662G33746l04209J244830j303502P36896j61854p10684n130J293998l22484j146869
$$ 733746 429537 1674367 370865 1107761 945907 235223 230093 1524091 1201607 54738
1652E4738J361862j208179o25511K385907j51494K39060j722236j74866J843488
$$ 54738 1416600 208421 -417090 1968817 1817323 2056383 334147 159281 2002769
1643B002769q93479p35222N92001j29214q65950J753693M46770o79229N76303
$$ 2002769 1109290 374068 966069 836855 -29095 1724598 2171368 1492139 2068442
1634B068442m94877r07911J914233o97125j011588Q69109k27244K7326O71399
$$ 2068442 1573565 665654 2579887 1882762 871174 1740283 1513039 1540365 2211764
1625B211764j092727J713341n65125j346695J030191q15107J635995J056337k134072
$$ 2211764 1119037 2832378 2267253 920558 1950749 1135642 2771637 3827974 1693902
1616A693902J90688n66517J738874j694033O88400m78549P28716j448127m07032
$$ 1693902 1884590 1318073 3056947 1362914 2051314 1572765 2301481 853354 446322
1607D46322J658947q11252l7872n55256P51743q78620r23677J645674m92949j70741
$$ 446322 2105269 1294017 1256145 700889 1452632 574012 -349665 1296009 803060 632319
1597F32319K005852j133750L47330o22427k053747L59812K797820M1558l84421
$$ 632319 2638171 1504421 1851751 1229324 -824423 -464611 2333209 2374767 1990346
1588A990346j881471o04022K188637k89365r27266K43044J202318J90503m12836
$$ 1990346 108875 -495147 1693490 1404125 476859 719903 1922221 2112724 1699888
1579A699888j022988l5458J168887K3476M47822j48131j190206p11446K145803
$$ 1699888 676900 641442 1810329 1833805 2281627 2133496 943290 231844 2377647
1570B377647l51201l34024j87378j006038J794765j064207L42145q00482Q50946
$$ 2377647 2026446 1692422 1505044 499006 2293771 1229564 1571709 771227 1622173
1561A622173j080507Q93204l30655J293521n83188n79043j929572J364146M01191
$$ 1622173 541666 1434870 1104215 2397736 1814548 1235505 -694067 670079 1071270
1552A071270m87683Q58206q48125O75626J680897J03006k066785P24119n78293
$$ 1071270 583587 1441793 593668 1269294 2950191 3053197 986412 1710531 1132238
1543A132238l53504K13432N33473r72205J910735j923711m00842Q88930j222091
$$ 1132238 778734 992166 1525639 553434 2464169 540458 139616 1028546 -193545
1534a93545J218042r12465M13850K259563J75139p54776P83411j390196m63218
$$ -193545 1024497 112032 525882 2785445 2960584 2205808 2989219 1599023 1135805
1525A135805M22008K66120k40702k13738j275971L240344j889641P76800j124177
$$ 1135805 1557813 1823933 1583231 1369493 93522 3333866 1444225 2221025 1096848
1516A096848J070212J39869k100605j38648J124500J06253J432367j20324k245341
$$ 1096848 2167060 2306929 206324 67676 1192176 1298429 2730796 2610472 365131
1507C65131K311030q19458J19874l86422k17441l42531Q97461k37575J132178
$$ 365131 2676161 1856703 1976577 1590155 1372714 1030183 1927644 1690069 2822247
1498B822247m39646j4419o61132M30157l56603k2973J296417j279397P25431m19707
$$ 2822247 2382601 2368182 1707050 2137207 1780604 1757631 3054048 1774651 2500082 2080375
1488B080375k328809L318243j632337K01363P84799p20841J453381p80663J66475
$$ 2080375 -248434 3069809 1437472 1638835 2423634 1702793 3156174 2375511 2541986
1479B541986k99292J328353p39488j077556l30561L45646J081548o81203o56760
$$ 2541986 2242694 3571047 2831559 1754003 1423442 1769088 2850636 2169433 1512673
1470A512673J168548K82401K4252l0342J436047q34068j58971L41072N15582n44763
$$ 1512673 2681221 2963622 2987874 2957532 4393579 3559511 3400540 3741612 4257194 3712431
1460C712431M58029L78577P14771j636036j351484K056459j094908P71037k02227
$$ 3712431 4170460 4549037 5263808 3627772 2276288 4332747 3237839 4008876 3806649
1451C806649J53441M69226J370887j258363O22834n06983q06848J807428j278147
$$ 3806649 3960090 4429316 5800203 4541840 5164674 4657691 3850843 5658271 4380124
1442D380124J600946l1979r20941L93637J51100m18274K256078j62451j080225
$$ 4380124 5981070 5949091 5028150 5421787 5572887 5154613 7410691 7248240 6168015
1433F168015Q45719J585675j460151m64362J805015M46257r46861k37152N86115
$$ 6168015 7013734 8599409 7139258 6674896 8479911 8926168 7979307 7742155 8328270
1424H328270J119480J836430M66265L21217J4339J699282K37812K803978N20816
$$ 8328270 9447750 11284180 11750445 12071662 12086001 13785283 14023095 16827073 17347889
1415A7347889M52849K7196K485685L331140K011283K394712L117317K906645M914354
$$ 17347889 17800738 17827934 20313619 23644759 25656042 28050754 31168071 34074716 38989070
1406C8989070R59926M640310J721185J667030K673369M126807M924061O146093
$$ 38989070 39948996 44589306 46310491 47977521 50650890 54777697 59701758 65847851
1398F5847851O666010L581242K899023L299076O490612O287005J605472k304213
$$ 65847851 72513861 76095103 78994126 82293202 88783814 95070819 96676291 94372078
1390I4372078Q532906J5853374K4081415J4329445J2104912j263632j3103007
$$ 94372078 102904984 118758358 142839773 157169218 169274130 168010498 154907491
1383A54907491j3940513j7657155k2510121j6451390j4967217p936214p554587
$$ 154907491 140966978 123309823 100799702 84348312 69381095 61444881 53890294
1376E3890294p018589p586991l642213j592723m207969l827816l776293N22975
$$ 53890294 46871705 39284714 35642501 34049778 29841809 26013993 22237700 22760675
1368B2760675m346521p22533j356397n15443j409926k400124r71250R64645j077898
$$ 22760675 18414154 17691621 16335224 15819781 14409855 12009731 11038481 12003126 10925228
1359A0925228j564343j021134J831968k392472R94615j614828o16638Q38261p71305
$$ 10925228 9360885 8339751 10171719 7779247 8773862 7159034 6542396 7380657 6609352
1350F609352j169045N64400j155111J156979M87074l73325m57983J349290k044103
$$ 6609352 5440307 6004707 4849596 6006575 6493649 6120324 5662341 7011631 4967528
1341D967528j843953Q31303Q90300j417636M21639J614779N68389k387764l17403
$$ 4967528 3123575 3954878 4845178 3427542 3849181 5463960 6032349 3644585 3327182
1332C327182m9949n33702O04210p59914J959242k055275P33000Q54290J372489
$$ 3327182 3277233 2743531 3347741 2587827 4547069 2491794 3224794 4079084 5451573
1323E451573p08738j325592m4180p5630J143378k559524J123645m82513R8599
$$ 5451573 4742835 3417243 3373063 3297433 4440811 1881287 3004932 2522419 2621018
1314B621018l49213K579987k360155J152565j489959M95117j357445J074531j983979
$$ 2621018 2271805 4851792 2491637 3644202 2154243 2649360 1291915 2366446 382467
1305C82467J452995N26261p78039K50049j27331L45531J79903j84787k78419J519802
$$ 382467 1835462 2361723 1583684 1833733 1706402 2051933 2231836 2047049 1768630 3288432
1295C288432k55790r3547O04126p14590r95258R6459n25673J065103K17406k066900
$$ 3288432 3032642 2939095 3543221 2828631 1833373 1929832 1404159 2469262 2686668 619768
1285F19768R20191N12054j314104k08637J089339j536847R53854q77910J693128
$$ 619768 1539959 2052013 737909 529272 1618611 81764 1035618 157708 1850836
1276A850836j451200p35764K501652k034197Q47878J11418n88585j359506J660358
$$ 1850836 399636 -336128 2165524 131327 979205 1090623 502038 -857468 802890
1267H02890j77604l08447J831750j192322J107397l003959K492557l82683p96608
$$ 802890 625286 316839 2148589 956267 2063664 -940295 1552262 1169579 372971
1258C72971J433127k053747P51054n4895M10404J22435K42626j674500J232003
$$ 372971 1806098 -247649 503405 448510 858914 981349 1223975 -450525 781478
1249G81478J29944p35295r87069k40810L37884N69731J400297j037362Q06128
$$ 781478 911422 176127 -810942 -1051752 -713868 -144137 1256160 218798 1024926
1240A024926N45323K67148j066461l00130M17499J016470K01406j137341J315777
$$ 1024926 1570249 1837397 770936 470806 888305 1904775 2106181 968840 2284617
1231B284617j381657o90527j294656J555599L564058l851191Q02589J73320j87391
$$ 2284617 902960 212433 -1082223 473376 4037434 186243 988832 1162152 974761
1222I74761j10589q60597J43912q79806p98615K435884p12496n61484P92257j19981
$$ 974761 864172 3575 147487 -732319 -1530934 904950 192454 -369030 423227 303246
1212C03246J593053m99940k240312J774764m05895J757564j649096m29774P32610
$$ 303246 1896299 1396359 -843953 930811 524916 2282480 633384 203610 936220
1203I36220j453490K175565j989310j797777L308385m28764M22991j588828R35146
$$ 936220 -517270 1658295 -331015 -2128792 1179593 750829 1173820 -415008 520138
1194E20138n59855j027609K601407o97809j165537O47437Q6806o2498n12489J294410
$$ 520138 -39717 -1067326 1534081 836272 -329265 318172 404978 342480 -170009 1124401
1184A124401j644382J841345j607690L21902Q32855j117945Q37626J82796K5918
$$ 1124401 -519981 1321364 -286326 35576 868431 -249514 588112 770908 796826
1175G96826p31213l42707N54840j96540N51786q69579J79016N70724P72283k014251
$$ 796826 65613 -277094 277746 81206 632992 -236587 -57571 513153 1285436 -728815
1165g28815Q44433L77291m94823J44379l3270N62784K61038p28442k960K48793
$$ -728815 115618 492909 -1914 142465 109195 671979 933017 204575 201615 450408
1155D50408J071739r27390J636127q66447j307098K73151P19404p79377o71996
$$ 450408 1522147 594757 2230884 1364437 57339 330490 1049894 270517 -401479
1146d01479J101821R62137k132200J870215j445968J136429j925543m8846j85354
$$ -401479 700342 1662479 -469721 1400494 -45474 1090955 -834588 -883434 -1068788
1137a068788J784607m20139j033214J395463j982728K311301j309303l66586Q28277
$$ -1068788 715819 295680 -737534 657929 -1324799 986502 -322801 -689387 138890
1128A38890J084309j925459R67563n88355O16269j41305K1524j245360K699924
$$ 138890 1223199 -702260 265303 -323052 293217 151912 173436 -1071924 1628000
1119A628000m72069n42294M20835p78256j117442R75660j02516N0104r01843J314351
$$ 1628000 1155931 613637 1034472 256216 -861226 114434 11918 62022 -839821 474530
1109D74530j45811l70774j30660J60327K18073j691304Q96433O17644j041630
$$ 474530 328719 -42055 -172715 -12388 205685 -1485619 -589186 28458 -1013172
1100a013172L34097Q78647J18148K8901r044j98964J752916k495515P56759o33080
$$ -1013172 -679075 199572 317720 346621 337577 138613 1891529 -603986 152773 -480307
1090d80307J66686J39024J296617k236191J835699k282667K902862j624802K24146
$$ -480307 -313621 -174597 1122020 -1114171 721528 -1561139 1341723 -283079 -58933
1081e8933J173213j491113J782849K14587j924750P61135r55960O60749n3075
$$ -58933 1114280 -376833 1406016 1620603 -304147 456988 -498972 161777 108702
1072A08702J05415k111970K266979J027496j556101K62587K21437M64177K09677
$$ 108702 214117 -1897853 369126 1396622 -159479 103108 324545 788722 998399
1063I98399j068868p10236J065300l04594p23197P07572l09116J632101j634957
$$ 998399 -70469 -780705 284595 -19999 -743196 -35624 -344740 1287361 -347596
1054c47596P18746o12263q4350m61522J141826j592619Q16711l69358Q74310Q04461
$$ -347596 371150 -241113 -325463 -786985 354841 -1237778 -421067 -790425 83885 888346
1044H88346p16792N80642j073886l93216R97253n39091Q5529M29004L2487r63041
$$ 888346 171554 752196 -321690 -714906 282347 -256744 -171215 257789 290276 -672765
1034f72765m58380J158082r35971m00042K280074j943855l55843J390228K77263
$$ -672765 -1131145 26937 -909034 -1309076 970998 -972857 -1328700 61528 338791
1025C38791k24236K8379p44712n33214N61243K473059j450298o52912J485816
$$ 338791 114555 142934 -601778 -1134992 -573749 1899310 449012 -203900 1281916
1016A281916j584498K07473Q65549r02542Q03678o20741n05719J491005j823685
$$ 1281916 -302582 -95109 770440 -132102 671576 50835 -454884 1036121 -787564
1007g87564R13611n92058J048117j686188j368153K022917R96021j228829J874098
$$ -787564 126047 -466011 582106 -1104082 -2472235 -449318 546703 -682126 1191972
998A191972k217087Q18971n89173M40940J48323L61942j36074r42252K261473
$$ 1191972 -1025115 -206144 -795317 -354377 -206054 155888 19814 -922438 1339035
989A339035j727323J638844j637225o03764J014500j337068J525128J05622J5338
$$ 1339035 -388288 1250556 -386669 -990433 24067 -1313001 212127 317749 333087
980C33087j69238r3515J212832j3803j887617o6834J631457r45579L43399J314280
$$ 333087 163849 70334 1283166 1269363 -618254 -685088 946369 790 344189 1658469
970A658469n78746j535554L47582l32207J774802j778847J001654j142162P54941
$$ 1658469 1079723 -455831 -108249 -440456 1334346 -444501 557153 -585009 169932
961A69932r13275P88205Q96n95118J831064k198144N51542K40345k039681K836045
$$ 169932 -743343 44862 45758 -549360 1281704 -916440 -364898 -124553 -2164234 671811
951F71811m78791O06203k885838J823068m85457m13397k98508R74409J7936J328370
$$ 671811 193020 799223 -2086615 -263547 -749004 -1162401 -1460909 -486500 -468564 859806
941H59806j062684M87529n86985m96164j3448l81132l2971J035699P02689j502145
$$ 859806 -202878 284651 -302334 -798498 -811946 -1193078 -1226049 -190350 512339 -989806
931i89806J318312j243422k67371J286161r3472J017989j207511L31381P48354
$$ -989806 328506 -914916 -1182287 103874 10402 1028391 -179120 152261 900615
922I00615p64972J203746j270307j781438J051929K94305J285669j889242J077464
$$ 900615 135643 1339389 69082 -1712356 -660427 -366122 919547 -969695 107769
913A07769J164631j830952J143645j091946j266563N56950J339913p55292Q79257
$$ 107769 1272400 -558552 585093 -506853 -1773416 -1216466 123447 -631845 247412
904B47412n77153m51006n43504L71522q35259J530026M63563j044906J063577
$$ 247412 -329741 -780747 -1324251 -952729 -1787988 -257962 205601 -839305 224272
895B24272l9978q61092L73091k12050K79304j98051J438089p86734r4277k41460
$$ 224272 184294 -676798 -303707 -515757 -236453 -434504 1003585 216851 122574 -118886
885a18886Q10825m48415R39102p77413k59549j051571R99632r03476J464821k421454
$$ -118886 691939 243524 1182626 405213 145664 -905907 93725 -809751 655070 -1766384
875a766384L253794j428320R81901L00589k007289J853764o63358q76496J516700
$$ -1766384 1487410 59090 1040991 1341580 -665709 1188055 524697 -351799 1164901
866A164901p16316R90585j621038N5556j027083J347682J500793k142566R3926
$$ 1164901 448585 1439170 -181868 -126312 -1153395 194287 1695080 -447486 -353560
857c53560N45303q43234J391097j827747J684144j185246K12960J104889K85152
$$ -353560 191743 -651491 739606 -1088141 596003 -589243 -376283 728606 1013758
848A013758o47758k06475Q725j761572J586175Q85026j586482J249207O95482
$$ 1013758 366000 159525 168250 -1593322 -7147 877879 -708603 540604 1236086
839A236086j865865M05086j223060J597115n08441M30897J336175j338906n92566
$$ 1236086 -629779 -224693 -1447753 149362 -359079 71818 1407993 69087 -523479
830e23479Q92279m97460m34110L11511K132230l174468N40897l14793L68262Q04706
$$ -523479 368800 -128660 -562770 -251259 1880971 -1293497 -752600 -1067393 -699131 105575
820A05575j600475J765441k32723j93457r31741J242557R8677K43939K71710j379099
$$ 105575 -1494900 270541 37818 -155639 -1087380 155177 253854 497793 769503 -609596
810f09596R07323K16494j366242o93624O22586J224660k19303k195879K171272
$$ -609596 297727 514221 -852021 -1545645 -923059 301601 82298 -2113581 57691
801E7691p19982Q73134k47655Q69861J17680j240865J211283j611558k66859n8269
$$ 57691 -662291 210843 -36812 833049 950729 -290136 921147 -690411 -957270 -1015539
791a015539J021502Q07269j984763M41486R83027K91676k374118K435521q95839
$$ -1015539 5963 813232 -1171531 -730045 252982 544658 -1829460 606061 -289778
782b89778k07919j196872K769726O28462p49888k556846J423968J12408o29283
$$ -289778 -497697 -1694569 1075157 1703619 953731 -1603115 -179147 -66739 -696022
773f96022O35741J845023k195448n90364j018295J936121Q64925j697956p65294
$$ -696022 -60281 1784742 -410706 -1001070 -2019365 -83244 781681 -916275 -1681569
764a681569P12965J424182l14165l88677O16364j410605K506369j705660M75821
$$ -1681569 -968604 455578 141413 -247264 369100 -1041505 1464864 -240796 235025
755B35025m84072K55531Q08709j852528R67073q59089J253851j918010J967688
$$ 235025 -249047 6484 815193 -1037335 -70262 -929351 324500 -1593510 374178
746C74178N03579j719797J093659q0574j224638q25448J485142K7810j61837P53317
$$ 374178 877757 -842040 251619 171045 -1053593 -1879041 -393899 -366089 -527926 225391
736B25391p56797q1089P07062j502890J916491m64875M67453n89350m82775J064119
$$ 225391 -531406 -612495 94567 -1408323 508168 43293 510746 -78604 -561379 502740
726E02740m00450K00401j241088Q06577J16131q6317q46965l74326M09688J543437
$$ 502740 102290 302691 -938397 -131820 -15689 -102006 -948971 -1323297 -913609 629828
716F29828k356519K152172j549420K163386k74479K8178j210233P8901J686146
$$ 629828 -1726691 425481 -1123939 1039447 764968 793146 -417087 -338186 1347960
707A347960l28074m09745p62305j864989N05473K941801j150264j841456J161360
$$ 1347960 1019886 610141 -152164 -2017153 -1511680 1430121 279857 -1561599 -400239
698d00239P26762p32635m35792L15905j051402J768980n97967M25800m10547l37631
$$ -400239 326523 -406112 -841904 -525999 -1577401 191579 -406388 19412 -391135 -728766
688g28766L29161l59185J670767m75819j577015Q24925j016320L087687k351734
$$ -728766 -399605 -758790 911977 436158 -1140857 -315932 -1332252 1755435 -596299
679e96299J328625r84815o68399l71466o01506N38146N30522L79884L66549M06386
$$ -596299 732326 -252489 -920888 -1292354 -1893860 -1355714 -825192 -445308 -78759 327627
669C27627p39342K25167j73945L43849k28365n30673N83200n30762J026385j871381
$$ 327627 -411715 -186548 -360493 -16644 -245009 -775682 -192482 -723244 303141 -1568240
659a568240R80214J728j51633j71258J003719N05787N78175j400080l78038K10636
$$ -1568240 -588026 -586298 -737931 -909189 94530 600317 1178492 -221588 -599626 -388990
649c88990l78696J05541j405556m43426J714152J060210o31659m07335Q89426
$$ -388990 -767686 -662145 -2067701 -2511127 -796975 263235 -368424 -775759 113667
640A13667j91662K76897q56929K80448j327685k98685J692518p412k61462M83717
$$ 113667 -77995 198902 -658027 -377579 -1705264 -2003949 -311431 -318843 -580305 -96588
630i6588J276558k846476L11178J157315M0773J23102q22137J088825j031956
$$ -96588 1179970 -1666506 -1355328 -198013 -157240 -34138 -856275 232550 -799406
621g99406N47344j025943Q58634j036560M47250J282089Q10472k421487J442944
$$ -799406 -252062 -1278005 -419371 -1455931 -1008681 273408 1083880 -1337607 105337
612A05337j227883K3638l34017j35062J563660J12322O38095n32353j045340M07157
$$ 105337 -1122546 -1098908 -1432925 -1567987 -4327 107995 746090 213737 -831603 -424446
602d24446Q80051j916875K629846o40307j791576n72335J123799r17772L9337
$$ -424446 455605 -1461270 1168576 528269 -1263307 -1835642 -711843 -1629615 -1590278
593a590278J513256k37606j678431R58283J807640k862974K155158q21457L91696
$$ -1590278 -77022 -314628 -1993059 -1034776 772864 -2090110 65048 -756409 -364713
584c64713M55081n26896M00709L87416L36547j859966O83776q44607P78377J583771
$$ -364713 90368 -436528 -35819 351597 688144 -1171822 -488046 -1332653 -554276 1029495
574A029495j601757R8198J171132j034000N70980K81540n98319p02517K211413
$$ 1029495 -572262 -474064 697068 -336932 234048 515588 -82731 -785248 1426165
565A426165j812682J271193j667989q26986J039239J760957j119694q44728Q98811
$$ 1426165 -386517 884676 -783313 -1610299 -571060 1189897 70203 -774525 124286
556A24286K236319l104586R9785M95347l64626P17292p75410r9411M20825M19850
$$ 124286 2360605 -743981 -644196 -148849 -513475 203817 -571593 -671004 -250179 169671
546A69671j43997J057674k872606R87413K361989k434762K98414P91151k172584
$$ 169671 25674 1083348 -1789258 -801845 1560144 -874618 -576204 214947 -1957637
537a957637J042444P72538r88806k5982O06134n78294m15226K104250j267976
$$ -1957637 -915193 -142655 -1131461 -1157443 -551309 -1129603 -1544829 559421 -708555
528g08555O60385M07408j716122K51641J492995n31830P57645P36991k637037
$$ -708555 -48170 359238 -1356884 -1105243 387752 -144078 613567 1350558 -1286479
519a286479J919669m90342l58570J96627j109414J302947q32686Q17275J03192
$$ -1286479 633190 142848 -215722 -19095 -1128509 174438 -658248 159027 262219
510B62219J51086j014459m88324P29475L5174L77715n97347Q54717m92395j279314
$$ 262219 413305 -601154 -1089478 -360003 -324829 52886 -544461 310256 -182139 -1461453
500a461453J529837J774587l409179J579827j089037O65576J288860r09605p28749
$$ -1461453 68384 1842971 -1566208 13619 -1075418 -409842 879018 -30587 -759336
491g59336n92235P5361Q85851P49612m13584j4563Q5965j055013O43703N81171
$$ -759336 -1351571 -1276210 -390359 359253 -54331 -68894 17071 -1037942 -394239 186932
481A86932j582158O28951R7015o46142J301028p75750L70696j09716l65564J340043
$$ 186932 -1395226 -766275 -669260 -1315402 -14374 -790124 -419428 -529144 -894708 445335
471D45335j18379R91444k171367P60487j294834K31431j027587P46032N69284
$$ 445335 326956 1318400 -852967 -92480 -1387314 -1155883 -2183470 -1437438 -868154
$$ [...]
##END NTUPLES=NMR SPECTRUM
##END=
