##TITLE=abcd
##JCAMPDX= 6.0         $$ Bruker NMR JCAMP-DX V2.0
##DATA TYPE= NMR FID
##DATA CLASS= NTUPLES
##ORIGIN= UXNMR, Bruker Analytische Messtechnik GmbH
##OWNER= root
$$ XWIN-NMR		Version 3.5
$$ Tue Jul 15 11:32:40 2025 Russian Standard Time (UT+4h)  servis@DPX200
##.OBSERVE FREQUENCY= 200.131235884673
##.OBSERVE NUCLEUS= ^1H
##.DELAY= (6, 6)
##.ACQUISITION MODE= SIMULTANEOUS
##.ACQUISITION SCHEME= undefined
##.AVERAGES= 32
##.DIGITISER RES= 18
##SPECTROMETER/DATA SYSTEM= spect
##.PULSE SEQUENCE= zg
##.SOLVENT NAME= CDCl3
##.SHIFT REFERENCE= (INTERNAL, CDCl3, 0, 16.5164)
##AUDIT TRAIL= $$ (NUMBER, WHEN, WHO, WHERE, WHAT)
$$ ##TITLE= Audit trail, XWIN-NMR		Version 3.5
$$ ##JCAMPDX= 5.01
$$ ##ORIGIN= Bruker BioSpin GmbH
$$ ##OWNER= servis
$$ F:\spectra/data/av/nmr/H1/1/audita.txt
$$ ##AUDIT TRAIL=  $$ (NUMBER, WHEN, WHO, WHERE, WHAT)
(   1,<2025-07-15 11:31:05.81 +0400>,<servis>,<DPX200>,
      <created by zg, POWCHK disabled, PULCHK disabled
       configuration hash MD5:
       00 E9 B6 7A A2 85 ED C7 34 08 36 98 17 FE 4E 26
       data hash MD5: 32K
       A2 81 1D 94 03 E6 17 02 80 6D EC 8A F8 9E 40 26>)
$$ ##END=
$$ 
$$ hash MD5
$$ AA 85 C7 A9 4B C2 B6 E4 6E F5 19 BF CC 7A 93 DF
##$RELAX= 
##$RELAX= 
##$RELAX= 
##$RELAX= 
##$RELAX= 
##$RELAX= 
##$RELAX= 
##$RELAX= 
$$ Bruker specific parameters
$$ --------------------------
##$DU= <F:\spectra>
##$EXPNO= 1
##$NAME= <H1>
##$PROCNO= 1
##$TYPE= <nmr>
##$USER= <av>
##$AMP= (0..31)
100 100 100 100 100 100 100 100 100 100 100 100 100 100 100 100 100 100 
100 100 100 100 100 100 100 100 100 100 100 100 100 100 
##$AQSEQ= 0
##$AQ_mod= 1
##$AUNM= <au_zg>
##$AUTOPOS= <>
##$BF1= 200.13
##$BF2= 200.13
##$BF3= 200.13
##$BF4= 200.13
##$BF5= 500.13
##$BF6= 500.13
##$BF7= 500.13
##$BF8= 500.13
##$BYTORDA= 1
##$CFDGTYP= 0
##$CFRGTYP= 5
##$CHEMSTR= <none>
##$CNST= (0..31)
1 1 145 1 1 1 1 1 1 1 1 1 1 1 1 1 1 1 1 1 1 1 1 1 1 1 1 1 1 1 1 1 
##$CPDPRG= <>
##$CPDPRG1= <>
##$CPDPRG2= <>
##$CPDPRG3= <>
##$CPDPRG4= <mlev>
##$CPDPRG5= <mlev>
##$CPDPRG6= <mlev>
##$CPDPRG7= <mlev>
##$CPDPRG8= <mlev>
##$CPDPRGB= <>
##$CPDPRGT= <>
##$D= (0..31)
0 2 0 0 0 0 0 0 0 0.06 0 0 0 0 0 0 0.0002 0 0 0 0 0 0 0 0 0 0 0 0 0 0 
0 
##$DATE= 1752564665
##$DBL= (0..7)
120 120 120 120 120 120 120 120 
##$DBP= (0..7)
150 150 150 150 150 150 150 150 
##$DBP07= 0
##$DBPNAM0= <>
##$DBPNAM1= <>
##$DBPNAM2= <>
##$DBPNAM3= <>
##$DBPNAM4= <>
##$DBPNAM5= <>
##$DBPNAM6= <>
##$DBPNAM7= <>
##$DBPOAL= (0..7)
0.5 0.5 0.5 0.5 0.5 0.5 0.5 0.5 
##$DBPOFFS= (0..7)
0 0 0 0 0 0 0 0 
##$DE= 6
##$DECBNUC= <off>
##$DECIM= 32
##$DECNUC= <off>
##$DECSTAT= 4
##$DIGMOD= 1
##$DIGTYP= 9
##$DL= (0..7)
0 120 120 120 120 120 120 120 
##$DP= (0..7)
150 150 150 150 150 150 150 150 
##$DP07= 0
##$DPNAME0= <>
##$DPNAME1= <>
##$DPNAME2= <>
##$DPNAME3= <>
##$DPNAME4= <>
##$DPNAME5= <>
##$DPNAME6= <>
##$DPNAME7= <>
##$DPOAL= (0..7)
0.5 0.5 0.5 0.5 0.5 0.5 0.5 0.5 
##$DPOFFS= (0..7)
0 0 0 0 0 0 0 0 
##$DQDMODE= 0
##$DR= 18
##$DS= 0
##$DSLIST= <SSSSSSSSSSSSSSS>
##$DSPFIRM= 0
$$ [...]
##$SUBNAM0= <"">
##$SUBNAM1= <"">
##$SUBNAM2= <"">
##$SUBNAM3= <"">
##$SUBNAM4= <"">
##$SUBNAM5= <"">
##$SUBNAM6= <"">
##$SUBNAM7= <"">
##$SUBNAM8= <"">
##$SUBNAM9= <"">
##$SW= 20.6817932712277
##$SWIBOX= (0..15)
0 0 3 0 0 0 0 0 0 0 0 0 0 0 0 0 
##$SW_h= 4139.07284768212
##$TD= 32768
##$TD0= 1
##$TE= 0
##$TE2= 300
##$TE3= 300
##$TEG= 300
##$TL= (0..7)
0 120 120 120 120 120 120 120 
##$TP= (0..7)
150 150 150 150 150 150 150 150 
##$TP07= 0
##$TPNAME0= <>
##$TPNAME1= <>
##$TPNAME2= <>
##$TPNAME3= <>
##$TPNAME4= <>
##$TPNAME5= <>
##$TPNAME6= <>
##$TPNAME7= <>
##$TPOAL= (0..7)
0.5 0.5 0.5 0.5 0.5 0.5 0.5 0.5 
##$TPOFFS= (0..7)
0 0 0 0 0 0 0 0 
##$TUNHIN= 0
##$TUNHOUT= 0
##$TUNXOUT= 0
##$USERA1= <user>
##$USERA2= <user>
##$USERA3= <user>
##$USERA4= <user>
##$USERA5= <user>
##$V9= 5
##$VALIST= <valist>
##$VCLIST= <CCCCCCCCCCCCCCC>
##$VD= 0
##$VDLIST= <DDDDDDDDDDDDDDD>
##$VPLIST= <PPPPPPPPPPPPPPP>
##$VTLIST= <TTTTTTTTTTTTTTT>
##$WBST= 1024
##$WBSW= 30
##$XGAIN= (0..3)
0 0 0 0 
##$XL= 0
##$YL= 0
##$YMAX_a= 1416470
##$YMIN_a= -1201326
##$ZGOPTNS= <>
##$ZL1= 120
##$ZL2= 120
##$ZL3= 120
##$ZL4= 120
##$ABSF1= 10
##$ABSF2= 0
##$ABSG= 5
##$ABSL= 3
##$ALPHA= 0
##$AQORDER= 0
##$ASSFAC= 0
##$ASSFACI= 0
##$ASSFACX= 0
##$ASSWID= 0
##$AUNMP= <proc_1d>
##$AZFE= 0.1
##$AZFW= 0.1
##$BCFW= 1
##$BC_mod= 2
##$BYTORDP= 0
##$COROFFS= 0
##$CY= 19
##$DATMOD= 1
##$DC= 2
##$DFILT= <>
##$DTYPP= 0
##$F1P= 11.0000007629395
##$F2P= -0.999999237060547
##$FCOR= 0.5
##$FTSIZE= 0
##$FT_mod= 4
##$GAMMA= 1
##$GB= 1
##$INTBC= 1
##$INTSCL= 1
##$ISEN= 128
##$LB= 0.05
##$LEV0= 0
##$LPBIN= 0
##$MAXI= 10000
##$MC2= 0
##$MEAN= 0
##$ME_mod= 0
##$MI= 0
##$NCOEF= 0
##$NC_proc= 0
##$NLEV= 6
##$NOISF1= 0
##$NOISF2= 0
##$NSP= 1
##$NTH_PI= 0
##$NZP= 0
##$OFFSET= 16.51637
##$PC= 1
##$PHC0= -275.1915
##$PHC1= 4.101552
##$PH_mod= 0
##$PKNL= yes
##$PPARMOD= 0
##$PSCAL= 4
##$PSIGN= 0
##$REVERSE= no
##$SF= 200.13
##$SI= 16384
##$SIGF1= 0
##$SIGF2= 0
##$SINO= 400
##$SIOLD= 16384
##$SREGLST= <1H.CDCl3>
##$SSB= 0
##$STSI= 0
##$STSR= 0
##$SW_p= 4139.07284768211
##$SYMM= 0
##$S_DEV= 0
##$TDeff= 0
##$TDoff= 0
##$TI= <>
##$TILT= no
##$TM1= 0
##$TM2= 0
##$TOPLEV= 0
##$USERP1= <user>
##$USERP2= <user>
##$USERP3= <user>
##$USERP4= <user>
##$USERP5= <user>
##$WDW= 1
##$XDIM= 8192
##$YMAX_p= 0
##$YMIN_p= 0
$$ End of Bruker specific parameters
$$ ---------------------------------
##NTUPLES= NMR FID
##VAR_NAME=  TIME,          FID/REAL,        FID/IMAG
##SYMBOL=    X,             R,               I
##VAR_TYPE=  INDEPENDENT,   DEPENDENT,       DEPENDENT
##VAR_FORM=  AFFN,          ASDF,            ASDF
##VAR_DIM=   16384,         16384,           16384
##UNITS=     SECONDS,       ARBITRARY UNITS, ARBITRARY UNITS
##FACTOR=    0.0002416,     1,               1
##FIRST=     0,             0,               0
##LAST=      3.9581328,     0,               0
##MIN=       0,             -1201326,        0
##MAX=       3.9581328,     1416470,         0
$$ Real data points
##PAGE= N=1
##DATA TABLE= (X++(R..R)), XYDATA
0@%%%%%%%%%%%%%%%%%%%%%%%%nQnJ9m1M3m0N1n9N4n5O4o8O8p2Q4r2R5j03J12j15
45e7J24j42J54j63J73j95K18k41K75l13L57m13M90n85P14q97J153j520K083l000
65a785M597p711J4900l7639K32481J211627o40346j615120l264J250855L00549
76G09144r70612l43689Q96598M40220r90323p98550Q61253J196301m35877j290609
86g26144L9055J244651L05489j116659o27933R03117Q95733o27397j139669J80807
96f68950J109631J75362r00941k80330Q17230L97281p72051n81311O92839Q71543
106H60303m15944j087355n2796R81142L43686q11262m98537O88394O52612n39003
116A21240q10981L16978R60121Q2537q50579l83579N86404M26616m68189m38149
$$ y = [0, 0, 0, 0, 0, 0, 0, 0, 0, 0, 0, 0, 0, 0, 0, 0, 0, 0, 0, 0, 0, 0, 0, 0, 0, -5, 3, -2, 17, -24, 19, -21, 30, -29, 25, -30, 34, -34, 34, -38, 46, -46, 49, -54, 58, -57, 67, -75, 79, -84, 89, -106, 112, -129, 146, -167, 190, -223, 267, -318, 396, -501, 652, -868, 1215, -1785, 2812, -4899, 10001, -27638, 204843, 1416470, 776124, -838996, -842260, 408595, 709144, -261468, -605157, 291441, 731661, -258662, -1057212, -195959, 1000342, 564465, -726144, -687089, 557562, 863051, -253608, -881541, 21576, 917309, 289912, -849757, -668950, 440681, 616043, -284898, -565228, 252002, 649283, -122768, -704079, -11240, 860303, 444359, -642996, -695792, 285350, 629036, -182226, -680763, 7631, 660243, 121240, -689741, -372763, 587358, 669895, -180684, -564263, 22141, 448757, -19432, -457581]
126d57581M67865N52320m65928q26762K17635J015977K58596q51891n98930N07343
136a81356O81968k13640n90976J06422N33738r9996o16731k2371O68824K24084
146D89966o14601m14491M87394N66668l11580o69969J03614P16067J46102o36968
156a37798l49091M49876M10408k78854l66327K25570L63529k29330m82880J30187
166b64710O09542R6408o09841l44220M44417M59130k47261m36972J49741M31202
176B87436p6747m58723l0058M79437J88505m22503l27188K79492L38619k08752
186D9518l47157J79777M13021r9674m85994m7623N16079K71894l89501m00027
196c39687K12288M02570j01285l80898K5169L44942m12l71796p4706L91472K04861
$$ y = [-457581, 10284, 562604, 96676, -730086, -512451, 503526, 762122, -89769, -688699, -181356, 500612, 286972, -304004, -197582, 336156, 236160, -380571, -402942, 265882, 489966, -124635, -539126, -51732, 514936, 203356, -466613, -362999, 353068, 499170, -137798, -486889, -37013, 373395, 94541, -271786, -46216, 317313, 87983, -394897, -264710, 344832, 441240, -168601, -512821, -68404, 390726, 143465, -293507, -143766, 287436, 210689, -248034, -278092, 201345, 389850, -32653, -359841, -80349, 258270, 49518, -297639, -117862, 295159, 195485, -290509, -338132, 177947, 449841, 60340, -339687, -127399, 275171, 173886, -207012, -181843, 163099, 162687, -209109, -283815, 107657, 312518]
207C12518l41579l07426K81047M26214j49142m87486j5065M68739J60467l92704
217d4417k76635K51601K82424j73874k73309J59227L26260j22412m12311K7595
227b55851M92952J63672m47663l33997L00539M04648j48841m08847K9492L78043
237A74147L6323l81065j17975L80692K25028l34682l18708K56851L94703j43493
247A71821m28748L1274M48508J00844m36989k46480L63281L56213k57223m26501
257c24000J23737M30607j4537m11935p4145L96659J78183l52736k72263L00660
267a9770L75161k04438m50234P5730M74631N5842m66965k08439L82819L19370
277C33707k64642l82116J42960M04433l1478l86751l1917L96868J16898l96262
$$ y = [312518, -29061, -336487, -55440, 370774, 221632, -265854, -280919, 187820, 348287, -44417, -321052, -69451, 212973, 39099, -234210, -74983, 251277, 128865, -283446, -255851, 237101, 400773, -46890, -380887, -80348, 324300, 175459, -233388, -203896, 174147, 210470, -170595, -288570, 92122, 317150, -17532, -336240, -79389, 315314, 171821, -256927, -225653, 222855, 323699, -113290, -359770, 3511, 359724, 102501, -324000, -200263, 230344, 215807, -196128, -270273, 126386, 304569, -48167, -320430, -19770, 355391, 150953, -299281, -223551, 251080, 306922, -160043, -368482, 14337, 333707, 69065, -313051, -170091, 234342, 202864, -183887, -215804, 181064, 297962, -98300]
287i8300k31859L47839L50333k45078m52198P1779M62004Q3700m14862j96413
297c23055L45636K72728k64121l09915K05837L62601j17821l99798O259M09573
307A87924J13674l96181k51020L22432L49106k25036m15089J03077M33740K7582
317B50209l96354j24039L50559K15909k83993k86228K14871L47795j37621m04710
327b53602K6813M14391Q0244l95284j94013L30417K89450k28824l47673J24092
337a53989L86412k513l76118r4870L44060J70659k99466k36700K34563K81119
347B53157j70722l36624P1355L66818M8113l57043j62087L14302K63331k23113
357F7487l07028J34316L20905n0008l15168l1653K91321R8520k76471j84346K34159
$$ y = [-98300, -330159, 17680, 368013, 122935, -329263, -257484, 204520, 288220, -126642, -323055, 22581, 295309, 31188, -278727, -72890, 289711, 171890, -227908, -221649, 187924, 301598, -94583, -345603, -23171, 325935, 100899, -314190, -211113, 222627, 250209, -146145, -270184, 80375, 296284, 12291, -273937, -59066, 288729, 151108, -253602, -226789, 187602, 267846, -127438, -321451, 8966, 298416, 69592, -278081, -153989, 232423, 229910, -146208, -241078, 102982, 273641, -25825, -262525, -27962, 253157, 82435, -254189, -182834, 183984, 232097, -124946, -287033, 27269, 290600, 67487, -239541, -105225, 215680, 165672, -149496, -181149, 110172, 208692, -67779, -252125, -17966]
368a7966K60187j71625l17777Q8779L52280K0735l29667j10843K82748J90376
378B47227k11206k43754J32625K67971p3575k96793J903L02311O7234k95016j42557
389b43630K61714K23174j85000k71491J01701L04215j856l01709q6853K71407
399G1672J49718k36709k07650J77773K37477j20597k63134N2472K79781L2158
409A72961k70269j08451K52297J93028j98254k50538J26322K76848n2389k82563
419a41008l0947K52802R0459k22401j48658J83046K00379j32143k36206Q3425
429a01252K73266q280k76463o7377K54533J39845k09091k03901J34115K31615
439A67010o9031k49374J520K47575N6688k31718j04156K16760J64347j71242k10048
$$ y = [-17966, 242221, 70596, -247181, -158402, 193878, 214613, -115054, -225897, 56851, 247227, 36021, -207733, -75108, 192863, 119288, -177505, -175602, 126709, 193943, -101073, -243630, 18084, 241258, 56258, -215233, -113532, 190683, 188827, -112882, -199735, 71672, 221390, -15319, -222969, -45196, 192281, 71684, -191450, -138978, 140803, 172961, -97308, -205759, 46538, 239566, 41312, -209226, -82904, 193944, 141555, -141008, -171955, 80847, 171306, -51095, -199753, -16707, 183672, 51529, -184677, -101252, 172014, 163734, -112729, -180106, 74427, 214272, 5181, -198720, -64605, 167010, 97979, -151395, -149875, 97700, 154388, -77330, -181486, 35274, 199621, 28379, -181669]
450a81669J13569K47656l8138k64037m8053K43276J12535k14014j70939J61845
460c7969K04052j07007k20318N5211K36936J2337k29845p1842K18308J37207j84750
471A2320j94958J27741K25407o9890k46049m587K33708O8277k06431j21481J72205
482c738J70670j21106j95241P7568K18993k1318k26422l8382K13172R3138j92108
493b4774j56052J39871J94556q1365k17720J9552K21978M4401j99173q6816J76879
504C1337J31547j39328j64685R5684J90724m9512k16594j7945K12543P8394j94363
515d2198j35627J52717J77040r3263j90568M4044K00041J3373j92095o1748J79353
526E1069J07520j60538j58881J16844J88548o8375k09274M578K06467N7475j82466
$$ y = [-181669, -68100, 179556, 141418, -122619, -170672, 72604, 185139, -28875, -199814, -37969, 166083, 59076, -161242, -106031, 130905, 143242, -86603, -158445, 59863, 197070, 12320, -182638, -54897, 170510, 100620, -145429, -150016, 83692, 151969, -54462, -175943, -3738, 166932, 45826, -149415, -71847, 147146, 125828, -100594, -138976, 74196, 167334, -24774, -180826, -40955, 153601, 72236, -145484, -125932, 96046, 140447, -58726, -145542, 31337, 162884, 23556, -141129, -45445, 145279, 95767, -120827, -138772, 73771, 152165, -42198, -177825, -25108, 151932, 58669, -131899, -87855, 112186, 125559, -66536, -128284, 51069, 158589, -1949, -160830, -43986, 144562, 76187, -133087, -128509, 77958, 135433, -47033]
537d7033j05456J56089J54713j09688j80308O5625J95921j8851k02157l6483J85602
548E7974Q1271j66855j32369J26696J70599p7740j93083K9560K08244L1336j94322
559e8689p7962J71216J21130j34046j56155Q4348J71613m1716j88875j1142J87307
570F7029N7850j77143j01919J57859J50844j09472j76228N6915J88932L877j81531
581f2987n6171J59553R1358j43337j30917J11312J55899p5601j76103K9525J86624
592H9155L1321j69977q0312J45938J27781j05632j55970O2274J66825k5364j74338
603h8299k1902J60472O0513j42670j00233J13390J38393p0121j59088K8681J74672
614I3808K3598j64890o4767J42523R6624j17517j29861P4094J46529l2277j60187
$$ y = [-47033, -152489, 3600, 158313, 48625, -131683, -66058, 129863, 111012, -91145, -127628, 57974, 139245, -27610, -159979, -33283, 137316, 59576, -133507, -103947, 104297, 135633, -58689, -136651, 34565, 155695, 21649, -134506, -50158, 121455, 79739, -109136, -120278, 67029, 124879, -52264, -154183, 3676, 154520, 45048, -131180, -74265, 114667, 118544, -62987, -119158, 40395, 131753, -11584, -142501, -31189, 124710, 49109, -126994, -97469, 89155, 120476, -49501, -129813, 16125, 143906, 38274, -117696, -55422, 111403, 86039, -88299, -110201, 50271, 110784, -31886, -132119, -18729, 119664, 49543, -109545, -80864, 93808, 117406, -47484, -112251, 30272, 126896, 9379, -120482, -46388, 100141, 67864, -92323]
625i2323j6452J58227O2346j40799r3636J23173J27012q7202j44199M9269J56626
636A02042m548j63051n1639J44776R3391j21388j28595Q5198J46088m9901j50422
647i8049J9658J57354K5758j46678o6269J30436J08599j01761j44557N7540J57433
658I9464j9527j63451k4509J48282N9045j25043q5713J02951J17027o6766j35237
669i3477L2982J52006R587j54206n2976J35273Q3693j11352j13938P0620J24508
680H2720l2805j29185j110J35136M2120j25819p4419J12009J06207q0501j24170
691h9817M3316J26982j0235j29986l1637J17355O4991j04141r7051Q2102J24860
702I6739m5515j32170J3663J33350K3551j19208n2677J01152P9380q4447j11555
$$ y = [-92323, -108775, 49452, 111798, -29001, -122637, 536, 127548, 40346, -103853, -54584, 102042, 97494, -65557, -117196, 27580, 120971, -417, -129012, -43814, 102274, 52373, -98049, -78391, 78963, 104721, -41957, -108226, 22210, 130809, 29048, -115509, -57969, 99464, 79937, -83514, -108023, 40259, 99304, -25739, -111452, -8501, 108526, 41760, -93477, -60495, 91511, 101098, -53108, -106084, 29189, 112882, 1530, -112408, -41788, 82720, 49915, -79270, -80380, 54756, 96876, -28943, -103362, 8647, 114854, 34353, -89817, -46501, 80481, 70246, -59740, -91377, 25978, 90969, -13172, -110223, -28121, 96739, 51224, -80946, -67283, 66067, 89618, -29590, -82267, 18885, 98265, 13818, -97737]
713i7737N1993J27682k0932j38571j6292J34486N3149j12886p7513R0837J04114
724I8330n6263j16447K3789J23252O021j28562m0730J18045O7558j06124r7886
735a09017P6304J18030l6828j21812J908J22760L7039j08166o1489R5153Q3467
746I7349q0367j06307N0990J17233k0682j23218k0725J11713N3082r2963p5439
757h9334P6742J00052m8623j10173K2854J17318Q386j13799m2113R5120O5697
768H2127p8098r0154N0305J03390k4277j11127l056J14160L7267r8540o0178Q2297
780D116Q4217n6773j00871K5177J06402K503j09898l5946R6781N8535q1847p8083
792h5687O3153R6918l3970j04764O750J12574L0729j03798o1917Q3485Q0501o3292
$$ y = [-97737, -45744, 81938, 61006, -77565, -93857, 40629, 93778, -19108, -96621, -5784, 98330, 42067, -74380, -50591, 72661, 78682, -49880, -90610, 27435, 94993, -11131, -109017, -32713, 85317, 48489, -73323, -71415, 51345, 88384, -19782, -81271, 13882, 97349, 16982, -89325, -38335, 78898, 58216, -65002, -85727, 25986, 79068, -13895, -89334, -12592, 87460, 38837, -71336, -48482, 68836, 77222, -36577, -78690, 16430, 82127, 4029, -86125, -35820, 67570, 43293, -67834, -70890, 43270, 80537, -18003, -78181, 4116, 88333, 31560, -69311, -44134, 62268, 64771, -45127, -81073, 15708, 74243, -7604, -85687, -22534, 74384, 40414, -64350, -57600, 54974, 85703, -18095, -80012, 3473, 83974, 20682]
804B0682r7074L5295J00592j2939j05325j5761J04570M9373r0406p3819P3349
815a1463R7669m3288j05642J6529J05723R001j05171m1013Q9745O3052p4302q5810
827h4970N1303J01365k4596j05018J014J08560L0186r5174n4577P8497P5401n7223
839B4768r3790K7879R8323n873j03921k2124R8032M7558q1763o5623O3351Q3487
851G0304l3826q8602J0710R3087J4935r3260m3015Q0969O1857o6767q1445L9422
863c5631Q7074j2461q5492j0601Q3773L7501p1176n5914O1276P5517m2183q8229
875e6546J6920Q7794N153q6229l3411P1459N3056n5429o9833L7874Q4906j3513
887D2201q6320l837Q7598K6589p8712m7455O2238O3361m4987q0897J6732Q4854
$$ y = [20682, -76392, -41097, 59495, 46556, -58769, -74530, 30040, 79413, -10993, -84812, -11463, 86206, 42918, -62724, -46195, 59528, 68529, -36642, -77655, 12090, 75142, 840, -84970, -33667, 67698, 43102, -61916, -60902, 47658, 77844, -17330, -71907, 6590, 81991, 24768, -69022, -41143, 57180, 51307, -52614, -74738, 23294, 70852, -10911, -76534, -13183, 70304, 36478, -52124, -41414, 51673, 66608, -26652, -69667, 11302, 73159, 6392, -75053, -35631, 51443, 38982, -46510, -57111, 26662, 64163, -7013, -62927, -1651, 73866, 31683, -56546, -39626, 48168, 53321, -32908, -66319, 5140, 58196, 2767, -67066, -29192, 55714, 42201, -44119, -47956, 39642, 66231, -12481, -59936, 2302, 65663, 20676, -60221, -43489, 41365]
899D1365N363q6356k6601Q2387M8288o8006o0157N4031P5818k9289q2109L558
911d1708Q2632J9056q1909m4892O9577N9521n8072p4542L9597Q3133j4289q1477
923d3373o929P9846L4010o7287n2673N4570O7621m0973q0822J9128Q0834j808
935D2144q0804k1238P1435M2005n4814n7638M0585P4175j7805p7715L57P8108
947C8795J7434p3293l6423N8236M7575m5646o2713K3931P0830k312p3040j6338
959e2964P3314L7560o0266m8595M9014N8800l1330o6205Q781O5989Q899o7768
971b4771l2496N9479M8211m8838n9726L6347O9284j4881o7356j409O6388K3168
983E3400n9080m1903M5883N4381l5486o8304J7072O9625j375o9027j4977O3410
$$ y = [41365, 46728, -39628, -66229, 16158, 64446, -3560, -63717, -9686, 66132, 36843, -45266, -41708, 40924, 59980, -21929, -66821, 2756, 62277, 4205, -70337, -30740, 52393, 38104, -43373, -50302, 29544, 63554, -3733, -56406, -1836, 65785, 24812, -56010, -36882, 43952, 42144, -38660, -59898, 11537, 53542, -1272, -58910, -18325, 55850, 38045, -39670, -39313, 38795, 56229, -17064, -53487, 4749, 52324, 6678, -56035, -32104, 38726, 36414, -36626, -52964, 20350, 57910, -2356, -50951, -1937, 56863, 25533, -40672, -31891, 34098, 42997, -24771, -57267, 2212, 50423, 1585, -58141, -21794, 47490, 32609, -34747, -36156, 30232, 53400, -5680, -47583, -1700, 52681, 17195, -51109, -34037, 35588, 34213, -34814, -49791, 13619]
995A3619L4488m9060m6024L7446O0984j9073o7676J095O7989J3315o6639l1577
1007e1113N3475M1444m1690n2514K5343O1182n451o1740r782O5020K9186n6623
1019c263m2195M5221N1793l2350o0126J1327N8465L894n9086k2977N4620L9567
1031D4890m4551m9627L5699O1620j7770o2467J863O1106J5267n6926l4153M3737
1043a312M5700l5136n8687J9618O4221l831o3508j0048O1600K9301m9306m0663
1055d2051L8116N2968k2927o2062M603O2199Q419o3286k6672N4874L8956m2927
1067B10m8693K9214N8783q791n9541n436O1192K2519n5884l7752M5112M6329l5031
1080A2231n7348J5571N9148R67n8347j7652N5046L5272m4080m3616L5267N4914
$$ y = [13619, 48107, -953, -46977, -9531, 51453, 32380, -35296, -34201, 33788, 47103, -19536, -51113, 2362, 43806, 2116, -50398, -25055, 36127, 30676, -31064, -40846, 24174, 53360, -3263, -45458, -237, 51556, 19206, -40920, -29593, 28872, 32766, -26320, -49297, 5323, 44890, 339, -49288, -13589, 48031, 30261, -32206, -30343, 30763, 46030, -10896, -45049, -1312, 44388, 9252, -49435, -29817, 34404, 30573, -32935, -42983, 18617, 47918, -1388, -42051, -3935, 49033, 26106, -35956, -31353, 30846, 39265, -24021, -50693, 4181, 43137, 210, -48483, -19269, 39514, 30723, -28818, -34254, 26938, 49457, -6427, -44179, 933, 47262, 12231, -45117, -29546, 29602, 30569, -27778, -45430, 9616, 44888, 808, -42808, -7541, 47373]
1092D7373k0737n8085L635N7268J0876n6324l0281M4994M2098l5225n2268K1156
1104b5520N8977m658n6281p160N5793K4434m6272l7456L4742M7138k3056n7006
1116c6325N199N6362P431n5217k2454M7705L5550l5168m2683K4978N2524p027
1128C0875n4020p671N3251K1134m9185l5403L6723M1395k7078m9315J0919N1336
1140B2961N456m9253j7947M8441L4052l8121m2028K7886M8740j4742n1668j473
1152b7696M6704J3238m5506k8947L7109L9955k7514m6770J7611N3646j649m9859
1164a9678r792M6352K3015l7766l4585K5468M0797j7716m9860L286N1006Q159
1176B8686m8947j8505M2942L1089k9673l6012J9598M3723m887m6199q551M4474
$$ y = [47373, 26636, -31449, -27814, 29454, 40330, -15994, -46275, -1281, 40817, 5592, -46676, -25520, 33457, 28799, -27482, -34642, 21151, 45585, -687, -38143, -3401, 43737, 20681, -36325, -31126, 25236, 32667, -22550, -45004, 2701, 38251, 3083, -39600, -14622, 37902, 30875, -23145, -30816, 22435, 43569, -5616, -41019, -4296, 37099, 10021, -39294, -28375, 22961, 28417, -20836, -38783, 9658, 43710, 5589, -36439, -8553, 40187, 25445, -26223, -27696, 19008, 32246, -13260, -42207, -5098, 34857, 7343, -39427, -21816, 31830, 30181, -19678, -29470, 16882, 39897, 2131, -32454, -6986, 33811, 16095, -33765, -30479, 20527, 28686, -20261, -38766, 4176, 35265, 5592, -30420, -10822, 32901, 28014, -18185, -26736, 17738]
1188A7738J6898m3992k9591L4755L5271k4851m0687J2384M3192M027l9938j4239
1200b9033L9568K7885l3087l5526K5250L9293j8042m4308L763M1158O928l8267
1212a4418k0420L1583L1859k2519l6314J7754M3763o746m3469k823M1465J1854
1224C1569l6955k4612K5399L0686j7534l8426O521M1399L242m0082q849M0087
1236A2445J9474l0923k6210K2660L2090j1508l7173j850L5705R810l7187k0494
1248c3161L1614K6172k4528k8790J8225L4631n388l3262n104L3317J7754k9335
1260B145k7851K1616L0619j7480l5840P159L4418J482l1731j1408K9686K4190
1272B7005k0741l0117J4666L7076n181l8415l599L4778R304l3261k0679K4564
$$ y = [17738, 34636, -9356, -38947, -4192, 31079, 6228, -34459, -22075, 21117, 25144, -14794, -29033, 10535, 38420, 5333, -30193, -4943, 34350, 16308, -28000, -24237, 16921, 23849, -14418, -34838, -3255, 28604, 6085, -30229, -12475, 31288, 24542, -18927, -21750, 19715, 31569, -5386, -29998, -4599, 26087, 8553, -29873, -23352, 18047, 21289, -18793, -27642, 12445, 31919, 996, -25214, -2554, 29536, 18028, -19145, -20995, 14710, 24520, -12667, -33161, -1547, 24625, 97, -28693, -10468, 24163, 18775, -14487, -19591, 13726, 31480, 2145, -25706, -4090, 26529, 9049, -26791, -19632, 14786, 16268, -15463, -26871, 2815, 27005, 6264, -23853, -9187, 27889, 22708, -15707, -19306, 15472, 24776, -8485, -29164, -4600]
1284d600K7370j6705l4127P325L9408N186l7954j1719L7622K1770l0517k7636
1296b4577K1407L1223j3893l7793N77L7694R466l8682k0386L4651K9957k5337
1308D307l3362J9084L8321o767l7344l715L5948J3510l5463k5938K7820L2428
1320B8829k1788l8769J1081L9454j44l5642p704L4519J9772k6809k6718K0742
1332c177L3451j3584l8490K108L6214M859l4854j5280K7599K2302j8784k7244
1344b4880J2939L3227j795l2918n018L3158J3635k9344k2009J9708K4805j3057
1356H451k9912J383K9671P524k8514j3940K7707K3030k0369k6563J4235L0991
1368B3694l679l0695p115K6298J4243k5447k4180J8587K8073j2545l1506N864
$$ y = [-4600, 22770, 6065, -28062, -20737, 18671, 23857, -14097, -25816, 11806, 33576, 3059, -24577, -3170, 28053, 14160, -23633, -23056, 14638, 24104, -14578, -34964, -313, 29644, 4307, -29055, -9971, 28350, 21583, -15761, -19476, 16472, 29982, -5481, -31419, -3599, 28829, 7041, -31728, -20647, 18807, 18663, -16979, -24683, 9836, 29608, 2799, -23919, -3177, 30274, 16690, -21800, -19692, 16522, 21381, -13473, -28753, -1154, 21148, 2364, -24880, -11941, 21286, 19491, -13427, -18445, 14713, 28348, -996, -23005, -3297, 21508, 8451, -21461, -20078, 9593, 17117, -11397, -25337, 2370, 25400, 5031, -21532, -7297, 23694, 20015, -10680, -17795, 8503, 22746, -2701, -26881, -8294, 19779, 7234, -24272, -18408]
1380a8408L3995N189k9855j2715K7648K2445j9986k8624J1782L1750o443l5771
1392a8993m181L3169R986l0297j8018K5356K6569j5685l0310R014L5034J885l3769
1405a0240r663L1082J5792k8562k3742J9603K6434j3464l1363L486L3237O916
1417A9516k9792j3133K8866K1148k1303k4921J5797K7176q231l0142k632K7444
1429I793Q898k6798j8578K1706K3882j4535k5310J0133K8421o61k5391o425K4076
1442I211J3639k0096k1611J3105K4235r126k8158O7K6718N924k2995j0912K0226
1455B27J9170j2310k1720P352K5923M9k8052p596K5007J1626k2325j9296J4635
1468g310K1415p930k3518J127K6751Q070k4572j2132K3745J9203j8821k3639J2072
$$ y = [-18408, 15587, 20776, -9079, -21794, 5854, 28299, 8313, -20311, -8529, 23221, 16778, -18993, -23174, 9995, 19981, -10316, -28334, -2978, 23591, 7906, -22404, -13390, 21644, 23529, -10240, -19903, 11179, 26971, -1591, -25333, -5730, 20704, 7240, -24123, -20637, 12600, 19516, -10276, -23409, 5457, 26605, 5302, -19619, -3822, 23354, 15123, -15019, -17651, 9793, 18691, -8107, -26685, -4979, 18903, 4368, -20942, -10809, 17612, 16951, -8440, -14865, 9211, 22850, 2754, -18857, -5752, 18483, 9357, -18801, -18734, 7984, 13908, -9087, -19999, 227, 19397, 7087, -14633, -7281, 18642, 18691, -9361, -16957, 8050, 19676, -2649, -21945, -7310, 14105, 6175, -17343, -16216, 10535, 18605, -5967, -18099, 5646, 24849, 6028, -17611, -5539]
1481e539K3439n538k6242m230K3053J0648k1740j7563J9582K4042j3407k5386
1493a8881R828K7876p61k5771o445K1810J2128j9361k0295J2390K3539q918k7055
1506a9916K904K7809L862k3834p718K1234J5556j3534j9330P817K2111k258k6104
1519a1401n162K3468Q368k2542j3290J6935J7311r768j8804M275K1987N537k0427
1532c513j0291J9509J4902j7185j9670J1047J9325p213k1462j402J9754Q667j6425
1545c957j4033J4756K1331r291k2224O120K4040o82k3253o325J8569J0290j5857
1558e16j8319R435K1704m283k3971K90K5959O623k2174r537J9686J5027j3770
1571F154j9249O534K0905j847k4340o744K3015J0314k1116j4432J8223J8742j0899
$$ y = [-5539, 17900, 12362, -13880, -18110, 4943, 15591, -6149, -23712, -4130, 19912, 6505, -18881, -9053, 18823, 18062, -7709, -14154, 7656, 19784, 423, -19872, -7482, 16057, 7139, -19916, -17012, 10797, 14659, -9175, -16893, 4341, 19897, 6363, -12967, -5150, 16961, 14703, -11401, -16563, 6905, 15273, -7269, -20559, -3624, 13687, 3919, -14885, -10610, 11377, 16914, -3513, -13804, 5705, 20607, 3422, -16248, -5201, 14124, 6911, -14551, -15953, 3801, 12468, -3957, -17990, -3234, 18097, 8806, -13418, -7298, 16742, 16060, -7193, -13518, 5051, 15341, -516, -18835, -9400, 12304, 8021, -15950, -15660, 10299, 16922, -5252, -14789, 4897, 19924, 6154, -13095, -6561, 14344, 12497, -11843, -18587, 4428, 14742, -6374, -20806, -2583, 16159, 5260]
1584E260j8557N949K1441J915k0814q329J8512J3162j7974j8615J1706J9319q521
1597D454j9896K589J9739M876j6556r135J5794J5752j0616j8298O685J9314l082
1610A1620k0391l668J6234O631j4500j2035J0277J6039m706j7145K117J9812M234
1623A4519j7320p311J4984J0607j1688j4986M689J5260j661j7616m270J6840R076
1636A1123j4586j1400J3090J5762o624j5579K744J6524K845j7074q804J3831J1710
1649A3562j3562j6540Q450J7570l985j7447r3J8409P152j4457j0328J3069J4917
1662A6717r320j8451M455J8442k136j9645m511J6506Q481j3717j2495J0673J7352
1675A2351m989j7410K493J9818K280j8358o614J5011R439j3398j4349O923J5200
$$ y = [5260, -13297, -7348, 14093, 16008, -4806, -13135, 5377, 18539, 565, -18050, -6344, 12975, 4454, -15442, -12853, 6886, 11762, -4794, -13929, 1865, 17617, 7001, -11297, -4612, 14702, 11620, -8771, -12439, 3795, 10426, -4074, -16109, -5832, 10207, 5501, -11644, -9527, 10285, 14519, -2801, -10112, 4872, 15479, 3791, -11195, -6506, 8754, 7093, -10523, -14793, 2047, 11123, -3463, -14863, -1773, 13989, 7365, -8214, -5470, 11054, 13899, -3175, -11979, 1852, 13562, 0, -16540, -8090, 9480, 5495, -11952, -12045, 6364, 13516, -941, -11269, 1800, 16717, 7397, -11054, -6599, 11843, 9707, -9938, -14449, 2057, 10538, -3179, -15674, -5001, 12351, 7362, -10048, -7555, 12263, 14543, -3815, -10429, 4582, 14021, 623, -13726, -6803, 8397]
1688H397k780j7517j383J7719O936j5027q246J4406J2758r639j4399M897J4912
1701A1034m45j6961n520J3798P970j3213j2097J0923J4144n747j3656L103J5492
1714H825L282j3454o786J1494J0536j0092j5038N858J4283l927j5430j317J3971
1727B205N740j1110q145R940J3036m706j4116K282J5603Q70j5548n206J1747O584
1741I176j0653j0827N782J2750j563j3700j145J5446O160j2711p348J1423J0368
1754A3158p942j2392K866J1594k81j3581n589J2365Q585j1033j1185R518J3721
1767I804m082j2511J798J3337L381j1982q084R512J0242q824j4878M820J4958
1780G491k481j4722j566J3946O493r909q263Q879J2814m668j5079J016J5755R42
$$ y = [8397, 5617, -11900, -13283, 4436, 11372, -3655, -11901, 2505, 15263, 5624, -8775, -3878, 11034, 10589, -6372, -11892, 1906, 9876, -3337, -15434, -4511, 9633, 3886, -9770, -6667, 8825, 12107, -1347, -8133, 3361, 13897, 3805, -11233, -5375, 8908, 4981, -10449, -11766, 2205, 7945, -3165, -11310, -1370, 11666, 6960, -7156, -4874, 10729, 11599, -3949, -9155, 2592, 9176, -1477, -12304, -6522, 6228, 4665, -9035, -10180, 5266, 11426, -1285, -8633, 2790, 13158, 5216, -7176, -4310, 7284, 7003, -6578, -12167, 198, 8783, -2250, -13435, -3917, 9804, 5722, -6789, -4991, 8346, 11727, -255, -8339, 1173, 11415, 2591, -12287, -7467, 7491, 5010, -9712, -11278, 2668, 9161, -748, -9011, -132, 12682, 8014, -7065, -6049, 9706, 10648]
1794A0648j6444o112J3244P385j1211j0455O962J3229j316j3637m88J5764N689
1807A3258j4507p995J2721R732j0597j2524M855J1776j791j3187l851J2771Q428
1820I089j1429r467J1408J2964p189j2653M064J2459K20j2122n402Q869P419q563
1834c33j1822N617J3213l044j2751J469J3455K975r464n473P791Q904m534j1570
1848e567K62J1164Q21j2996m114J0468O044q168p249N749R716p2r349k134J1034
1863E609N736j0187q673P920Q610p326j1014K948R985M47r724m545R864Q903o653
1878A900r988O485J2546l258j2458L95J0550J825j0890o606P548Q744n904j1526
1892a0637L119J3508J70j2116q13J2594M671r831o533P011Q374n230j1449L01
$$ y = [10648, -5796, -11908, 1336, 8721, -2490, -12945, -5983, 7246, 5930, -7707, -8195, 7569, 13258, -1249, -9244, 3477, 13209, 2612, -9912, -5057, 6719, 4928, -8259, -12110, 661, 9089, -2340, -11807, -399, 12565, 5376, -7277, -3213, 9246, 9466, -2656, -8058, 811, 8230, -333, -12155, -6538, 6675, 3631, -9120, -7651, 5804, 8779, -685, -6158, 1633, 10537, 6003, -5567, -5305, 5859, 6680, -6316, -10430, 38, 6082, -2086, -9335, -3586, 6130, 6058, -3291, -5425, 5609, 11345, 1158, -7515, 405, 9015, 1689, -9325, -6377, 3608, 4055, -5669, -10214, -350, 8553, 1900, -8088, -1603, 10943, 7685, -4773, -4378, 6172, 7997, -2893, -9499, -1951, 6793, 889, -10637, -7518, 5990, 6160, -5956, -6769, 5825, 10496, 665, -5868, 1143, 9517, 4287, -7162, -6861]
1906f861J1115J405j2128m488J1211O955q526o653P242R315k537r327m23R795
1920F095K871j0066o535P961O266p421q561M266Q606j054p646o52Q661M976o415
1935A352o288N667Q384m134r587P08P943J59q505l790O234N869m540p080L721
1950c887R986o58q586p04R224L489p927n962M784O527l891r329L94R141J261r567
1966e705k872R794N936o566o195N482Q719k451r300q17Q818K377j0105n883Q028
1981g40O369p083p774N026Q816n62q001o82R340M010p653o168O476O943n947r210
1997f840K611Q089j310q233k089P359M898n148n509N294Q522k519q127J195P785
2012E978P0p589l560M717M123l739p083J513P624J085p133j708Q237M307n657
$$ y = [-6861, 4254, 5659, -6469, -10957, 254, 7209, -1317, -7970, -728, 8587, 6050, -3277, -3700, 6095, 8966, -1100, -7635, 326, 6592, -829, -9390, -5124, 3482, 2428, -5218, -5870, 2791, 7767, 1352, -4936, 731, 9115, 4981, -4606, -3898, 4045, 4204, -4301, -8091, -1857, 4012, -528, -7608, -3887, 6099, 5441, -3145, -3849, 5375, 8864, 937, -5025, -241, 6286, 2395, -6934, -6540, 2601, 3862, -5705, -8577, 1217, 7153, 587, -5608, -126, 8593, 6142, -3158, -3975, 4843, 7220, -2885, -8768, -740, 5629, -1454, -9228, -4202, 4614, 4052, -3949, -4631, 4709, 8719, 1066, -5102, 1374, 8317, 2370, -6840, -4229, 3860, 2550, -5683, -7772, -413, 4485, -663, -6172, -878, 7644, 5125, -3002, -1807, 5978, 6048, -1541, -5101, -384, 3739, 0, -7083, -5570, 2054, 3139, -3994, -5702, 2535, 6842, 1185]
2027A185m377M018N931k127p523j642O414L108p711n919O140O893m625o441L314
2042c362Q050P13p081k218P464N516o786q023M066Q422m218j0028J362Q609R19
2057C405q143l074P769O690m592p689M057J0341k146j0504j57R161J116r695m365
2072g826O444N795m678p712L009R277O28r223n38R873L180q240l818N646M921
2087F738m859o960O96O501M29p319k715P657M918o043m325N375N665k107m699
2102a048Q6M825J667n288m996L389M662l589o160K052N957j06l791j295M561L980
2118D906j841m771R31O013p2p132k014N476J750n512l947L107M725m20n271j89
2134d261P100L774o641l628O416M894n671o144K952N314j485p348j826O381L974
$$ y = [1185, -3192, 826, 6757, 4630, -2893, -4535, 1879, 4987, -2724, -8643, -2503, 4390, -235, -6676, -3362, 4688, 5401, -1680, -3898, 3566, 9082, 2296, -5727, -1661, 6761, 2543, -7485, -6123, 2486, 3405, -4738, -7812, -43, 6647, 2055, -5634, -1577, 8764, 6618, -3886, -4043, 5118, 6234, -3461, -7826, -1382, 4413, -265, -7977, -4968, 4309, 4937, -4286, -4824, 5049, 8229, -11, -3829, 1817, 6738, 1879, -5081, -4385, 2116, 2545, -4774, -7489, 168, 5086, -957, -5282, 93, 5758, 3651, -1048, -962, 3863, 5530, 242, -4754, -1365, 3297, -292, -6452, -4400, 1557, 1451, -2340, -3635, 926, 4906, 3065, -1706, -775, 5238, 5166, -1966, -3980, 1496, 3246, -2266, -6213, -3106, 1619, 1199, -4072, -4261, 2839, 6613, -28, -3656, 2760, 7654, 1983, -4161, -1209, 4105, 2620, -4728, -6554, -173, 3801]
2149C801n903n452O587P764m371p088M034P305j291p044j655N522L208o127o395
2164g105M233O804l426p891K747Q620l71o097k95O087L276m655m845K762N485
2179E329j958p864j45O652K63o907j195N378L164k842k653K143N028P70n180j934
2195a951N102K189o036l348L552K548k904l616M23M236J405l007k022M092M492
2210E155k547m562K258M477j371m891j225L056J591l191m027J886N313r92m727
2225c797O53O277J458m630j602L977K798k898m666Q78M374j104n707j497N760
2240B74J891m674k393M689M022j712l894J268N283K07n145k409M183K183n221
2255a448l831L139L944k233m026J184M796J443l625j487M320L455l603m196K426
$$ y = [3801, -2102, -7554, -967, 6797, 2426, -4662, -628, 6677, 5386, -1658, -3313, 2209, 5417, -710, -7105, -2872, 3932, 506, -7385, -4638, 3982, 3611, -2486, -2781, 3306, 6582, 1927, -2918, -156, 5329, 3371, -4493, -4638, 2014, 2277, -4630, -5825, -447, 2717, -125, -2778, -635, 4393, 5163, -17, -1951, 3151, 5340, -696, -4044, -492, 2056, -848, -4464, -4041, 195, 1600, -1407, -3429, 663, 5155, 2608, -1954, 304, 4781, 3410, -1481, -2706, 350, 1941, -1250, -5277, -3391, 1922, 930, -3797, -3144, 3133, 4591, -39, -1641, 2336, 5134, 2236, -2430, -1552, 2822, 1718, -3989, -5486, 274, 2165, -2509, -4902, -213, 3809, 2097, -1797, -529, 4754, 4961, -184, -2593, 1590, 3773, -1448, -5279, -2140, 1804, -429, -4455, -3271, 1525, 2968, -657, -2144, 2176, 5631, 2028, -2168, 258]
2270B58L667k324m586m72L293J222k937l005L017M470j673l736K083M942l17l765
2286A37j013L058J652l248l626P71L492q54n058J80N375J512m090j361M343L209
2302D479k070l541N75M515J88n480k476M453J721m848l187L646L594j805k991
2317c227R47M732J737l945k186M375L245m340m442K570L734k849m540L92L906
2332A09J299l721j726L849M138k267l922K711N013k021m702k2L112M4l079k810
2348c995J507L561j169m134J123M752Q72l758JL774J500k407k461N64K510Q1m768
2365b447j381L495J977l989k130L104L024j104j804Q96K858J451k854k503K396
2380I89L054l057m540J344L640j412l638P0L307K185j960k401K123M830r02n452
$$ y = [258, 3925, 1601, -2985, -3457, -164, 1058, -1879, -4884, -1867, 2603, 930, -2806, -723, 4219, 3902, 137, -876, 2182, 3834, 586, -3040, -2269, 1223, 369, -4689, -4509, 866, 2378, -1712, -3073, 1270, 4479, 2409, -1132, -557, 3958, 4146, -1334, -3810, 643, 2364, -2484, -5671, -2025, 1569, -236, -3227, -2280, 2452, 4189, 244, -1942, 2433, 5678, 1338, -3104, -534, 3200, 351, -4189, -3797, 109, 1408, -2313, -4039, -190, 3948, 1681, -2241, 470, 5483, 3462, -1240, -1262, 1850, 1894, -1185, -3995, -2488, 1073, -96, -4230, -3107, 1645, 2517, -1241, -1240, 2534, 4034, 1627, -834, -270, 2240, 2321, -2447, -3828, -333, 1644, -2345, -4475, -1371, 1653, 549, -1255, -359, 2499, 3950, 1096, -1407, 989, 4043, 986, -3554, -2210, 1430, 18, -3620, -3550, -243, 1942, -18, -2419, -296, 4534, 3632, -1820]
2396a820J007N042p30m762j538K839J514k682l106J132M455J98m613K49N820J495
2412D500m648j614M072K247l188l466P27K890m06m385j829M808K287l915k249
2427d169M611L141j985k937J682K829N52l344k570K579K350l640l714K669L651
2442A705k084l410J523L382J128k008j158J904L097j283m112M74L443j081m008
2457b488m18K460P49k154j242J328K768P93k733q8M112R72l763j525K730R48k375
2474G4k269N56J873j66k650j084K680L004k072k179L170K752j582k280N12J805
2490B144L01k647k271J378K427k062l405J612L454k83k697N90L117J115j515j705
2506d47J197K509q78m179l70K999J44l708r01L059J333j532j477J427K964M06
$$ y = [-1820, -813, 4229, 3499, -1263, -2801, 38, 1552, -1130, -4236, -3104, 1351, 1549, -3064, -2815, 3005, 4500, -148, -1762, 2310, 4557, 1369, -2097, -1370, 1520, 1114, -3271, -5100, -292, 1995, -1920, -4169, 442, 3583, 1598, -1339, 343, 3172, 3724, 380, -2190, 389, 2739, -901, -4615, -1946, 1705, -379, -3789, -2266, 1116, 2244, 236, -922, 982, 4079, 2796, -1316, -842, 2601, 1520, -2488, -2906, -446, 303, -1851, -3093, -1765, 1003, 1796, -937, -1025, 3087, 4059, 296, -1229, 1501, 2449, 74, -2195, -1639, 234, 68, -2582, -3666, -986, 2018, -54, -2233, 937, 3689, 2107, -173, 339, 2144, 2445, -202, -2473, -1095, 1332, -730, -4135, -2523, 931, 648, -2049, -1459, 1658, 2773, 1258, -447, 750, 3259, 2381, -1798, -2168, 831, 975, -2733, -3634, -575, 758, -774, -2251, -824, 2140, 2546]
2522B546k866m33L094J501l379k469K175J614k138k903P21K455N18k290j129L472
2538D89K583k214k655K853L018j895l159M35K278k85l339j879K727K298k371l083
2554d199K715L785p98k821P74L320N32l027q55J326J990k222l513R47L213j155
2570A2l522P62L073R58j926n54K108K023n52k684K72K597n55l347o75K146J67
2587C03j960j257J354J603K30j254J00K287J461j995j087J724J226j511j758m65
2603i99P87K22j289j517J072K417r45j849J230K813K85j917l5J671P84j443k682
2620a395M26J903l97l506l66L435R43k976n51K961J852j119j845O68L079L10l782
2637c60j474L185R81m364j719L006J919k103k229J585L076L54k386r72L662K054
$$ y = [2546, -320, -753, 2341, 3842, 463, -2006, 169, 1783, -355, -3258, -2537, -82, 436, -1854, -2983, 489, 3072, 858, -1797, 1056, 4074, 2179, -980, -545, 1733, 1448, -1891, -3770, -1043, 1255, -1116, -4199, -1484, 2301, 1503, -1318, -544, 2776, 3308, 281, -574, 752, 2742, 520, -2993, -2046, 1167, 12, -3510, -2748, 325, 1283, -643, -1197, 911, 2934, 2382, -302, -30, 2567, 2012, -1335, -2010, 136, 303, -1657, -2914, -1560, 43, 273, -981, -881, 1406, 2867, 872, -215, 1509, 2735, 1224, -534, -999, -212, 10, -1279, -2796, -1724, 693, -252, -2101, -871, 1942, 2227, 310, 275, 1946, 2730, 1287, -1395, -969, 934, 537, -2969, -3335, 100, 1043, -1933, -2484, 477, 2329, 1210, -635, 33, 3112, 3422, -360, -1834, 1351, 2332, -2032, -3751, -745, 1174, -929, -3158, -1573, 1503, 1857, -529, -1501, 2161, 4215]
2653D215l453k406K599K009k839l150J022K292o12j745j029K668K312j757k154
2668b028K616L128j746k547J176J816r64k016j102P19J288j026k423O87L041J96
2684H15k500O07K791N54j189o35L73P50j73j795j585J881Q24k226j838K352J357
2701C63p17q61O22K056R40j393j591J727K132j924l432J222K249j472k665L66
2717b378J860Q98j195j605J878L244n53l124P30L598o40l427m40K358p5k259j386
2734b516Q52J881j86k691O22L444R66k898j67L214P27k599j124Q45J108j087k239
2751a848n89K071Q26k220q97K570J403j388o37J434J469l23j096q20Q57Q24j645
2768ik059P13J618j101j407M96J621P18m98l84L94K152Jk007m13K280n05k762
$$ y = [4215, 762, -1644, 955, 2964, 125, -3025, -2003, 289, -323, -2068, -3097, -429, 1883, 126, -2028, 588, 3716, 1970, -577, 599, 2415, 1451, -565, -1667, -948, 340, -686, -3109, -2422, 619, 815, -1685, -1078, 1713, 2267, 1078, 443, 816, 1566, 1393, -402, -1987, -106, 718, -1508, -3346, -994, 363, -354, -1215, -593, 1463, 2403, 1010, -581, 1146, 3278, 1354, -2078, -856, 1393, -79, -2744, -2378, -518, 380, -815, -2420, -542, 2702, 2149, -975, -245, 3353, 2713, -714, -1154, 1204, 1129, -1130, -2516, -1664, 217, 31, -2660, -2038, 1406, 2372, -526, -693, 2521, 3248, 649, -475, 370, 1478, 391, -1848, -2437, -366, 460, -1760, -2657, -87, 1316, -72, -709, 725, 2194, 1871, 775, -45, 812, 1636, -9, -2068, -1355, 263, -838, -2245, -1749, -128, 590, 92, -292, 102, 2254, 2255, 248, -165, 2115, 1610, -1152]
2786a152p82J439O58j266j308N02K118O23j961n25L089J604k655j068K463J191
2802B970k187k140M57J526j75k554j107K665J715j782j985K870K323j612k000
2817a016J611K159n37k323j208J985O81k552k125K042J983j399j878J618K523
2832A564n36j246K86J559Q24j459j629N25J544j500j957M09J584n27j103J49J272
2849b41P04K35o90L46J548J4j340l54Q00q7j440n48J09j2M00p79m53R00K123p83
2869D52r18R29J475k81j311j08N24P89j530j761K33K045q41k284K19K954K37j775
2887i52M9K101J394j388j699Q52J984p21l221l31K589Q3l048o85K871J216j709
2904f15j248J853K466n01k395L29K608J57l442o63K338J24k288j453J661J458
$$ y = [-1152, -1934, -495, 163, -1103, -2411, -1909, 209, 832, -1129, -1654, 1435, 3039, 384, -684, 1779, 2970, 783, -1357, -900, 626, 451, -2103, -3210, -545, 1170, -612, -2597, 273, 2596, 984, -1016, 595, 2754, 2217, -106, -1314, 671, 1352, -1200, -3325, -1283, 700, -699, -2577, -959, 1564, 1028, -218, 68, 1627, 2451, 992, -637, -112, 1432, -68, -2025, -1616, -32, -559, -1662, -1513, -241, 463, 698, 8, 354, 1902, 1916, 576, 222, 1022, 935, -505, -1053, -944, -956, -556, -1335, -1788, -888, 1235, 452, -466, 463, 1938, 1657, 346, 238, 762, 1551, 21, -1740, -1507, 538, -303, -2587, -2368, 586, 823, -952, -903, 1198, 2592, 1204, -495, 357, 2341, 1620, -1601, -1932, 657, 740, -2308, -2993, -122, 1094, -615, -1863, -10, 2456, 1955, -440, -111, 2497, 2654, -788, -1451, 887, 1011, -1277, -2730, -1069, 389]
2920C89o95j493K27K560R91k062n02K640O10k128j221J118N35j073j568OR77Q28
2938A39j371q35J838J413q13p83J269R42l08r14r7KJ22n24j352k22J237k76j107
2957a640J62J225Q56m75J26K89Q65L60r59j208J350Q28k059j396R32N53p09q01
2975a701M07R41J284q53q06J429J725r64k031R88J732j036k234R6Q80q3r73j115
2993b314R96J988l29j907J116K652n87k148P27J932l08j809j028N76J025p48j947
3010b113N6K577K9k070m4K729M17j286j64J297O20n06j663o19J169L56k415o41
3028b271K087M70j662m20J497J226q8p62J14J037R89j617j332J170J091j639j580
3045a690P27P66p78p26K31J090J387m16q27Q40J535p38j585L50J112n89j208m98
$$ y = [389, -306, -1799, -1572, 988, 1979, -83, -585, 2055, 2665, 537, -684, 434, 969, -104, -1672, -1666, -689, 139, -1232, -2067, -229, 1184, 371, -412, 857, 1799, 1491, 577, 480, 482, 604, 80, -1272, -1494, -257, -533, -1640, -1478, -253, 603, 128, 254, 543, 1408, 1768, 809, -399, 951, 1779, -280, -1676, -744, -191, -900, -1701, -1294, -353, 931, 78, -728, 701, 2426, 1462, -569, 419, 2151, 1115, -1119, -1023, -143, -226, -1199, -2314, -1318, 670, 341, -1566, -450, 2202, 1615, -533, 194, 2126, 1818, 9, -1019, -443, 582, -166, -2113, -2057, 520, 549, -1521, -1565, 1164, 1581, 295, 131, 1428, 2048, 1542, -121, -740, 429, 785, -1630, -2271, -184, 286, -1376, -1796, -299, 927, 839, 77, 191, 1228, 2217, 600, -732, 438, 1529, -110, -1690, -963, -197, -975, -1701, -1470, -380, 1007, 591, -236, 604, 2139, 1401, -184, 166, 1278, 689, -519, -1017]
3063a017L17K12j88j178J84K027J70j050M6K014J42j116k77P52K81o99j362m04
3081a146P70K79j369p76J741P32p18k83J170J072j44p32l70R81M92j579j409Q60
3099d29P52q60j431N69J306j69m26j02Q70J229l17r96N17J715q86k103o3J344
3117E20j34j425o26O63Q89k62q90k5K290L75j374j55J909K98j612r43Q49L26n65
3136A08j544j43J214L85j496l59J804J507j232q77J358J180o68p85n90J010J90
3153A062j424j351J086J241j473j109R06J873n86o96L42J249O22m39j412N88J285
3170A764j179j870K40J055l00j371j32Q65Q51J54m94J23J792K08j606k17J342
3187A225L68j716j027O16O30o80j129K1J563O88r77p48J867J091j070r44J227
$$ y = [-1017, -700, -488, -676, -1854, -1670, 357, 527, -523, -477, 1537, 1679, 563, 286, 1038, 1319, 620, -742, -1146, -376, -97, -1466, -2242, -501, 231, -487, -770, 400, 1472, 1328, 596, 226, 1207, 1699, 120, -1289, -429, 323, -537, -1968, -1399, -93, -262, -688, -790, 80, 1309, 992, -4, 513, 2228, 1342, -761, -824, 520, 386, -1039, -1665, -1002, -113, -375, -1265, -1290, 1000, 1375, 1, -154, 1755, 2053, 441, -502, 347, 673, 108, -1436, -1579, -365, 20, -1476, -1835, -31, 1476, 244, -633, 725, 1905, 1237, 452, -138, 872, 1062, -362, -1713, -627, 614, -859, -1968, -1062, 811, 225, -471, -129, 1120, 1742, 1303, -109, 479, 1764, 585, -1285, -1045, 10, -290, -1661, -1793, -928, -77, 77, -417, -294, 1498, 1706, 100, -117, 1225, 1593, -123, -1150, -534, 96, -584, -1713, -1692, -129, 559, -418, -1166, 701, 1792, 722, -222, 1005]
3204A005Q96p43j471l77O23O87j241j510J112J413r78r36J163J481o0j187K04
3221H1J099O54j115j286K97J252j013j888L37J574m3j077q2J358P96l94o06J74
3239A18J488n1j629m79J627k32j691n88O73M06k07l75n74J598Q73q99m20J245
3257H83J108j340p45O06M36l07j291n17O24N73n84j376P39J800k00j284P91J690
3275A606o3j200l09P78N95q66j818l2J722n52j664j37K231J47j335P5J184J021
3293A383j51j160r3J657L26k564j024J975J31j676r43J595P85q60n93O22J217
3310F27P17q40q90J808N72j764j057J296L02j430p05M43N99K26r42n2O69J498
3328A077q76m61Q99J045p40o27L60k42m90j88q69m5P19rq28N26J081J35m47M59
$$ y = [1005, 1901, 1158, -313, -690, -67, 620, -621, -2131, -1019, 394, -584, -1520, -357, 1124, 1064, -123, 81, 1180, 1834, 719, -567, -270, 982, -31, -1919, -1582, -8, -51, -1128, -1210, 148, 944, 550, -56, 118, 1606, 1555, -74, -553, 1074, 842, -849, -1437, -764, -358, -565, -940, -1514, 84, 957, 58, -362, 883, 1991, 651, -94, 512, 948, 641, -650, -1167, -543, 30, -554, -1930, -1191, 609, 409, -875, -84, 1606, 1543, 343, 34, 812, 1407, 541, -1277, -1309, 413, -139, -1803, -1940, 291, 438, -897, -822, 362, 1383, 1232, 72, -21, 1636, 1962, -602, -1626, 349, 480, -1196, -2139, -544, 241, -619, -1212, -590, 627, 1344, 504, -386, 1422, 1994, 230, -827, 469, 771, -659, -1364, -921, -322, -96, -1038, -1090, -421, 1077, 201, -260, 639, 1684, 944, 317, 677, 435, -55, -243, -1112, -1157, -438, -447, -1275, -749, 332, 467, 20, 479]
3348D79N12P4J24n45o15L61L91j078j183N51P18n33o10M62R49J59no24J149J159
3368A895q42j476O55J347q28k174N01J259o00j069k82J406Q32o49r27J093J727
3385A868m09j860K31K030m13j917m64J045N45j590j260R40J808l78j786P84K390
3402A564j53j997N47J265L68j352j044N66Q55o77j668N97J129r5j305L36J675
3419F11J58n60j24N10O40l34r73L83J80j22r42n63P19K35p61Q3L53O39J14K42
3439D88l40M24J089o25p54m0K43m15o21j31r9K38J0n94J7J453L60o45j13J093
3459A038N97j129n83O49O1j05j157n69R86M89j527p40J693J156j344l85J437Q92
3477A459l16j017l0J086J42j679j002J059O49j299j036J117J418n48j263J026
$$ y = [479, 991, 1065, 1189, 644, 29, 390, 781, -297, -1480, -929, -211, -744, -1354, -892, 57, 216, 211, -413, 736, 1895, 1053, -423, 232, 1579, 751, -1423, -922, 337, -263, -1332, -1614, -208, 624, -25, -952, 141, 1868, 1459, -401, -170, 1860, 1447, -470, -934, 111, 656, -934, -2194, -1254, 554, 176, -1610, -826, 1564, 1411, -586, -39, 1226, 1594, 242, -802, -236, 619, -58, -1726, -1129, 0, -95, -1400, -1064, 611, 769, 209, 85, 595, 1235, 901, -72, 311, 491, 369, -573, -1136, -417, -182, -943, -860, -507, 132, 246, 488, 148, 572, 1661, 1036, 282, 242, 485, 70, -551, -682, -781, -543, -533, -1127, -1110, 343, 703, 58, -55, 1038, 1635, 506, -77, 572, 633, 528, -629, -1198, -212, 277, -1250, -1990, -297, 859, -485, -870, 567, 1459, 1143, 126, 96, 1182, 1324, -355, -1357, -298, 351, -948, -1984, -867, 551, 3, -1260, -234]
3493b34J061L93p63p21J059J027j230j522P36Q82r82j344M51R10R3p08K72L56
3511b64J154M1r17M63J109m93j147l81R54m41n60o66J07L91M17p09J28J185O87
3530A058q38k35R45N86p16m62k88M25j41q50n85M15P15q39q28R62J239K5o33M59
3550D14M86M03n10q73M78Q79j009j494K03J092m78j081L38J036L14j61n23Q33
3568C47P96J34j403R6J255l69j530N0O07j39q78j62L23O69L45q21J10J492P31
3587A653j232j49Q94J07r46m15J05k8L2r05n38P41P20o21o08J181Q74k05l43L80
3607F97L19k07k01r00j52O55k43j324K13R29m1r26N84Q94K09M3l70q7J078J06
3627A276j120o28J149J08j590m57P81M13n18n62L73J002N65n40o89J548P89j751
$$ y = [-234, 827, 1220, 457, -264, 795, 1822, 592, -930, -194, 688, -294, -1638, -1187, -277, -184, -892, -620, -264, 890, 931, 14, 477, 1586, 1093, -54, -435, 519, 78, -482, -1148, -1041, -650, -233, -942, -814, 371, 1058, 220, -15, 930, 1516, 800, 338, 50, 475, 334, -516, -1101, -686, 29, -810, -1638, -676, 563, 588, -45, 414, 900, 1303, 793, -80, 398, 1277, 268, -1226, -1023, 69, -409, -1490, -1152, -116, 198, 37, -486, 347, 1143, 1277, -126, -30, 1225, 856, -674, -624, -17, -156, -1034, -1196, -873, -204, 141, -680, -570, 922, 1653, 421, 272, 1166, 1273, 327, -88, 17, -11, 21, -884, -1422, -681, 39, -582, -1190, -9, 865, 660, 317, 697, 1016, 809, 608, -292, -444, 211, -32, -1356, -1143, -214, -255, -1181, -597, 297, 506, 549, 179, 92, 1170, 1276, 156, -472, 677, 785, -805, -1262, -481, -68, -586, -1148, -775, 227, 792, 252, -437, 1111, 1900, 149]
3645A49o78J169L61j114q18J33L32K51q08l38J163J158j336m31J374J060o83r75
3663c1O66K59o25o66l51K73M54q89k68M60R51m41p35Q20J156k41l34K87k7kj89
3684E27j027P3K07L11j458P7J170k91j82J19M36L25M07j85j49N17J96q86o12L16
3704a09K54o23m85K5L07J80j24o2L21J058r3o88O52M99l04n97j16L93l58n84l97
3725h51r5P06l11o61O33J278m6q10O34N48K38p11p38L29O19o62p99m07Q47q8q25
3746a172Q4J010N23p10K08K67R09k05o50j1N80K26j596n97P87K95j186lQ83L88
3766C0j0j69J8R04L81n64n48M67Q33r20j016L19O75p43m46k22K93J068n31n68
3786g49N92J236o20n52O17Q77m97j026k01L14J07o80m09K59O46k5q38J99J569
$$ y = [149, -529, 640, 1001, -113, -931, -798, -466, -215, -1023, -1361, -198, 960, -376, -807, 567, 1627, 944, -31, 635, 894, 269, -397, -748, -475, -21, -910, -1178, -718, 233, -208, -943, -123, 1033, 792, 458, 745, 718, 716, 527, -500, -427, -220, 91, -1367, -1290, -120, -411, -593, -474, -38, 287, 694, 509, 360, 877, 1073, 187, -425, -109, 145, -478, -963, -938, -631, -451, -575, -637, -316, 742, 649, -39, 613, 1112, 808, 211, 95, 488, 130, -454, -851, -946, -240, -551, -1212, -579, 699, 653, -157, 477, 1025, 1263, 552, -186, 143, 762, 100, -699, -1106, -259, -347, -1172, -1088, -78, 445, -265, -57, 210, 1119, 914, 264, 253, 833, 1059, -537, -1134, -347, -52, -1238, -1241, -358, 30, 20, -149, -131, 773, 1154, 590, 42, 509, 1342, 422, -594, -275, 400, -343, -789, -1011, -718, 350, -181, -749, -157, 1079, 459, -93, 524, 1401, 904, -122, -323, -9, 98, -582, -991, -732, -86, -111, -949, -750, 819]
3805H19k50m62j78J109j74j97n28k83N06j13r52n40J165j70m22l73J143JN0J67
3825C18k8N56L79n63p80O94J91q30p41K95N83q14j07J86J18Q18J84n89M15R92
3845A277l65q86M87L63o95m11m07L46j20Q9m77l27J288K9n79qJ031N21m94m12
3865B50K66L83j45r74m08M07J61p64n55Q64J097j121j29R59P82k63m75m3M63L63
3885A118q27j046O53N85q98r16O11J011p00m25K53R29M13m95l78O55N54l90j215
3904e08L45Q27p55q93K06M81j85j07j26J1J215k67j98L24R76n88q07J64N64m60
3924B19m45k97l56L63Q8m00j89Q13O60n17O5K86O23k98j17j48k12J45l41o08j6
3945f82P73n07p47M46Q51q5l71K95N48M75n8q77l5P26Jj376k06J088m40r91J87
$$ y = [819, 569, 107, -71, 1038, 864, 667, 139, -144, 362, 249, -703, -1243, -78, -248, -670, -1043, 100, 101, 151, 318, 290, 846, 1225, 662, -118, 576, 767, -63, -804, -509, 74, -740, -847, -661, -543, 275, 459, -130, 285, 1277, 912, 26, 513, 876, 181, -230, -637, -291, -411, -322, -799, -1126, 162, 191, -388, -396, 635, 1156, 662, 250, 516, 899, 754, -220, -628, -221, -60, -824, -1379, -515, 582, -539, -668, 291, 1073, 810, 335, 292, 755, 1118, 291, -755, -102, 483, -415, -1331, -720, 291, -409, -834, -581, 348, 761, 266, -112, 543, 1097, 707, -508, -163, 664, -91, -984, -778, -297, -482, -589, -715, -704, 511, 244, 46, 370, 1346, 758, -49, 115, 679, 219, -226, -523, -879, -516, -428, -828, -1017, -204, 456, -61, 4, 290, 913, 615, 498, 350, 138, 283, -58, -666, -682, 91, -416, -1163, -717, 134, 49, -322, -27, 521, 996, 938, 61, 26, 752, 753, -623, -829, 259, -181, -1172, -985]
3966i85O03N77l14l31K92R39K94r47j73Q38N9p62o87N96J41m88m99P6O99p2k47
3987c91k97J094M62n97l98Q56K63n33o56K16J99l31o33r5K13P36m40o24P18Q66
4007F28j57n13O57P8n4k00k33j43K00k91m82k70P14k46k86p5P24K28Q7j93J30
4028C03O30mp41k66O14l5p17n35M15L50l25n04K46P13R3m15k9Q69O56q97m99M58
4050C80K13m79o55J90L50n2o50l00Q72O44q13m88Q46J145n96n80L06M72l32n47
4070g4l18L68J97p05o73R45L51m46n17R18R49n35k29J63mK23J40r33nL45k99o88
4092h27PM05M5k45M16n2L30K98r3j16J20M06k79m76J35l5k13l03k76J78M65q0
4114a90n39M26Q67L5p51O0J060q3p26J42J1O4m85p26J00M85J96j073J49J336M2
$$ y = [-985, -382, 195, -119, -450, -158, 781, 1075, 128, -45, 793, 852, 90, -597, -1, 140, -348, -847, -771, -72, -144, -391, -688, 406, 868, 271, -127, 729, 992, 459, -197, 19, 218, -113, -746, -841, -628, 108, -332, -956, -238, 628, 471, -42, 615, 693, 639, 439, 206, 63, 263, -28, -510, -780, -66, -312, -598, -673, 51, 279, 366, 173, 303, 933, 929, 188, -78, 536, 501, -216, -751, -336, 14, -311, -815, -569, 144, 237, -178, -207, 662, 1318, 421, -78, 380, 593, 114, -541, -351, -1, -53, -703, -1003, -131, 513, -300, -788, 58, 1203, 607, 27, 333, 805, 473, -74, -392, -24, 173, -532, -1205, -260, 91, -355, -872, 46, 995, 460, 231, 394, 390, 613, 753, -180, -185, 160, -139, -827, -820, -415, -370, -615, -199, -251, 79, 377, 284, 168, 288, 694, 415, -61, 74, 39, -174, -477, -753, -575, -110, -190, -729, -303, 564, 599, -152, -92, 968, 885, 159, 301, 312, 376, -109, -835, -735, -250, -54, -1127, -978, 358, 400]
4135D00q32J31J007L02m41p43M68M01k39j314J05Q85j98j023p4J251L48q31j62
4154e59P52Q09l29n57M6P08J8j410k38R48J18r56m08O13J63K8k86L22P39J76m06
4175B91j08P77p2r17p2J27J55q12J69J29k7Q0M6m8K43N38l6q9L04kj95J57k71
4198C67m41k82J99k58k98R1M30r9m92Q81N38k53l24K94J61M25n05n06K33L33k83
4219B11r49K17O45m07n18k2Q71M58p78M8M13P90l43p09K14Q34p06j012r4Q18k16
4240b35m74O3J62Q06q1o66L62J031Nj109L71N30l91n92M2J08K13p06j52L59M14
4261F0J26o18J65R71J32n61j79O28j81l68j55r1K0j58m16j3K12L12o23K55M93
4282A1J86K45j33k7K20L0j16n84J23N73q75j44j42J90J10M3kJ83N61R7n16J98
$$ y = [400, -432, -301, 706, 1008, 567, -176, 292, 693, 454, -860, -755, 130, -68, -1091, -1165, 86, 434, -397, -559, 193, 1002, 673, 116, 162, 870, 888, -522, -760, 188, 306, -650, -1058, -445, -282, -254, -540, -218, 521, 697, 291, 183, 960, 888, -29, -101, 26, 181, -631, -462, -333, -360, -280, -234, -282, -39, 499, 463, 374, 678, 676, 481, 638, 367, -74, -356, -157, -415, -713, -622, -192, -291, -783, 98, 636, 383, 59, 353, 514, 939, 434, -72, 161, 494, 211, -738, -521, 124, -283, -801, -823, 48, 506, -272, -224, 189, 979, 636, -73, 141, 975, 269, -743, -837, -19, -235, -709, -646, -484, 322, 241, -425, -63, 968, 973, -136, 235, 765, 374, -218, -176, -68, 145, -561, -713, -354, 60, 186, -432, -267, 704, 836, 275, 96, 724, 543, 175, 20, -71, -51, -209, -625, -638, -426, -114, -737, -482, 11, 197, 442, 309, 282, 502, 532, 416, -168, -45, 528, -347, -491, -633, -443, -333, -290, -292, -109, 452, 549, 33, 231]
4304B31M90l9p30J63L56k94m60o42N33m5P6L7j18O11L33n91j79J017J73o59J3
4325B76o6K71j77p68k99N77jo16J34J58J018p30j92Q22J55j40k30N6M03j13l87
4346A51p74N22o3l73j99L71K75J65k50K22L47J76M9o25N99J78l15o39K4J05m6
4367a00m67J42rN74m1m32P6Q64J52n92p8M46L10o60m32M07j13k15l63k54K22O70
4389A07m37m06P64N59k79k72N97J50k04m38k80K45J06n29p98N91L92m11k12L88
4409c67M81%k41L49K42L95k59n49N2M41m69o69L14L02m15l01J54L73L61l31J26
4430a1J39O20l98j35j68N23l59l75k44M50k35l54OO7K39K79J8k38O15L17l34M7
4452D69L21k81l04l60O8j55J35j60l98J64M15j95k4L71M64q3k35J12n6J41r5n32
$$ y = [231, 721, 682, -48, 115, 471, 177, -283, -925, -392, -437, -361, -324, -442, 169, 502, -89, -268, 749, 922, 263, 276, 210, 481, 304, -464, -763, -186, -187, -803, -669, -511, 507, -223, -415, 407, 562, 422, 192, 248, 651, 538, 151, -623, -101, -164, -537, -736, -365, -90, 75, -175, 47, 394, 570, 619, -6, 593, 771, 456, -183, -159, -54, -100, -567, -425, -434, 140, 99, -333, -257, 607, 759, 167, 89, 535, 845, 185, -247, 160, 47, -168, -531, -785, -563, 107, -330, -736, 28, 587, 308, 36, 633, 783, 579, 141, -139, 106, 212, -317, -1115, -524, -132, -543, -755, -367, 114, 114, -127, 222, 464, 859, 600, 51, 103, 544, 75, -594, -280, 22, -393, -694, -540, -167, 194, -137, -11, 128, 748, 350, 215, 47, 570, 211, -164, -408, 42, -193, -547, -541, -474, -235, 44, 62, -176, 439, 756, 422, 469, 790, 509, 205, -155, -87, -242, -107, -267, -665, -501, -86, -281, -305, 66, 530, 447, 212, 324, 268, 409, 314, -218]
4474b18j12M37j35p70K07L95J51k47k09P03J32k18K28k03O23Jp91k57K83L61q46
4495d85J3P1K15j16l5o8N26M35j97l73K04O69n43m02L18J14l46n10P4K64r8R6
4517a74m03K00O61L8l27K41M85N6p75L83J09j29n44m26Q5O31k45m99k2P81l1k79
4539a84L35N65j20j73p4k32K67J50o91m11Q00l25m37j33N62J68l86K61J9L96j02
4560B55j46j36O08K37o66o00L55J54m70k68K89J4J47j76J08K38K65J89k54K31
4580C74L01k87l78J70j6m78Q1K3j96R8K54j66N3L82L07l65J59K77k85J44l70j
4602H1Q8j09m34l49J66N13l79r5M37K50P7K6k45M58K72q4p86K22L83m41p48K75
4624d22L43j99m00O5P02J18j38k12K16P15j60n79J21M50k64o19K4M21l40l69k73
$$ y = [-218, -330, 107, -28, -798, -591, -196, -45, -292, -501, 202, 334, 116, 344, 141, 764, 765, -26, -283, 0, 361, -485, -472, -401, -186, -302, -337, -405, 121, 556, 359, -14, 190, 859, 316, -86, 232, 346, 0, -510, -436, -172, -270, -174, -577, -377, 284, 322, -5, 236, 721, 777, 2, 385, 494, 365, -179, -605, -520, 111, -134, -633, -655, 126, 95, -184, 151, 716, 596, 423, 349, 117, 384, 534, -157, -568, 232, -93, -530, -663, -101, 67, -319, -58, -39, 357, 255, 109, -27, 581, 818, 152, -448, -93, 61, -409, -677, -388, -374, -227, -403, -295, -57, 208, 397, 143, 374, 675, 388, 10, 180, 164, -314, -233, -210, -406, -308, -54, -220, -167, 215, 522, 157, 316, 593, 308, 452, 82, 81, 169, 60, -374, -723, -557, -44, -423, -518, -81, 169, 246, 272, 27, 485, 757, 673, -113, 109, 492, 51, -697, -422, -79, -278, -678, -613, 89, 207, 69, -143, 73, 788, 628, 49, 170, 620, 356, -263, -239, 182, -158, -527, -800]
4645h00N91M07l1p17O29O27L5p18QN01j07n16k00K15K12n25m82O5N37J8m55O02
4667a04L70Q8n1J72J48k46k00r3j19l2k40j30O3PR2r6N6K90N4N3K46j22RJ11J25
4692D51l0n73K64l31k6j12J7j8J77j05q7O26K30n82J33L03K99k40k83j06L79l55
4714C1l69j60J12L49m31k38N97N14o19r6O08J62K0m65K26J13k52m53j66M55K63
4735B01n56l95O41K10j96l37L86N87Nk30k37L6L52n75l84L91L92p29l55M78L77
4756F2n25L32O2K27K64m8l29L88J59l15l78o0J17m4k73k8K56l20L53Lp1J77M60
4779D69j85n5J72p0L0J34m06j76J53k18k98Q2P6n6j26N41M58l96j71K35K13Lk33
4802A76p6k38K33p3n83J81L41k65j77J87M57R1l50j31P14J61j43m02k34N61l13
$$ y = [-800, -209, 198, 167, -550, 79, 706, 741, 23, 31, 532, 425, -91, -291, -76, 136, -389, -871, -806, -269, -251, -706, -104, 266, 354, 303, 475, 623, 377, 177, 84, -35, -67, -307, -437, -374, -367, -275, -371, -315, -25, 29, 82, 328, 206, 215, 326, 451, 421, -152, 112, -219, -245, -357, -340, -358, -181, -286, -373, 253, 483, -99, 34, 337, 636, 396, 113, 7, 386, 31, -338, -498, -386, -37, -468, -706, -109, 405, -214, -310, 298, 460, 480, 15, 241, 354, 102, -351, -517, -62, 201, -355, -750, -109, 101, -95, -432, -46, 541, 546, 316, 79, 115, 467, -108, -492, -101, 291, -438, -793, -315, 62, -463, -131, -69, 158, 422, 374, 45, 433, 592, 277, -101, -161, -44, -88, -361, -389, -133, -453, -100, -97, -168, 9, 469, 284, 229, 401, 331, 361, 495, 89, -87, 66, -152, -450, -368, -292, -348, -474, 67, 525, 129, -42, 193, 406, 409, 176, 100, -138, 95, 22, -561, -380, -39, -304, -481, -294, 163, 254, -96, -227, 487, 648, 505, 103, -131, 430, 117]
4823A17n61J04L38k3p12M03L94k65J34j03J56M77K02m25j80N96k28o27J22K94
4843B13m60k69ML88l33M95l31J88K13L73k77k90P72k77j84j66J19k97r8p3j06
4864c96j27K31J00q1J52L04p3K70j06j71J99K46k33q55P80j85l74l46O33j81K1
4885a92K7K0J14J99j02l6L51K10k38n20K50K15n87m22M91J82k39K0j72M13N00
4906D84l94l8M55R7l46k63M13O5l53o48L44J97j19l05j44N82J25l59j76M87M47
4927E51k04o1N0J57k52k44p7k79K54k33J99k22K79k09R3L57l8j24K99J35k05K20
4949D46k10l56k03K58j90p4%K4j87M77R9R4k42L78L4j17o2L95n40j78J22O4j27
4972i5p8j17n9L01m4k32o9O38K57j34m88M66J62k63j93k19J91l4l18n0K99K27
$$ y = [117, -444, -340, -2, -25, -737, -334, 60, -205, -71, -174, -18, 459, 661, 236, 56, 652, 424, -203, -81, 213, -247, -516, -512, -124, -457, 38, -293, -105, 108, 481, 204, -86, 686, 409, 225, 59, 178, -119, -217, -290, -396, -523, -292, -192, -273, -121, 183, 110, 380, 274, 103, 302, 548, 315, -540, 240, 55, -319, -665, -32, -213, -192, -165, -145, -31, 168, 66, 30, 381, 591, 353, -167, 83, 298, -289, -711, -220, -38, -277, -257, -429, -16, 484, 90, 52, 507, 604, 258, -5, 408, 473, 120, -528, -184, 13, -106, -411, -555, 27, 152, -207, -383, 104, 551, 347, 286, 336, 493, 241, -3, -80, -359, -105, -338, -139, -361, -82, -291, -198, 159, 121, -3, 296, 431, 226, 446, 236, -120, -323, -65, -255, -329, -329, -305, -492, -15, 84, 178, -64, 314, 348, 231, 169, 564, 24, -154, -32, 32, -95, -173, -290, -349, -48, -92, -324, -393, 245, 502, 368, -120, 346, 508, 245, 52, -167, 24, -10, -328, -378, -79, 148]
4994A48o14n7P05J08j93k11L84J04J04l92J53J68j25o37k34L77R3l14j40O75M4
5015A46j72O4J36M6K23l38j23M13j9l37k79K08M3l83j54K15J35J30Lm9N36q6K10
5038E68m32J66L46m50l62j0K11k33j4J23o39M48K00j72R2M31J1k12L45j27L2j93
5060A29J39l60o6PL0m37J84L00k62J8L55J70k41L75k4j5J18k19j86K8K48m50l96
5083e55L66j47Qj07L01K11j39L8J90Q1j6J46j47k28K50k27m65M49q9m49L47o1
5105b43n1J88M79k77n5J23J54j61L3j7j8p8j75j09j13M2q5j38K12N61l06n1L11
5128B26J75K4k68J74K4k06j27l00O2q5J61m45K67J66J06k99J67M08j34J99k60
5149C5O7L01l02l61OK30k04j14j61M79o5j40J5K55N43n08J23M7K00o9n58n9K11
$$ y = [148, -466, -523, 182, 290, 97, -114, 270, 374, 478, 86, 239, 407, 282, -355, -589, -212, -119, -433, -573, 102, 146, -26, 38, 174, 220, 443, 105, -18, 395, 376, 39, -240, -32, 11, -372, -526, -311, -176, -46, -43, -92, 444, 358, 568, 136, 302, 648, 198, -164, -174, 37, -196, -210, -87, -726, -278, -78, -250, -158, 273, 284, 72, 417, 290, 322, 129, 268, -92, -158, -151, -121, -558, -374, -74, -336, -318, 37, 207, -34, 341, 317, 302, 420, 201, 15, 43, 291, -159, -555, -189, -336, -328, -435, -134, 77, -62, -24, 166, 247, 231, 377, 230, 2, 252, 25, -440, 9, -80, -529, -182, -243, -294, -106, 373, 96, 41, 164, 318, 157, 190, 173, 155, 77, -98, -207, -320, -278, -363, -501, -289, 272, -34, -85, 226, 401, 425, 157, 331, 355, 149, 22, -278, -216, -301, -140, -585, -318, -152, -46, -345, -178, 230, 96, 295, 35, 102, 403, 101, -260, -254, -24, -228, -342, -503, -24, -89, -229, -214, 41, 584, 76, 199, 246, 446, 377, -181, -240, -29]
5172b9q1j29J55l98k3K55n0L41j14M39j78j39N49l28k05P2J90l80K36l05j93J35
5194a80j16K2Q6l5J38J20l4L06k0j29J81j0j75p8j28O5m40N20k85j32P4K6J46
5217g8J66N6J40Q6N8l1l53J3M1l19OJ37p8k49J16N4O0j42J23O4L67J14l78J85
5241A58J65j59K4l37P2k98J59r9l35M54J72o6j19K94K70l46J14o9K21m1q8j9l54
5264b27M1j00k49K96N5J69r7J7L44k78J14j35K34J94K2j41j57j21P4k90k10M77
5286C2q6k80J85oJ33K25n5p2K68J24l52Np5J85m00Qj54p3k7K02m1p0L62K10r3
5311A55Q1J25k14J48l75N32p67J56P9p3m3p6J98l95M95j50P5K71P2j25J53Nj36
5334A91l29O3O8LJ51j92k81o8L27j05j33O69j48P3k19J81k38O9Qj35J06j43m5
$$ y = [-29, -110, -239, -84, -482, -505, -250, -300, 41, -73, 366, 188, 49, 598, 270, 65, 137, 327, -53, 183, -122, -315, -180, -296, -274, -188, -223, -85, 35, 1, 307, 287, 158, 339, 329, 154, 76, -52, 13, -427, 93, -192, -324, -250, -224, -78, 88, 144, 284, 370, 428, 397, 44, 57, 98, -221, -215, -78, -156, -405, -289, -235, -175, -317, -194, -130, 237, 351, -27, 158, 323, 164, 188, -149, -77, -375, -216, -315, -650, -196, -24, -90, -209, 85, 355, 9, 123, 54, 275, 234, 146, 127, -227, -186, -286, -535, -239, -184, -15, -112, -95, 249, -29, 85, -50, 184, 378, 400, 259, 102, -19, 55, -235, -445, 32, -54, -334, -149, -155, -22, 203, 148, 76, 344, 468, 116, 121, 46, 231, -169, -161, -315, -388, -415, -213, -254, -324, 38, 248, 155, 236, 361, 147, 295, -80, 452, -315, -159, -80, -153, -196, -272, -74, -469, 26, -124, -49, 222, 294, 169, 322, 327, 191, -138, -75, -7, -4, 147, -45, -326, -394, -67, -172, -305, 364, 216, 289, 70, 251, 13, 82, 90, -45, 61, -82, -127]
5357a27j12j99M16n84O58j12OK98k8J16m04P0L01j35k77J20K44l69j05p8J49J26
5379b6l74J51O2K69Q1j45K65J25O5m06j04J67J16k19m42m7K66L15n33J4M85R9
5401A84l68J95K99k4j43J9q0K01k71j88Q4k61N51o56L7L99l9lJ57J09J34k0Kq9
5425B29M8O0l40L4j71J77n41L84N5k45PJ08L88j90J17p4J6K94k67J31q8j52j48
5448a68j46j05J86p8k51N36p2J22J04J24o0K53j11j19m3Nj33m8r3Q4k94P4k3J97
5472e9k76K15J24J40J67m98L16M66k0n40P6j33j29k75R7J87J75j16k22J36M69
5493C00k14n3K40J93p9k56j23J28n7k33k39M02l01J04P0J63q6L04k06m3M03l39
5515G8J01k4Q3j73p8P6j89m6o1Q0j20j64L93O0J15Q3J6j47J76L6j48l7R1n23K70
$$ y = [-127, -239, -438, -22, -606, 52, -60, -54, 244, 216, 332, -72, -2, 299, 164, -113, 7, 251, -118, -223, -301, -152, -26, -400, -249, -187, 82, 163, 18, 283, 408, 473, 67, -37, 130, 246, 27, -415, -462, -196, 119, -414, -400, 85, 184, -184, 11, 310, 286, 143, 162, 82, 283, 12, -176, -92, -353, 198, -458, -421, -22, -61, -64, 93, 202, 336, 316, 318, 229, 277, 337, -3, 31, -140, 37, -504, -120, -65, -310, -303, -195, 193, 3, 120, 46, 62, 356, 89, 220, 132, -20, -168, -314, -419, -233, -311, -562, -26, -98, 24, 128, 252, 192, 445, 334, 215, 172, 177, 44, -4, -97, -13, -307, -233, -256, -59, -335, -120, 4, 144, 311, -187, 129, 595, 575, 35, 111, -22, -151, -426, -329, -142, 33, -83, -305, -169, 300, 86, 33, 273, 466, 387, 131, 8, 136, 79, -154, -393, 9, -292, -188, -118, 45, -41, 263, 57, 14, 417, 78, 179, 155, 238, 65, -13, 63, -126, -172, -233, -153, -273, -437, -44, 16, 131, 214, 230, 83, 259, 295, 147, 110, 201, -322, -52]
5540e2O0l24j2K47j70L80k21J57J91N0o7P7l97K05K43j99l13o8l5L9q1J04J05
5563h1J4j91K71M32k32o6k12N77j92j94L3k63J04J27k40l45L15m3j38J71J84p3
5585d2R9n8L18J37q4k41l1q7j25k94o2N59k94J8m7M9L54j93j1kK52l7l6k2j46
5610b6L17k13k90J12M3k7k54L76j09k7J71o2o6L5N84k71j51j70J20j41k24K61
5632a2k58K29k99N0L2P3L02k28L38L5p1k3k45M74l72k9j51J64j4o9J24j85J51
5655A6j37L2k36O67j22j52J40j6R1l17J51o0P9k52j52J4L61k48m4N9M2J56k3O2
5679A11p8P2k5k84K82j6Q8q3j59J53m00J60N3K32k26J9J85N06m74L9Q9k69L00
5702B75j57j71j16%o0J7K34j58O7j9N4m5K42J19r6k1nL5k95J68p3l20j04K33o5
$$ y = [-52, 8, -316, -328, -81, -251, 129, -92, 65, 256, 306, 239, 316, -81, 124, 367, 168, -145, -213, -248, -209, -290, -186, -81, -67, -258, 13, 445, 213, 147, -65, 512, 320, 126, 159, -104, 0, 127, -113, -458, -143, -186, -324, -153, 31, -42, 57, -1, 317, 454, 370, 129, 98, 11, -114, -408, -470, 89, -205, -187, -234, -185, 169, -24, -35, -37, 215, 178, 142, 120, -26, 291, 78, -212, -100, -57, -84, -338, 38, -71, -98, 73, 11, -55, -20, 564, 293, 142, -28, 92, -49, -273, -12, -270, -41, -340, -290, -258, -185, 117, -111, 227, 262, 191, 168, -77, 397, 25, -4, -155, 9, -5, -74, 50, -135, 16, -121, -89, -325, 342, 220, 68, 208, 192, 283, -34, 117, 57, 136, -116, -268, -254, 107, -141, -185, -126, -84, 72, 49, 111, 33, 105, 80, -204, 78, 62, 150, 67, -92, 61, -339, -179, -126, 106, -120, -101, 84, 590, 116, 155, 244, -25, 275, 118, -53, -169, -169, -229, -212, 22, -136, -69, -88, -34, -79, 163, 282, 186, 165, 160, 195, -100, 68, -5, -325, -429, -196, -261]
5727b61r0K13J85q5q2K11n8N5J18k01J00j4jm74J07L83n90J83K47Q5P3j73J01
5750C2j78oL20j6L76j25k15m66K67J28k54M6o3j21K96k86J41m7L85m8p2j10M47
5773D31k25k05M5N0r8m33O1K1O3J65l1N0J64L4q1J26P6K20m47K52O9l03r7j89
5797b82J86m9M4j36q1K59P8k74L34QL1j21r0K14J45K2k73k32J86r8k63K75K23
5820A06j89j53R5N2J29M7R7j4j82K46l37J95j03J26k42J22m2j89J86J37m5n0J67
5843A59L15k24J53l54K05j05j59L2J10l55L55m51Q1O2J70p8J01K28K6j97J82J4
5865B70m32K84k7k15J61j13m5m8N7J10q5j8K6L11Kk00KJ75j3k80L1m7J03l80J89
5890a82J98l62K81MP6q2N6J50Q5J59m6l76K63p2p0j02k93J88J78k06j98L5M60
$$ y = [-261, -351, -138, 47, -38, -120, 91, 33, 88, 206, 5, 105, 91, 90, -384, -277, 106, -484, -301, -54, 31, 104, -69, 32, -146, -152, 168, 152, 528, 403, 188, -278, -11, 117, -137, -91, -154, -275, 21, -265, -124, -171, 214, 166, 94, -16, 431, 206, 1, 46, 96, -2, -435, -374, -353, -290, -125, -156, -106, 58, 92, 11, 137, 213, 433, -14, 238, 307, 4, -93, -282, -96, -145, -101, -237, -318, -59, 19, -255, 79, 87, 118, -3, -93, 121, 266, 288, 15, -217, -31, -129, -392, -117, 106, -83, -236, -141, -89, 40, 87, 184, 170, -12, 234, -103, 92, -11, 115, -127, -5, -47, -236, -50, 87, 42, -8, 159, 474, 250, 403, 49, 254, 149, -10, 22, 132, -223, 132, -319, -238, -176, -6, -84, 17, 245, 271, 74, 256, 270, -162, 122, 95, -120, 41, -72, -117, -165, -108, 2, -83, -101, -75, 236, 238, 38, 40, 215, 202, -78, -47, -94, 9, -371, -182, 16, -346, -65, -61, 15, -67, -11, 139, 224, 383, 337, -39, 224, 152, 82, -20, -313, -125, 53, -153, -351, -316, 144]
5913A44k73k2K78K96k95j62J36J59r0k41k32M22j36M8m00J97l1L31k04r7L37J01
5935B66o1M9Q4k30O7J19l26l04K30J6k30K19Q0j12R7p8j12M86K48j31k54lj64
5958d4K88l69K33j02l11M80m01j41J28J49o1J0K78J77m42J56M09n28N3J88j32
5979A8o3m0j84L87k83J77o6J48j88R5L4K16K75n91k1J16K66j94l4q8j70P0k2k86
6003d28M74ln6j46K03K75j64J47J56l78M4q9l23J13J84k9k50K34J54l05J46m5
6025h6L93m36K74o4j04k24M04q4p1J72q1j20k21K04m80M82J07J55k64R5J43j73
6047B1L77k39j00Q4k13k32L33k96K64m10M04j06j26K68j9R3k4j27M54k45k71P0
6069d0J82q5k99L15p1k17K15j82J50K70k76lJ20k4J48j5J34n5K7j93k80J30q0
$$ y = [144, -129, -151, 127, 423, 128, -34, 102, 261, 171, -70, -302, 120, -16, 32, -368, -171, -202, 129, -75, -172, 165, 266, 205, 254, 338, 108, 175, 294, -32, -336, -106, -90, -320, -101, -21, -133, -36, -114, -226, 260, 508, 377, 123, 120, -44, 244, -125, 108, 6, -305, 175, -226, -367, -239, -90, -151, -141, 137, 314, -128, 28, 437, -91, -38, 150, 18, -45, -85, -269, 118, -165, 12, -54, 94, -94, 1, 35, 251, 526, -65, -86, 30, 296, 102, 68, -20, -190, -120, -142, -428, 46, 43, -13, -159, 44, 319, 155, 302, 458, 80, 124, 35, -288, -175, 9, -20, -270, -36, 118, -187, -41, -86, 307, -129, 145, 81, -23, -247, 157, 73, 2, 174, 93, -27, -248, -44, -524, -42, 65, 220, -44, 51, 194, 21, 398, 159, 59, 143, -70, -302, 31, -265, -1, -411, -7, -113, -239, 29, 10, 103, 79, -48, 406, 161, -110, -40, 142, 57, -242, 73, 2, -215, 0, -182, -32, 238, -38, -41, 79, 55, 203, 188, 322, 267, 294, 101, -179, -49, -129]
6092a29P1j54K38o4l9J72p6M0r9K10r2p6R2J83k93J49k45J55j36J0K22l22L51
6115A68o0k18K67K2O6n6K01j98m6r0k23J20K7j21J25j15J82J12j88N8J04r0M8
6138I5J37k36K37k16k31L69l07K02j80O4O6n0kk0L2J84M2K76m06K24r6l02J08
6161a0J63k30m7J77O0r3j39n1J57l2j35L50j13oJ38j91K9K34l88r6P9L03j06n22
6185d69N79l02N23m74J73n6K9J84j87J98k81J83N5j22j56J38j10K0J36k80k1M90
6207B50m26M85o4l90K06n7K36j2k33k04k4K70j40K0n7o1qJ38J29j04j5J0K26o9
6231A06J20n7j5l92K61J4n4j37J79j54J0M62k60j9N6L6j58J57J13j01k41R8k04
6254a80R5O2l7k17K21P9k98J31K24K46m40K40o5J04j59K04Pl26J6j06J40Q7k33
$$ y = [-129, -58, -212, 26, -38, -77, 95, 19, 59, -40, 170, 78, 2, 94, 277, -16, 133, -112, 43, -93, -83, 139, -183, 168, 108, -110, 157, 179, 245, 189, 390, 192, 146, 56, -167, -47, -20, -141, -16, -131, 51, 163, -25, 33, 137, 47, 95, 232, -4, 233, 17, -214, 155, -152, 50, -130, -66, 0, -50, -52, -72, -40, 144, 186, 462, 56, 280, 184, -118, -10, 153, -77, -124, 53, 113, 20, -119, -170, -13, -45, -180, 170, 57, 51, 189, -2, 27, 261, -127, -223, -144, 159, 53, -469, 110, -192, 331, -143, 30, -26, 3, 187, 0, 198, -83, 100, 155, 33, -123, 15, -95, -75, 61, -219, -240, 250, -176, 309, 245, -145, 61, 4, 240, 228, -5, -209, -233, 37, -103, -83, -140, -201, -209, -71, 58, -46, -61, -51, 175, 106, 226, 169, 154, -238, 23, 37, -17, -154, 25, -129, -119, 343, 83, 64, 120, 156, -2, 155, 268, 167, -74, 24, -180, -85, -23, -60, -277, -56, 23, -275, -144, 80, 326, -114, 126, 61, 165, 6, 210, 217, -109, -93, -199, -59, 28, -205]
6277b05j54L29J03j62K1L6K06J51l62K75j87J83k24l4j3k4j71O0P9N9n6J20O9
6300I9J61o1K3k36J44O0q8K2k9o5k25R4j42K09J73l4k65K70j54J94R4M1n3j7k
6325B13k02P9J1r0Q5k97P5K27J67k03k48L21J39k21L3N8rl04L94m4k89j8Q4L5
6349dr3O3k33M54j73J47j85Q9P8J45k35K83j29l45l2P5J01o1j20P2O1Q4oN2P6
6374A64l1j92L7Q4N5k65M19j63J13k25j65K10p6R4j42q5K82j06l2K89j12j27k66
6397b40M12k01j81K19q8Q8j2p8m3n4R4r4J20J54j06R3J13j23p6L8J04l09L40l9
6421A31j36j71q6L14j03J21J02j65J80k22N2K01j92R2j41J16l6j95M5l8j47K16
6443f2j45J48O8J20l9p4R0j61K9N4q2Q9k38j6K02l0j67L37j78J80j75K21k86J57
$$ y = [-205, -359, -30, 73, -89, -68, -32, 174, 325, -37, 238, 51, 234, 10, -24, -37, -61, -232, -172, -93, -34, -90, 30, 99, 260, 199, 222, -14, 130, 190, 102, 124, 95, 30, -195, -101, -243, -34, 139, 105, -160, 110, -44, 150, 244, 285, 232, 215, 213, 11, 90, 101, 11, 96, -201, -126, 101, 268, 65, -183, 138, 277, 56, 89, 147, 138, -166, 228, 184, -105, -123, -39, -4, -97, -34, -267, 187, 14, 161, -24, 65, 143, 288, 53, 336, 207, -138, -170, -95, 6, -55, -175, -103, -42, 42, 36, 88, 164, 133, -59, -22, 62, 117, -148, 271, 108, 221, -4, -169, 41, -35, 59, -83, -168, 114, 8, -24, 265, 153, 26, -240, 172, -29, -210, 9, -79, 9, -3, -81, -124, -178, -84, -178, -58, 96, -10, 83, 196, 73, -3, 35, 139, -170, 170, 131, -5, -176, -262, 52, -51, 70, 172, 7, 187, -35, 17, 218, 26, 118, -23, 93, 57, -138, -93, -131, -278, -62, -207, -59, 9, 129, 90, 16, 106, -55, -26, 28, -54, 35, -203, -219, -17, -47, -214, 123, -55, 125, -50, 171, -115, 42]
6467D2K0j25J93N3%Lk62J63k51J84J41q5J63m79L18j09L82k38J00j7j52J18ok6
6491A30j1Mj65J28j30P6j69K43l20M3K10j52L29M9l1k0j53k69K55j29pK76l00
6514a13J44o7p3mR4q5L69l09N4m8L31k2j29r7j37k20L37R3j51J69l84K88r9j5
6538g4M6P0j7R8L8o1J88k27R6q8j64q9L1J86m7l03L96J87k18J6R0o6n7p4K03r5
6564F5j18o5j3r6J77M3j44L39M0k02J81j15J07o5k32K42n3J08r8L3l53K75m12
6587c56M18k27R7M2k73K13n8P7K13k02R6J28k26J58pj71kK76k59m3k63J49L27
6610A07j47K10k90J39Nj30oK27K13l93M3k8L4p5n4O0l62N12l1j70K24j19j30J69
6634Hp1J02j57P2P4o7L6m4j36M75m08j94K75J50Nm3k11J66P3j0l7j24L4Q7j20
$$ y = [42, 62, -63, 130, 183, 183, 186, -76, 87, -164, 20, 161, 76, 239, -240, 78, -31, 351, 113, 213, 196, 44, 162, 156, 130, 119, 123, -42, 86, -44, 32, -137, 106, -214, -171, 39, -113, 216, 265, 234, 214, 61, -208, 47, -82, -89, 187, -113, 31, -36, -109, -113, -19, -104, 265, -44, 10, -38, 293, 271, 142, 45, -92, -312, 25, 118, -33, 136, -248, 40, -59, -74, -28, 42, 25, 123, 161, 100, 288, 61, 157, 69, -95, -184, -153, 33, -14, -317, 79, 266, 48, 64, 154, 88, 31, -43, 160, 65, -53, -118, -131, -227, -50, -7, -151, 188, 228, 26, 207, 92, 199, 134, -98, 144, 91, 199, 101, 134, -219, 56, -356, 62, -165, -68, -26, -299, -86, -144, -67, 146, -56, 40, 168, -58, 100, 93, -78, -80, 196, -63, -106, -369, -220, 107, -40, 170, -120, 19, 24, -106, -112, 115, 328, -65, -22, -50, -16, -91, -145, -85, -447, 65, 34, -136, 88, -31, -161, 8, -63, 39, -118, -46, 28, -39, -3, -47, -183, 292, -116, -310, -35, 115, 120, 77, -134, 32, 105, 95, 58, -66, -32, 55, -65]
6659f5k08K46j23J76j99j0J50q9J4J34k18K78j00j69K59K09k26K18n26J96N6k94
6681b91M44L1j7j92J31L39j83m27K32j14K27l3k11P2m3J9m2J34l6o2j16L24j21
6704F5j5n5J97k92K53Qj78j4K33k43j32J74N0o5o2K70m52K72k03L53j42N7Rm5
6728D3Q2j96L04m79K00J19j78J42j43K57r2j77K52J04m09j18L45J44K4k66N7J5
6750C0n4k69m6N43L7m54K03M57k44j80j20J68Ok07L20j00K2k61Q6j71K78k08J45
6773a9k93L92l09J74K54j71K9j36Q0P7j01N3j88L02j14k04J02J17j64J8K2J04
6795B5j86K52J19r2r2R6p8k17J60M2o1k97L69j11p2J03Q5N9m8j7r8o0L30o9L3
6820A75j62j0l6Ml1J02k4M8j3j05j23K69k10J41L3J23l00p3L65k56J21k3j94J74
$$ y = [-65, -273, -27, -150, 26, -173, -183, -33, -122, -108, 26, -192, 86, -14, -183, 76, 285, 59, 277, -249, -53, 3, -291, 153, 184, 167, -25, 106, 445, 262, -165, 67, -47, 180, 147, -64, 8, -35, -16, -58, 76, 40, -22, -138, 186, 65, 50, -5, 192, -100, 153, 161, -17, -31, 202, -41, -173, 1, 51, -14, -76, 194, -258, 14, -189, 164, 22, 79, 88, 43, 125, -71, 233, -246, -46, 73, -105, 37, -106, 151, 59, -118, 134, 238, -171, -289, 56, 200, 224, -42, 15, 30, -24, -293, -339, 204, 241, -213, -10, 447, 203, 23, -97, 71, 77, -130, 190, 90, 112, -149, -63, -234, 44, -164, -19, -312, 80, -229, -55, 199, 28, 57, -79, 1, 78, -23, 30, -158, 144, 30, -174, -72, 45, -119, -101, -79, 25, -161, 91, 210, 118, 26, 122, 44, -173, -13, 29, -32, -329, 40, -71, -143, -40, 45, 104, 56, 39, -59, -119, 211, 142, 175, 13, 3, -33, -29, -60, 42, 18, 66, 53, -52, -175, 94, -116, 25, 58, 181, -119, -192, 173, -83, 38, 15, -179, -5]
6844eJ39j41j48j17K38K32Kj72O0J38l49J61KJ4j08j02R9J02o8N7j2K7j02K44
6868A91j72j7J39j15pJ9J39Qk3k56N8J39k01O3j18J20j5j96J12J51KK00k18n5
6892e2R1R8j10J09q1O4j1l58K85j26L3O6K1q3K62l44J94k11J30J58k00J75j5k7
6916F8L4j06N2j3J13j22p7n2J35o2K21l13J74j69L13l86j09L15o4j44K09M3j57
6939i7J41j1k56L72N8j65r0J56J54k89j61J09J25k93K56J65k50L55m11L14p2j61
6961e1L10l8l4l10R7J47r4j07q3J12J07j36k03L70j37JJ48j2j70n7p1Q6K24Q6
6985A85k37J29j86J0j13KK62k11J77L3L1P8l08K34L7J43j36l26J71J06j7j30q8
7008a54J27L8q3N9J44m43L74j12J65K10j28l98J19Q2Q7j70J84N1j81K8NQ4l24
$$ y = [-5, 134, -7, -155, -272, -34, 198, 200, 28, 88, 226, -123, 38, 40, 54, -54, -156, -57, 45, -23, 34, 22, 49, -53, 191, 19, 2, 141, 26, 19, 38, 177, 185, 162, -94, -36, 103, -98, -35, -153, -33, -48, -244, -132, 19, 21, 221, 3, -52, 39, 137, 27, 136, 55, 119, 108, -250, 35, -91, -58, 8, 29, -54, 208, -136, 58, -153, -23, 135, -65, 110, 95, 68, 102, -4, 48, 35, 148, 26, -51, -103, 32, -30, 191, -122, 52, -117, 196, -190, -299, 16, -48, -192, 17, 60, -97, 44, 33, -223, 149, 207, 42, -48, 108, 262, -27, -188, -79, 46, -247, 9, 174, -76, 279, -132, 182, 110, -51, 259, 221, 187, -123, -26, 121, 27, -80, -163, -51, 56, -80, -283, 87, -50, -49, 99, 87, -83, -140, -211, -125, 99, 185, -52, 77, -109, -99, -212, -210, 52, -159, 18, 51, 82, 160, -148, 86, 123, 266, 130, -196, -25, 81, 64, -66, -154, -27, 11, -72, -13, 131, -312, 62, -50, 115, 325, 197, -201, -82, 0, 87, -83, 101, 152, -29, -1, 4, 88, -236]
7031b36J49l5J23j60J09L11j89j18n5L04j84j72j9K30J7j36n0J65M0l58L59J8
7053A13P9n48L70l4K93j75j9j91P5K28l53L09l72J65L43m15j01K88k22J96J25
7074A54o6q2M0p6k37J87N2J37K29l51J44j61P2P3L6L4k57K17J20O0k77k11K64
7097A01j9j71m5J32m8r4J90p1K6K07m59L20N2j00J61r7k39N7J19P8l26J75K77
7120B26j66j62o9J37r7M06m12j15L76r2o4J28r9Jk11K62K0j15J00m3n5l3K67K12
7144D02k74j06M4j05l2J44O4l03J75K21k43mj58L41k43j44PK13k0M2k7j66K11
7167C9j70K36l9j38K2j33J33N3m1j29QQ7n8J75p3J25l3L7p0L2J1j50j30O8K09
7192G1j31JJ33j10L1M0j62M0K8P8O1K41l33J8R4Q7m96K92qO0n6j99O5J97k1j44
$$ y = [-236, -87, -122, 1, -159, -50, 261, 72, -46, -101, 203, 19, -153, -172, 58, 75, -61, -111, 54, 94, -264, 95, 113, 192, -356, 14, -20, 273, 98, 79, -112, -37, 191, -162, 147, -225, -60, 283, -132, -233, 55, -167, 29, 154, 88, 6, 46, -30, -267, -80, -28, 109, 338, -13, 131, -30, 42, 115, 151, 185, -72, 145, 265, 325, 48, -163, 101, 82, -89, -134, -2, -50, -144, 46, -25, 1, 208, -251, 69, 121, 21, 182, 85, -154, -97, 22, 100, -226, -51, 226, 60, -102, -171, -34, -131, 275, -137, -252, 124, 32, -32, 96, -3, -2, -213, 49, 69, -46, 54, 11, -44, -77, 190, 402, 128, 22, 66, -39, -71, 73, 137, -166, 9, 230, -13, -17, -175, 166, -77, -221, -214, -1, -21, 21, -6, -172, 39, -131, 105, 66, -72, -50, -183, -50, 3, -38, -167, -159, -72, -130, 45, -28, 97, 64, 101, 31, 63, 74, -76, -206, -138, 71, -60, -59, 74, -36, -5, 35, -127, -87, -59, 19, 80, 321, -12, 6, 100, 187, -309, -17, -25, 35, -21, -220, -155, 42, 21, -123]
7218a23L17j76R0kl0j78K69k99J97J20l52J75r6O0m1m2p6K40kr7r4N9O1O3j09
7243f6j47K01R1J70m13R1P3R4nj84K42R4k51J6R1%o6K15k27MJ02j34j0k5K36l84
7269a92K87J9k12K40n3R2j90r7J28j4j77J67j61Q8q6J77Q9k78K98k39KN1K5J82
7293A46r6j74k09L68J88j35j77J86q4j43jnK11l13K71J53j62j01O2J37o1j48J58
7316G1j53L6R1P5qk15lK18j67J90j12k05L82k41j21J41K31m99L04j49J68o3J53
7339A24m37K33MQ3M9o0J09j47M0p7j88J51O8Q4j08l18L67J72j29k30J93j35J13
7362c9R7o2P4J08j39O4N9j60r9Q7j78K26mp1k01L53j13P6m2%q3j11K32k77J7K36
7388E0M8j29O3K0q9j91L04n6Rk0J1J09L6N0o5j27L4j61J83m5K5N4j03K9o2j43
$$ y = [-123, 194, 18, 108, 106, 76, -102, 167, -132, 65, 185, -167, 8, -88, -28, -69, -111, -187, 53, 51, -46, -140, -81, -20, 43, -66, -213, -12, 79, 249, -164, -73, 0, 94, 89, -95, 147, 241, -10, 6, 97, 97, 31, 246, 19, 23, 125, -9, -19, -44, 192, -192, 95, 114, -98, 142, 89, 181, -9, -106, 22, 8, -169, -2, -163, -75, -161, 16, 105, -173, 125, -114, -112, -61, -36, 146, 50, -124, -333, 35, 223, 88, -89, 97, 13, -130, -131, -136, 75, -238, 33, 186, 24, -77, -15, 122, 61, -87, 71, -82, -46, 45, 120, 112, -103, -106, 112, -55, 135, 23, -182, 200, -41, -162, -21, 210, -289, 15, -134, 34, -29, 124, -313, -80, -76, 7, 56, -4, 105, -42, -2, -79, -267, -116, -48, 36, -72, -390, -23, 149, 20, -210, -17, -152, -39, 58, -4, 70, 178, 39, 103, 162, 2, -97, -10, -188, 38, 34, -37, -238, 115, 2, 78, 36, 36, -47, -158, 74, -203, -186, 50, 98, -31, 32, 52, -37, -228, 76, 20, 29, 9, 20, 129, 165, 215, 150, 23, 57, -104, 79, 34, 59, 113, 10, 39, -23, -166]
7414a66J62k60J77J84qo2J36j80K17k76oL09O5l91N6J06j03J07J2N0K8m7n2J52
7438B10L9j66r9kj28o6K65j11J1M2j25J53kJ14j79J45m8j63N1P8J52k61J62M4
7462A16j95o3rJ02J69j61p1j2J45L9l9p7P5k68J38J24j79J36Pj29k4J82J30k03
7486f7L4Ol1J85l70K92P0j54L7K71j64j89J8N8l32J62J81jr0K71l44j8K91K00
7510C16l95J46J40j69K3P8r7k18J48j50M56l00M5k8KJ3jm8J3P1R3o4j50J15j33
7535i4R8k30L62j81J20j31K10j64j5r5J88K91l60M0J07r8k17K17o7J37k74Q9o3
7558a30K57k16q2L31l29J52p8q3L25k23J01k06K32J19r5M4L8k84J23L2K31l10
7580e1k1K87Kk76O5P4K65j63l03R0J78k16K6%p7J76r7K09j22j61J04k38K57q2
$$ y = [-166, -4, -264, -87, 97, 89, 27, 163, -17, 200, -76, -82, 227, 292, -99, -43, 63, -40, 67, 79, 129, 157, 110, 58, 210, 249, 83, -16, -18, -146, -212, 53, -58, -47, -5, -130, 23, 21, 135, -44, 101, 53, -110, -59, 19, 171, -90, 72, 116, -79, -142, -151, -49, 120, -41, -112, -124, 21, 60, 21, -56, 19, -249, -111, 13, -166, -30, -23, -152, -176, 6, 136, -67, -33, -27, -58, 127, -243, 49, 119, -35, 2, 273, 109, -80, -62, -4, -336, -174, 7, 6, -84, 187, -157, -175, 116, 316, -79, 67, 207, 38, 61, 139, 42, -176, -28, -178, 278, -22, 23, -5, -3, 10, 9, -39, -26, 45, 138, 74, -76, 39, -94, 4, -226, 136, -45, 75, -56, 154, -10, -25, -120, 68, 359, -1, 39, 146, 48, -169, 48, -19, 118, -156, -67, -130, 127, -89, -171, 160, -169, -17, -95, -178, 147, -76, 25, -181, 51, 170, 75, 119, 157, -127, -4, 28, 259, -51, -72, 215, 217, -59, 6, 80, 345, 182, -121, -31, 147, -69, -43, -43, -120, 56, -41, 168, 46, -115, -11, -249, 8, -74]
7604g4J83r7K23j36M8r8nM3Lo9r9K24k7k63K48l43K15O0J16L5p2k9Oj9k9J31j72
7631Cr4K2pK0K94j92Q8j78J59j9J11mk08J3J69k24k8K15k36J97k73LK68q3l5J65
7657A46j36J13j75O0L3l10K38j40J94J9j53k35K72n1J20P7Mj8r4n4N7p1J80Q8
7681A64j49K07j65j5K81l80J78l27K17L6L6k50M8J10K32k94K66k0l64K76k55J12
7703e6Q9j38J47j34p5J69J01k6J76j82n8m0r0O4K88k93O4J50l05o5J59k69M34
7726A10M9l09P3N2R2J19k78pK35j31J38k24K45l66L38l43K10j22J86J04j19ok57
7749b11M89k79p4m4Jj01J35K3l0L9m4J34m4p2k1L45l85P7Q7j5K71l67J22j09J90
7774A17o0l10J46J06r8k49N37l98K01JJ71L2J2K8k0j21J06m04J59j05K55jl65
$$ y = [-74, 109, 12, 235, 99, 147, 49, 44, 87, 90, 21, -78, 146, 119, -144, 104, -239, -24, 36, 152, 187, 115, 86, 92, 73, 44, 175, 3, -91, -69, -76, -56, 238, 46, 134, -44, 115, 96, 207, 203, -5, 8, 177, -47, -75, 140, -96, 101, -172, -169, 99, 16, -19, 146, 10, 123, -52, 8, 41, -269, -31, -171, 23, 42, -111, -346, -74, -125, -5, 72, 76, 58, -36, -90, -33, -104, 76, 164, 15, 222, 57, 42, 323, -57, 121, -206, 11, 47, 83, -167, -119, -9, 223, -71, 195, 175, -189, 87, -168, -56, 33, -105, 42, -92, -167, 2, 103, 77, 253, 71, 13, -27, -117, -53, 235, -58, 6, 156, -149, -214, -55, -324, 110, 159, -150, -77, -25, 67, 186, -92, -99, 136, 5, 143, -81, 164, -202, 136, -207, 3, -119, 67, 171, 52, 46, -211, 278, -1, -75, -119, -118, -219, -84, -61, -91, -52, -96, 38, -6, -78, -99, 246, -139, -62, 25, 10, 281, -86, 36, -73, 117, 57, -253, -107, -1, -99, -348, 189, -209, -8, -7, 164, 196, 208, 236, 216, 95, 201, -203, -44, -149, 106, 105, -260]
7797b60J48Q5kL62n00j69L62K44l56J31kJ35j9l37J40j17K08k23Q4j1N4M6Kl68
7821c63K49J59k04K76k74J09L11m43K59N2k45K14j66K80j56K7k78L33j64K57l25
7842i2Qm1L03nk34J58l56K72j5J61j74J21j00j39L19m46m2L91J2q4k24K11J97
7865B01p3p9q0Q7k29J42l9K52j02q5j17K1K96M1j7l47J89nK4j31j56J76K1%j7
7890b7M8q0l5k3n8J21j21J59j18k5L34j77K2J24j52m8j25k6J18l1OK02j64J94
7914A18p9L62l59r0j25J74r1j36M37l69J77p5O8j47j23J40O2J56K69l56J09P6
7936A98k05K16m8l17P1K08j78J29q8l9j64K61j50J96K3m7j8p1j23K04m6k06J32
7959f2K94k74o4R3k20l3N74n9j72rk28K21J10k91K71Mj72k2p9J20k2M8r3N3p7
$$ y = [-260, -112, -27, -29, 333, -167, -336, 26, 270, -86, 45, 43, 178, 159, -178, -38, -155, 53, -170, -86, -97, -43, 3, 5, -363, -114, 45, -159, 117, -157, -48, 263, -180, 79, 131, -114, 100, -66, 214, 58, 85, -193, 140, -24, 233, -92, -84, -125, 178, 173, -61, 97, -259, 13, -2, 159, -15, 106, 6, -133, 186, -260, -302, 89, 101, 17, -207, 4, 201, 128, 49, -31, 56, -173, -31, -70, 182, 80, -5, -122, -101, 195, 236, 219, -128, 61, 56, 80, -51, -207, -31, -10, -10, -27, 21, -59, -94, -117, -175, -54, -175, -16, -134, -159, 175, -2, 20, 144, -8, -56, -181, -207, -89, -120, -114, 88, -76, 118, 39, 401, 42, -48, -173, 1, -90, -226, 211, -158, 19, -56, 12, -135, -258, -118, -56, 100, 369, 13, 122, 198, -7, 209, 161, -156, -85, 123, -55, 74, -14, -53, -217, 44, -106, 90, 113, 66, 48, -23, -146, 58, 12, -194, -62, 232, -42, -106, -13, -233, -266, 308, 249, 77, 68, -160, 61, 171, -120, 151, 155, -17, -39, -118, 2, -20, 28, -65, -12, -89]
7984h9J9J14L6O5K8k85K31j07j68K13k33M01k93j87M71j47k31J19p9J38J28j93
8006d9K60O3n3j82J99m75N15m00j42L57j64M7o%L5J8o2J04q4P0j31R3J74q1k31
8031a25J66k16L44l15J05J86j02l4L3j80K51l82L22k45Q0p6L06k08J34P8k19J64
8053F7j10lo6K38j58j66J78L1j80L50k83J39N4m9Nj30Jj8J75p6o7J81o7Rj46J25
8079C4j31J50j02N2J54j45j1j45J38j20n2J93Pj26m9J82k12J74J22JN3l26O9K20
8103A30lo8j28j01P8K99k70NP8j10K36n7k08J69q9nK23k91K00Q5m3r3O8k3N2r9
8129C5q3J72r6j90n1L62j21N5k24N1K74j23k67K17l2k2K0j08J4j7M09j23k2k08
8153g8RJ23k50K99o9n0Q2k91L43j6j11J8P9j33O7o9j28J87R5j69J25K04l31M4
$$ y = [-89, -70, 44, 80, 145, 173, -112, 119, 12, -156, 57, -176, 225, -68, -255, 216, 69, -162, -43, -122, 16, 144, -49, 211, 274, 221, 39, 238, -237, 278, -122, -264, 93, -71, -24, -30, -30, 5, 23, -39, 65, -19, 51, -80, 13, 187, 106, -125, 41, -175, 169, -146, -41, 145, 43, 9, 42, -138, 113, -269, 53, -192, -112, -188, 118, -90, 44, 122, -97, 67, -43, -46, -112, 126, -32, -198, -20, 11, -169, 181, -102, 37, 91, 42, 47, -83, -82, -100, 75, -1, -68, 113, 46, 55, -91, 34, -97, 53, -49, 3, 157, 12, 1, -144, -6, -126, -178, 15, 22, -104, -153, 29, -183, -9, 113, 114, 167, -159, -90, 130, 127, 59, -69, -170, -92, 207, -63, -58, 20, -90, 146, 89, -119, 50, -39, -44, 179, -112, 88, 173, 130, 37, 105, 82, 134, 35, -48, 124, 28, -162, -213, 149, 28, 83, -141, -90, 184, 61, -206, 11, -21, -43, -23, -131, -117, -134, 275, 152, 130, -78, -69, 54, -196, 103, 34, -16, 66, -225, 118, 102, -9, 9, 88, -45, 22, -47, -175, 12, 107, -62, 63, 267, -64, -20]
8177b0j04q6M4J8K87j11R5j34k8J39k16J21J60j5k3k1k8k25J33K21k04j3k38K67
8201A9M7m6K61j68j16M7k82K21J25j27N4R0k22K67n2j5r5J16j03k48L64l10K61
8224H8M1p0n9j11o8j55L02j89K17J46k37l1p4J47K5J14j17L3P8j38O0k3J63m02
8248b60L19J8j37j03M29m42L53Pk29k1P0M1K16j73%J78l24K02J05k20k16M25k71
8271c3j76K07K52j29j35j83P3L71M6m18R9j11J49L06m60J13r2Q1j43R1q1L19j39
8294Gj69K59K0k0j12J87j92k9L9Ok57L57r2Nq6M6j61J36J26rJ18j99O0j49K02
8319I3j13k5m5P6Q6j93J26J9o7R4k50J09L09l21R8J82R3j31j11R1j65L0j24J67
8343B8jj4Q3j54R1P9j15K13q3j93R7K86l19l8L0J09J4l3R0n0q7k28L62j09j69
$$ y = [-20, -124, -210, -166, -148, 139, 28, 123, -11, -39, 100, -116, 5, 165, 150, 127, 106, 78, -147, -14, 207, 3, -10, -248, 19, 66, 20, 281, 113, -3, 44, -238, -17, 108, -19, 35, 125, -97, 170, 118, 103, 8, 124, 21, -227, 137, -173, 88, 129, 59, 0, -111, -179, -334, -32, -221, -4, 142, -95, -126, -200, -53, -28, 86, -31, 2, 80, -58, 2, -21, 142, -260, 59, 77, -60, -163, 266, -176, 177, 184, -45, -66, 4, 45, 261, 88, 88, 266, -58, 144, 249, 29, -187, 238, -33, -209, -2, 250, 121, -14, -197, -124, 247, 293, -125, -26, -137, 12, 318, -142, -29, -121, -40, -183, -92, -173, 146, 7, -162, 97, 117, 97, -15, 172, -20, -49, -10, -4, -261, 96, 4, 9, -77, -31, -192, -56, 70, 61, 179, -20, 40, -109, 93, -20, -45, -90, -14, 72, -121, 5, 24, -43, 51, -199, -90, 219, -102, -4, 178, 271, 140, 29, 120, -45, -15, -139, 28, 27, 13, 96, -58, 33, 112, -3, 210, 127, -66, 31, 317, -2, -40, -10, 99, 113, 80, 170, 120, 33, -195, 167, 58, -111]
8368a11J66j12J48L7k00j9K17J27j25j88n6L18l12Q1m6j1P2K35k44Q6j71J29p1
8391e0L47k17r4J11J40k04J42k0nk46O3J22m19N11j47n5N8l9K04j19ro3l5k94
8415c18L57k33L13l20K52k41L97k85K02k15J43q9K3Kj88K06N3r3k7K10j2n9j12
8438c4Q1l8J4j49Q2J23N2p6o4K14J17j31k96l7K78J03j55o2J45q5m7r8J74j51
8462d0N8k1rj21L00k58J76k2j4L3m8k52L84k16p9J47j28J10J19j75j55K08j42
8485a45J20J7J25l01m8K53o0J19j66m0P9J22j83J13O9J05l06K12j85K16j8k51
8507a53J66k1J72j70p4M0O9j17J6K21j83J39n25L42K0J43k01k9M2qJ38j6Pk85
8531b67M30m38K89j5J38k88K45K41k26j02J30k65J9J45O7l66L33P0P5r7K1j36
$$ y = [-111, 55, -57, 91, 128, -72, -91, 126, 253, 128, -60, -116, 202, -110, -29, -75, -86, -14, 221, -23, 63, -108, 21, -50, 297, 80, -14, 97, 237, 33, 175, 155, 150, -96, -33, 89, -330, 181, 34, -21, 37, -2, 202, 83, 74, 11, -24, -318, 39, -194, 119, -201, 51, -190, 207, -78, 124, -91, 52, -37, -14, -12, -200, 6, 59, -34, -61, 149, 137, 78, -34, 47, 9, 23, -126, -44, 79, 131, 55, -9, 205, 322, 191, -105, -142, 136, 239, 84, 22, 167, 82, 35, -63, 111, -40, 18, -3, -12, -133, 167, -91, 85, 63, 49, 82, 34, -218, 166, -50, -129, 18, -110, 0, 119, -56, -211, -3, -145, -25, -8, 117, -184, -232, 21, -39, 80, -86, -126, -47, 75, -108, 5, 74, 179, -127, 85, -100, 116, 98, -153, 13, -8, 164, -6, -80, -40, 29, -88, -72, 149, -34, 105, -420, -78, -58, 85, -116, -145, -103, -111, 27, 11, 18, -267, 163, -275, 14, -1, 137, -151, 94, 335, 109, 7, 137, -128, -109, 36, 103, -263, 70, 140, 215, 118, 139, 3]
8553CN6j13J21J32m32L01r8K9k20K01qK30j25j67J85j46N9k50R0J09J54l06J37
8576e8o2J00K18j50O6n27L39J59j17j05K52r8j90K43l6Q1j47n4J98k15J54O4n6
8599E9P7l28J00J0rn2J24J2n4K6n9J95K4L5m5N6k21m5L7J30o4k65J5R3J82J59
8625A92j36j9J39k15J88j29J21k81K64q9k08N62m63RJ13pk33K52j47J41j02oK5
8648b9J07l0m7k00K72l31L16n2j6J34l78M42n63L49j50J73J87m18J17PJL78l03
8671c4M7m6m5K38j90Q0n5M9l1k6J5J72J0K2j74j24K42l69K88k0k1J17l98J1J79
8696f3J37l00Q8L16l19J62MM6N0j28R3o5k37J99m2o6M36n40J98j02K46j01l9k
8720b9K39k43J9r3k7J26M1K9J16q7q7K16l51K54j63k41L03J86k64R0k94J49P0
$$ y = [3, 59, -54, 67, 199, -233, 68, -30, -1, -221, -20, -28, 202, 77, -90, 95, -51, 8, -242, -152, -43, 111, -195, -58, -120, -20, 198, 48, 114, -413, -74, 85, -32, -137, 115, 17, -173, 70, 34, 115, -32, -86, 112, -103, 51, 115, 59, 136, -192, -92, -82, -91, -143, -19, -7, -61, -35, -94, 101, 125, 160, 115, 171, -50, -95, -58, 72, 8, -257, -242, -149, 33, 192, 56, 37, 176, -39, 149, 20, 141, -140, 124, 35, -173, 389, -74, -65, 48, 41, -192, 60, -87, 54, -48, -54, -29, 78, 48, 1, -199, 73, -258, 58, 6, -10, 124, -254, 188, -375, -26, -176, -3, 184, -234, -117, -110, -109, 269, -34, 13, -33, -78, 160, -30, 50, -5, 44, 13, -13, 2, 174, 184, 206, 32, -92, 150, -219, 69, 49, 28, 145, -253, -242, -63, 74, -226, -138, 178, -141, 21, 25, 71, 121, -7, 86, 21, -216, -17, -59, -125, 311, -229, -31, -133, 113, 12, -27, -29, 210, -33, -14, -107, -134, -8, 33, 62, 178, 91, 4, 220, -131, 123, -40, -281, 22, 208, -56, 34, -260, -111, -41]
8743d1L7J82j04j20P9K4j95J27J14p9j5p0j5k70M05j05P1l7R3r8Nk78K59k5L6
8768b0K20l90Q6N1J97m5O5j53O4k68J5K5j94M27M3j01pK72k36Q7k88k00K93o3
8792a20L31l04J67k56L02n9j97P8J23l31Q8j7K08r5r0K74j45p5J24J94j21j68
8814h9J57Q2k95N4N5R2j59J49q8J69q0k75L73k69O0J5P7J9Mn0j26M6J30k11L17
8839A57l07K57k46J76l27K72J99j16k7j28J16k8oK2N7k61L14k37J99k66oQ3k9
8862a32J17k75O5J75k55M01q7M5j25K03k18K05j4L8J35l36p8J46L9r0K45l54J78
8885B8o9j32L40j41J33M4l31J66j75N8Q7L8R8j90J7j03R1J50r2oL8P6k53J65j73
8910a36J49L0k15JJ57J4j96K39j72L81m00O2J11J69k43J70M2k38K90j98O6J13
$$ y = [-41, -4, 178, 74, -46, 33, 57, -138, -11, 103, 24, 9, -61, -76, -346, 59, -46, 25, -12, 81, -17, -12, -290, -31, -56, -20, 200, -190, -104, -53, 144, 99, 164, 11, 75, -193, -178, -153, -347, 80, 123, 22, 15, 287, 51, 138, -150, -350, -57, -120, 211, -93, 74, -182, 120, 61, -136, -58, 65, -266, -178, -195, 13, -82, -172, 102, -43, -118, 6, 200, 79, -89, 68, 150, -145, -91, -36, 56, -103, 46, -42, 127, 47, -228, 145, -124, -64, -49, 28, 47, 51, 1, -125, -79, 51, -160, 157, -150, 107, -139, 37, -290, -18, 181, 65, 38, -90, 26, -2, -8, 14, 71, -190, 124, -113, 86, -180, -186, -103, -132, -15, -290, -225, -50, -305, 96, 9, 54, -71, 132, -86, 119, 105, 143, 278, -58, -136, 10, 49, -41, 204, -150, 28, -41, -173, 167, 26, 159, 203, -128, 38, -137, -79, 8, 46, 144, -46, -29, -132, -41, 109, 17, 11, 49, 125, -128, 37, -136, 13, 43, -172, -171, -14, 0, -196, 43, -129, 252, -148, -86, 25, 194, -49, 121, 163, -75, 215, 17, 83, 196]
8932A96k95Q7p0l5Mo8K06ro5N6%j53P0n3lj20K86K8j93O4J50j12k85L47k26J94
8958AK02l78L80k12Pk19L2K79r4p5p0K18l2j42K29o4j15Jj69L83j90L05k35k01
8982a59R5J57k58O9L26k83J87m41L38k26N1p9J30K46l17L11j94K6J92j53j62P9
9004f5j61J15M4Q9k32L08k38Q5P0k04R7N5n9K31j83N6J1q3QJ37o4J68n4K18l69
9029b0j27J30M1j24J10pMj76P1o0K48k48J12J28k35J58j12m4K60l8k74L82j45
9052C4J46j91k3k88K04J51q5j9J7J16j4Q7k41P2J64p2k1k40J82p7J32K07n2k39
9076e0L7l08J72L0J45l00L39j16K39j59j76L47r5k73J95N7R7m50L28j6l21K47
9098c1N3k2J56j07n7k0J54l2j24q7K85j53j43L4m3K92r4J01j66J03j88k8J36q2
$$ y = [196, -99, -12, -82, -117, -113, -181, 25, 16, -49, 7, 7, -146, -76, -129, -132, -252, 34, 62, -131, -67, 83, -29, -314, 33, -193, 1, 203, -175, 205, -7, 0, -219, -187, 92, -2, -77, -147, 71, 39, -103, 126, 62, -53, -52, -221, 162, -28, 277, 42, -159, -64, 93, -165, -96, 230, -53, 134, -307, 31, -195, -144, -223, -93, 153, -164, 147, -47, -21, 171, 18, -144, -65, -226, -111, -67, 22, -210, 98, -140, -55, 15, -189, -92, -37, -96, 135, -48, 8, 19, -64, -56, 81, 17, 185, 131, 349, -20, -147, -17, 24, -100, 10, 3, 7, -169, -98, -158, 90, -158, -46, 82, -153, 5, -107, -151, 109, 71, -203, 179, 34, 180, -11, -34, -322, -118, 33, -52, -71, -54, 62, 48, 135, -106, -34, 130, 58, 37, -203, -21, -98, 34, 241, 189, -50, -13, -321, -149, -119, 26, -274, 65, -51, 188, 29, -147, 200, 105, -168, 27, 84, 181, -269, 59, 43, -278, -31, 22, 0, 156, 49, -8, -28, 126, 94, -30, -117, 168, 15, -128, -94, -137, 155, 61, 162, -4, 99, -89, -117, 19, -63]
9122f3J8J03j72L59k95J19j04lK55l30j03J75J34P5q0r1k9J51j02j85K39j28J24
9145F7j17K60l27J15o9k1Q0j06p4K36j17J22m8kJ13j39J21J69j39Mj1n9o3J26
9169A21l6k40K90l74J64j5L11m18K43l2k4J46m26K69J31J1l22M06k76K63j45o0
9191a3j58J52k99P4N5J03M00o9m15K27jj52j06l9K12P5J45k42k8k0J80j05j09
9214a33K17J76k19O8j59J83l88Q2K23j07n6L3R1j55K4MOk0J74j83J00j13L22k71
9238a01J96m28K32J81k50j24J33M0M2q8J44J07%k98L3K82r7J25o7Q3j15m4q5L6
9262f3Q1nL0J69o4O5j39n4J33j92M05m40J03n2%J97j08k73J60j68K26q8M1om4
9287h6k5R7P7L3P0l57L71k13J21p9k00L1J85j13J42j81J4J29oJ5k27K23j22J04
$$ y = [-63, -45, 58, -114, 245, -50, 69, -35, -38, 217, -113, -216, -41, 93, 168, 88, -3, -32, 119, 17, -168, 71, -57, 67, -50, 210, -117, -2, -71, -92, -12, -118, -192, 44, -73, 49, 1, -1, 112, -27, 94, 263, 124, 128, 117, 58, -5, 121, 85, -155, 135, -239, -75, -90, 221, -197, 46, 14, -10, 136, -290, -21, 110, 121, -201, 205, -71, 192, 47, -13, -171, -19, -318, -244, -189, -86, 314, 245, -170, 57, 56, -96, -202, -241, -29, 46, 191, -51, -79, -99, 81, -24, -133, 84, 260, 41, 109, -50, 133, -255, -173, 50, -57, -113, -80, 11, -144, -120, -116, -110, -130, 44, -139, -39, -152, 170, -101, 95, -333, -101, 80, -170, -294, -161, -121, -79, -167, -23, 84, 84, -214, -181, 101, 4, 129, 62, 145, 30, -14, -99, -63, 18, 13, 43, 212, 148, 213, 74, 20, 153, -39, 366, -74, 29, -23, -23, 174, 66, -207, -47, -215, 11, -77, -36, -42, -86, -111, -14, 63, 96, 166, -191, 180, -33, 88, 9, -191, -160, 25, -88, 54, -127, -113, 16, 10, 25, -202, 21, -101, 3]
9311Cm7m3J10q1M9k8L48k32J4k23pQ7J72p0O6J36k56Q0k23jJ95M2n8j97J77l6
9337b3J14k01J50L2j48L00j37N4k61J28Q0j08Q2j09j47J84k20N4n4K87r7LK7n6
9361f6K17k8j49J25j14M1l4J23j73j57L66j59J30k46J0n8j1k7K03j16J42j40J10
9384a1R4k44m3L24k03N6j39K25jMj39jJ89k53K68K1J56l96P1R7l1j59K43j44K43
9409B27n0j06qJ23k13k61M17N8j41k2j67lP1j1J96j17J10J66k95j19J13j5L08
9432B61m97J82P2j67L15o8j42M1Ol2N8Mn3N2o1Nk1P6J58j93k54K38m1J48k14J52
9458B5j89J17j6K10l47K63K19n93K37L1J40j01k5qp0M56m74k54M97k40K70j20
9480B8j47q0J20J40q3j85L85j90o3m2O1o8q3J78k6k39K09j50J60K72Jk60J60j32
$$ y = [3, -44, -87, 23, -58, -9, -37, 311, 79, 93, -130, -137, -50, 122, 52, 118, 254, -2, 78, -145, -146, 49, 91, 33, -164, 13, -23, 91, -110, 40, 72, -76, 224, 87, 141, -120, 8, 88, -20, 62, -47, -194, -10, -230, -176, -230, 57, -40, -37, -10, -66, 151, 123, -26, 99, -15, 26, -8, 115, -58, -215, 151, -8, 122, -124, -114, -172, -183, -210, -7, -123, 19, -121, -11, 83, -161, -204, 120, -83, -27, -166, 59, 58, 62, -77, -78, 111, -142, 126, 147, 303, -93, -22, 75, 44, -115, 128, -16, 227, 177, 71, 63, 186, -27, -288, 129, 187, 46, 24, -143, -146, -75, -86, 110, -7, 103, 269, -26, -145, -32, -47, 261, -236, -54, 18, -149, 166, 98, -44, -3, 3, -29, 29, 33, -20, 32, -29, -24, -45, 31, 189, -4, -258, -20, -61, 87, -127, 25, -164, -47, -63, 147, -200, 63, 282, -311, -74, -43, 97, -4, -29, -37, -107, 349, -125, -379, 118, -122, 148, 28, -119, -199, -79, 61, -22, -207, 178, -12, -75, -117, -56, -124, -207, -29, -55, -294, -85, -235, -75, 197, 198, -62, 98, -34]
9504c4K3Q1p8k72J32J87m8L9L0J45k50R5m6o7k46M70l32K43n8J0J2Lq7J29p2J08
9530A17k98N7L3q9L17j99L5j68J62Q3k34L03ok29OJ58r7pJ59j66N2R5j09J47j65
9555d3K42j40J39k17J30k71PJ14Q8m6r5J06J48l60K18P8j63K8J33j73L16j52k35
9578a48J98J06k26q0O9K85j35J88k46R4j84KpJ8pj39M77m39K19q7J61r7Q1j73
9602g0j0J45j05q6K08n5J10j19N1K1q3p0n4L3o1K25l32J30qJ01j05K70l46K62
9626E2R5k88kQ9j13M0L3R6k98M6K03r1Q8L9j02P7K95k48m0J22j36K30j02j74R4
9651En5m0J55M7k94l0K37k25J60K22j85M20j03m21J73l3j18K50k42k9J36j09m7
9674a26J5J84j51j42J68K0j13J59R4k62L38j20J28k49J9p8J66J6M5n2l7qm3M5
$$ y = [-34, -11, 70, -8, -280, -148, 39, -9, 30, 60, 205, -45, 50, 4, -63, -309, 161, -171, 72, 14, 24, 36, 39, -48, 81, 9, 117, -181, -124, -91, -180, 137, -62, -27, -195, -33, 50, -184, 119, 113, -116, -110, 48, -49, -56, 103, -63, -11, 84, -25, 122, -43, 199, 59, 198, -19, 111, -160, -153, -39, 49, 3, -92, 14, 162, -198, 20, 98, -65, -37, 96, -77, 239, 87, -148, 50, 156, -70, -150, -81, 204, 69, 257, 11, 105, -79, -77, -84, -66, -73, -212, 265, -174, 45, -42, 119, 22, 103, -70, -80, 65, -40, -126, 82, 27, 137, 18, 69, 90, 7, -63, -117, -84, -145, 80, -252, -122, -130, -29, -134, 136, -210, 52, 147, -141, -143, -54, -167, -127, -94, 2, -296, -250, -47, -138, -50, -11, -113, -36, 259, 11, -29, 93, -43, 187, 85, -89, 5, -50, -90, 65, 112, -182, -212, 25, -200, -40, 182, -3, 417, 314, -107, 66, 33, -85, 165, -77, -106, 30, -79, -126, -111, 73, -78, -220, -52, -32, -145, 14, 108, -154, 184, 64, 192, -57, -38, -116, 50, 66, 111, 59, 22, 14, -29, 16]
9698A6J04j69k09L65p3nQ8N7m52K20Q7j12L63m50L07R8l52J95l56R7K08L1n7j36
9722a35l7L55K1o4k20r6L11k50O8J98L8j60j64J84K26k79L40m54K98k73K46l02
9744a49J19Q6l3j47K47n5j38J58R7k94L47k39j14L41k73N8O5l9J82j85k5J03j13
9767aN0l88K20K22l06J02L22k80L4J04o9k54J22j0J74J31j33l5J6L05k50M3j65
9790d6J42l16K28q0J58k29Q6J09n3q3K31j08N0j71O0j76K37k86L89q3Q9J62k10
9813A00j4p4R2q8m9Q8j83Q7J89l3j8J62j74j99J58j33J42M8K07l16q1Kk2J34K1
9838D6l4K68j19k77Q1J05j56M15m83P0J74J47k42Q9j71m7J96o6o3Q5o3O7k5J79
9862A76j35l0jJ90k79R8P4J4l8J30k14j18J18J1j44q2J70m2J14k97M34l30O1J3
$$ y = [16, 120, -49, -258, 107, 34, 29, 117, 174, -278, -58, 29, -83, 280, -170, 137, 235, -117, 78, -278, -181, 27, 58, 1, -135, -172, 183, 204, 140, -80, -176, 135, -115, -47, 151, 189, 29, -135, 49, 275, -4, 336, -118, 180, -93, 153, -149, -30, 56, 23, -124, 123, 68, -70, 88, 185, -109, 238, -1, -115, 226, -47, 11, 76, 37, 219, 34, 9, 112, -1, 49, -339, -119, 103, -203, -101, 221, -59, -25, 79, 10, -244, -122, -132, 42, 173, 40, 5, 21, 326, 76, 119, -46, 96, -220, 8, -72, 86, -143, -57, 52, -1, -84, 147, 39, 89, -82, -22, -198, 39, -247, 142, 59, 148, 310, 100, 86, 12, 104, 16, -33, 55, -128, -41, 148, 115, 97, 259, 85, -114, 44, -89, 53, 101, 308, -8, -89, -87, -109, 25, 46, 12, 280, 161, -116, -35, 70, -86, 329, -154, -84, 90, 237, -5, 84, -87, -134, 62, -4, -67, 18, -45, 22, -3, 176, 41, 11, 10, 200, -79, 19, 93, 107, 69, 199, -15, -133, -15, -4, -148, -230, -60, -102, 12, -285, 149, -181, -120, -107]
9886a07Lr5J93J57k27Q4P2k30L8M8J56M9n6J90l80J57l28P6K65o1j15k7j22L04
9910D4J32l52J41p5R2j0R6J28j88o5K8K68k59Q2Q0o2J51j27k67J49L9K44k31J7
9934E5pp2K09n3l8q2J02n45L48l0J84l31N02j23k27J51nN7K9n3J68j87j0J3j45
9959i0P5j5NK29k49l98N63J03j01M4l09K95M4k72K82m24L41r9j61J16L63l32l08
9982b98M43m37L77j1k40L10N8j60m4k55P7L4J99k26R2N4J9K4o2j43J68l7k47M55
10006A50k2l3q5J13J69l17J10J20q4k19R5K71k83R3l39N43k93p1P8l1m5rJ58j12
10030d3j5J23j84P2j6pm3P1qj14K48j76N5Q8k3J0J15k27K67q7Q2n1l57j12L68
10055C6o3J60j10j45J52J78k19mJ54j14L2o0k80L08m3k13J07j14K08P7o1K43j45
$$ y = [-107, -104, -199, -6, 151, -76, 8, 80, -150, -112, -64, 92, 141, 85, 275, -105, 52, -276, -200, 65, 4, -111, -138, -260, 44, 176, -176, -35, -110, -18, -28, 68, 196, 8, -57, -29, 239, -20, 62, 142, 80, 231, 104, -163, -14, 25, 269, 38, 55, 48, -24, 185, 132, 94, 12, 114, -431, -83, -113, 71, -260, 242, 119, -108, 43, 38, 95, 124, 71, 239, 52, 42, 55, -90, -15, -30, -25, 204, -45, -443, 120, 223, 122, 166, -143, 152, 196, -76, 206, -218, 123, 24, -137, -21, 342, 10, -298, 145, -292, 85, 74, -166, 144, 202, 42, -2, -257, -180, -146, 53, -173, -81, -27, -8, 16, -46, -189, -21, -58, -305, 150, 128, 95, 10, 123, 292, -25, 85, 205, 121, -98, -3, 268, -15, 78, -261, 282, -11, -82, -4, -35, -80, -89, 69, -43, -58, 65, -119, -47, -63, -70, -113, -42, -50, -164, 84, -92, -37, 51, 28, 38, 153, -74, 193, 106, 188, 137, -220, -332, 36, -27, 133, 23, -122, 30, 208, -11, -15, 139, 25, 57, -3, -283, 25, -18, -231, -124, -238, -30, 47, -14, 229, 84]
10078H4q8j29J73J15l26K65K1Q1r7k4K04j91o3J29l2r8J3J7jo6j18J60o8M4J04
10103A09J07o6k04QJp3K7K04N1k66R7l6L9n9P0m6N4j50P8j9K8M0p5J21p4O2n5
10130b7k1k08J58N4l8M08l28o9K00j66%j75M29l66K97j0j84J50Q2l10J59k0O2
10153G7K62l52n0q4K57j97J68j24O6j20L56j64q3p1J31j8k3K38m93J91J06q4k9
10176d0o1k8MJ9p8J86J65k50Jj00M7M00m84K24k9k14J62q7nk5L65k35o9J18q4
10201i8n9J11KJ34l04J58J46j29J11J58l04J74j50L5o9mk38L61m8k19K02M2pq5
10225h0J55p1K02j02j44l7K03k22k1K19k24K40J9j02j56K9nM1N5pm2R6M2j71L44
10250B61m56J92Q2j64l1J64M5l7K4j86K0J00p2j60J54J34j30J66j03j55j75N27
$$ y = [84, -4, -133, 40, 155, -171, 94, 115, 196, 99, 75, 279, 88, 25, 154, 122, 24, 37, 54, 53, -13, -131, 29, -39, 5, 109, 216, 150, -54, -46, -45, -118, -91, 113, 164, -102, -5, -41, -2, -61, 9, -37, 17, -133, -55, -74, -46, -6, -81, 40, -34, 28, -27, -48, -256, -98, -44, -82, 326, -2, -71, 129, -37, -37, -212, 217, -149, 148, 138, -46, 104, 186, -124, 35, 15, 77, 339, -13, -63, -147, 110, -87, 81, -43, 23, -97, 259, 95, 12, -59, 72, 54, 31, 269, -224, -33, 73, -11, -40, -101, -129, -125, -106, -184, 2, 167, -83, -82, -182, -135, 265, -219, 5, -24, -238, -76, -163, -168, -193, 172, -63, -132, -14, -98, -157, -46, -44, 90, -214, -56, 90, -39, 72, 230, -74, 100, -50, -15, -84, -88, -326, 35, -13, -232, -30, 12, 5, -80, 75, 4, 206, 104, -40, -77, 126, -96, -117, 102, -122, 118, 137, 35, -121, -92, -97, -56, -1, -8, -50, 46, 88, -83, 261, -195, -3, 79, -85, -116, 48, 93, 56, 80, -106, -86, 14, -58, -218, -64, 70, -60, 106, 3, -152, -327, 200]
10272B00k11J44j04K9L4j04j0j63K59n5o0N3NK34l13J37k16k5K14q5K7K31k32
10295a1J00N7k1j58N0J16k91K34j69m2L44q5l25J42Q1q5N1l2m8L38l61Q4J64j4
10319A19J46l16o7K39k7r8Q2kk12J85q6k1p8K4L8l1K44j85p2j02L12k19Q1j3q6
10344a45J37k27K35K49l04j45J37L5l0p0K52l5J00k45P4p2J17J1j47J53kk39K16
10367E5M0j55q8K5K11k89L21J01k23J31j98L36k74O0j78J68j07J1K05k34m1N8
10389f5J25j29K4j30L02l4j2j45K02k7j33R4j67O1N4j71J96M5O9k52K16R3j45
10412G1m30K98J20j76J2Q3j40K94j64q7J70k11J16nl5J31J8M0k15Np8K10p9k06
10436b58J86R0j44J73o4Q5n4j58J74r0J66j59n9J68lJ55N7k50k67L28j23K7P6
$$ y = [200, -11, 133, 29, 58, 92, -12, -22, -185, 74, 19, -41, 12, 17, 251, -62, 75, -141, -166, 48, -37, -10, 221, -11, 89, 146, 125, -33, 17, 133, -158, 76, -93, -135, 209, 124, -201, -59, 22, -63, -12, -44, -92, 246, -115, -31, 133, 119, 265, -51, -118, 121, 94, -4, 78, 76, -136, 49, -37, -58, -136, -112, -74, -105, 139, -46, -118, -220, 92, -127, -46, -59, -145, -8, -235, 0, 249, -55, -200, -63, -28, -58, -128, 124, 89, 189, -56, 18, -54, 63, 74, -73, 80, 78, -161, 55, 95, -60, -148, -123, 88, -201, 120, 221, -2, 129, -69, 267, -7, 53, -125, 43, -64, -53, 152, -82, -123, -65, 60, -69, -45, -175, 127, 93, 81, -64, 138, 111, -22, 72, -95, -34, 20, -151, 45, 90, 159, -93, 123, 216, 71, -359, -61, 59, -117, -105, -22, -162, 132, -32, -119, 51, -160, -44, -49, -84, 47, 65, 105, -110, -105, -183, 27, -52, -258, -72, 18, -126, 47, -17, 68, 14, -144, 30, -60, 106, -53, -112, 56, 53, 208, 265, 15, -252, 76, -47, -20, 56]
10459E6n0P1j08l1K05L5l53L47L3j59K31l1K1m50Q1J35Qj00PJ08O2j43k2k44L17
10484B6l1Pj32J41J12m6j35J97k34p3L86k54L0k56K60r0K54j56j3j75L2L60l29
10507a19K69l7l5M5j70P5p7r0J49O4k3J8J6Q2j24k44L63k28k37K56j38K42p6J43
10531A24j34j79K77j55q6R5k1M5q9K57l1j1j49K8j16J17o9N3J31k75J98l3j71
10554a94J88K18o8k99J98j00J95NJ14j30j9o0K1L3R1L9k19K71m25K46j86J46k07
10577a42K53k5L4j75Q6M3j62P1J49k43k1J89lJ05o4J40m01M3L35k33J66k55J3
10600i7K72j66J03N0j15N8j60L3J39m38K38K19k1j35j32J25J76k55J85j96L4K27
10622A44l48N06m03%K9m6P1P5N5Rq0Q6j39J26o8O7l04J92Kl16M83k43qR9K53k10
$$ y = [56, 6, 77, -31, -62, 143, 178, -175, 172, 205, 46, 277, 246, 267, -183, -102, 33, 41, -59, -52, 56, 118, -25, -47, -291, 26, -5, 2, -130, 11, 123, 77, -58, 139, -95, -168, 218, -36, -6, -262, -2, -92, 162, 6, -7, -182, -150, 210, -119, 150, 113, 78, 123, -47, 28, -49, -139, 10, 74, 51, 69, 85, 167, 43, -201, 162, -66, -303, -47, -185, 57, -19, 124, -10, -189, 88, -67, -153, -58, -79, -34, -123, 134, 103, 92, -57, -29, -145, -28, -97, -44, 87, -188, 10, -23, -194, -6, 212, 144, -155, 43, -57, 138, 143, 257, 127, 108, 48, 69, 102, 193, 232, 13, 284, -141, 105, -81, 65, -142, 111, 86, 120, -55, 31, 74, -88, -17, 132, -111, -132, 57, 54, 159, 95, 235, -166, -123, 212, -21, 145, -110, -97, 175, 9, 112, 162, 47, 105, -55, -22, 117, -321, -83, 136, 115, -20, -152, -27, 149, -106, 79, -117, -83, 144, -204, 302, -101, -101, -72, -118, -47, 28, 83, 92, 12, 98, -41, 85, 17, 84, -220, -28, -26, -342, 141, -102, -110, -11, 242, 32]
10648C2J94l26L25l11ON6j65L74l48K15J71l68L49j21n2J21j44k7J67j06n0P1
10670F3on7M9P4ok16j30Q7J56J5l13L79k41J18O0j65J52q3k82M46l41K08P8L7
10694H2k22Q7J15k47K24k68N9J58J71n9l08K48j9o4K20q1j26O2J00o6K1j52J51
10717H6q7l0j37K55j70K1j7n5L16P5k17J00m96M07J02j81N4j99K04p5N8nJ54J
10741A64k13J47Np7k10K02J14j77J32p6M7l1M2m2J10K1k73Q0J4J87k15K58l8j1
$$ y = [32, 226, -100, 225, -86, -80, -24, -189, 185, -163, 52, 223, -145, 204, 83, 31, 152, 8, -19, 148, 42, -8, 63, 57, 0, 49, 123, 117, -99, -229, -142, 14, 29, -284, 95, -146, -28, 32, -133, 19, -64, -346, 100, -241, -33, 45, 82, -140, -53, 62, -185, 39, -229, -170, -12, 159, 100, -208, 40, 21, -43, 177, 96, -30, 32, 132, 66, 87, -65, 86, -1, -31, -168, 87, -83, -62, -79, -134, 182, 257, 40, 140, -356, 51, 153, -28, 26, -173, 31, -44, 14, 9, 163, 164, -49, 98, 103, 26, -184, 18, 132, -45, 87, 11, 58, 27, 69, 27, 137, 158, -115, -35, -21, 166, -49, 209, 171, 160]
$$ [...]
16383F2
##END NTUPLES=NMR FID
##END=
