##TITLE=abcd
##JCAMPDX= 6.0         $$ Bruker NMR JCAMP-DX V2.0
##DATA TYPE= NMR FID
##DATA CLASS= NTUPLES
##ORIGIN= UXNMR, Bruker Analytische Messtechnik GmbH
##OWNER= root
$$ XWIN-NMR		Version 3.5
$$ Tue Jul 15 11:17:33 2025 Russian Standard Time (UT+4h)  servis@DPX200
##.OBSERVE FREQUENCY= 200.131235884673
##.OBSERVE NUCLEUS= ^1H
##.DELAY= (6, 6)
##.ACQUISITION MODE= SIMULTANEOUS
##.ACQUISITION SCHEME= undefined
##.AVERAGES= 32
##.DIGITISER RES= 18
##SPECTROMETER/DATA SYSTEM= spect
##.PULSE SEQUENCE= zg
##.SOLVENT NAME= CDCl3
##.SHIFT REFERENCE= (INTERNAL, CDCl3, 0, 16.5164)
##AUDIT TRAIL= $$ (NUMBER, WHEN, WHO, WHERE, WHAT)
$$ ##TITLE= Audit trail, XWIN-NMR		Version 3.5
$$ ##JCAMPDX= 5.01
$$ ##ORIGIN= Bruker BioSpin GmbH
$$ ##OWNER= servis
$$ F:\spectra/data/av/nmr/H1/1/audita.txt
$$ ##AUDIT TRAIL=  $$ (NUMBER, WHEN, WHO, WHERE, WHAT)
(   1,<2025-07-15 11:16:49.75 +0400>,<servis>,<DPX200>,
      <created by zg, POWCHK disabled, PULCHK disabled
       configuration hash MD5:
       00 E9 B6 7A A2 85 ED C7 34 08 36 98 17 FE 4E 26
       data hash MD5: 32K
       0E 2B AA 41 26 5B 21 88 4F E0 10 BE 2D 17 BE AB>)
$$ ##END=
$$ 
$$ hash MD5
$$ 4B 30 34 5A 59 88 5C 2A BA 3C 44 82 75 B0 FE 82
##$RELAX= 
##$RELAX= 
##$RELAX= 
##$RELAX= 
##$RELAX= 
##$RELAX= 
##$RELAX= 
##$RELAX= 
$$ Bruker specific parameters
$$ --------------------------
##$DU= <F:\spectra>
##$EXPNO= 1
##$NAME= <H1>
##$PROCNO= 1
##$TYPE= <nmr>
##$USER= <av>
##$AMP= (0..31)
100 100 100 100 100 100 100 100 100 100 100 100 100 100 100 100 100 100 
100 100 100 100 100 100 100 100 100 100 100 100 100 100 
##$AQSEQ= 0
##$AQ_mod= 1
##$AUNM= <au_zg>
##$AUTOPOS= <>
##$BF1= 200.13
##$BF2= 200.13
##$BF3= 200.13
##$BF4= 200.13
##$BF5= 500.13
##$BF6= 500.13
##$BF7= 500.13
##$BF8= 500.13
##$BYTORDA= 1
##$CFDGTYP= 0
##$CFRGTYP= 5
##$CHEMSTR= <none>
##$CNST= (0..31)
1 1 145 1 1 1 1 1 1 1 1 1 1 1 1 1 1 1 1 1 1 1 1 1 1 1 1 1 1 1 1 1 
##$CPDPRG= <>
##$CPDPRG1= <>
##$CPDPRG2= <>
##$CPDPRG3= <>
##$CPDPRG4= <mlev>
##$CPDPRG5= <mlev>
##$CPDPRG6= <mlev>
##$CPDPRG7= <mlev>
##$CPDPRG8= <mlev>
##$CPDPRGB= <>
##$CPDPRGT= <>
##$D= (0..31)
0 2 0 0 0 0 0 0 0 0.06 0 0 0 0 0 0 0.0002 0 0 0 0 0 0 0 0 0 0 0 0 0 0 
0 
##$DATE= 1752563809
##$DBL= (0..7)
120 120 120 120 120 120 120 120 
##$DBP= (0..7)
150 150 150 150 150 150 150 150 
##$DBP07= 0
##$DBPNAM0= <>
##$DBPNAM1= <>
##$DBPNAM2= <>
##$DBPNAM3= <>
##$DBPNAM4= <>
##$DBPNAM5= <>
##$DBPNAM6= <>
##$DBPNAM7= <>
##$DBPOAL= (0..7)
0.5 0.5 0.5 0.5 0.5 0.5 0.5 0.5 
##$DBPOFFS= (0..7)
0 0 0 0 0 0 0 0 
##$DE= 6
##$DECBNUC= <off>
##$DECIM= 32
##$DECNUC= <off>
##$DECSTAT= 4
##$DIGMOD= 1
##$DIGTYP= 9
##$DL= (0..7)
0 120 120 120 120 120 120 120 
##$DP= (0..7)
150 150 150 150 150 150 150 150 
##$DP07= 0
##$DPNAME0= <>
##$DPNAME1= <>
##$DPNAME2= <>
##$DPNAME3= <>
##$DPNAME4= <>
##$DPNAME5= <>
##$DPNAME6= <>
##$DPNAME7= <>
##$DPOAL= (0..7)
0.5 0.5 0.5 0.5 0.5 0.5 0.5 0.5 
##$DPOFFS= (0..7)
0 0 0 0 0 0 0 0 
##$DQDMODE= 0
##$DR= 18
##$DS= 0
##$DSLIST= <SSSSSSSSSSSSSSS>
##$DSPFIRM= 0
$$ [...]
##$SUBNAM0= <"">
##$SUBNAM1= <"">
##$SUBNAM2= <"">
##$SUBNAM3= <"">
##$SUBNAM4= <"">
##$SUBNAM5= <"">
##$SUBNAM6= <"">
##$SUBNAM7= <"">
##$SUBNAM8= <"">
##$SUBNAM9= <"">
##$SW= 20.6817932712277
##$SWIBOX= (0..15)
0 0 3 0 0 0 0 0 0 0 0 0 0 0 0 0 
##$SW_h= 4139.07284768212
##$TD= 32768
##$TD0= 1
##$TE= 0
##$TE2= 300
##$TE3= 300
##$TEG= 300
##$TL= (0..7)
0 120 120 120 120 120 120 120 
##$TP= (0..7)
150 150 150 150 150 150 150 150 
##$TP07= 0
##$TPNAME0= <>
##$TPNAME1= <>
##$TPNAME2= <>
##$TPNAME3= <>
##$TPNAME4= <>
##$TPNAME5= <>
##$TPNAME6= <>
##$TPNAME7= <>
##$TPOAL= (0..7)
0.5 0.5 0.5 0.5 0.5 0.5 0.5 0.5 
##$TPOFFS= (0..7)
0 0 0 0 0 0 0 0 
##$TUNHIN= 0
##$TUNHOUT= 0
##$TUNXOUT= 0
##$USERA1= <user>
##$USERA2= <user>
##$USERA3= <user>
##$USERA4= <user>
##$USERA5= <user>
##$V9= 5
##$VALIST= <valist>
##$VCLIST= <CCCCCCCCCCCCCCC>
##$VD= 0
##$VDLIST= <DDDDDDDDDDDDDDD>
##$VPLIST= <PPPPPPPPPPPPPPP>
##$VTLIST= <TTTTTTTTTTTTTTT>
##$WBST= 1024
##$WBSW= 30
##$XGAIN= (0..3)
0 0 0 0 
##$XL= 0
##$YL= 0
##$YMAX_a= 4420436
##$YMIN_a= -4313889
##$ZGOPTNS= <>
##$ZL1= 120
##$ZL2= 120
##$ZL3= 120
##$ZL4= 120
##$ABSF1= 10
##$ABSF2= 0
##$ABSG= 5
##$ABSL= 3
##$ALPHA= 0
##$AQORDER= 0
##$ASSFAC= 0
##$ASSFACI= 0
##$ASSFACX= 0
##$ASSWID= 0
##$AUNMP= <proc_1d>
##$AZFE= 0.1
##$AZFW= 0.1
##$BCFW= 1
##$BC_mod= 2
##$BYTORDP= 0
##$COROFFS= 0
##$CY= 19
##$DATMOD= 1
##$DC= 2
##$DFILT= <>
##$DTYPP= 0
##$F1P= 11.0000007629395
##$F2P= -0.999999237060547
##$FCOR= 0.5
##$FTSIZE= 0
##$FT_mod= 4
##$GAMMA= 1
##$GB= 1
##$INTBC= 1
##$INTSCL= 1
##$ISEN= 128
##$LB= 0.05
##$LEV0= 0
##$LPBIN= 0
##$MAXI= 10000
##$MC2= 0
##$MEAN= 0
##$ME_mod= 0
##$MI= 0
##$NCOEF= 0
##$NC_proc= 0
##$NLEV= 6
##$NOISF1= 0
##$NOISF2= 0
##$NSP= 1
##$NTH_PI= 0
##$NZP= 0
##$OFFSET= 16.51637
##$PC= 1
##$PHC0= -287.1506
##$PHC1= 19.70155
##$PH_mod= 0
##$PKNL= yes
##$PPARMOD= 0
##$PSCAL= 4
##$PSIGN= 0
##$REVERSE= no
##$SF= 200.13
##$SI= 16384
##$SIGF1= 0
##$SIGF2= 0
##$SINO= 400
##$SIOLD= 16384
##$SREGLST= <1H.CDCl3>
##$SSB= 0
##$STSI= 0
##$STSR= 0
##$SW_p= 4139.07284768211
##$SYMM= 0
##$S_DEV= 0
##$TDeff= 0
##$TDoff= 0
##$TI= <>
##$TILT= no
##$TM1= 0
##$TM2= 0
##$TOPLEV= 0
##$USERP1= <user>
##$USERP2= <user>
##$USERP3= <user>
##$USERP4= <user>
##$USERP5= <user>
##$WDW= 1
##$XDIM= 8192
##$YMAX_p= 0
##$YMIN_p= 0
$$ End of Bruker specific parameters
$$ ---------------------------------
##NTUPLES= NMR FID
##VAR_NAME=  TIME,          FID/REAL,        FID/IMAG
##SYMBOL=    X,             R,               I
##VAR_TYPE=  INDEPENDENT,   DEPENDENT,       DEPENDENT
##VAR_FORM=  AFFN,          ASDF,            ASDF
##VAR_DIM=   16384,         16384,           16384
##UNITS=     SECONDS,       ARBITRARY UNITS, ARBITRARY UNITS
##FACTOR=    0.0002416,     1,               1
##FIRST=     0,             0,               0
##LAST=      3.9581328,     0,               0
##MIN=       0,             -4313889,        0
##MAX=       3.9581328,     4420436,         0
$$ Real data points
##PAGE= N=1
##DATA TABLE= (X++(R..R)), XYDATA
$$ [...]
$$ plain form
9806 -81 17 -15 -39 198 65 -129 28 -38 -234 -74 -248 207 -53 70 161 -126 114 -78 -123 30 90 272 52
9829 52 -44 -22 72 -7 -2 74 95 434 43 145 -180 -81 -96 -36 98 148 39 56 -159 -172 72 -121 206 30 -68
9854 -68 -175 -119 -124 -46 65 49 -33 284 79 -161 66 -68 191 -215 22 -1 -156 76 -130 31 109 45 -97
9877 -97 32 131 71 212 -185 56 137 148 168 72 -76 -7 -71 -22 208 337 13 169 154 62 -96 18 57 112 21
9902 21 -26 -66 -19 -154 -88 0 -30 44 24 -22 135 -22 1 90 -26 -11 -195 164 -33 17 -75 98 -232 -90 -226
9927 -226 -243 32 -181 31 17 -160 160 41 -41 161 58 -115 -63 -136 -116 -55 -105 -141 20 -25 -203 36 46 -4
9951 -4 -133 -3 127 17 78 18 -386 0 20 22 -26 99 114 -39 -77 265 -73 -207 -4 16 -17 -47 199 -69
9975 -69 -224 297 121 -117 109 137 37 48 -119 46 -36 129 -2 34 29 -52 -127 -2 -71 -85 -79 277 -36 -285
$$ packed form
9806h1R8l2k4K37j33j94J57o6j96J60j74M55k60J23R1k87K40j92m5J53O0J82k20
9829E2r6K2R4p9NP6K1L39l91J02l25R9j5O0J34N0j09J7k15j3K44j93L27j76r8
9854f8j07N6nP8J11j6q2L17k05k40K27j34K59m06K37k3j55K32k06J61P8o4j42
9877i7J29R9o0J41l97K41Q1J1K0r6j48O9o4M9K30J29l24J56j5r2j58J14L9N5r1
9902B1m7m0M7j35O6Q8l0P4k0m6J57j57K3Q9j16J5j84L59j97N0r2J73l30J42j36
9927b26j7K75k13K12j4j77L20j19q2K02j03j73N2p3K0O1n0l6J61m5j78K39J0n0
9951dj29J30J30j10O1o0m04L86K0Km8J25J5j53l8L42l38j34K03K0l3l0K46k68
9975f9j55N21j76k38K26K8j00J1j67J65q2J65j31L6nq1p5J25o9j4OL56l13k49
$$ plain form
9999 -285 97 125 -104 -59 54 132 -179 32 122 -227 -117 -85 -86 -67 125 -163 43 46 -50 258 -55 8 -152 -148 5
10024 5 35 221 175 178 17 30 241 -25 -38 -220 -98 1 -29 7 -51 89 241 -46 -14 63 -189 -114 325 327 -111
10049 -111 -23 -116 14 115 21 91 -104 88 132 -149 -127 -117 -24 108 -19 -73 168 152 -67 -69 -33 -14 -132 65
10073 65 63 -138 -100 58 95 14 -152 -271 49 119 -83 -20 -59 47 -187 21 45 -290 -86 16 130 130 213 215 -168
10098 -168 34 -142 58 -86 46 39 -32 91 -249 -122 -284 -131 -116 -132 49 -240 255 75 -183 179 141 112
10120 112 71 -176 -111 48 -32 -63 168 -125 68 32 248 228 -28 -52 -49 31 -101 -60 -96 -166 -43 5 -269 -94
10144 -94 180 44 -128 88 -26 -116 -81 -144 194 127 -38 107 19 33 -178 -89 -85 180 8 16 15 4 -106 88 -44
10169 -44 -17 19 214 109 41 62 35 -120 18 27 23 116 135 -75 -55 -93 146 69 44 -126 -192 275 17 93 89 -97
$$ packed form
9999b85L82K8k29M5J13P8l11K11R0l49J10L2jJ9J92k88K06Lr6L08l13O3j60MJ53
10024EL0J86m6Lj61J3K11k66j3j82J22R9l0L6n8J40J52k87L2P7k52P5M39Km38
10049a11Q8r3J30J01r4P0j95J92M4k81K2J0R3J32j27n4K41j6k19kL6J9j18J97
10073F5kk01L8J58L7q1j66j19L20P0k02O3l9J06k34K08K4l35K04J02J14%Q3Kl83
10098a68K02j76K00j44J32pp1J23l40J27j62J53J5j6J81k89M95j80k58L62l8k9
10120A12m1k47O5J59q0l1K31k93J93l6K16k0k56k4LQ0j32M1l6p0J23M8k74J75
10144i4K74j36j72K16j14r0L5o3L38o7j65J45q8J4k11Q9MK65j72Qjj1j10J94j32
10169d4K7L6J95j05o8K1k7j55J38RmR3J9k10K0l8K39p7k5j70o6M67k58P6mj86
$$ plain form
10195 -97 -91 190 60 -63 120 7 -15 -256 170 -175 -7 139 -165 -12 129 -97 85 -75 -83 71 -59 -12
10217 -12 -30 -157 -203 118 -32 194 17 101 176 -113 226 88 -51 -62 166 147 206 -40 78 -31 69 119 126
10240 126 -76 102 84 -153 -53 -33 131 -6 -65 30 129 -130 -22 113 -78 -158 -27 -75 -7 -2 -90 -95 -209 -25
10264 -25 -258 56 -111 -145 168 -66 369 103 160 -104 -161 114 167 210 195 156 39 -171 78 195 98 29 -225
10287 -225 -234 -18 11 -60 -156 28 -15 25 199 8 -101 -91 -19 15 -201 -38 113 -115 188 204 -68 1 183 -37
10311 -37 122 -91 15 -221 -10 134 100 133 -86 -85 144 38 16 236 -113 83 209 14 -102 -98 -93 105 -71
10334 -71 -142 47 49 -339 12 -201 89 22 94 162 -214 48 37 68 -2 -94 -22 -216 -108 25 -189 -158 -176 -114 303
10359 303 -56 58 149 216 -29 -84 203 14 48 -70 141 -178 -125 68 70 71 38 -38 117 176 153 26 37 174
$$ packed form
10195i7OK81j30j23J83j13k2k41M26l45J68J46l04J53J41k26J82j60qJ54j30M7
10217a2j8j27m6L21j50K26j77Q4P5k89L39j38j39j1K28j9N9k46J18j09J00N0P
10240A26k02J78j8k37J00K0J64j37n9R5R9k59J08J35j91q0J31m8O8Nq8nj14J84
10264b5k33L14j67l4L13k34M35k66N7k64n7K75N3M3j5l9j17k10K49J17r7o9k54
10287b25rK16K9p1r6J84m3M0J74j91j09J0P2L4k16J63J51k28L03J6k72O9J82k20
10311c7J59k13J06k36K11J44l4L3k19JK29j06k2K20l49J96J26j95j16MNJ98j76
10334g1p1J89Kl88L51k13K90o7P2O8l76K62j1L1p0r2P2j94J08J33k14L1j8O2M17
10359C03l59J14R1O7k45n5K87j89L4j18K11l19N3J93KJl3p6J55N9k3j27J1J37
$$ plain form
10383 174 45 109 106 57 225 265 -296 130 36 -25 -75 -297 162 -180 -93 161 -114 -208 133 20 -87 33 277
10406 277 -18 57 -71 121 -5 164 -9 -109 -90 133 -88 -59 34 -67 157 7 -152 62 182 17 -93
10427 -93 66 -125 -69 -12 -102 -109 -85 166 -5 -42 -156 95 -197 161 -210 230 19 -58 80 -51 -80 -11 0 -74
10451 -74 -30 -217 229 105 46 -94 219 23 -125 -165 -220 -160 99 -7 -31 -232 223 -52 67 31 -131 16
10473 16 -16 -9 61 -244 -277 -27 125 -140 185 67 134 -45 -103 -69 -338 73 91 -34 -213 -28 173 -21 408
10496 408 51 -29 -29 -159 152 -93 -129 149 -135 54 -96 348 10 145 -149 -13 -9 -99 161 -158 -211 198
10518 198 -11 -65 182 78 178 -137 -12 49 72 -100 -77 89 95 -96 -52 -43 69 -26 -351 -149 50 -71 -174
10541 -174 -117 -35 -26 166 -191 39 -139 51 112 137 17 40 95 200 118 -106 199 1 157 159 -51 88 0 3
$$ packed form
10383A74j29O4lm9J68M0n61M26r4o1n0k22M59l42Q7K54k75r4L41j13j07J20K44
10406B77k95P5j28J92j26J69j73j00J9K23k21K9R3j01K24j50j59K14J20j65j10
10427i3J59j91N6N7r0pK4K51j71l7j14K51k92L58l71M40k11p7J38j31k9O9J1p4
10451g4M4j87M46j24n9j40L13j96j48m0n5O0K59j06k4k01M55k75J19l6j62J47
10473A6l2PP0l05l3K50J52k65L25j18O7j79n8L4k69M11J8j25j79J85K01j94M29
10496D08l57q0%j30L11k45l6K78k84J89j50M44l38J35k94J36Mr0K60l19n3M09
10518A98k09n4K47j04J00l15J25O1K3j72K3J66Oj91M4RJ12r5l25K02J99j21j03
10541a74N7Q2RJ92l57K30j78J90O1K5j20K3N5J05q2k24L05j98J56Kk10J39q8L
$$ plain form
10565 3 -40 -206 -158 75 25 200 -54 80 99 -65 -218 -76 -219 -4 -133 -136 68 211 -133 -133 -61 -226 -90
10588 -90 -34 25 36 -28 290 -88 -45 299 -126 117 -110 19 -191 -10 62 -57 27 46 -64 -14 -13 209 32 64
10612 64 -128 28 -102 75 82 148 -43 -90 -32 11 49 17 -45 72 -310 6 -120 -90 151 -48 -32 -86 -130 181
10636 181 -14 -50 80 -142 19 9 70 36 -11 -102 -140 78 96 6 121 -93 -19 -5 -141 93 -281 191 373
10659 373 172 194 86 112 -27 -110 290 -2 -162 106 -35 56 -288 106 2 133 17 5 38 -91 -2 -86
10681 -86 -286 219 31 -67 -177 -21 -57 33 338 7 109 -141 -71 27 99 -114 82 158 -109 -118 -36 101 -104
10704 -104 98 15 -96 -93 -107 -46 96 192 96 -122 -46 -141 124 -96 83 101 74 -46 103 26 -117 64 97 -119
10728 -119 4 259 -242 -74 -105 126 121 -213 234 0 111 8 256 -163 156 277 -45 97 -28 18 -215
$$ packed form
10565Cm3j66M8K33n0J75k54J34J9j64j53J42j43K15j29lK04J43l44%P2j65J36
10588i0N6N9J1o4L18l78M3L44m25K43k27J29k10J81P2j19Q4J9j10N0JK22j77L2
10612F4j92J56j30J77PO6j91m7N8M3L8l2o2J17l82L16j26L0K41j99J6n4m4L11
10636A81j95l6J30k22J61j0O1l4m7r1l8K18J8r0J15k14P4J4j36K34l74M72J82
10659C73k01K2j08K6j39q3M00k92j60K68j41R1l44L94j04J31j16j2L3j29Q9q4
10681h6k00N05j88r8j10J56l6R0L05l31J02k50P0R8P2k13J96P6k67rQ2J37k05
10704a04K02q3j11Lj4O1J42R6r6k18P6r5K65k20J79J8k7j20J49p7j43J81L3k16
10728a19J23K55n01J68l1K31nl34M47k34J11j03K48m19L19J21l22J42j25M6k33
$$ plain form
10749 -215 72 75 28 -109 -238 112 -72 -112 -147 48 -147 5 -156 65 -115 -176 241 -226 11 -76 83 65
10771 65 -148 -109 -2 38 -14 -180 122 -103 199 182 -138 -88 -153 -157 75 269 183 44 62 -33 71 -23 -61 210
10795 210 -10 89 -36 41 45 291 49 28 -42 -134 -54 -27 -85 -46 33 -38 -137 249 -13 -74 -185 -39 267 23 -109
10820 -109 -25 -108 114 96 21 227 -10 -139 -84 -53 49 -75 114 119 16 91 -139 105 -75 21 247 165 -276
10843 -276 -61 138 -47 6 158 36 201 192 204 -94 135 21 78 347 -76 -24 -81 -85 -17 201 -20 -105 60
10866 60 35 -200 -122 -265 -39 -112 -119 125 78 183 283 16 -97 -10 241 182 -24 115 -103 -49 222 -3 -176
10889 -176 -58 181 -48 -123 34 59 220 21 39 168 126 179 330 129 134 132 -153 -104 -37 -192 -109 119 -188 -54
10913 -54 217 19 93 39 -285 12 -135 -177 68 -10 -39 188 173 231 -145 -82 119 -197 120 104 -141 -43 6 313
$$ packed form
10749b15K87Lm7j37j29L50j84m0l5J95j95J52j61K21j80o1M17m67K37q7J59j8
10771F5k13L9J07M0n2j66L02k25L02j7l20N0o5mK32J94q6j39J8r5J04r4l8K71
10795B10k20R9j25P7MK46k42k1p0r2Q0K7n8L9P9p1r9L86k62o1j11J46L06k44j32
10820a09Q4q3K22j8p5K06k37j29N5L1J02j24J89Nj03P5k30K44j80R6K26q2m41
10843b76K15J99j85N3J52j22J65rJ2k98K29j14N7K69m23N2n7mO8K18k21q5J65
10866F0k5k35P8j43K26p3pK44m7J05J00k67j13Q7K51n9k06J39k18N4K71k25j73
10889a76J18K39k29p5J57K5J61j99J8J29m2N3J51k01Nkk85M9O7j55Q3K28l07J34
10913e4K71j98P4n4l24K97j47m2K45p8k9K27j5N8l76O3K01l16L17j6k45R8M9L07
$$ plain form
10937 313 170 133 372 116 137 96 166 40 -53 148 -27 144 306 5 172 -18 -31 -43 -20 -116 83 -13 9
10960 9 84 24 -96 114 -24 -9 110 26 -31 -247 -238 60 -174 -172 -52 135 -175 14 1 221 63 -150 -102 -248
10984 -248 119 -4 83 -24 -30 87 -2 8 -19 -205 -37 -7 -188 7 149 164 -38 -34 123 104 -115 -200 -26 -168
11008 -168 22 11 -196 -204 -105 -120 1 8 54 -122 -66 -76 184 68 -124 175 -62 -92 -231 -18 14 -78 153 39
11032 39 145 -90 228 88 17 107 -137 162 -42 -29 -48 -174 136 -10 -107 38 231 -297 -121 -78 -139 -60 -13
11055 -13 22 40 91 -174 -126 14 215 166 -180 -173 97 -149 -75 -235 -20 145 -156 117 190 54 137 -386 -48
11078 -48 75 281 14 113 235 -51 -88 30 127 131 29 9 135 229 -200 -169 138 113 107 -141 -98 69 309 -103
11102 -103 204 -63 -15 74 -72 91 -114 -178 78 -18 -206 55 4 -24 -114 -129 171 -289 -25 -194 -152 -75 61
$$ packed form
10937C13j43l7K39k56K1m1P0j26r3K01j75J71J62l01J67j90j3j2K3r6J99r6K2
10960IP5o0j20K10j38J5J19q4n7k16RK98k34KJ20J87l10J89j3K20j58k13M8j46
10984b48L67j23Q7j07oJ17q9J0k7j86J68L0j81J95J42J5k02MJ57j9k19q5J74j42
11008a68J90j1k07qR9j5J21PM6j76N6j0K60j16j92K99k37l0j39K13L2r2K31j14
11032C9J06k35L18j40p1R0k44K99k04J3j9j26L10j46r7J45J93n28J76M3o1P9M7
11055a3L5J8N1k65M8J40K01m9l46PK70k46P4j60K15J65l01K73P3j36Q3n23L38
11078d8J23K06k67R9J22k86l7J18R7Mj02k0J26R4m29L1L07k5ok48M3J67K40m12
11102a03L07k67M8Q9j46J63k05o4K56r6j88K61n1k8r0j5L00m60K64j69M2P7J36
$$ plain form
11125 61 -184 164 1 83 125 -134 84 -29 -205 -162 256 14 -57 114 -145 -27 -119 248 -86 -261 -84 -14
11147 -14 -111 -81 184 82 6 -225 27 -246 90 129 -104 91 -99 -63 -24 -48 146 -203 77 82 79 45 -79 -148
11171 -148 147 -32 -130 -23 -87 -12 80 153 -27 176 59 0 -30 112 232 -141 -143 -108 137 130 52 -18 -120 -277
11195 -277 -138 103 115 87 4 14 -23 106 -51 92 -138 -209 -79 143 110 -199 20 -125 -115 -130 -19 -65 -49
11218 -49 59 14 65 -148 -24 268 -75 115 -82 -103 117 -5 64 115 -49 134 -243 50 9 -184 105 -13
11240 -13 -15 286 63 101 -98 -133 289 185 -205 69 105 -49 -121 -48 47 -288 -48 -15 178 89 -390 31 118 -20
11264 -20 -64 8 87 -43 -62 -16 82 171 73 -93 -6 57 -186 -26 -159 -12 -70 -21 -117 -107 227 -40 -355 50 -159
11289 -159 -315 27 -8 -148 -153 -20 -45 47 45 92 -28 -156 -4 31 81 40 27 -85 -140 -7 248 -30 -244 244
$$ packed form
11125F1k45L48j63Q2M2k59K18j13j76M3M18k42p1J71k59J18r2L67l34j75J77P0
11147a4r7L0K65j02p6k31K52k73L36L9k33J95j90L6L9k4J94l49K80Nll4j24o9
11171a48K95j79r8J07o4P5R2P3j80K03j17n9l0J42J20l73kL5K45pp8p0j02j57
11195b77J39K41J2k8q3J0l7J29j57J43k30p1J30K22l3l09K19j45J0j5J11m6J6
11218d9J08m5N1k13J24K92l43J90j97k1K20j22O9N1j64J83l77K93m1j93K89j18
11240a3kL01k23L8j99l5M22j04l90K74L6j54p2P3R5l35K40L3J93q9m79M21Q7j38
11264b0m4P2P9j30j9M6R8Q9r8j66Q7O3k43J60j33J47n8M9r6J0L34k67l15M05k09
11289a59j56L42l5j40nJ33k5R2kM7j20j28J52L5N0m1j3j12n5J33K55k78k14M88
$$ plain form
11313 244 -24 99 62 -28 13 -44 54 -4 157 172 -56 32 45 -167 100 64 243 -24 153 -184 39 200 -21
11336 -21 -68 71 1 -132 -23 -78 -44 -98 228 118 -19 -173 -105 -101 61 158 212 -72 39 73 -14 -112 -65 -87 -246
11361 -246 -71 108 4 58 -197 188 58 228 -170 336 151 -190 -69 -217 84 195 180 -94 -14 72 156
11382 156 165 30 38 -112 -41 -36 179 142 168 -70 -63 -114 79 247 48 -59 19 -31 50 -177 -14 -239 -247 112 30 -95
11408 -95 -135 61 -235 -229 1 -76 17 -131 -108 108 -12 -112 -42 92 40 -327 -56 -59 -43 0 24 -47 69 -46 0
11433 0 -1 34 126 80 246 13 -92 -198 113 -31 173 92 -43 -35 -274 83 -33 122 -8 -10 -220 97 -162 26
11457 26 -54 -47 11 -51 -37 102 -124 -42 217 -2 -105 128 -67 103 -43 6 170 206 59 -248 160 -30 43
11480 43 94 129 116 -39 -64 90 -49 -67 -143 137 -47 -89 -133 67 193 125 151 -86 -130 115 103 -36 -181 -56
$$ packed form
11313B44k68J23l7r0M1n7R8n8J61J5k28Q8J3k12K67l6J79k67J77l37K23J61k21
11336b1m7J39p0j33J09n5L4n4L26j10j37j54O8MJ62R7N4k84J11L4q7r8M7k2j59
11361b46J75J79j04N4k55L85j30J70l98N06j85l41J21j48L01J11j5k74Q0Q6Q4
11382A56Rj35Qj50P1NK15l7K6k38Pn1J93J68j99j07P8n0Q1k27J63k25qL59q2j25
11408i5m0J96k96OK30p7R3j48K3K16j20j00P0J34n2l67K71lJ6M3K4p1J16j15M6
11433@jL5R2m6J66k33j05j06L11j44K04q1j35Qk39L57j16J55j30kk10L17k59J88
11457B6q0PN8o2J4J39k26Q2K59k19j03K33j95J70j46M9J64L6j47l07M08j90P3
11480D3N1L5j3j55k5J54j39j8p6K80j84m2m4K00J26o8K6k37m4K45j2j39j45J25
$$ plain form
11504 -56 -155 -104 -96 -129 37 119 -61 -67 -31 37 -109 112 -150 92 31 -24 180 -19 76 72 -207 239 -14 136 55
11529 55 78 -80 182 150 -119 130 28 -226 -51 97 -174 -167 -105 -228 288 257 13 -273 -133 -272 179 -108
11551 -108 203 -19 -114 34 -37 -128 -62 48 -68 2 -184 154 -245 -89 -72 39 -202 75 50 -23 -178 23
11573 23 -116 106 74 -40 134 62 -128 100 211 -19 74 -287 -147 115 -34 -69 -39 55 190 -221 59 -330
11595 -330 -82 9 -137 239 -21 -129 11 98 130 136 144 11 -122 239 29 -107 17 94 95 -190 -75 50 -16
11618 -16 -30 26 -41 -146 -182 -66 -95 200 -33 -166 153 176 149 8 -69 -1 47 -119 -146 -252 -63 -48 203 89
11642 89 -60 -335 -180 135 -107 150 62 74 168 -72 12 -23 222 -18 -40 -101 -26 -130 147 10 0 -100 50
11665 50 191 -239 6 -86 -6 14 80 -107 12 -6 13 -306 -28 238 76 99 45 37 -23 -199 -42 -84 -50 24 -24
$$ packed form
11504e6r9N1Ql3J66Q2j80oL6O8j46K21k62K42o1n5K04j99R5mk79M46k53J50q1
11529E5K3j58K62l2k69K49j02k54J75J48k71PO2j23N16l1k44k86J40j39M51k87
11551a08L11k22r5J48p1r1O6J10j16P0j86L38l99J56J7J11k41K77k5p3j55K01
11573B3j39K22l2j14J74p2j90K28J11k30R3l61J40K62j49l5L0R4J35m11K80l89
11595c30K48R1j46L76k60j08J40Q7L2OQj33j33L61k10j36J24P7Jk85J15J25o6
11618a6j4N6o7j05l6J16k9K95k33j33L19K3k7j41p7O8M8j66k7j06J89J5K51j14
11642H9j49k75J55L15k42K57q8J2R4k40Q4l5K45k40k2o1P5j04K77j37j0j00J50
11665E0J41m30K45r2Q0K0O6j87J19j8J9l19K78K66j62K3n4qo0j76J57m2L4P4m8
$$ plain form
11690 -24 51 -135 -8 47 -28 104 -60 -81 221 -28 76 94 325 202 48 -83 -138 6 -90 -22 -46 8 -157
11713 -157 -199 197 -4 -4 168 19 -318 81 -86 140 125 -25 -114 192 -20 -158 108 -18 118 90 -294 -148
11735 -148 -217 -89 -34 -38 -21 216 27 87 -119 -17 -153 98 171 165 -19 0 184 -102 -7 -49 162 -46 5 27
11759 27 294 13 -100 189 33 64 -114 -67 -51 67 275 111 280 157 -135 2 -34 49 -74 -29 -262 -383
11781 -383 179 -154 -59 79 -184 112 -46 178 -11 82 -5 24 102 321 -79 47 289 -263 -45 -234 61
11802 61 4 -185 -137 -7 -66 -195 130 -89 44 10 -51 -388 126 136 5 272 82 -99 111 -60 -70 41
11824 41 -136 107 -122 87 81 0 -8 130 46 94 55 87 -41 -54 -195 -46 260 103 153 -106 -83 31 89 237
11848 237 211 -76 -90 66 -23 35 23 89 -128 109 -24 355 143 36 18 -135 178 23 -21 -286 -17 -195
$$ packed form
11690b4P5j86J27N5p5J32j64k1L02k49J04J8K31j23j54j31n5J44r6O8k4N4j65
11713a57m2L96k01%J72j49l37L99j67K26j5j50q9L06k12j38K66j26J36k8l84J46
11735a48o9J28N5mJ7K37j89O0k06J02j36K51P3oj84J9J84k86R5m2K11k08N1K2
11759B7K67k81j13K89j56L1j78M7J6J18K08j64J69j23k92J37l6Q3j23M5k33j21
11781c83N62l33R5J38k63K96j58K24j89R3q7K9P8K19m00J26K42n52K18j89K95
11802F1n7j89M8J30n9j29L25k19J33l4o1l37N14J0j31K67j90j81K10j71j0J11
11824D1j77K43k29K09oq1qJ38q4M8l9L2j28j3j41J49L06j57N0k59K3J14N8J48
11848B37k6k87j4J56q9N8j2O6k17K37j33L79k12j07j8j53L13j55m4k65K69j78
$$ plain form
11870 -195 -73 26 319 -18 81 -87 253 -10 46 188 -103 -315 -271 -132 -68 93 -91 -54 63 -12 -158 98
11892 98 29 -165 -148 51 63 180 -29 125 216 -61 -37 203 100 -48 -222 126 112 319 -132 -83 -83 -194 -35
11915 -35 -253 76 74 -41 54 80 -3 -193 -82 164 210 -40 -84 -46 200 -7 -137 3 33 -101 -233 71 -200
11938 -200 -12 -58 42 -10 40 70 25 -22 73 9 -120 22 25 77 -87 26 101 -63 -16 61 -301 -51 349 -78
11962 -78 63 94 40 37 169 62 131 10 -359 48 181 105 -98 212 -91 -204 185 86 100 48 74 -87 -10 -72
11986 -72 106 -28 -12 46 0 -40 -244 22 199 66 -31 6 285 -97 -79 0 204 119 172 36 -50 65 -75 54
12010 54 168 375 37 150 111 -232 57 -95 129 -188 -90 -228 -252 96 21 271 4 -18 -23 94 78 39 34 -154
12034 -154 135 72 -2 142 13 -155 201 -173 39 -5 -48 197 -170 151 50 -140 -85 60 184 -25 158
$$ packed form
11870a95J22R9K93l37R9j68L40k63N6J42k91k12M4J39O4J61j84L7J17p5j46K56
11892I8o9j94J7J99J2J17k09J54R1k77K4K40j03j48j74L48j4K07m51M9%j11J59
11915c5k18L29kj15R5K6q3j90J11K46M6k50m4L8K46k07j30J40L0j34j32L04k71
11938b00J88m6J00n2N0L0m5m7R5o4j29J42LN2j64J13P5j64M7P7l62K50M00m27
11962g8J41L1n4lJ32j07O9j21l69M07J33p6k03L10l03j13L89r9J4n2K6j61P7o2
11986g2J78j34J6N8m6m0k04K66J77j33r7L7K79l82J8P9K04q5N3j36q6J15j40J29
12010E4J14K07l38J13l9l43K89j52K24l17R8j38k4L48p5K50k67k2nJ17j6l9nj88
12034a54K89o3p4J44j29j68L56l74K12m4m3K45l67L21j01j90N5J45J24k09J83
$$ plain form
12055 158 94 -102 62 -103 113 -71 -179 -200 268 70 248 -82 -188 -123 257 230 89 -88 14 174 137
12076 137 42 -245 130 -60 -220 -77 162 -22 97 28 -129 -54 129 -74 -359 -14 -105 -75 60 208 448
12097 448 384 144 66 126 233 25 67 -110 97 16 -38 79 -58 156 133 52 34 -9 66 102 161 -45 -60 27 -145
12122 -145 113 190 111 13 -113 100 42 12 53 -249 15 117 87 -99 76 -183 32 239 -109 -248 -96 -154
12144 -154 57 -214 57 177 11 -149 81 92 -58 187 70 -113 -109 -14 -195 -24 85 171 -29 -72 -145 225
12166 225 60 30 97 -10 -102 -115 -2 -46 -18 -51 -187 26 68 -175 -91 169 -300 207 39 146 -11 -19 -63 91
12190 91 43 -154 139 -6 110 28 -31 -205 145 17 -106 31 -43 199 164 244 39 -24 62 208 -68 7 -17
12213 -17 20 -55 60 -75 -230 -141 -63 256 -201 155 38 97 28 123 -15 127 141 194 20 -13 -151 -149 166 67
$$ packed form
12055A58o4j96J64j65K16j84j08k1M68j98J78l30j06O5L80k7j41j77J02J60l7
12076A37r5k87L75j90j60J43K39j84J19o9j57P5J83k03k85L45r1L0J35J48K40
12097D48o4k40p8O0J07k08M2j77K07q1n4J17j37K14k3q1j8m3P5L6N9k06j5Q7j72
12122a45K58P7p9r8j26K13n8l0M1l02K64J02l0j86J75k59K15K07l48j39J52n8
12144a54K11k71K71J20j66j60K30J1j50K45j17j83MR5j81J71J09Q6k00m3p3L70
12166B25j65l0O7j07r2j3J13m4K8l3j36K13M2k43Q4K60m69N07j68J07j57qm4J54
12190I1m8j97K93j45J16q2n9j74L50j28j23J37p4K42l5Q0k05o3Q6J46k76P5k4
12213a7L7p5J15j35j55Q9P8L19m57L56j17N9o9R5j38J42J4N3j74l3j38KL15r9
$$ plain form
12237 67 33 -5 -189 8 9 5 -62 88 -71 76 -33 -109 -39 -119 214 -42 167 66 -68 -82 -78 -58 154 260 -150
12262 -150 49 278 65 -77 145 -65 -85 -82 144 59 65 29 0 -29 -77 -52 297 -120 -76 111 -149 -88 -75 129
12286 129 44 -62 79 121 105 -16 -133 311 -127 7 -152 -83 47 91 46 10 -39 122 35 -46 25 -50 66 -198
12310 -198 12 14 -74 -100 115 54 7 -201 166 4 -82 176 -98 -182 -121 35 30 147 192 146 113 208 -124 155 142
12335 142 65 -118 -27 -216 10 -22 -25 145 -215 215 -58 159 -155 5 -162 -89 201 203 -40 49 -13 52 59 13
12359 13 43 31 -132 268 48 -43 120 175 274 111 -131 -333 109 -82 -32 111 -73 183 -178 25 -167 6
12381 6 -49 -160 224 37 13 62 -64 21 108 -126 198 -89 -208 -144 -15 -266 -78 25 -156 95 -165 -72 -98
12404 -98 0 -2 104 -36 232 355 -144 226 -251 156 -91 157 184 -36 33 119 -100 -240 198 -23 -226 -78
$$ packed form
12237F7l4l8j84J97Jmo7J50j59J47j09p6P0q0L33k56K09j01j34j4MK0K12J06m10
12262a50J99K29k13j42K22k10k0LK26q5Ol6k9k9m8K5L49m17M4J87k60O1J3K04
12286A29q5j06J41M2j6j21j17M44m38J34j59O9J30M4m5l6m9J61q7q1P1p5J16k64
12310a98K10Kq8k6K15o1m7k08L67j62q6K58k74q4O1J56nJ17M5m6l3R5l32K79j3
12335A42p7j83R1j89K26l2lJ70l60M30k73K17l14J60j67P3K90Kk43Q9o2O5Pm6
12359A3L0j2j63M00k20r1J63N5R9j63k42k02M42j91N0J43j84K56l61K03j92J73
12381Fn5j11L84j87k4M9j26Q5Q7k34L24k87j19O4J29k51J88J03j81K51k60R3k6
12404i8R8kJ06j40K68J23m99L70m77M07k47K48K7k20O9Q6k19j40M38k21k03J48
$$ plain form
12426 -78 103 -36 -47 -14 -29 147 9 -155 -268 288 114 109 -129 -186 159 237 180 -234 -98 -71 24 -55 -19 -122
12450 -122 -26 108 55 -227 68 -66 -221 211 169 -78 -213 248 117 36 78 -55 -252 -26 138 -148 -98 61
12472 61 106 49 36 108 41 199 -61 195 93 -317 -28 210 -101 -2 -118 -26 -155 -157 171 -128 117 -160 57
12495 57 -145 183 29 -31 -135 -89 7 -72 46 -67 -128 59 -87 19 106 -2 -155 -117 -66 -91 110 250 -1
12518 -1 -97 10 -191 -31 -158 -76 127 109 -111 65 -240 69 -42 229 3 -152 89 153 -147 26 110 156
12540 156 -4 -31 19 50 171 52 -71 42 81 66 159 88 -232 149 109 71 -30 -24 78 163 -53 125 311 -29
12564 -29 -33 83 72 195 101 122 -120 -44 229 -119 -145 142 -134 -15 -104 -196 -19 39 -48 150 -278 -76 -60 29
12588 29 -18 -11 67 1 36 -56 -57 197 -115 107 -177 74 84 -175 119 -173 134 -86 43 -180 -207 -246 88 175
$$ packed form
12426g8J81j39j1L3j5J76j38j64j13N56j74nk38n7L45P8n7m14J36K7R5p9L6j03
12450a22R6J34n3k82K95j34j55M32m2k47j35M61j31q1M2j33j97K26J64k86N0J59
12472F1M5n7j3P2o7J58k60K56j02m10K89K38l11R9j16R2j29kL28k99K45k77K17
12495E7k02L28j54o0j04M6R6p9J18j13o1J87j46J06Q7j08j53L8N1k5K01J40k51
12518ar6J07k01J60j27Q2K03j8k20J76l05L09j11K71k26j55K41O4l00J73Q4M6
12540A56j60k7N0L1J21j19j23J13L9j5R3p1l20L81m0l8j01OJ02Q5k16J78J86l40
12564b9mJ16j1J23r4K1k42P6K73l48k6K87k76J19q9r2J77N8q7J98m28K02J6Q9
12588B9m7PP8o6L5r2jK54l12K22k84K51J0k59K94k92L07k20J29k23k7l9L34Q7
$$ plain form
12612 175 12 -144 -87 -63 117 140 155 -142 -11 344 -133 134 274 131 -57 -149 -103 205 -27 -77 -252 26
12634 26 105 -150 101 -37 -180 -124 237 -3 105 -12 143 -113 -148 36 -31 97 64 -86 104 36 -136 102
12656 102 -45 50 -172 77 23 -197 -248 30 -145 -18 -133 16 80 83 -111 -230 241 -136 -4 122 96 218
12678 218 -94 -11 -132 -104 71 -83 -107 119 -43 12 30 11 71 -162 111 155 40 -163 91 -54 30 -106 -171
12701 -171 48 -25 -39 -17 103 12 -117 31 96 3 -26 -172 53 -128 126 96 -199 -49 105 -193 58 16 -9
12724 -9 47 -77 -108 -137 111 -353 174 -265 -266 34 27 -49 35 -26 94 -8 -116 -153 2 198 73 -293 -156 -220
12748 -220 -23 -102 -122 250 -44 50 -114 -123 39 -55 13 20 -122 69 -211 63 -22 -222 -247 189 -21 18 175 -116
12772 -116 -168 53 -155 -171 -9 92 105 -131 133 -217 -251 17 148 -75 -166 224 -5 -177 87 -157 132
$$ packed form
12612A75j63j56N7K4J80K3J5k97J31L55m77K67J40j43j88r2M6L08k32n0j75K78
12634B6P9k55K51j38j43N6L61k40J08j17J55k56l5J84o7J28l3j50J90o8j72K38
12656A02j47R5k22K49n4k20n1K78j75J27j15J49O4Lj94j19M71l77J32J26k6J22
12678B18l12Q3j21K8J75j54k4K26j62N5J8j9O0k33K73M4j15k03K54j45Q4j36o5
12701a71K19p3j4K2J20r1j29J48O5r3k9j46K25j81K54l0k95J50J54k98K51m2k5
12724iN6j24l1k9K48m64N27m39jL00pp6Q4o1J20j02j08l7J55J96j25l66J37o4
12748b20J97p9k0L72k94R4j64rJ62r4O8Pj42J91k80K74q5k00k5M36k10L9J57k91
12772a16n2K21k08j6J62J01J3k36K64l50l4K68J31k23r1L90k29j72K64k44K89
$$ plain form
12793 132 -333 -99 -64 137 -2 146 152 -386 -89 -63 62 -133 -208 54 59 25 29 -203 61 -53 -34 148 43
12816 43 -67 129 127 10 -153 -40 89 15 -74 167 122 -207 -141 -81 142 -82 121 65 170 -32 152 -140 -46
12839 -46 39 74 -75 -126 -3 -200 249 373 -38 48 -103 -100 148 -131 76 29 -128 238 -30 146 66 -15 16
12862 16 103 -73 22 -166 66 -37 -176 -158 -188 145 -37 296 164 151 68 -73 -5 -137 19 115 40 128 -42
12885 -42 61 67 30 349 -133 -58 -103 -6 -207 15 -129 -72 -134 115 32 -85 -257 44 2 13 -123 5 292 -143
12909 -143 86 -137 97 165 -167 56 -260 -59 125 -162 -108 96 -72 -4 -61 -91 -60 -18 240 -161 49 -21
12931 -21 85 -172 30 -8 10 119 367 87 127 -25 -24 103 -156 -44 -90 -145 -91 -125 39 79 166 -307 105 -103
12955 -103 76 167 -272 78 -154 -200 -90 -50 -60 -50 198 -21 -330 -108 -6 -258 31 -72 143 -98 51
$$ packed form
12793A32m65K34L5K01j39J48On38K97K6J25j95p5K62Nl4Mk32K64j14J9J82j05
12816D3j10J96kj17j63J13J29p4q9K41m5l29O6O0K23k24K03n6J05k02J84k92R4
12839d6Q5L5j49n1J23j97M49J24m11Q6j51LK48k79K07m7j57L66k68J76q0q1L1
12862A6Q7j76R5j88K32j03j39J8l0L33j82L33j32j3q3j41O8j32J56R6p5Q8j70
12885d2J03Ol7L19m82P5m5R7k01K22j44N7o2K49q3j17j72L01m2J1j36J28K87m35
12909a43K29k23K34O8l32K23l16K01J84k87N4K04j68O8n7l0L1M2K58m01K10p0
12931b1J06k57K02l8J8J09K48k80M0j52JJ27k59J12m6n5N4l4J64M0Q7m73M12k08
12955a03J79R1m39L50k32m6J10M0j0J0K48k19l09K22J02k52K89j03K15k41J49
$$ plain form
12976 51 -22 -61 194 -130 161 3 -43 -132 -149 -183 -286 179 -212 146 -225 73 7 -27 -212 65 -95 13 30
12999 30 67 32 -199 72 -219 56 287 66 -42 -109 14 140 81 45 198 -192 83 -158 43 -87 -174 -185
13021 -185 182 34 -115 12 -95 4 41 30 -20 -26 -153 263 98 -121 -70 88 135 -68 -163 81 -64 32 68
13044 68 76 -88 -80 48 -353 -186 227 -35 -139 -99 -216 47 -141 -94 -28 53 -76 -76 -126 -164 -176 22 -455 -36
13068 -36 6 -110 37 12 39 68 35 -61 150 -124 -119 -24 125 -75 -122 -220 -83 -42 -148 99 -135 -103 -14 18 -15
13093 -15 -54 -75 87 106 107 189 -26 81 93 292 -73 -137 238 142 127 -72 94 -12 111 1 -88 -99 24 -6
13117 -6 -40 114 -34 56 -93 -22 -17 -248 -40 -67 -35 -162 68 58 18 -49 49 133 -151 -15 -239 10 39 33 124 177
13143 177 5 53 227 114 -60 -1 -148 -96 -282 309 154 -227 -39 34 95 -40 -210 -69 -154 60 123 -70
$$ packed form
12976E1p3l9K55l24K91j58m6q9j7l4j03M65l91L58l71K98o6l4j85K77j60J08J7
12999C0L7l5k31K71k91K75K31k21j08o7J23J26n9l6J53l90K75k41K01j30q7j1
13021a85L67j48j49J27j07R9L7j1n0oj27M16j65k19N1J58M7k03r5K44j45R6L6
13044F8Qj64QJ28m01J67M13k62j04M0j17K63j88M7O6Q1j29%n0l8j2J98m77M19
13068c6M2j16J47k5K7K9l3r6K11k74NR5J49k00m7r8J37M1j06K47k34L2Q9L2l3
13093a5l9k1J62J9JQ2k15J07J2J99l65o4L75r6j5j99J66j06J23j10q9j1J23l0
13117fl4J54j48R0j49P1Nk31K08k7L2j27K30j0m0o7R8Q4k84J36k24K49K9oR1N3
13143A77j72M8J74j13j74N9j47N2j86N91j55l81J88P3O1j35j70J41q5K14O3j93
$$ plain form
13165 -70 -102 -47 -48 -54 -99 117 60 300 -8 273 66 72 -14 -50 -24 -154 142 37 -308 -67 28 -147 -210 -3 100
13190 100 -241 -64 128 8 -216 10 -130 -90 -111 -35 142 33 67 -141 37 -34 35 177 -154 33 143 50
13212 50 139 -120 28 -169 195 -197 -238 105 136 -127 -105 -284 -205 -58 -155 -195 110 152 2 28 354 -117 -144
13235 -144 11 53 -156 39 33 243 -89 -24 138 175 -128 -145 -25 -29 -20 -43 95 -119 91 127 -6 -26 101 112
13259 112 -2 89 165 35 250 77 7 -100 70 -64 -52 7 58 -120 -37 -207 -129 -17 -43 -199 -266 129 111
13282 111 -114 -45 -208 -172 1 -88 -58 158 -201 -52 3 110 57 95 -64 -216 -411 -179 -143 307 -83 -33 -97
13305 -97 -174 88 -236 50 164 81 -17 26 -31 -147 68 -90 114 165 48 53 69 32 -187 84 -167 289 8
13328 8 -81 65 15 -188 58 82 18 140 168 -20 -23 -20 126 -167 91 30 -11 -95 -36 -184 -21 14 -104 -12 -25 128
$$ packed form
13165g0l2N5jom5K16n7K40l08K81k07Oq6l6K6j30K96j05l45K41R5j75o3K07J03
13190A00l41J77J92j20k24K26j40M0k1P6J77j09L4k08J78p1O9J42l31J87J10r3
13212E0Q9k59J48j97L64l92m1L43L1k63K2j79P9J47r7m0L05M2j50K6L26m71k7
13235a44J55M2k09J95oK10l32O5J62L7l03j7J20mRk3J38k14K10L6j33k0J27J1
13259A12j14R1P6j30K15j73p0j07J70j34J2N9N1j78Q3j70P8J12k6j56o7L95j8
13282A11k25O9j63L6J73q9L0K16l59J49N5J07n3L8j59j52j95K32L6M50l90N0o4
13305i7p7K62l24K86J14q3r8M3n7j16K15j58K04N1j17NJ6l7k19K71k51M56k81
13328Hq9J46n0k03K46K4o4J22K8j88lLJ46k93K58o1m1q4N9j48J63L5j18R2j3J53
$$ plain form
13354 128 -123 9 231 -97 -79 -89 7 5 -81 35 22 41 -187 -77 66 -4 -41 88 121 231 -55 43 60 39
13378 39 -55 -36 -14 -32 94 123 -249 69 23 276 92 -19 -24 68 -11 59 194 49 -25 26 -191 123 138 64 -43
13403 -43 175 109 -123 -33 -191 -304 -173 331 -102 -308 280 213 -211 -79 -80 20 -185 12 -102 -133 137 64
13425 64 91 -42 -3 -104 333 179 -171 60 150 -25 94 10 -86 128 -38 -201 84 -30 -253 -160 19 -138
13447 -138 34 67 -41 153 123 -84 65 129 -102 115 61 -225 49 -186 -47 -153 39 101 -107 9 133
13468 133 -11 214 46 181 40 -75 -93 -190 -34 -61 -56 -69 -40 104 -82 -150 -234 106 122 130 -4 54 75 201
13492 201 4 54 -48 -137 -155 -204 -107 -16 -132 117 81 257 36 189 57 -58 -105 37 205 85 65 -43 0
13515 0 65 -15 195 -295 -46 -182 -31 34 -82 -108 -36 -55 -21 -125 -169 1 35 153 -185 -189 55 -7 32 26 -161
$$ packed form
13354A28k51J32K22l28J8j0R6kq6J16j3J9k28J10J43p0l7J29L3J10k86R8J7k1
13378C9r4J9K2j8J26K9l72L18m6K53j84j11nR2p9P0J35j45p4N1k17L14J5p4j07
13403d3K18o6k32R0j58j13J31N04m33k06N88o7m24J32jJ00k05J97j14l1K70p3
13425F4K7j33L9j01M37j54l50K31R0j75J19q4r6K14j66j63K85j14k23R3J79j57
13447a38J72L3j08J94l0k07J49O4k31K17n4k86K74k35J39j06J92O2k08J16J24
13468A33j44K25j68J35j41j15j8r7J56k7Nj3K9J44j86o8q4L40J6Qj34N8K1J26
13492B01j97N0j02q9j8m9R7R1j16K49l6J76k21J53j32j15m7J42J68j20k0j08M3
13515@O5q0K10m90K49j36J51O5j16k6P2j9L4j04m4J70L4J18l38mK44o2L9oj87
$$ plain form
13540 -161 176 14 271 290 -60 -58 -90 119 39 -17 -103 -224 25 12 -223 -72 -95 81 61 -47 37 -145 138
13563 138 -54 -102 177 121 93 -17 159 28 2 -143 -42 150 286 -208 -43 -45 -78 3 -65 49 24 -40 -76 123
13587 123 -76 3 -101 -304 112 -107 49 -191 71 -185 34 -118 99 -224 -4 -39 -132 -13 71 11 -11 134
13609 134 261 257 -96 -190 62 -50 96 -27 -231 -12 48 -55 -13 -94 -23 73 144 384 21 -216 116 -305 63
13632 63 -66 -78 47 13 -95 123 114 73 -27 -49 -163 -361 256 -29 171 175 0 -18 55 89 -67 -64 114 113 -93
13657 -93 32 -140 3 42 70 -66 52 -206 152 -97 -120 -196 -65 -90 154 174 61 14 52 -161 -59 -154 -158 98
13681 98 45 18 30 84 -101 -23 73 46 15 101 80 -36 -117 131 -99 4 -50 67 -14 -172 45 -178 86 73 -164
13706 -164 62 -107 -176 -111 -104 -247 44 -121 199 -60 6 72 -20 132 145 168 -25 -22 176 -54 161 -81 2 140
$$ packed form
13540a61L37j62K57J9l50Kl2K09q0n6q6j21K49j3k35J51k3J76k0j08Q4j82K83
13563A38j92m8K79n6k8j10J76j31k6j45J01J92J36m94J65kl3Q1o8J14k5o4l6J99
13587A23j99P9j04k03M16k19J56k40K62k56K19j52K17l23K20l5r3J19Q4o0k2J45
13609A34J27ml53r4K52j12J46j23k04K19O0j03M2q1P1R6P1K40l63k37L32m21L68
13632F3j29j2J25l4j08K18rm1j00k2j14j98O17k85K00Mj75j8P3L4j56LJ78jk06
13657i3J25j72J43L9K8j36J18k58L58k49k3p6J31k5K44K0j13m7L8k13J02r5mK56
13681I8n3k7J2N4j85P8R6k7l1Q6k1j16q1K48k30J03n4J17q1j58K17k23K64j3k37
13706a64K26j69o9O5Pj43K91j65L20k59O6O6r2J52J3K3j93LJ98k30K15k42Q3J38
$$ plain form
13730 140 -43 -162 74 -197 120 -100 16 -14 75 -46 -224 87 -168 25 -223 -85 -127 3 -10 69 68 -175
13752 -175 61 -33 -43 2 8 79 -61 38 -38 -59 152 96 -136 120 148 -139 -99 -18 -14 240 94 -133 99 -320 57
13777 57 -178 24 27 -55 -26 -240 210 -54 18 -92 67 -31 -103 13 39 -153 -318 32 20 146 163 -43 -143
13800 -143 10 71 65 45 -32 -42 -45 -84 192 37 63 80 84 -58 150 -47 189 -92 -130 -97 -118 -53 34 197 -59 -141
13826 -141 -42 135 -22 -97 -53 205 82 38 -226 -15 -278 180 265 14 170 73 44 110 -7 -40 -196 65 39
13849 39 -4 136 -175 -121 -275 203 -200 -82 -168 -67 -58 -2 139 46 -266 93 -44 -44 -275 -55 -399 12 -124
13872 -124 40 179 29 226 112 -298 -143 -275 2 -209 -11 -7 -254 55 35 88 -80 -150 114 -82 -65 -28
13894 -28 -76 -11 196 170 -175 44 -31 -70 -168 -52 -62 -203 -107 5 124 -175 23 80 76 -76 -177 31 -56 62
$$ packed form
13730A40j83j19K36k71L17k20J16l0Q9j21j78L11k55J93k48J38m2J30j3P9jk43
13752a75K36r4j0M5OP1j40R9p6k1K11n6k32K56K8k87M0Q1MK54j46k27K32m19L77
13777E7k35K02Lq2K9k14M50k64P2j10J59r8p2J16K6j92j65L50j2J26J7k06j00
13800a43J53O1ok0p7j0ll9K76j55K6J7Mj42K08j97K36k81l8L3k1O5Q7J63k56q2
13826a41R9J77j57p5M4K58j23m4k64K11k63M58Q5k51J56r7k9O6j17l3j56K61k6
13849C9m3J40l11N4j54M78m03J18q6J01RN6J41r3l12L59j37%k31K20l44M11j36
13872a24J64J39j50J97j14m10J55j32K77k11J98Mk47L09k0N3j68p0K64j96J7L7
13894b8m8O5K07k6l45K19p5l9r8J16j0j41R6J12J19k99J98N7mj52j01K08q7J18
$$ plain form
13918 62 -87 178 128 17 15 -2 -93 -74 229 78 224 -54 -7 -106 -80 -20 -139 -33 -48 -42 -109 23 128 -126 -12
13943 -12 113 12 111 257 -32 33 -71 -66 -111 80 81 12 15 -46 -41 63 -174 -22 79 -21 60 123 -14 71 -178
13968 -178 -100 222 22 159 -313 -128 -22 -321 -7 74 -85 -81 240 49 -58 24 -94 29 -4 -63 65 -132
13990 -132 74 -5 85 0 112 239 54 34 -95 27 78 63 69 16 -9 -82 -107 -94 51 -39 -17 105 -131 142 133
14015 133 -23 148 176 29 286 -172 45 30 -116 -38 189 8 -82 207 36 -77 -10 -28 -208 -32 73 79
14037 79 -153 -219 -119 -183 -88 158 57 261 -73 2 27 -55 11 -160 -174 -136 -160 -87 -59 -8 53 -65 -33 185 102
14062 102 -111 -90 -83 -110 9 153 24 -59 351 255 -31 -185 -83 -35 -78 -177 -214 -115 -125 131 -147 -107 175 -9
14086 -9 63 24 86 -19 -71 -105 -224 182 -215 -51 60 5 19 -249 -216 -232 48 47 -43 -91 1 -17 -62 115 200 -77
$$ packed form
13918F2j49K65n0j11kj7r1J9L03j51J46k78M7r9K6O0j19J06j5Oo7J32J05k54J14
13943a2J25j01R9J46k89O5j04Nm5J91Jo9Lo1NJ04k37J52J01j00Q1O3j37Q5k49
13968a78P8L22k00J37m72J85J06k99L14Q1j59ML21j91j07Q2j18J23l3n9J28j97
13990a32K06p9R0q5J12J27j85k0j29J22N1j5On3k5p3k5J3J45r0K2J22k36K73r
14015A33j56J71K8j47K57m58K17j5j46P8K27j81r0K89j71j13O7j8j80J76J05O
14037G9k32o6J00o4R5K46j01K04l34P5K5q2O6j71j4L8k4P3K8N1O1j18L2K18q3
14062A02k13K1Pk7J19J44j29q3M10r6k86j54J02M8m3r9l7R9j0K56k78M0K82j84
14086iP2l9O2j05n2l4j19M06l97J64J11n5J4k68L3j6K80jr0m8R2j8m5J77Q5k77
$$ plain form
14112 -77 -37 23 42 236 69 -22 15 148 214 -154 -38 -70 4 -115 -87 -100 -40 -95 124 24 -238 77 -15 -145
14136 -145 -237 132 -150 -41 163 483 -80 -134 25 -118 -25 210 14 -239 79 225 255 -397 144 -70 -85
14157 -85 73 -1 235 -83 -93 -184 -152 -100 -40 31 116 82 0 30 -9 172 215 157 307 -77 88 113 7 75 168 210
14183 210 -113 71 -94 -129 -158 113 -181 76 -137 3 102 -118 98 70 -62 125 -222 -21 -49 -153 -187 -81
14205 -81 88 92 -68 18 146 63 8 57 193 94 -290 -123 -4 -29 -261 84 -22 -58 79 -189 -31 32 62 138
14229 138 -39 -3 82 -244 -5 -151 -97 -166 311 143 73 -192 -130 126 -177 98 -99 25 101 -133 225 96
14251 96 -16 -297 77 -31 94 69 13 -83 31 24 -36 294 -136 11 -26 54 130 -70 -3 -46 -58 59 -71 68
14275 68 39 -165 3 -1 -82 118 -141 -193 113 -60 115 22 2 -82 55 29 153 -66 -270 194 -259 28 -227
$$ packed form
14112g7M0O0J9J94j67r1L7J33O6l68J16l2P4j19K8j3O0n5K19j00k62L15r2j30
14136a45r2L69k82J09K04L20n63n4J59j43R3K35j96k53L18J46L0o52N41k14j5
14157h5J58p4K36l18j0r1L2N2O0P1Q5l4q2L0l9J81M3n8J50l84J65K5j06O8R3M2
14183B10l23J84j65l5k9K71k94K57k13J40R9k20K16k8j32J87l47K01k8j04l4J06
14205h1J69Mj60Q6J28q3n5M9J36r9l84J67J19k5k32L45j06l6J37k68J58O3L0P6
14229A38j77L6Q5l26K39j46N4o9M77j68p0k65O2K56l03K75j97J24P6k34L58j29
14251I6j12k81L74j08J25k5n6r6J14po0L30m30J47l7Q0P6k00O7m3j2J17j30J39
14275F8k9k04J68mq1K00k59n2L06j73J75r3k0q4J37k6J24k19k04M64m53K87k55
$$ plain form
14298 -227 130 -37 -265 54 -75 -16 8 -87 126 -33 117 -80 -146 193 211 137 262 -29 325 -271 112 111
14320 111 43 -38 -7 132 -173 29 -85 128 -167 17 -140 71 -116 103 -118 5 -88 87 -3 -61 240 99
14342 99 -100 63 19 -10 -80 -16 -77 -28 209 -23 132 -127 29 -96 -278 2 -41 270 -63 -198 -243 -68 90
14365 90 -13 -269 -94 60 -55 17 -90 -41 73 -23 -260 67 -46 -275 -241 155 13 -92 -151 -102 -106 182 193
14388 193 69 185 -98 101 9 -107 -313 34 22 -118 -10 63 19 -25 -15 86 -142 -97 53 41 15 -213 -128
14411 -128 -27 25 131 18 -12 217 -54 -6 -250 -249 -48 -87 284 56 -398 46 -51 -11 -98 -135 309 -108 10
14434 10 -24 -65 188 202 120 25 204 172 -86 5 -157 93 -24 -272 -78 -32 -24 -107 -108 -70 122 115 -160 49 37 -98
14460 -98 -53 -51 70 -423 2 145 5 -38 67 -160 56 -69 -27 144 -61 -4 -29 -120 91 -68 -264 262 -93
$$ packed form
14298b27L57j67k28L19j29N9K4r5K13j59J50j97o6L39J8p4J25k91L54n96L83j
14320A11o8q1L1J39l05K02j14K13k95J84j57K11j87K19k21J23r3J75r0n8L01j41
14342I9j99J63m4k9p0O4o1M9K37k32J55k59J56j25j82K80m3L11l33j35m5J75J58
14365I0j03k56J75J54j15P2j07M9J14r6k37L27j13k29L4L96j42j05n9M9mK88J1
14388A93j24J16k83J99r2j16k06L47j2j40J08P3m4m4J0J01k28M5J50j2k6k28Q5
14411a28J01N2J06j13l0K29k71M8k44JK01l9L71k28m54M44r7M0q7l7M44m17J18
14434A0l4m1K53J4q2r5J79l2k58R1j62K50j17k48J94M6Qq3jL8J92pk75K09j2j35
14460i8M5KJ21m93M25J43j40m3J05k27K16j25M2J71k05N7k5r1K11j59j96N26l55
$$ plain form
14483 -93 69 -143 -110 -114 0 -195 -112 51 72 -48 96 -85 -23 22 -48 110 41 89 182 -148 72 -224 12 59
14507 59 50 -162 210 -114 -87 22 -259 -235 58 23 94 47 -90 -162 -81 55 122 131 -19 207 -77 -153 -101 85 -147
14532 -147 157 -27 175 -13 83 -11 -46 -135 -46 141 -116 -135 -116 -35 94 -182 63 22 47 -42 -3 -109 63 31
14556 31 -60 230 -18 50 81 -127 -137 31 -200 91 -145 141 -364 -158 42 -228 -94 24 96 118 -90 213
14578 213 -72 191 90 -177 191 34 -67 -140 74 15 0 -183 -18 229 120 40 -93 137 -27 203 5
14599 5 -22 23 91 -151 13 -75 -140 -183 -131 44 -176 52 -110 85 2 -126 34 -74 -101 156 221 167 88 -283
14623 -283 54 130 33 -279 -69 -9 192 12 -145 -101 138 24 -35 78 7 184 9 -156 33 3 109 79
14645 79 21 93 81 29 -181 -54 -34 -15 -178 -133 -15 17 -94 -19 -82 -277 -32 -39 -161 248 -146 74 41 -76
$$ packed form
14483i3J62k12L3mJ14j95Q3J63K1j20J44j81O2M5p0J58o9M8R3l30K20k96K36M7
14507E9rk12L72l24K7J09k81K4K93l5P1m7j37p2Q1J36O7Rj50K26k84p6N2J86k32
14532a47L04j84K02j88R6r4l5q9Q9J87k57j9J9Q1J29k76K45m1K5q9L9j06J72l2
14556C1r1K90k48O8L1k08j0J68k31K91k36K86n05K06K00k70J34J18P2K2k08L03
14578B13k85K63j01k67L68j57j01p3K14n9j5j83J65K47j09q0j33K30j64K30j98
14599Ek7M5O8k42J64q8o5m3N2J75k20K28j62J95q3j28J60j08k7K57O5n4p9l71
14623b83L37P6r7l12K10O0K01j80j57M4K39j14n9J13p1J77j75j65J89l0J06l0
14645G9n8P2j2n2k10J27K0J9j63M5J18L2j11P5o3j95K45pj22M09l94K20l3j17
$$ plain form
14669 -76 167 82 -72 -182 -18 -42 -70 -102 67 -240 173 -54 -287 155 -118 123 -8 -29 -178 86 -19 49
14691 49 -120 -65 -115 -53 71 -42 -36 -15 74 69 -154 -178 -186 -174 101 27 37 5 -164 80 -6 130 91 97 -96 48 -43
14718 -43 159 -79 -201 -73 84 70 -72 -150 -147 38 50 97 100 31 -18 -255 -18 122 -123 -207 -160 29 -91 -102
14742 -102 -40 166 7 -58 65 111 -46 -15 -71 -17 66 26 53 -92 25 8 -6 -73 267 -34 122 5 -43 -46 -273
14767 -273 -14 80 197 -35 -337 55 -205 -30 2 31 -145 177 -222 -30 -185 27 105 -118 105 -119 95
14788 95 -162 -95 100 -3 95 214 68 -262 -53 149 170 66 51 -73 92 -20 150 -64 -179 -39 107
14809 107 66 -29 114 -71 70 9 114 -386 29 -175 164 254 -180 -93 -172 -281 -83 -210 19 143 -152 -16
14831 -16 -77 282 73 -130 290 -192 26 14 -63 -106 -65 282 127 -109 -6 -131 85 18 145 202 23 90 -119
$$ packed form
14669g6K43q5j54j10J64k4k8l2J69l07M13k27k33M42k73K41j31k1j49K64j05O8
14691D9j69N5n0O2J24j13OK1Q9nk23k4qJ2K75p4J0l2j69K44q6J36l9Oj93J44r1
14718d3K02k38j22J28J57j4j42p8LJ85J2M7Lo9m9k37K37J40k45q4M7J89j20j1
14742a02O2K06j59o5J23M6j57L1n6N4Q3m0K7j45J17j7j4o7L40l01J56j17m8lk27
14767b73K59R4J17k32l02L92k60J75L2K9j76L22l99J92j55K12P8k23K23k24K14
14788I5k57O7J95j03R8J19j46l30K09K02K1j04j5j24J65j12J70k14j15J40J46
14809A07m1r5J43j85J41o1J05n00M15k04L39R0m34Q7p9j09J98j27K29J24k95J36
14831a6o1L59k09k03M20m82K18j2p7m3M1L47j55k36J03j25K16o7J27N7j79O7k09
$$ plain form
14854 -119 -51 129 91 152 -8 79 -220 109 76 76 -34 246 -255 78 24 -124 47 -48 -249 279 -216 91 132
14877 132 -50 132 190 45 47 -157 -160 -81 -9 -39 14 -82 -76 -2 -100 -158 -163 23 -147 142 109 -178 72 44 42 17 -66
14904 -66 -64 179 -75 94 -138 64 -17 97 250 -57 62 -61 -5 1 -45 60 -66 44 -64 -30 212 19 -39
14927 -39 131 -45 -42 -9 -119 -19 82 56 129 65 -118 83 92 19 31 56 32 -96 15 -299 -37 -111 -263 20
14951 20 91 120 -72 58 -106 17 -19 -143 -1 -101 -25 5 188 189 -46 -225 5 189 59 -161 8 75 -55
14974 -55 -195 76 62 -9 78 -400 211 83 -188 -89 -20 -156 -38 -56 38 15 77 91 102 60 -40 -60 245 -149
14998 -149 86 243 -154 227 -231 -105 354 -87 109 104 -6 -230 -116 26 -27 12 94 52 -39 -48 -22 22 -65 217
15022 217 -104 -40 103 -89 -17 -80 32 86 160 195 101 -11 -64 8 -77 110 134 26 -232 29 4 244 32 -175
$$ packed form
14854a19O8J80l8O1j60Q7k99L29l3%j10K80n01L33n4j48J71r5k01N28m95L07M1
14877A32j82J82N8j45Kk04lP9P2l0N3r6OP4r8n8nJ86j70K89l3k87K50k8kk5q3
14904f6KK43k54J69k32K02q1J14J53l07J19j23N6Om6J05j26J10j08L4K42j93n8
14927c9J70j76LL3j10J00J01k6P3o4j83K01Rp3J2K5k4j28J11l14K62p4j52K83
14951B0P1K9j92J30j64J23l6j24J42j00P6L0J83Jk35j79K30J84j30k20J69O7j30
14974e5j40K71j4p1Q7m78O11j28k71R9O9j36J18j8R4k3O2J4J1m2j00k0L05l94
14998a49K35J57l97L81m58J26M59m41J96nj10k24J14J42n3L9Q2m2r1rK6M4q7K82
15022B17l21O4J43j92P2o3J12N4P4L5r4j12n3P2q5J87K4j08k58K61k5K40k12k07
$$ plain form
15046 -175 -240 -35 -102 -9 -111 -99 86 -161 168 4 -121 177 23 -183 7 -369 103 -201 18 -43 -249
15067 -249 -55 2 -99 249 -198 -95 182 -160 -93 -30 201 55 -51 78 8 -111 -269 -87 138 63 -197
15088 -197 -91 32 -36 96 112 -99 -60 23 233 104 -176 97 33 -70 -94 -56 -202 -97 72 -46 266 -215
15110 -215 29 -186 -192 4 282 208 109 -93 -21 100 -88 -24 36 -35 -155 123 -214 -105 -105 -134 -57 72 43 -97
15134 -97 103 346 -412 202 -37 96 277 188 -244 124 -251 -126 92 -199 276 142 114 -68 -24 -22 -301 -65
15156 -65 -229 -39 74 -130 33 -134 91 31 -3 -156 -90 73 -11 3 -145 27 277 136 80 1 118 174 100
15179 100 -28 -26 -197 -159 133 -212 -6 103 -93 38 -175 13 -42 -102 174 313 -184 31 161 -62 -41 44
15201 44 -4 118 43 -142 -90 -77 -98 222 -178 80 1 192 11 115 -35 -153 -25 -253 -60 206 15 -10
$$ packed form
15046a75o5K05o7R3j02J2J85k47L29j64j25K98j54k06J90l76M72l04K19o1k06
15067b49J94N7j01L48m47J03K77l42O7O3K31j46j06J29p0j19j58J82K25p5k60
15088a97J06J23o8J32J6k11L9Q3K10j29k80K73o4j03k4L8j46J05J69j18L12m81
15110b15K44k15oJ96K78p4r9k02P2J21j88O4O0p1j20K78l37J09%k9P7J29k9j40
15134i7K00K43p58O14k39J33J81q9m32L68l75J25K18k91M75j34k8j82M4Kk79K36
15156f5j64J90J13k04J63j67K25o0l4j53O6J63q4J4j48J72K50j41n6p9J17N6p4
15179A00j28Kj71L8K92l45K06J09j96J31k13J88n5o0K76J39m97K15J30k23K1Q5
15201D4m8J22p5j85N2J3k1L20m00K58p9J91j81J04j50j18J28k28J93K66j91k5
$$ plain form
15223 -10 181 -107 247 -63 9 6 160 84 -32 -21 -91 -23 -164 -52 56 111 96 112 110 174 -15 36 24 56 -8 196
15249 196 -284 -11 -88 -161 129 57 91 -64 89 8 16 -91 -139 141 192 -148 88 137 -10 74 4 -32 120 -107
15273 -107 250 -168 87 135 11 -56 -45 -109 -179 129 -141 38 38 26 98 69 72 283 -72 -39 302 52 46 -31 -104
15298 -104 -78 74 123 68 -200 112 9 161 -139 22 -138 -46 -64 -141 195 -64 -26 -173 0 7 111 -95 135
15321 135 -60 -175 72 -60 -93 -232 19 27 -81 -48 -127 -54 -7 -280 43 -86 146 2 -30 11 -63 1 -52 70
15345 70 -117 -8 138 -27 -242 86 -19 -160 -91 -99 -56 187 -91 195 -48 4 -89 30 -92 -85 9 -305 -105
15368 -105 -76 -107 -53 -77 -93 174 181 -36 -206 -14 -301 -39 -124 95 -146 48 -20 -95 -24 -95 -161 -82 -61 -53 14 163
15394 163 25 38 119 -90 50 -105 -115 -92 44 6 198 -117 259 -59 12 143 107 80 -258 239 -483 158
$$ packed form
15223a0J91k88L54l10P2lJ54p6j16J1p0O8j41J12J08N5j5J6kO4j89N1j2L2o4K04
15249A96m80K73p7p3K90p2L4j55J53q1Qj07m8K80N1l40K36M9j47Q4p0l6J52k27
15273a07L57m18K55M8j24o7J1o4p0L08k70J79%j2P2k9LK11l55L3L41k50op7p3
15298a04K6J52M9n5k68L12j03J52l00J61j60R2j8p7L36k59L8j47J73PJ04k06K30
15321A35j95j15K47j32l3j39K51Qj08L3p9P3M7k73L23j29K32j44l2M1p4O4n3J22
15345G0j87J09J46j65k15L28j05j41O9qM3K43k78K86k43N2r3J19j22PR4l14K00
15368a05K9l1N4k4j6K67Pk17j70J92k87K62q5K19k41J94o8p5P1p1o6P9K1QO7J49
15394A63j38J3Q1k09J40j55j0K3J36l8J92l15L76l18P1J31l6k7l38M97p22O41
$$ plain form
15416 158 -69 127 141 4 -81 -177 163 -142 70 -70 2 36 -125 97 -247 234 -56 172 240 -110 -25 -78
15438 -78 -24 -60 -94 -18 6 42 -41 -130 -29 -82 109 -180 7 59 0 214 19 44 67 178 -33 -83 -68 4 245
15463 245 66 -42 -18 -48 -69 -155 54 -74 -24 -6 126 -33 -129 -36 -173 -210 11 225 -18 48 6 -7 -194 8
15487 8 1 -213 188 24 29 -1 52 100 13 36 -127 -81 -169 31 115 -110 72 -68 80 70 -209 -88 8 185 0
15512 0 268 -210 39 144 42 117 -14 -90 -313 92 -30 -178 -91 180 156 71 -184 -137 63 19 11 0 147 -48
15536 -48 -27 245 -139 -363 68 -209 -16 -92 -70 -84 -87 -175 64 63 -315 161 0 -44 69 57 -171 -39 -139 191
15560 191 -70 -229 136 -164 13 -190 10 -137 109 182 -25 107 16 -34 -3 243 65 -103 -92 -124 142 -60
15582 -60 1 -154 47 28 -161 -239 -67 -205 -16 -165 -386 8 77 93 -88 175 -48 -172 -83 47 41 -233 -51
$$ packed form
15416A58k27J96J4j37q5r6L40l05K12j40P2L4j61K22l44M81k90K28O8l50Q5n3
15438g8N4l6l4P6K4L6q3q9J01n3J91k89J87N2n9K14j95K5K3J11k11n0J5P2K41
15463B45j79j08K4l0k1q6K09j28N0J8J32j59r6R3j37l7K21K14k43O6m2j3j87K02
15487Hpk14M01j64Nl0N3M8q7K3j63M6q8K00Q4k25J82j40J48j0k79J21R6J77j85
15512@K68m78K49J05j02P5j31p6k23M05j22j48Q7K71k4q5k55M7K00m4qj1J47j95
15536d8K1K72l84k24M31k77J93p6K2j4lq8K39jl78M76j61m4J13j2k28J32j00L30
15560A91k61j59L65l00J77k03K00j47K46P3k07J32r1n0L1K46j78j68J1l2K66k02
15582f0O1j55K01j9j89p8J72j38J89j49k21L94O9J6j81K63k23j24Q9J30ok74J82
$$ plain form
15605 -51 120 38 -33 -253 91 -235 39 168 121 -139 -289 44 64 -175 11 -111 -146 81 -43 -94 -88 -372 23
15628 23 -96 96 -32 2 68 163 135 -41 -96 78 -43 134 -141 -48 275 -32 -169 -140 112 -231 4 15 -52
15651 -52 78 -98 230 101 189 85 -58 -47 17 -164 -141 -100 -75 -84 62 130 -150 -319 90 -40 130 124 17 72
15675 72 -80 7 -142 -79 -139 36 54 9 67 -5 -64 209 -65 -62 124 -15 55 -78 -164 -54 -180 -111 -37 27 11
15700 11 112 -116 -15 -49 -162 -34 145 51 -183 -178 51 -157 -225 26 145 -73 75 -1 84 3 1 21 -142 -93
15724 -93 49 39 15 148 111 229 0 -8 -172 -128 157 -328 -21 -130 10 -15 -39 -91 -130 -80 -246 31 97 53
15748 53 61 61 9 24 -363 -288 95 -138 89 99 -98 -179 100 121 69 109 -75 -141 36 108 85 331 120 -91 -6
15773 -6 35 10 153 -21 63 39 10 -86 6 -134 -9 71 -120 112 2 -13 175 -31 38 32 -50 131 -52 94 -103
$$ packed form
15605e1J71q2p1k20L44l26K74J29m7k60j50L33K0k39J86j22l5K27j24n1Ok84L95
15628B3j19J92j28L4O6R5k8j76n5J74j21J77k75R3L23l07j37K9K52l43K35J1o7
15651e2J30j76L28j29Q8j04j43J1O4j81K3M1K5rJ46O8k80j69M09j30J70oj07N5
15675G2j52Q7j49O3o0J75J8m5N8p2n9K73k74LJ86j39P0j33q6J10j26O9P4O4j6
15700A1J01k28J01l4j13J28J79r4k34NK29k08o8K51J19k18J48p6Q5q1kK0j63M9
15724i3J42j0k4J33l7J18k29qj64M4K85m85L07j09J40k5k4n2l9N0j66K77O6m4
15748E3Q%n2J5l87P5L83k33K27J0j97q1K79K1n2M0j84o6J77P2k3K46k11k11Q5
15773fM1k5J43j74Q4k4k9r6R2j40J25Q0j91K32j10j5J88k06O9oq2J81j83J46j97
$$ plain form
15798 -103 89 -5 185 80 64 131 148 -214 288 61 -89 -343 213 -191 1 -269 -143 194 -48 168 111
15819 111 235 3 213 -49 107 -14 -49 -172 45 -87 94 -98 -176 -117 -377 -117 29 -216 -34 81 155
15840 155 18 51 33 81 -66 39 63 145 -25 4 -22 -148 18 155 -101 46 110 117 64 -51 29 60 123 101 -92
15865 -92 49 99 -31 -111 -32 -95 -68 160 -144 -234 -23 47 138 -86 -50 -82 330 14 37 294 43 83 36 -190
15889 -190 -59 404 196 -149 154 62 71 -83 -13 16 -51 9 52 -263 -188 118 29 213 -112 111 -136 -70 243
15912 243 -45 -20 -156 55 141 -4 -198 156 -54 -75 137 121 29 64 -40 44 -12 54 241 32 47 181 -136
15935 -136 117 -10 -72 -66 -20 -32 83 -133 -72 -65 16 -9 76 101 -80 76 95 33 -160 -104 47 -39 10 -387 295
15960 295 25 -30 -144 86 13 20 147 -59 -149 -112 -140 -211 116 -123 -74 230 116 -22 -67 -18 -202 110 -98
$$ packed form
15798a03J92r4J90j05j6O7J7l62N02k27j50k54N56m04J92k70J26L37k42K16n7
15819A11J24k32K10k62J56j21l5j23K17j32J81j92p8N9k60K60J46k45J82J15P4
15840A55j37L3j8M8j47J05K4Q2j70K9k6j26J66J37k56J47O4Pn3j15Q0L1O3k2j93
15865i2J41N0j30q0P9o3K7K28l04r0K11P0R1k24L6l2M12l16K3K57k51M0m7k26
15889a90J31M63k08l45L03r2Rj54P0K9o7O0M3l15P5L06q9J84l25K23k47O6L13
15912B43k88K5j36K11Q6j45j94L54k10k1K12j6r2L5j04Q4n6O6J87k09J5J34l17
15935a36K53j27o2OM6j2J15k16O1PQ1k5Q5K5j81J56J9o2j93N6J51q6M9l97O82
15960B95k70n5j14K30p3PJ27k06r0L7k8p1L27k39M9L04j14j38m5M9j84L12k08
$$ plain form
15983 -98 -116 20 -66 89 -209 -231 224 9 127 148 -39 -259 -165 71 -118 153 -34 5 87 61 -53 204 -139
16006 -139 -53 -78 134 -48 -317 57 17 109 -24 -213 74 -239 -120 -139 -64 156 271 -14 251 -27 76 -77
16028 -77 38 -146 -46 72 -134 -84 233 59 53 -9 108 108 -187 30 -208 364 -117 -190 -42 43 -137 11 228
16051 228 -6 24 72 51 -177 -30 -220 186 -76 -159 51 230 -33 59 -12 86 -35 -123 -73 -59 32 -208 -118 34
16075 34 -74 -44 -327 -304 -47 28 -17 -85 -46 123 -46 -110 -54 -144 -78 7 -116 -228 -183 -148 215 77 -304 -60
16099 -60 -8 -60 -157 32 22 -42 -85 144 -36 126 -229 96 -212 26 136 216 -1 2 80 -39 29 136 15 42
16123 42 -83 -106 81 -22 -133 -138 3 107 -27 -29 -20 -92 9 -122 9 167 93 -233 -53 -208 -138 141 8
16146 8 85 -14 13 -53 -151 -85 -188 -84 0 -39 77 130 -253 -60 -264 17 84 15 104 142 227 38 164 -180 79
$$ packed form
15983i8j8J36q6J55k98k2M55k15J18K1j87k20R4K36j89K71j87L9Q2k6j14K57l43
16006a39Q6k5K12j82k69L74m0R2j33j89K87l13J19j9P5K20J15k85K65k78J03j53
16028g7J15j84J00J18k06N0L17j74oo2J17%k95K17k38N72m81p3J48Q5j80J48K17
16051B28k34L0M8k1k28J47j90M06k62q3K10J79k63R2p1R8j21q8N0J4R1k40R0J52
16075C4j08L0k83K3K57P5m5o8L9J69j69o4N6r0O6Q5j23j12M5L5L63j38l81K44
16099f0N2n2r7J89j0o4m3K29j80J62l55L25l08K38J10Q0k17LP8j19O8J07j21K7
16123D2j25k3J87j03j11nJ41J04j34kRp2J01j31J31J58p4l26J80j55P0K79j33
16146HP7r9K7o6r8O6j03J04Q4l9J16N3l83J93k04K81O7o9Q9L8Q5j89J26l44K59
$$ plain form
16171 79 -72 -90 -75 -147 92 9 16 -72 170 177 -39 55 96 170 -184 80 17 -49 107 -48 -88 35 54 29 260 -180
16197 -180 -103 121 -145 77 -99 21 48 47 -23 -73 -106 -36 81 157 86 137 171 92 -74 -157 -57 -241 -51 1 -56
16222 -56 34 -56 -216 -189 -133 36 -45 -95 53 32 99 -57 166 -180 98 -1 -170 -290 -123 -139 -209 -98 -176 -77
16246 -77 132 -2 92 34 -235 -39 168 62 -82 -37 118 -99 -146 -121 134 221 -104 46 -282 -152 95 106
16268 106 -51 29 -46 -169 93 61 243 181 -12 145 -73 87 135 -119 -73 -96 -58 -314 -183 -111 168 -73 -252
16291 -252 -102 100 -106 -29 -17 58 -199 -223 72 -129 98 -171 300 -13 74 70 41 -90 112 -75 40 -100
16313 -100 39 -121 -104 -115 -42 212 -24 -40 -40 139 18 47 21 68 48 77 80 56 -255 69 59 104 25 -13 -11 -207
16339 -207 -16 -81 27 -166 79 138 45 174 -272 -4 -67 215 -96 156 245 20 -132 -312 -120 -67 45 -75
$$ packed form
16171G9j51j8J5p2K39q3Pq8K42Pk16R4M1P4l54K64o3o6J56j55m0J23J9k5K31m40
16197a80P7K24k66K22j76J20K7jp0n0l3P0J17P6p1N1L4p9j66q3J00j84J90N2n7
16222e6R0r0j60K7N6J69q1n0J48k1O7j56K23l46K78r9j69j20J67j6p0J11p8R9
16246g7K09j34R4n8k69J96K07j06j44M5J55k17m7K5K55Q7l25J50l28J30K47J1
16268A06j57Q0p5j23K62l2J82o2j93J57k18J60M8k54M6k3L8k56J31P2K79k41j79
16291b52J50K02k06P7J2P5k57k4K95k01K27k69M71l13Q7mk9j31K02j87J15j40
16313a00J39j60J7j1P3K54k36j6%J79j21K9k6M7k0K9Lk4l11L24j0M5p9l8Kj96
16339b07J91o5J08j93K45N9r3J29m46K68o3K82l11K52Q9k25j52j80J92N3J12j20
$$ plain form
16361 -75 87 68 -78 -14 -48 40 -113 259 105 67 147 41 7 -86 -54 68 61 -16 32 33 -143 -22
$$ packed form
16361g5J62j9j46O4l4Q8j53L72j54l8Q0j06l4r3L2J22pp7M8Jj76J21
16383b2
$$ Imaginary data points
##PAGE= N=2
##DATA TABLE= (X++(I..I)), XYDATA
$$ plain form
0 0 0 0 0 0 0 0 -32 32 -32 32 -64 64 -96 128 -160 192 -224 288 -353 416 -512 612 -736 857 -994 1185
26 1185 -1376 1569 -1825 2107 -2395 2719 -3101 3515 -3961 4459 -5021 5624 -6275 7001 -7808
41 -7808 8668 -9600 10647 -11777 13002 -14347 15830 -17443 19208 -21159 23321 -25707
53 -25707 28357 -31344 34718 -38523 42913 -48031 54055 -61281 70162 -81370 95993
64 95993 -115983 145114 -191649 277796 -490247 2062607 1906304 -4276445 -2223090 2694052
74 2694052 2654828 -2274130 -2505357 1660358 2541366 -2208312 -3853729 871693 4420436
83 4420436 762154 -3794468 -1682087 3334979 2561372 -2140108 -2556084 1795555 2820800
92 2820800 -1378060 -3556109 133064 3191930 467227 -3095158 -1120736 2797192 1727450
$$ packed form
0@%%%%%%l2O4o4O4r6J28j60K24k88L52m16N12o41P69r28J124j348J593j851K179
26A185k561K945l394L932m502N114n820O616p476Q420r480J0645j1899J3276j4809
41g808J6476j8268K0247k2424K4779k7349L0177l3273L6651m0367M4480m9028
53b5707N4064n9701O6062p3241Q1436r0944J02086j15336J31443j51532J77363
64I5993k11976K61097l36763M69445p68043K552854j56303o182749K053355M917142
74B694052l9224m928958k31227M165715Q81008m749678j645417M725422L548743
83D420436l658282m556622K112381N017066p73607m701480m15976M351639J025245
92B820800m198860k178049L689173L058866k724703l562385J974422L917928j069742
$$ plain form
101 1727450 -2417701 -2158056 2243379 3257483 -979536 -3435013 -302447 2847477 865872
110 865872 -2320103 -1118910 1912246 974542 -2296938 -1704681 2278561 2919276 -1127715
119 -1127715 -3307215 -163489 2981226 1186832 -2048043 -1290130 1517539 1028059 -1787227
128 -1787227 -1518257 1728883 2260863 -1131211 -2797049 115622 2753077 856516 -2118605
137 -2118605 -1165120 1734954 1368960 -1519908 -1722519 1134042 1976007 -687395 -2165366
146 -2165366 97228 2079656 339919 -1952831 -664229 1994989 1309536 -1666418 -1881057
155 -1881057 995886 2073711 -297676 -1904253 -189444 1503854 163680 -1551725
163 -1551725 -272335 1865159 915002 -1761466 -1617697 1229697 2095019 -329319 -1905819
$$ packed form
101A727450m145151K59645M401435J014104m237019k455477L132566L149924j981605
110H65872l185975J201193L031156r37704l271480N92257L983242O40715m046991
119a127715k179500L143726L144715j794394l234875P57913K807669m89480k815286
128a787227K68970L247140N31980l392074j665838K912671K637455j896561k975121
137b118605R53485K900074l65994k888868k02611K856561Q41965k663402j477971
146b165366K262594J982428j739737k292750J288602K659218o85453k975954k14639
155a881057K876943J077825k371387j606577J714809J693298j340174j715405
163a551725J279390K137494r50157k676468J43769K847394Q65322k424338j576500
$$ plain form
172 -1905819 -259829 1403225 233977 -1354739 -306812 1477441 604573 -1574637 -1185023
181 -1185023 1310779 1747983 -579593 -1718268 109451 1577473 196344 -1448729 -449907
190 -449907 1301086 612420 -1294940 -1001962 1006185 1205157 -712591 -1304021 510554
199 510554 1526767 -76383 -1518415 -299633 1452235 736691 -1151950 -1013416 708693
208 708693 912915 -618748 -982707 530119 1148008 -363337 -1380924 -10550 1515738
217 1515738 642798 -1141370 -911677 739921 930862 -484752 -881768 369430 869041
226 869041 -391717 -1150472 78209 1263594 352328 -1125818 -677119 885439 910414
235 910414 -529225 -888172 369577 927389 -219949 -1007934 -16781 988330 201696
$$ packed form
172a905819J645990J663054j169248j588716J047927J784253q72868k179210L89614
181a185023K495802M37204k327576j138675J827719J468022j381129j645073R98822
190d49907J750993o88666j907360K92978K008147J98972j917748n91430J814575
199E10554J016213j603150j442032J218782J751868p15544j888641J38534J722109
208G08693K04222j531663l63959J512826O17889j511345j017587J370374J526288
217A515738q72940j784168K29693J651598J90941j415614l97016J251198M99611
226H69041j260758p58755J228681J185385r11266j478146M48699J562558K4975
235I10414j439639l58947J257749N57812j147338p87985R91153J005111p86634
$$ plain form
244 201696 -998846 -480413 870294 692023 -706865 -874327 506706 1056712 -162899
253 -162899 -1032932 -90894 954436 286583 -841732 -409238 763344 514358 -763932
262 -763932 -777817 594336 1002099 -299171 -1104580 -51023 1036111 335903 -837243
271 -837243 -430436 740061 530960 -674819 -677592 582446 871929 -389905 -1043627 63618
281 63618 1035509 210545 -946322 -430292 802690 577708 -655473 -679681 538232 817527
291 817527 -350569 -898795 157667 960939 71472 -967693 -325920 875843 528702
300 528702 -751709 -724343 535885 814609 -331482 -846934 165712 887344 25095
309 25095 -885775 -198038 897222 443988 -801169 -671244 600228 798162 -390352
$$ packed form
244B01696j200542N18433J350707j78271j398888j67462J381033N50006j219611
253a62899q70033R42038J045330o67853j128315M32494J172582k48986j278290
262g63932j3885J372153M07763j301270q05409J053557J087134p00208j173146
271h37243M06807J170497k09101j205779k773J260038K89483j261834o53722J107245
281F3618R71891q24964j156867N16030J232982k24982j233181k4208J217913K79295
291H17527j168096n48226J056462Q03272q89467j039165O41773J201763l47141
300E28702j280411K7366J260228K78724j146091n15452J012646P21632q62249
309B5095r10870O87737J095260m53234j245157J29925J271472J97934j188514
$$ plain form
318 -390352 -874692 151315 849361 11189 -841368 -175821 834120 383770 -748847
327 -748847 -556066 639988 741930 -427501 -830810 202919 843116 -8885 -839404
336 -839404 -207196 753514 353411 -684232 -512665 571269 654283 -405273 -731639 249682
346 249682 814915 -18550 -794826 -183135 730218 357589 -637170 -521260 479496 595394
356 595394 -364858 -687262 205267 738565 -23443 -736814 -147820 721009 363162 -597764
366 -597764 -500706 468671 609486 -321912 -687949 145534 693375 -13011 -718165 -170855
376 -170855 672463 336379 -587763 -477934 485073 626948 -303594 -681726 150513 722297
386 722297 24202 -711956 -196223 643410 320168 -590712 -478775 464365 586091 -330020
$$ packed form
318c90352m84340J026007O98046q38172q52557O65547J009941m50350j132617
327g48847J92781J196054J01942j169431m03309J033729O40197q52001q30519
336h39404O32208R60710m00103j037643J71567J083934Q3014j059556l26366R81321
346B49682N65233q33465p76276O11691R13353l72629r94759J15910J000756J15898
356E95394r60252l22404Q92529N33298p62008p13371N88994Q68829l57847r60926
366e97764R7058R69377J40815r31398l66037Q33483N47841p06386p05154N47310
376a70855Q43318l36084r24142J09829R63007J41875r30542l78132Q32239N71784
386G22297o98095p36158N15733Q39633l23242r10880J11937R43140J21726r16111
$$ plain form
396 -330020 -672884 173144 733836 27457 -700749 -174509 663473 334542 -569762 -458113
406 -458113 451945 543163 -344990 -646343 174260 677396 -23652 -692431 -145459 658543
416 658543 313957 -554477 -416953 464256 530096 -321289 -586471 187135 621472 -56646
426 -56646 -654571 -116134 610768 246198 -562931 -389312 456810 494696 -317152 -540360
436 -540360 202695 592957 -49216 -584513 -72708 573495 202570 -538904 -347175 436889
446 436889 434823 -340464 -524854 193247 552999 -54911 -543556 -57200 539103 196096
456 196096 -475518 -289617 420971 396306 -326473 -483870 190172 510658 -73911 -535247
466 -535247 -77047 489944 185822 -434666 -273864 379652 371457 -279451 -420822 198096
$$ packed form
396c30020l42864Q46028N60692p06379p28206N26240Q37982l28931r04304J11649
406d58113R10058R1218q88153l01353Q20603N03136p01048o68779N46972Q04002
416F58543l44586q68434J37524Q81209O5840q51385k65182P73606M34337o78118
426e6646n97925N38437P26902l64570q09129J73619Q46122L7886q11848k23208
436e40360P43055L90262o42173n35297N11805O46203l70925p41474J91729P84064
446D36889k066p75287j84390P18101L59752o07910m88645M86356N96303l43007
456A96096o71614J85901P10588k4665p22779j57397O74042L20486n84569m61336
466e35247M58200N66991l04122o20488J60802O53516q195o50908j41371O18918
$$ plain form
476 198096 486550 -68114 -504639 -71603 468738 180324 -425212 -295119 326997 347063
486 347063 -254309 -399542 174799 453085 -60928 -464035 -40313 476925 182733 -417227
496 -417227 -287263 332320 353439 -252323 -414803 142727 424755 -68463 -455644 -37249
506 -37249 458857 156404 -418480 -251442 374529 364166 -266545 -415764 167085 446522
516 446522 -66516 -461272 -47547 429402 119714 -422731 -223891 378399 318689 -307621
526 -307621 -396737 220298 470361 -76283 -460622 -28861 436764 120652 -398773 -199260
536 -199260 349941 254559 -328815 -358948 241415 429427 -127719 -460121 4544 450715
546 450715 121665 -377512 -176419 338336 241383 -291524 -305295 230522 360938 -163218
$$ packed form
476A98096K88454n54664m36525M33036N40341k88414o05536J30093O22116K0066
486C47063o01372j45233N74341K78286n14013m03107M23722N17238k94192n99960
496d17227J29964O19583K1119o05762j62480N57530K82028m93218l87181M18395
506c7249M96106l02453n74884J67038O25971j0363o30711j49219N82849K79437
516D46522n13038l94756M13725M76949l09688n42445J98840O02290n9710o26310
526c07621q9116O17035K50063n46644l84339M31761M65625l16112n19425J99513
536a99260N49201r5382n83374l0133O00363J88012n57146l32402M64665M46171
546D50715l29050m99177K01093N14755r6953n32907j3771N35817J30416n24156
$$ plain form
556 -163218 -428879 34975 423853 70403 -395460 -166071 344065 250297 -259879 -284132
566 -284132 206996 334918 -127550 -357465 55690 373110 17158 -395564 -136339 351414
576 351414 227046 -288749 -310280 185485 342989 -81547 -321464 36623 332873 24925
586 24925 -336696 -88785 346045 191217 -312461 -310084 194009 348051 -87297 -351667
596 -351667 -9439 316718 60481 -293775 -91427 311029 179223 -278194 -259973 217471
606 217471 335395 -113596 -367220 -4700 337223 73841 -318720 -148071 273785 195679
616 195679 -233967 -238382 197196 298239 -122929 -326327 56512 365533 50203 -360843
626 -360843 -162708 300306 230401 -232644 -276516 148030 269106 -114013 -286526 84217
$$ packed form
556a63218k65661M63854L88878l53450m65863K29389N10136r3768n10176k4253
566b84132M91128J27922m62468k29915M13155L17420l55952m12722K59225M87753
576C51414j24368n15795k1531M95765J57504m24536k39917L58087K96250l07948
586B4925l61621K47911M34830j54828n03678K377N04093J54042m35348k64370
596c51667L42228L26157k56237l54256K02348M02456j31806m57417J8221M77444
606B17471J17924m48991k53624L62520L41923k63382l92561J70649M21856p8106
616A95679m29646m415M35578J01043m21168k03398L82839L09021l15330m11046
626c60843J98135M63014o9905m63045m3872M24546J21076l83119j72513L70743
$$ plain form
636 84217 340954 178 -367093 -106447 360080 238356 -265261 -299117 158163 291485
646 291485 -101623 -289117 58393 292668 -30486 -340399 -59158 354192 180722 -295920
656 -295920 -260491 218871 314748 -116512 -306704 54090 299072 -6472 -306469 -63566
666 -63566 287396 116130 -280726 -196381 236192 262156 -168840 -304688 93312 337331
676 337331 18799 -299105 -86662 252527 126393 -214833 -153621 191170 180431 -193835
686 -193835 -266666 125609 324106 -15637 -322950 -91706 269506 166857 -176868 -159127
696 -159127 149764 168184 -144952 -212114 117568 268777 -55454 -318889 -67479 279518
706 279518 149423 -212533 -189331 151575 209566 -97235 -207387 78502 242766 -25140
$$ packed form
636H4217K56737l40776l67271K60646M66527j21724n03617l3856M57280J33322
646B91485l93108j87494L47510K34275l23154l09913K81241M13350j73470m76642
656b95920L5429M79362R5877m31260j90192L60794K44982l05544k99997K42903
666f3566L50962j71266l96856Q4345M32573K5964m30996j35848L98000K44019
676C37331l18532l17904K12443L39189j26134l41226O1212L44791j0739l74266
686a93835p2831L92275J98497l39743l07313K31244L61212j02649l43725J7741
696a59127L08891J8420l13136o7162L29682J51209l24231k63435K51410L46997
706B79518j30095l61956K3202L40906N7991l06801j10152K85889J64264k67906
$$ plain form
716 -25140 -260126 -38520 256486 99987 -245862 -182527 185102 227069 -123303 -261374
726 -261374 43706 260921 28646 -224201 -51019 220829 87346 -215905 -130702 213865
736 213865 205510 -171603 -286737 60453 289063 30109 -256876 -92283 203730 106452
746 106452 -179698 -110576 199750 176378 -172964 -242325 109872 291841 -10586 -287575
756 -287575 -82784 229841 114457 -199084 -144533 168305 167523 -147057 -202306 117428 251415
767 251415 -45278 -260319 -15874 264485 90621 -237043 -154731 182189 183924 -137680
777 -137680 -210315 79303 203949 -52102 -215100 22710 244187 42724 -243149 -111293
787 -111293 223209 191443 -146542 -218696 68852 199922 -33687 -192653 5166 188918
$$ packed form
716b5140k34986K21606K95006j56499l45849O3335L67629M1967l50372j38071
726b61374L05080K17215k32275k52847J73182K71848j33483l03251Q5203L44567
736B13865q355l77113j15134L47190K28610k58954k86985J64593K96013r7278
746A06452k86150O9122L10326k3372l49342o9361L52197J81969l02427k76989
756b87575K04791L12625j15384l13541N4551L12838p82l14580n5249L19734J33987
767B51415k96693k15041K44445K80359j73864l27664Q2312L36920J735l21604
777a37680p2635K89618J24646k56051j62998K37810K21477k01463k85873J31856
787a11293L34502l1766l37985p2154K87548J31070k33609j58966J97819J83752
$$ plain form
797 188918 12098 -216617 -73873 215485 154687 -159375 -196348 96569 216462 -22293
807 -22293 -191642 -12694 175408 33332 -179774 -76891 163841 110728 -152410 -163381
817 -163381 105379 194511 -45773 -198231 -2688 200412 65957 -165722 -95759 139582
827 139582 119662 -116413 -144135 85292 156501 -68619 -195914 11328 206479 54467
837 54467 -187336 -108187 152858 151059 -94602 -147121 73181 156882 -53264 -177142 17579
848 17579 191605 26619 -205101 -102120 166267 145887 -119422 -167515 78217 180045
858 180045 -34502 -171910 16045 187858 27975 -187458 -76786 170224 118131 -149047
868 -149047 -168679 95271 183076 -54045 -194103 8643 192515 37492 -171107 -59913
$$ packed form
797A88918j76820k28715J42744K89358o0798l14062l6973K92917J19893k38755
807b2293j69349J78948J88102j42076k13106J02883K40732n3113k63138j0971
817a63381K68760Q9132k40284j52458J95543K03100j34455k31679O9963K35341
827A39582j9920k36075k7722K29427P1209k25120j27295K07242J95151j52012
837E4467k41803P9149K61045j799k45661n2519K20302Q3701k10146j23878J94721
848A7579J74026j64986k31720J02981K68387k0380k65309m8093K45732J01828
858A80045k14547j37408J87955J71813j59883k15433J10672K47010n2093k67178
868a49047j9632K63950Q7805k37121j40058K02746J83872j55023k08599J11194
$$ plain form
878 -59913 167928 102532 -144218 -135764 118130 169044 -82048 -202575 17733 193728 23701
889 23701 -183649 -65072 159145 93003 -134321 -110421 125775 153146 -86317 -175356 45903
900 45903 192320 5288 -190387 -59314 158339 81643 -141923 -113749 111254 133920 -82735
911 -82735 -151533 55130 177782 -2388 -171782 -34251 166558 77400 -143249 -112769 104703
922 104703 125750 -80252 -149372 37413 151156 -6087 -154461 -26768 156611 73259
932 73259 -131371 -98259 111933 132526 -70015 -145902 27846 142840 -538 -149527 -42097
943 -42097 133518 66264 -125440 -98855 105543 131185 -64697 -139925 34834 154565 12148
954 12148 -144838 -46042 132057 72107 -123350 -109004 92348 123390 -71438 -146471 34121
$$ packed form
878e9913K27841o5396k46750Q454K53894N0914k51092j20527K20308J75995j70027
889B3701k07350J18577K24217o6142k27324K3900K36196K7371k39463q9039K21259
900D5903J46417j87032j95675J31073K17653p6696k23566K8174K25003K2666k16655
911h2735o8798K06663J22652j80170j69394J37531K00809q9158k20649L0480K17472
922A04703K1047k06002o9120J86785J13743j57243j48374J27693J83379q3352
932G3259k04630L3112K10192K0593k02541p5887J73748J14994j43378j48989J07430
943d2097J75615o7254j91704K6585K04398K5642j95882p5228J74759J19731j42417
954A2148j56986R8796J78099n9950j95457J4346K01352L1042j94828p5033J80592
$$ plain form
965 34121 156217 9253 -147960 -39151 146609 83561 -120197 -106775 98960 129186 -73670
976 -73670 -151374 32708 150885 -6210 -160029 -37872 149063 74677 -128603 -100920 112161
987 112161 135423 -72558 -143501 45909 155842 -10449 -158906 -30138 144866 56227
997 56227 -139140 -97391 110405 119683 -83138 -136975 55706 154633 -12546 -146577 -12961
1008 -12961 147482 50456 -132274 -82036 108332 101420 -91746 -130408 52982 135419 -26231
1019 -26231 -141817 -6257 141096 44219 -120765 -63359 111349 95211 -82645 -111794 55639
1030 55639 121220 -32327 -135284 -7322 124135 29777 -119564 -60835 102321 86377 -74591
1041 -74591 -96679 57939 117690 -23130 -117295 -2038 116910 27895 -113635 -61765 89229
$$ packed form
965C4121J22096j46964j57213J08809J85760o3048k03758J3422K05735L0226k02856
976g3670p7704J84082J18177j57095j53819J22157J86935p4386k03280K7683K13081
987A12161K3262k07981p0943J89410J09933j66291j48457J28768J75004q8639
997E6227j95367M1749K07796R278k02821n3837J92681R8927j67179j34031J33616
1008a2961J60443r7026j82730N0238J90368o912j93166l8662J83390Q2437j61650
1019b6231j15586J35560J47353r6877j64984N7406J74708j6138j77856k9149J67433
1030E5639O5581j53547j02957J27962J31457r4358j49341N8729J63156j5944j60968
1041g4591k2088J54618N9751j40820r4165J15257J18948q9015j41530N1870J50994
$$ plain form
1052 89229 74840 -75970 -98580 46967 107517 -19210 -108115 -912 115093 36016 -99350
1063 -99350 -54426 89666 77886 -70900 -98727 40357 101082 -22252 -113270 -10854 106373
1074 106373 33705 -98420 -53496 92197 82874 -65488 -91951 49493 109375 -19935 -114182
1085 -114182 -10045 106870 27964 -107681 -59136 88628 74124 -76185 -93135 57598
1095 57598 112449 -24808 -112556 4785 120331 29117 -109717 -52318 95690 68030 -87170
1106 -87170 -93866 60184 101379 -43678 -116871 15272 123563 18699 -113307 -38760 109903
1117 109903 69610 -86928 -82821 69504 94981 -52543 -111764 22138 112006 -2731 -120588
1128 -120588 -31491 110858 59148 -91777 -74324 78020 95732 -48189 -96847 31955 105352
$$ packed form
1052H9229j4389j50810k2610J45547O0550j26727q8905J07203J16005p9077j35366
1063i9350M4924J44092j1780j48786k7827J39084O0725j23334r1018J02416J17227
1074A06373p2668j32125M4924J45693r323j48362k6463J41444N9882j29310r4247
1085a14182J04137J16915p8906j35645M8545J47764j4504j50309j6950J50733
1095E7598N4851j37257q7748J17341J15546r1214j38834N7399J48008k7660j55200
1106h7170o696J54050M1195j45057p3193J32143J08291j04864j32006P4547J48663
1117A09903m0293j56538M107J52325K5477j47524n9221J33902Q9868j14737j17857
1128a20588Q9097J42349n1710j50925J7453J52344J7712j43921m8658J28802P3397
$$ plain form
1139 105352 -9279 -111486 -21554 102963 40997 -100478 -73021 75880 87763 -51924
1149 -51924 -94106 31913 102751 -2251 -94444 -11666 97808 37387 -91845 -62925 74783
1160 74783 78769 -60082 -100917 25140 98495 -1219 -94744 -19847 89800 43627 -74864
1171 -74864 -53108 73293 78732 -53818 -94662 28616 101114 -3269 -105762 -33269 85506
1182 85506 48564 -73996 -65510 59850 80337 -40903 -86054 31101 104970 102 -104537
1193 -104537 -27514 97056 53859 -83492 -81141 53126 85517 -37680 -95543 16641 99058
1204 99058 2883 -98602 -18462 105797 53311 -89043 -76458 69599 97581 -41136 -108457
1215 -108457 7726 98646 4469 -100961 -25272 95967 42461 -91532 -64097 83855 96847
$$ packed form
1139A05352j14631j02207Q9932J24517o1966j41475K7457J48901J1883j39687
1149e1924m2182J26019P0838j05002r2193Q2778J09474o0421j29232K8920J37708
1160G4783L986j38851m0835J26057P3355r9714r3525P4897J09647m6173j18491
1171g4864K1756J26401N439j32550m0844J23278P2498j04383j02493P2493J18775
1182H5506l6942j22560Q486J25360K0487j21240m5151J17155P3869j04868j04639
1193a04537P7023J24570m3197j37351K351J34267L2391j23197n7863J12184Q2417
1204I9058r6175j01485Q0140J24259n2486j42354J2585J46057K7982j38717o7321
1215a08457J16183R0920r4177j05430P5689J21239n3506j33993K7435J47952J2992
$$ plain form
1226 96847 -50576 -106683 22761 112585 8654 -105279 -31842 89761 39307 -89181 -60972
1237 -60972 75365 76335 -61777 -95861 38785 112851 -781 -105832 -22833 100231 49269
1248 49269 -81103 -61794 62953 65488 -56336 -82025 35550 88729 -19394 -101903 -10859
1259 -10859 102413 46061 -80598 -61636 63134 75056 -36716 -71467 24314 71208 -17427
1270 -17427 -84184 -6927 84601 27994 -84417 -59415 63249 77614 -32304 -74687 15961
1281 15961 75105 3943 -65293 -10505 67790 24507 -70699 -50097 56097 64221 -43119 -82954
1293 -82954 13348 81826 11442 -70403 -24514 63996 41073 -48456 -43117 47019 56495 -40012
1305 -40012 -73826 20053 80710 -418 -87615 -33310 69604 50536 -49600 -55468 37406 60996
$$ packed form
1226I6847j47423n6107J29444Q9824j03931j13933P3437J21603n0454j28488K8209
1237f0972J36337R70j38112l4084J34646P4066j13632j05051Q2999J23064n0962
1248D9269j30372J9309J24747K535j21824k5689J17575N3179j08123q2509R1044
1259a0859J13272n6352j26659J8962J24770J1922j11772l4751R5781M6894q8635
1270a7427o6757P7257R1528n6607j12411K5002J22664J4365j09918m2383R0648
1281A5961N9144p1162o9236N4788P8295m3283r5206K0602J06194Q124j07340l9835
1293h2954R6302O8478p0384q1845M5889Q8510k2923q9529N339R0136R476r6507
1305d0012l3814R3879O0657q1128q7197N4305J02914j9068j00136n868R2874K3590
$$ plain form
1317 60996 -24311 -59226 24305 75970 -6358 -85250 -21354 78773 43887 -66572 -67162 37456
1329 37456 65667 -23265 -65009 15139 69089 -2650 -69011 -5567 79144 32061 -70299 -52878
1341 -52878 53649 65369 -36674 -76012 10475 67268 -1838 -66367 -9196 64555 20411
1352 20411 -60935 -29497 63625 53964 -46941 -66954 27450 73381 -5634 -71480 -15586 54706
1364 54706 16404 -53198 -24323 50850 33522 -48143 -47705 41750 68809 -13645 -67320 -4751
1376 -4751 61596 20726 -49838 -28365 37342 25422 -40444 -38653 32430 47736 -22715 -57142
1388 -57142 6975 62853 17590 -49614 -26077 41838 36021 -28549 -38421 18143 36433 -17819
1400 -17819 -46920 4300 47948 5141 -52339 -21900 47738 40854 -28656 -42816 17626 46713
$$ packed form
1317F0996q5307l4915Q3531N1665q2328p8892O3896J00127l4886j10459n90J04618
1329C7456K8211q8932m1744Q0148N3950p1739o6361O3444Q4711m7083j02360J7421
1341e2878J06527J1720j02043l9338Q6487N6793o9106o4529N7171P3751m4144
1352B0411q1346L1438R3122r661j00905k0013R4404M5931p9015o5846N5894P0292
1364E4706l8302o9602K8875P5173j7328q1665M38Q9455K7059q2454n3675O2569
1376d751O6347m0870p0564K1473O5707j1920o5866J791P1083J5306p0451l4427
1388e7142O4117N5878m5263o7204K3537O7915n817o4570r872N6564J8290n4252
1400a7819k9101N1220M3648m2807n7480L0439O9638o884o9510j4160O0442K9087
$$ plain form
1412 46713 -2183 -40705 -2828 38856 4505 -47824 -20110 43630 31713 -39632 -48617 22598
1424 22598 55191 -974 -47168 -6012 46671 17097 -39838 -19920 40850 28470 -41658 -45813
1436 -45813 27058 51279 -15969 -59642 -4587 54953 18959 -45736 -24436 44006 36006 -33515
1448 -33515 -37756 31315 47601 -22767 -57469 5270 56676 6800 -59322 -27500 47175 36240
1460 36240 -36402 -39155 31067 46416 -19679 -45880 16665 55615 -1754 -58510 -17223 51614
1472 51614 28715 -45693 -43268 28916 42540 -21623 -43871 16129 49173 -3827 -47466 -3032
1484 -3032 52983 21973 -45141 -34038 34048 39356 -26315 -46929 10530 41965 -5954 -43937
1496 -43937 -3586 43351 15611 -37550 -21795 37248 36830 -23822 -41057 13542 42657 -3750
$$ packed form
1412D6713m8896l8522L7877M1684l4351n2329K7714O3740j1917p1345q985P1215
1424B2598L2593n6165m6194M1156N2683k9574n6935J9918O0770j2380p0128m155
1436d5813P2871K4221o7248m3673N5055N9540l5994o4695K1300O8442q000o9521
1448c3515m241O9071J6286p0368l4702O2739N1406m9876o6122L1822P4675j0935
1460C6240p2642k753P0222J5349o6095k6201O2545L8950n7369n6756M1287O8837
1472E1614k2899p4408K425P2184J3624o4163k2248O0000L3044n3000m3639M4434
1484c032N6015l1010o7114J1103O8086N308o5671k0614N7459L1435m7919l7983
1496d3937M0351M6937k7740n3161J5755N9043m18o0652j7235N4599K9115m6407
$$ plain form
1508 -3750 -43712 -9972 34084 12382 -33885 -22351 28151 30147 -20684 -34648 15686 44400
1520 44400 1314 -39985 -9626 36507 18528 -30837 -26747 20261 26889 -19174 -36674 8024
1532 8024 38955 1122 -39539 -9808 40496 24257 -29080 -27404 23992 34580 -14353 -38706
1544 -38706 3622 37263 451 -42985 -14425 38003 21199 -34421 -29730 28829 39659 -14854
1556 -14854 -39196 8612 44382 4102 -42509 -13497 38868 18875 -39193 -31593 28998 35223
1568 35223 -22978 -42441 12135 46482 2025 -41872 -8020 43997 20934 -36718 -26856 32130
1580 32130 32440 -27478 -41689 13792 40935 -6619 -44639 -5812 42059 16251 -35674 -20967
1592 -20967 34908 31893 -24244 -33631 18185 37609 -9666 -41421 -3198 36050 8146 -37339
$$ packed form
1508c750l9962L3740M4056k1702m6267J1534N0502J996n0831j3964N0334K8714
1520D4400m3086m1299L0359M6133j7979m9365M090M7008O628m6063j7500M4698
1532H024L0931l7833m0661K9731N0304j6239n3337J676N1396J0588m8933k4353
1544c8706M2328L3641l6812m3436K8560N2428j6804n5620M691N8559J0830n4513
1556a4854k4342M7808L5770m0280m6611K9012N2365j9993n8068P600O0591O225
1568C5223n8201j9463N4576L4347m4457m3897L3852N2017k3063n7652R862N8986
1580C2130L10n9918j4211N5481K7143m7554l8020L8827M7871k5808n1925J4707
1592b0967N5875l015n6137r387N1816J9424m7275l1755L8223L9248k7904m5485
$$ plain form
1604 -37339 -19906 29793 25418 -23101 -28389 18813 35365 -6924 -31913 2439 34304 7424
1616 7424 -32099 -16777 25302 19684 -23482 -28792 12917 28075 -6814 -29032 1099 31045
1628 31045 9389 -24944 -12169 24959 21235 -17651 -25618 10190 25958 -6426 -30207 -4977
1640 -4977 25254 8498 -24768 -15459 21418 22838 -13301 -22896 11477 29561 -1307 -28439 -5153
1653 -5153 26428 10499 -26414 -20280 17751 21317 -15519 -27100 8882 30045 -862 -28479
1665 -28479 -2880 31777 14160 -25505 -18428 21975 23764 -17337 -29770 7950 28418 -5742
1677 -5742 -33206 -3358 31684 10137 -28771 -15587 27880 25186 -18088 -26757 14224 30943
1689 30943 -7374 -33079 -1024 30378 3813 -32959 -14023 27451 18589 -24082 -24137 19475 31102
$$ packed form
1604c7339J7433M9699m375m8519n288M7202J6552m2289k4989L4352L1865k6880
1616G424l9523J5322M2079n618m3166n310M1709J5158l4889k2218L0131K9946
1628C1045k1656l4333J2775L7128l724l8886p967L5808J5768l2384k3781K5230
1640d977L0231j6756l3266R309L6877J420l6139r595L4373J8084l0868k7132K3286
1653e153L1581j5929l6913O134L8031L566l6836j1581L5982K1163l0907k7617
1665b8479K5599L4657j7617l9665P077M0403J789m1101j2433L7720K0468l4160
1677e742k7464K9848L5042k1547l8908J3184M3467k694m3274q669M0981J6719
1689C0943l8317k5705L2055L1402k6565l6772J8936M1474q862m2671n5M3612J1627
$$ plain form
1702 31102 -8751 -29338 5383 32397 3155 -29953 -8848 26587 11784 -27527 -21381 19217
1714 19217 23854 -14809 -28514 6973 30848 2298 -25879 -4081 27046 11386 -22310 -14062
1726 -14062 19312 17971 -17171 -25959 7198 25189 -3090 -26993 -5575 24239 11465 -18431
1738 -18431 -11563 18112 17848 -11281 -18060 8948 21895 -3886 -25710 -6017 21349 9043 -21042
1751 -21042 -16853 13712 17922 -8126 -17127 6888 21308 649 -19750 -2931 23053 10917
1763 10917 -21575 -19155 14028 20006 -10356 -24727 683 21440 2878 -20457 -5265 22339
1775 22339 12711 -19114 -15717 19498 24512 -12035 -28492 2498 26618 2751 -27367 -11928
1787 -11928 21051 13241 -20092 -17397 19815 24101 -13785 -26502 10776 33441 954 -31781
$$ packed form
1702C1102l9853k0587L4721K7014k9242l3108K1105L5435j4803l9311O146M0598
1714A9217M637l8663j3705L5487K3875k8550k8177K1798L1127j5660l3696Q248
1726a4062L3374j341l5142q788L3157J7991k8279k3903K1418K9814j2774k9896
1738a8431O868K9675k64k9129o779K7008J2947k5781k1824J9693K7366j2306l0085
1751b1042M189L0565M210k6048r001K4015J4420k0659k0399J6819K5984j2136
1763A0917l2492K420L3183N978l0362j4371K5410K0757j8562k3335J5192K7604
1775B2339r628l1825L397L5215N014l6547j6457L0990K4120k3867l0118J5439
1787a1928L2979p810l3333K695L7212M286l7886j2717L7278K2665l2487l2735
$$ plain form
1799 -31781 -9880 27221 15132 -24077 -21819 16531 20988 -16517 -26516 12400 31156 -4281
1811 -4281 -31882 -1976 34941 15248 -26954 -20753 20909 23876 -15902 -27184 8743 25108
1823 25108 -8764 -30710 1039 31788 7608 -29462 -15485 26701 26071 -15240 -25812 9782
1835 9782 26784 -4176 -26592 -951 24080 1976 -27996 -12078 24591 19226 -18846 -24949
1847 -24949 11372 29514 620 -23735 -3740 22458 7976 -19730 -10380 17167 12821 -18571
1859 -18571 -22363 9835 25060 -2466 -26773 -6703 23989 14834 -15107 -13935 13146 17030 -8521
1872 -8521 -17698 6302 20370 -3648 -26412 -7655 23457 13917 -20524 -21487 12233 23793 -3149
1885 -3149 -19774 1629 21383 3378 -19998 -5402 22351 11640 -23243 -22170 14875 25103
$$ packed form
1799c1781K1901L7101j2089l9209K258L8350M457l7505r999L8916J8756l5437
1811d281k7601K9906L6917j9693m2202O201M1662K967l9778j1282L5927J6365
1823B5108l3872k1946L1749L0749k4180l7070J3977M2186o30m1311j0572L5594
1835I782J7002l0960k2416K5641K5031k2104k9972J5918L6669n365l8072o103
1847b4949L6321J8142k8894k4355J9995K6198j4482k7706R350K7547m346l1392
1859a8571l792L2198J5225k7526k4307K0070L0692r155k9941J172K7081L884k5551
1872h521r177K4000J4068k4018k2764J8757L1112r540l4441r63L3720J1560k6942
1885c149j6625K1403J9754j8005k3376J4596K7753j0711l4883J073L7045J0228
$$ plain form
1897 25103 -8228 -28303 -1911 24664 7758 -19474 -8094 20773 13451 -18130 -15923 18379
1909 18379 23122 -13074 -29444 1868 27450 4226 -26610 -12713 19484 14509 -15706 -14539
1921 -14539 15863 19650 -11687 -21337 9913 27057 -1051 -27961 -8830 22411 13161 -18693
1933 -18693 -18261 10890 15908 -9457 -16271 9092 20559 -3992 -20971 842 24771 9889 -19662
1946 -19662 -15471 12358 15819 -8687 -17012 2630 12809 -4244 -15403 2009 17845 3994
1958 3994 -16376 -8068 15948 15809 -7727 -15728 2471 13629 -143 -12764 -3280 8577 1159
1971 1159 -11922 -5358 11321 9811 -8532 -12575 6003 16708 3004 -12056 -5404 8938 6609
1984 6609 -6714 -7456 4007 5379 -7694 -10681 4459 13402 -99 -14204 -4021 13723 11063
$$ packed form
1897B5103l3331k0075K6392K6575j6906k7232J1380K8867p322l1581K207L4302
1909A8379M743l6196j6370L1312K5582k3224l0836J3897L2197m975l0215J167
1921a4539L0402L787l1337r650L1250J7144k8108k6910J9131L1241r250l1854
1933a8693M32K9151N018k5365o814K5363J1467k4551j6979K1813K3929j4882k9551
1946a9662M191K7829L461k4506q325J9642J0179j7053j1159J7412J5836j3851
1958C994k0370Q308K4016j39k3536q001J8199J1158j3772j2621R484J1857p418
1971A159j3081O564J6679j510j8343m043J8578J0705j3704j5060O652J4342k329
1984F609j3323p42J1463J372j3073k987J5140Q943j3501j4105J0183J7744k660
$$ plain form
1997 11063 -6303 -9438 4240 9982 -2390 -9745 1180 9091 -2974 -15071 -3327 13764 6985
2010 6985 -12274 -11120 8965 14567 -2094 -11226 1897 12501 433 -12149 -1424 12938 2378
2023 2378 -15785 -9012 11928 11582 -9628 -14780 4465 15512 951 -11943 128 13615 3058
2036 3058 -12883 -3665 14380 6696 -14596 -13357 8535 13935 -5427 -15911 -16 14146 2383
2049 2383 -11493 -1055 14256 5178 -12540 -6457 12729 11191 -9737 -15038 3042 13168 -1386
2062 -1386 -14540 -3192 11378 3793 -10743 -3640 12233 8304 -8600 -8709 8427 12686 -3500
2075 -3500 -13557 -1770 10923 2730 -11418 -6564 7246 4839 -7251 -6365 7460 9924 -2976
2088 -2976 -9312 1863 12177 4247 -9566 -6606 6568 6491 -5860 -8792 1996 6403 -2615 -8587
$$ packed form
1997A1063j7366l135J3678N742j2372p355J0925P911j2065j2097J1744J7091o779
2010F985j9259J154K0085N602j6661r132J3123J0604j2068j2582J0725J4362j0560
2023B378j8163O773K0940l46k1210n152J9245J1047j4561j2894J2071J3487j0557
2036C058j5941R218J8045p684k1292J239K1892N400j9362j0484J5895J4162j1763
2049B383j3876J0438J5311r078j7718O083J9186j538k0928n301J8080J0126j4554
2062a386j3154J1348J4570p585j4536P103J5873l929j6904j09J7136M259j6186
2075c500j0057J1787J2693q193j4148M854J3810k407j2090Q86J3825K464j2900
2088b976o336J1175J0314p930j3813K960J3174p7j2351k932J0788M407r018n972
$$ plain form
2102 -8587 105 10051 4188 -7991 -5314 8695 10431 -3542 -9948 1352 9119 -115 -9973 -4070
2116 -4070 7266 3575 -8854 -7676 7278 10455 -4242 -10811 3386 13975 2636 -11173 -4175
2129 -4175 10470 6315 -9414 -9828 5933 9129 -6716 -13439 2979 14131 159 -13676 -2583
2142 -2583 14517 8008 -9901 -8432 9405 11274 -6695 -13291 3310 12978 -3189 -16221 -2410
2155 -2410 14221 4712 -13213 -7586 11914 11741 -7045 -11303 6435 13909 -2564 -13955 -182
2168 -182 13373 1205 -14776 -6697 10983 7684 -9929 -10785 7072 12872 -2556 -11218 2268
2181 2268 13466 2146 -11492 -3330 10721 5291 -10141 -9471 5756 8962 -4748 -11241 1222
2194 1222 10784 2082 -9020 -2187 10174 6167 -6340 -6032 5400 7881 -3627 -9836 -632 7964
$$ packed form
2102h587Q692R946n863j2179K677J4009J736j3973o406J1300P767r234r858N903
2116d070J1336l691j2429J178J4954L177j4697o569J4197J0589j1339j3809O998
2129d175J4645m155j5729m14J5761L196j5845o723J6418J1152j3972j3835J1093
2142b583J7100o509j7909J469J7837J869j7969o596J6601R668j6167j3032J3811
2155b410J6631r509j7925N627J9500j73j8786m258J7738P474j6473j1391J3773
2168a82J3555j2168j5981Q079J7680l299j7613q56J7857N800j5428q662J3486
2181B268J1198j1320j3638Q162J4051n430j5432O70J5227L206j3710o493J2463
2194A222R562q702j1102O833J2361m007j2507L08J1432K481j1508o209R204Q596
$$ plain form
2208 7964 1040 -8998 -4980 6587 5892 -4550 -5669 4282 8550 -50 -6889 -381 8060 3358
2222 3358 -7703 -6156 5173 5870 -5156 -9110 1018 8013 446 -7932 -1962 8912 5553 -6044
2236 -6044 -5293 6700 8830 -4057 -10163 1078 9035 -37 -10764 -4257 8183 4715 -8225 -6884
2250 -6884 7405 9354 -4406 -9025 4012 11743 63 -10775 -2424 9947 3848 -10507 -7961
2263 -7961 6890 7346 -6849 -9469 4764 10847 -1666 -9894 867 12066 3823 -9671 -4798
2276 -4798 9032 6906 -7892 -9205 4805 7877 -4711 -10342 1589 10086 586 -9355 -2139 10205
2290 10205 6225 -6745 -5680 6542 7411 -5002 -8387 2227 7286 -2199 -9418 -1398 7516 2447
2304 2447 -6864 -4030 6440 7104 -3106 -5540 3644 6634 -1102 -6438 -270 5092 358 -6676 -4293
$$ packed form
2208G964o924j0038M018J1567o95j0442j119R951M268q600o839O508Q441m702
2222C358j1061J547J1329O97j1026l954J0128O995p567q378N970J0874l359j1597
2236f044P51J1993K130j2887o106J1241P957r072j0727O507J2440l468j2940J341
2250f884J4289J949j3760m619J3037P731j1680j0838Q351J2371o099j4355K546
2263g961J4851M56j4195k620J4233O083j2513q228J0761J1199q243j3494M873
2276d798J3830k126j4798j313J4010L072j2588n631J1931Q497r500r941P216J2344
2290A0205l980j2970J065J2222Q69j2413l385J0614N059r485p219Q020Q914n069
2304B447r311K834J0470O64j0210k434R184K990p736n336O168N362m734p034K383
$$ plain form
2319 -4293 3816 4312 -3639 -5677 2081 6315 788 -4208 169 5281 2528 -3542 -2599 3118 3908 -3285
2335 -3285 -6238 -126 5049 500 -5846 -2608 4608 3911 -2419 -2806 3268 5424 -1031 -5198 556
2350 556 6403 929 -7455 -4199 4834 3797 -5062 -6158 2313 6083 -889 -5823 1280 8138 1999
2365 1999 -7035 -2421 7916 4947 -7167 -7442 3751 6750 -3423 -8752 304 7494 693 -7928
2379 -7928 -1240 9432 4572 -7525 -5124 8028 8275 -4633 -9107 1715 7887 -1223 -9244 -1932
2393 -1932 7596 1772 -8782 -3721 8838 6747 -6334 -7120 5924 9578 -1356 -8432 -357 7260
2407 7260 799 -8570 -3508 6324 3164 -7653 -5780 6449 7780 -3011 -7491 1747 8659 2242
2421 2242 -6333 -2517 5594 2974 -6021 -4419 4088 4139 -4800 -7026 1661 7107 1306 -5959 -2185
$$ packed form
2319d293Q109M96p951k038P758M234n527m996M377N112k753o070R43N717P90p193
2335c285k953O112N175m549o346L238P216o97o330l87O074K156o455m167N754
2350E56N847n474q384L256R033j037q859j096Q471L770o972m934P103O858o139
2365A999r034M614J0337k969j2114k75J1193K999j0173n329R056P190o801q621
2379g928O688J0672m860j2097K401J3152K47j2908m474J0822O172r110q021P312
2393a932R528n824j0554N061J2559k091j3081p86J3044L654j0934p076Q075P617
2407G260o461r369N062R832l160j0817J873J2229J331j0791m480R238O912o417
2421B242q575L816Q111k620q995J602Q507N1q939k226Q687N446n801p265L774
$$ plain form
2436 -2185 5899 5256 -2224 -3779 2643 4139 -2043 -4820 564 4393 -368 -6766 -3204 4402 4942
2451 4942 -2445 -5591 1560 6465 1433 -3913 -448 4489 1809 -4253 -3325 3642 4018 -4238 -7552
2466 -7552 358 6962 1022 -6691 -2686 5932 4908 -3092 -3463 4054 5572 -2790 -6325 1953 7409
2481 7409 -1085 -9549 -3610 7354 4554 -5990 -6006 4016 6605 -1860 -5303 3196 7684 -1061 -8036
2496 -8036 -326 8995 2408 -8911 -6655 4992 6296 -4222 -7338 2230 6640 -884 -5971 1624
2510 1624 8482 1475 -7835 -2633 7795 5598 -5869 -7432 2659 5945 -1920 -6985 -39 5568
2524 5568 125 -6006 -380 7762 3513 -5448 -4248 4621 6319 -2078 -6433 -771 4565 111 -4948
2539 -4948 -1587 3686 988 -4313 -2188 4595 4869 -1858 -4565 1196 5554 2025 -3773 -2650 1989
$$ packed form
2436b185Q084o43p480j555O422J496o182k777N384L829m761o398L562P606N40
2451D942p387l146P151M905n032n346L465M937k680o062R28O967L76q256l314
2466g552P910O604n940p713M005Q618j024q000l71P517J518q362l535Q278N456
2481G409q494q464N939J0964k800j0544j6J0022K589q465l443Q499M488q745o975
2496h036P710R321o587j1319K256J1647J304j0518l116R568M410p524n087P595
2510A624O858p007r310N202J0428k197j1467j563J0091L286p865n065O946N607
2524E568n443o131N626Q142m249q961J200Q869J698q397m355N662N336m454n059
2539d948L361N273k698n301K125O783K74o727k707N761M358l529n798J123M639
$$ plain form
2554 1989 1671 -2513 -2748 1155 1756 -2139 -3529 589 4816 1963 -3257 -2419 3232 5055 -399 -3528
2570 -3528 -573 2218 38 -3400 -1522 2217 812 -4429 -2980 3299 5111 -1417 -4953 408 6060
2585 6060 2485 -3527 -2164 2981 2511 -3647 -3551 2459 3444 -3748 -6047 1171 6345 548 -5680 -1635
2601 -1635 5350 3822 -2761 -3050 3225 3875 -3345 -4844 2258 4978 -2440 -7211 -762 5989 2242
2616 2242 -5190 -3212 4126 4258 -2106 -2898 3343 4532 -2528 -4862 1571 5214 -844 -6414 -2404
2631 -2404 3971 2553 -3605 -3254 2613 3797 -1720 -2716 2877 4863 -1334 -4467 722 4444 675
2646 675 -4831 -3197 2044 2236 -2222 -3044 1073 2638 -793 -2345 1752 3990 149 -3008 -642 2797
2662 2797 2022 -1731 -2982 -299 1571 -530 -2377 -193 1391 -26 -1674 -85 2891 1848 -759
$$ packed form
2554A989l18m184k35L903O01l895j390M118M227k853n220Q38N651J823n454l129
2570c528K955K791k180l438J878L739j405n241J449O279J812o528l536N361N652
2585F060l575o012J363N145m70o158R6O010R85p192k299P218N174n797o228M045
2601a635O985j528o583k89O275O50p220j499P102K720p418m771O449O751l747
2616B242p432J978P338J32o364p92O241J189p060k334O433L643o058n570M010
2631b404O375j418o158L51N867J184n517r96N593J986o197l133N189L722l769
2646F75n506J634N241J92m458q22M117J565l431j552M097K238l841l157K366L439
2662B797p75l753j251K683J870k101j847K184J584j417j648J589K976j043k607
$$ plain form
2677 -759 -1673 805 2759 746 -2415 -2018 771 749 -1855 -2104 350 1282 -702 -1773 564 3219 1484
2694 1484 -2375 -1359 3054 2802 -1519 -3126 611 2304 -855 -3355 -897 2384 362 -3371 -1279
2709 -1279 3846 3247 -2240 -2942 2869 4483 -740 -3729 122 3246 -59 -4533 -1797 3382 1540
2724 1540 -4048 -3286 3452 4332 -2001 -3809 1797 5410 180 -3947 6 4166 706 -4458 -2329
2739 -2329 3362 2379 -4230 -4498 2427 4233 -1559 -4238 1083 4890 1002 -3489 -608 4271 2044
2754 2044 -3689 -2985 2560 2904 -3026 -4365 812 3513 -497 -3527 -95 3642 1617 -2216 -1206
2769 -1206 2997 2600 -2029 -2740 1137 2510 -1246 -3381 -873 2138 452 -2275 -1331 2068 2106 -888
2785 -888 -1463 1277 2332 238 -1865 -499 1635 794 -1889 -2186 359 1390 -978 -2491 -264 2092
$$ packed form
2677g59r14K478J954k013l161L97K789k2k604k49K454R32j984j071K337K655j735
2694A484l859J016M413k52m321j607L737J693l159k500K458L281k022l733K092
2709a279N125n99n487p02N811J614n223k989L851L124l305m474K736N179j842
2724A540n588P62O738Q80o333j808N606L613n230m127L953M160l460n164K129
2739b329N691r83o609k68O925J806n792k679N321L807l888m491K881M879k227
2754B044n733P04N545L44n930j339N177K701m010l030L432L737k025l833J010
2769a206M203l97m629p11L877J373l756k135K508L011j686k727R44L399L8k994
2785h88n75K740J055k094k103J366K134q41k683k97K545J031k368j513K227K356
$$ plain form
2801 2092 1068 -1360 -575 2063 2053 -409 -1836 509 2507 -108 -3015 -1554 1994 1128 -2550 -2372
2817 -2372 1502 2451 -883 -2660 937 3848 897 -2876 -593 3845 1687 -3297 -2818 1920 2540 -2357
2833 -2357 -3916 783 3575 -173 -3998 -365 4283 1671 -3136 -1535 3803 2868 -2486 -3422 1706
2848 1706 3169 -1843 -4569 -251 3659 252 -4034 -1031 4250 2285 -2988 -1816 3222 3454 -1529
2863 -1529 -3345 1219 3276 -859 -4002 -984 2996 423 -3526 -1483 2896 2411 -1723 -2028 2052
2878 2052 3109 -674 -2424 389 2852 19 -2997 -1138 1897 484 -2480 -1959 1323 1764 -775
2893 -775 -1473 698 2465 652 -1366 16 1693 733 -1328 -1459 236 765 -824 -2121 -470 1119
2909 1119 590 -1290 -789 1363 1756 7 -822 604 1493 285 -1399 -948 682 659 -1484 -2400 165
$$ packed form
2801B092j024k428P85K638j0k462j427K345J998k615k907J461L548q66l678J78
2817b372L874R49l334j777L597K911k951l773K283M438k158m984M79M738O20m897
2833b357j559M699K792l748l825L633M648k612m807J601N338r35n354r36N128
2848A706J463n012k726M318L910l407m286L003N281j965n273J172N038K32m983
2863a529j816M564K057m135l143L018L980k573l949K043M379m85m134l05M080
2878B052J057l783j750K813K463k833l016J859L035j413k964N21L282M41k539
2893g75o98K171J767j813k018J382J677r60k061j31J695N29j589j297J651J589
2909A119n29j880N01K152L93j749q29J426Q89j208j684M51J630k3k143r16K565
$$ plain form
2926 165 1670 -596 -1945 -32 2292 870 -1291 -826 2040 2129 -1170 -2172 1074 2197 -1338 -3465
2942 -3465 -523 2360 171 -2700 -1151 2239 2299 -1571 -1716 2254 3279 -898 -3024 1031 3399 -264
2958 -264 -3925 -919 2582 923 -3058 -2414 2478 2180 -1983 -2441 2107 3837 -552 -3382 609 3535
2974 3535 537 -3373 -1530 2367 1098 -2893 -2783 1831 2820 -1684 -3123 1484 3921 105 -2832
2989 -2832 -58 3596 1569 -2563 -1815 1634 1354 -2148 -2979 894 2219 -1179 -3091 212 3031 1186
3005 1186 -2048 -708 2084 2117 -779 -1642 709 1469 -986 -2335 -356 1719 249 -2145 -1162 1302
3021 1302 1595 -316 -1354 411 2260 934 -1188 -487 1526 756 -1753 -1556 546 1204 -1012 -2495
3037 -2495 -840 2059 1584 -1569 -1397 1581 2440 -281 -1787 589 2272 -122 -2551 -962 2176 1003
$$ packed form
2926A65J505k266j349J913K324j422k161M65K866Q9l299j002L246J123l535k127
2942c465K942K883k189k871J549L390O0l870j45L970J025m177k126M055K368l663
2958b64l661L006L501j659l981O44M892k98m163m58M548J730m389k830L991K926
2974C535k998l910J843L897j269l991J10M614R89m504j439M607K437l816k937
2989b832K774L654k027m132P48L449k80l502q31L873J325l398j912L303K819j845
3005A186l234J340K792L3k896q63K351P60k455j349J979K075j470k394R83K464
3021A302K93j911j038J765J849j326k122P01K013p70k509J97K102O58k216j483
3037b495J655K899m75l153J72K978Q59k721j506K376J683k394k429J589L138j173
$$ plain form
3053 1003 -3035 -2805 1694 2835 -1210 -2918 815 3412 526 -2212 -256 3212 1265 -2831 -2469
3068 -2469 2371 2444 -2599 -3964 630 3284 -258 -3486 -477 3386 1224 -2548 -861 3419 2349
3083 2349 -2600 -2929 1825 3491 -1307 -4174 -680 3210 -6 -3101 -1271 2739 1776 -2072 -1158 2823
3099 2823 3230 -1275 -3093 952 3237 -16 -2980 -1320 1703 486 -1967 -1251 1529 1401 -1327 -1689
3115 -1689 1692 2960 59 -1947 -137 2152 1169 -1402 -1610 92 726 -1107 -1285 299 1038 -161
3131 -161 -1368 154 1667 1393 -587 -1247 650 1554 266 -1142 -931 607 163 -1126 -963 284 696
3148 696 -380 -1285 252 2152 763 -1456 -809 1788 1890 -853 -1454 305 983 -686 -2152 -217
3164 -217 1538 47 -2450 -1115 2488 1737 -1314 -1698 1567 2549 -168 -1601 27 1713 -318 -2517
$$ packed form
3053A003m038K30M499J141m045j708L733K597k886k738J956L468j947m096L62
3068b469M840P3n043j365M594K654l542l228L009L863k162l772J687M280j070
3083B349m949l29M754J666m798k867L494L890l216l095J830M010r63l848R14L981
3099B823M07m505j818M045K285l253k964J660L023j217k453P16K780j28k728l62
3115a689L381J268k901k006J810K289r83k571k08J702O34j833j78J584P39j199
3131a61j207J522J513k74j980o60J897R04j288j408K11J538m44j289J63J247M12
3148F96j076r05J537J900j389k219O47K597J02k743o01J759O78j669j466J935
3164b17J755j491k497J335L603p51l051l84L265R82k717j433J628J686k031k199
$$ plain form
3180 -2517 -907 2222 587 -2692 -1868 2063 2133 -966 -1914 1104 2508 457 -1610 282 2207 230
3196 230 -2455 -1087 2176 966 -2596 -2122 1325 2226 -493 -1706 695 1988 362 -1444 150 2281
3212 2281 485 -2219 -1025 1912 1052 -1878 -2010 514 1095 -481 -1240 108 1661 199 -775 267
3228 267 1629 571 -1182 -736 928 873 -1142 -1545 -411 309 -86 -965 20 830 158 -422 313 1065
3246 1065 674 -457 -416 295 564 -25 -593 -687 -576 43 -25 -399 96 289 -31 -139 434 1168 1004 -148
3266 -148 -622 53 1256 362 -1257 -1178 371 441 -1064 -673 630 603 -467 -593 810 1787 211 -1456
3284 -1456 34 1800 553 -1677 -1246 558 723 -1108 -1395 521 1244 -515 -1964 509 2211 718
3300 718 -1587 -129 2147 937 -1473 -1199 912 1060 -1256 -2109 528 1406 -535 -2447 254 2247
$$ packed form
3180b517J610L129j635l279Q24L931P0l099r48L018J404k051k067J892J925j977
3196B30k685J368L263j210l562M74L447R01k719j213K401J293j626j806J594K131
3212B281j796k704J194K937q60k930j32K524N81j576p59J348J553j462r74J042
3228B67J362j058j753M46J664n5k015m03J134P20l95q79R85Q10o72n80P35P52
3246A065l91j131M1P11K69n89n68r4J11O19o8l74M95J93l20j08N73P34j64j152
3266a48m74O75J203q94j619P9J549P0j505L91J303k7j070j26J403R77j576j667
3284a456J490J766j247k230M31J804J65j831k87J916P23j759j449K473J702j493
3300G18k305J458K276j210k410K74K111J48k316q53K637Q78j941j912K701J993
$$ plain form
3316 2247 459 -1634 -339 2259 1251 -1366 -1178 1049 1281 -1384 -2095 279 1473 -757 -2293 -292
3332 -292 1823 560 -1539 -443 1579 1241 -904 -926 1111 1447 -835 -1871 44 1487 -251 -1899
3348 -1899 -520 1059 454 -681 -310 1064 1123 -174 -250 660 1065 -251 -1220 -338 593 -9 -1261 -889
3366 -889 -262 212 -272 -568 384 566 628 -153 -145 510 778 50 -356 -248 496 60 -718 -1298 134 701 -142
3387 -142 -788 317 1329 417 -515 197 1233 873 -964 -1059 796 987 -742 -1739 -312 1076 -280
3404 -280 -1643 -355 1299 928 -803 -634 1340 1534 -673 -1296 678 1885 -309 -2305 -395 1537
3420 1537 38 -1742 -1162 1387 961 -1513 -1170 1536 1746 -507 -1495 708 1812 10 -2006 -585
3436 -585 1356 299 -2093 -1397 1357 1036 -968 -1504 1113 1928 -196 -1209 461 1736 383 -1391
$$ packed form
3316B247j788k093J295K598j008k617J88K227K32k665p11K374J194k230j536K001
3332b92K115j263k099J096K022l38k145k2K037L36k282j036J915J443j738j648
3348a899J379J579o05j135L71J374N9j297p6R10M05j316r69Q82R31o02j252L72
3366h89O27M74m84k96R52J82O2p81QO55K68p28m06J08P44m36p78n80J432N67q43
3387a42o46J105J012r12r32P12J036l60j837r5J855J91j729r97J427J388j356
3404b80j363J288J654l71j731J69J974J94k207o23J974J207k194j996J910J932
3420A537j499j780N80K549m26k474L43K706K10k253r88K203J104j802k016J421
3436e85J941j057k392O96K754l21k004n36K617Q15k124j013J670J275j353j774
$$ plain form
3452 -1391 -564 1029 221 -1435 -1278 784 681 -682 -1306 428 1223 13 -784 216 1333 553 -637
3469 -637 -209 831 659 -941 -946 -94 299 -532 -632 56 601 431 85 -89 587 662 374 -247 156 374
3489 374 -62 -517 -598 -116 -193 -177 -712 -492 663 444 -295 -333 721 1071 81 -410 361 889 222 -824
3509 -824 -743 609 413 -1165 -1062 544 1053 -423 -726 555 1547 59 -1062 -38 1306 684 -1393
3526 -1393 -970 969 626 -1429 -1618 405 1011 -851 -1302 416 1636 388 -1172 177 1807 798
3542 798 -1416 -979 1202 1145 -1133 -1696 150 1072 -532 -1517 144 1626 363 -1268 -79 1784 1092
3559 1092 -1051 -707 1108 1051 -1049 -1383 331 891 -744 -1401 -166 1233 155 -1154 -99 1495
3575 1495 1059 -622 -372 1052 942 -377 -688 109 259 -422 -1270 -518 620 261 -764 -523 560 539
$$ packed form
3452a391Q27J593q08j656J57K062j03j363o24J734P95j210p97J000J117p80j190
3469f37M28J040j72j600nQ52L93q31j00O88N45j70l46j74O76P5k88o21M03K18
3489C74m36m55q1M82p7J6n35K20J155k19p39l8J054L50r90m91P71N28o67j046
3509h24Q1J352j96j578J03J606N09j476l03J281R92j488j121J024J344o22k077
3526a393M23J939l43k055j89K023O06j862m51J718J220j248j560J349J630j009
3542G98k214M37K181n7k278n63J846R22j604r85J661J482j263j631J189J863o92
3559A092k143L44J815n7k100l34J714N60j635o57J235J399j078j309J055J594
3575A495m36j681K50J424j10j319l11P97J50o81q48P52J138l59j025K41J083k1
$$ plain form
3593 539 112 -345 141 438 288 -156 -461 171 -107 -689 -618 -212 386 -86 -443 -325 274 645 338 -250
3613 -250 221 779 385 -297 -391 390 85 -580 -776 20 595 -258 -962 -36 1250 600 -529 -293 906
3632 906 910 -778 -655 744 1074 -747 -1549 -172 1322 -1 -1670 -594 1172 914 -918 -763 1318
3649 1318 1014 -721 -788 1052 1667 -201 -1995 -284 1258 91 -1707 -834 1030 935 -780 -482 1038
3666 1038 1534 -604 -889 769 1884 68 -1340 -553 1421 244 -1479 -1075 888 637 -774 -717 887
3683 887 1246 29 -1173 614 1448 375 -925 -362 792 535 -1064 -966 143 278 -823 -724 37 940
3701 940 216 -851 25 990 858 -538 -316 138 283 -183 -554 -260 -305 -414 -505 -11 216 166 -151 -311
3721 -311 465 704 766 -58 -348 84 624 -83 -699 -334 27 8 -818 -133 565 388 -620 -812 595 1231
$$ packed form
3593E39m27m57M86K97j50m44l05O32k78n82P1M06N98m72l57J18N99L71l07n88
3613b50M71N58l94o82r4P81l05o65j96P96N75q53p04R26J286o50j129K36J199
3632I06Mj688J23J399L30j821q02J377J494j323j669J076J766k58j832J55K081
3649A318l04j735o7J840O15j868j794J711J542j167j798Q73J864r5j715K98J520
3666A038M96k138k85J658J115j816j408P87J974j177j723M04J963k51j411N7J604
3683H87L59j217j202J787Q34j073j300N63J154k57j599R8J109J35j101R9P61R03
3701I40p24j067Q76R65j32j396K22M54J45m66l71K94m5j09r1M94K27n0l17j60
3721c11P76K39O2q24k90M32N40p07o16L65L61j9q26O85O98j77j008j92J407O36
$$ plain form
3741 1231 371 -837 55 911 257 -709 -576 527 18 -937 -1035 552 785 -693 -1005 350 1790 301
3759 301 -856 -223 1191 425 -1014 -516 863 566 -1023 -1400 493 1343 -604 -1425 4 1525 599
$$ packed form
3741A231q60j208Q92Q56o54r66J33J103n09r55r8J587K33j478l12J355J440j489
3759C01j157O33J414p66j439M98J379k97j589l77J893Q50j947q21J429J521r26
$$ [...]
16383a33
##END NTUPLES=NMR FID
##END=
