##TITLE=abcd
##JCAMPDX= 6.0         $$ Bruker NMR JCAMP-DX V2.0
##DATA TYPE= NMR SPECTRUM
##DATA CLASS= NTUPLES
##ORIGIN= UXNMR, Bruker Analytische Messtechnik GmbH
##OWNER= root
$$ XWIN-NMR		Version 3.5
$$ Tue Jul 28 19:28:31 2026 Russian Standard Time (UT+4h)  servis@DPX200
##.OBSERVE FREQUENCY= 200.131235884673
##.OBSERVE NUCLEUS= ^1H
##.ACQUISITION MODE= SIMULTANEOUS
##.ACQUISITION SCHEME= undefined
##.AVERAGES= 32
##.DIGITISER RES= 18
##SPECTROMETER/DATA SYSTEM= spect
##.PULSE SEQUENCE= zg
##.SOLVENT NAME= DMSO
##.SHIFT REFERENCE= (INTERNAL, DMSO, 0, 16.4885)
##AUDIT TRAIL= $$ (NUMBER, WHEN, WHO, WHERE, WHAT)
$$ ##TITLE= Audit trail, XWIN-NMR		Version 3.5
$$ ##JCAMPDX= 5.01
$$ ##ORIGIN= Bruker BioSpin GmbH
$$ ##OWNER= servis
$$ F:\spectra/data/av/nmr/H1/1/pdata/1/auditp.txt
$$ ##AUDIT TRAIL=  $$ (NUMBER, WHEN, WHO, WHERE, WHAT)
(   1,<2026-07-28 19:28:04.59 +0400>,<servis>,<DPX200>,
      <created by zg, POWCHK disabled, PULCHK disabled
       configuration hash MD5:
       00 E9 B6 7A A2 85 ED C7 34 08 36 98 17 FE 4E 26
       data hash MD5: 32K
       92 F4 05 F1 B9 02 E8 4C 0F 74 FB 9C B3 B2 8F 5D>)
(   2,<2026-07-28 19:28:06.21 +0400>,<servis>,<DPX200>,
      <Start of raw data processing
       efp BC_mod = 2 LB = 0.05 FT_mod = 6 PKNL = 1 PHC0 = -415.5518 PHC1 = 3.101563 SI = 16K 
       data hash MD5: 16K
       09 E0 2D 05 C0 1C 2B 24 D6 07 AD 21 68 BF 1A 49>)
$$ ##END=
$$ 
$$ hash MD5
$$ ED 48 29 10 85 73 5B 3C 16 7A 76 B8 DD FF AA 0A
##$RELAX= 
##$RELAX= 
##$RELAX= 
##$RELAX= 
##$RELAX= 
##$RELAX= 
##$RELAX= 
##$RELAX= 
$$ Bruker specific parameters
$$ --------------------------
##$DU= <F:\spectra>
##$EXPNO= 1
##$NAME= <H1>
##$PROCNO= 1
##$TYPE= <nmr>
##$USER= <av>
##$AMP= (0..31)
100 100 100 100 100 100 100 100 100 100 100 100 100 100 100 100 100 100 
100 100 100 100 100 100 100 100 100 100 100 100 100 100 
##$AQSEQ= 0
##$AQ_mod= 1
##$AUNM= <au_zg>
##$AUTOPOS= <>
##$BF1= 200.13
##$BF2= 200.13
##$BF3= 200.13
##$BF4= 200.13
##$BF5= 500.13
##$BF6= 500.13
##$BF7= 500.13
##$BF8= 500.13
##$BYTORDA= 1
##$CFDGTYP= 0
##$CFRGTYP= 5
##$CHEMSTR= <none>
##$CNST= (0..31)
1 1 145 1 1 1 1 1 1 1 1 1 1 1 1 1 1 1 1 1 1 1 1 1 1 1 1 1 1 1 1 1 
##$CPDPRG= <>
##$CPDPRG1= <>
##$CPDPRG2= <>
##$CPDPRG3= <>
##$CPDPRG4= <mlev>
##$CPDPRG5= <mlev>
##$CPDPRG6= <mlev>
##$CPDPRG7= <mlev>
##$CPDPRG8= <mlev>
##$CPDPRGB= <>
##$CPDPRGT= <>
##$D= (0..31)
0 2 0 0 0 0 0 0 0 0.06 0 0 0 0 0 0 0.0002 0 0 0 0 0 0 0 0 0 0 0 0 0 0 
0 
##$DATE= 1785252484
##$DBL= (0..7)
120 120 120 120 120 120 120 120 
##$DBP= (0..7)
150 150 150 150 150 150 150 150 
##$DBP07= 0
##$DBPNAM0= <>
##$DBPNAM1= <>
##$DBPNAM2= <>
##$DBPNAM3= <>
##$DBPNAM4= <>
##$DBPNAM5= <>
##$DBPNAM6= <>
##$DBPNAM7= <>
##$DBPOAL= (0..7)
0.5 0.5 0.5 0.5 0.5 0.5 0.5 0.5 
##$DBPOFFS= (0..7)
0 0 0 0 0 0 0 0 
##$DE= 6
##$DECBNUC= <off>
##$DECIM= 32
##$DECNUC= <off>
##$DECSTAT= 4
##$DIGMOD= 1
##$DIGTYP= 9
##$DL= (0..7)
0 120 120 120 120 120 120 120 
##$DP= (0..7)
150 150 150 150 150 150 150 150 
##$DP07= 0
##$DPNAME0= <>
$$ [...]
##$SUBNAM4= <"">
##$SUBNAM5= <"">
##$SUBNAM6= <"">
##$SUBNAM7= <"">
##$SUBNAM8= <"">
##$SUBNAM9= <"">
##$SW= 20.6817932712277
##$SWIBOX= (0..15)
0 0 3 0 0 0 0 0 0 0 0 0 0 0 0 0 
##$SW_h= 4139.07284768212
##$TD= 32768
##$TD0= 1
##$TE= 0
##$TE2= 300
##$TE3= 300
##$TEG= 300
##$TL= (0..7)
0 120 120 120 120 120 120 120 
##$TP= (0..7)
150 150 150 150 150 150 150 150 
##$TP07= 0
##$TPNAME0= <>
##$TPNAME1= <>
##$TPNAME2= <>
##$TPNAME3= <>
##$TPNAME4= <>
##$TPNAME5= <>
##$TPNAME6= <>
##$TPNAME7= <>
##$TPOAL= (0..7)
0.5 0.5 0.5 0.5 0.5 0.5 0.5 0.5 
##$TPOFFS= (0..7)
0 0 0 0 0 0 0 0 
##$TUNHIN= 0
##$TUNHOUT= 0
##$TUNXOUT= 0
##$USERA1= <user>
##$USERA2= <user>
##$USERA3= <user>
##$USERA4= <user>
##$USERA5= <user>
##$V9= 5
##$VALIST= <valist>
##$VCLIST= <CCCCCCCCCCCCCCC>
##$VD= 0
##$VDLIST= <DDDDDDDDDDDDDDD>
##$VPLIST= <PPPPPPPPPPPPPPP>
##$VTLIST= <TTTTTTTTTTTTTTT>
##$WBST= 1024
##$WBSW= 30
##$XGAIN= (0..3)
0 0 0 0 
##$XL= 0
##$YL= 0
##$YMAX_a= 164135
##$YMIN_a= -414389
##$ZGOPTNS= <>
##$ZL1= 120
##$ZL2= 120
##$ZL3= 120
##$ZL4= 120
##$ABSF1= 0
##$ABSF2= 0
##$ABSG= 0
##$ABSL= 0
##$ALPHA= 0
##$AQORDER= 0
##$ASSFAC= 0
##$ASSFACI= 0
##$ASSFACX= 0
##$ASSWID= 0
##$AUNMP= <proc_1d>
##$AZFE= 0.1
##$AZFW= 0.1
##$BCFW= 0
##$BC_mod= 2
##$BYTORDP= 0
##$COROFFS= 0
##$CY= 18.4799938201904
##$DATMOD= 1
##$DC= 0
##$DFILT= <>
##$DTYPP= 0
##$F1P= 9.9274215381318
##$F2P= -0.165520771350173
##$FCOR= 1
##$FTSIZE= 16384
##$FT_mod= 6
##$GAMMA= 0
##$GB= 0
##$INTBC= 1
##$INTSCL= 4.127829e-11
##$ISEN= 128
##$LB= 0.05
##$LEV0= 0
##$LPBIN= 0
##$MAXI= 10000
##$MC2= 0
##$MEAN= 0
##$ME_mod= 0
##$MI= 50
##$NCOEF= 0
##$NC_proc= -9
##$NLEV= 6
##$NOISF1= 3.799351
##$NOISF2= 2.8
##$NSP= 0
##$NTH_PI= 0
##$NZP= 0
##$OFFSET= 16.48848
##$PC= 4
##$PHC0= -415.5518
##$PHC1= 3.101563
##$PH_mod= 1
##$PKNL= yes
##$PPARMOD= 0
##$PSCAL= 4
##$PSIGN= 0
##$REVERSE= no
##$SF= 200.130005582386
##$SI= 16384
##$SIGF1= 3
##$SIGF2= 2
##$SINO= 400
##$SIOLD= 16384
##$SREGLST= <1H.CDCl3>
##$SSB= 0
##$STSI= 16384
##$STSR= 0
##$SW_p= 4139.07284768211
##$SYMM= 0
##$S_DEV= 0
##$TDeff= 32768
##$TDoff= 0
##$TI= <>
##$TILT= no
##$TM1= 0
##$TM2= 0
##$TOPLEV= 0
##$USERP1= <user>
##$USERP2= <user>
##$USERP3= <user>
##$USERP4= <user>
##$USERP5= <user>
##$WDW= 1
##$XDIM= 16384
##$YMAX_p= 534129273
##$YMIN_p= -7070042
$$ End of Bruker specific parameters
$$ ---------------------------------
##NTUPLES= NMR SPECTRUM
##VAR_NAME=  FREQUENCY,     SPECTRUM/REAL,   SPECTRUM/IMAG
##SYMBOL=    X,             R,               I
##VAR_TYPE=  INDEPENDENT,   DEPENDENT,       DEPENDENT
##VAR_FORM=  AFFN,          ASDF,            ASDF
##VAR_DIM=   16384,         16384,           16384
##UNITS=     HZ,            ARBITRARY UNITS, ARBITRARY UNITS
##FACTOR=    0.252644378177508, 1,           1
##FIRST=     3299.83951724647, 0,            0
##LAST=      -839.233330435636, 0,           0
##MIN=       -839.233330435636, -7070042,    0
##MAX=       3299.83951724647, 534129273,    0
$$ Real data points
##PAGE= N=1
##DATA TABLE= (X++(R..R)), XYDATA
$$ [...]
11262 -806346 -1760004 -2265692 -1988500 -2583766 -1874871 95355 -1349063 -2661328 -3104628
11253 -3104628 579774 -178056 -2034253 -524903 -1439112 326553 -1971678 -1942054 -2285087
11244 -2285087 -1051044 -2070537 -700399 69347 -651180 -2816833 -2397338 -574239 881952
11235 881952 -1870316 -3080581 -1182324 -382725 -3355126 -2642200 -2168686 -2221862 -2552240
11226 -2552240 -3134855 -1873675 -698603 -1378044 -3760343 -201356 -2903971 -2913956 -1709495
11217 -1709495 -1273038 -3260733 -880331 -2124518 468874 -343885 -2292040 -1654266 -921614
11208 -921614 -2469602 -2532843 -341341 612433 -2934592 660222 -65026 776727 -3097106
11199 -3097106 -240838 -2231324 -2395165 -4299490 -864179 -3217867 456273 -898352
11191 -898352 -2612899 -2310549 -1086377 1196606 -3137291 -1697496 464723 -474869 -1996775
11182 -1996775 -1838627 -1594180 -1140772 -4941952 -755433 -585384 -2958114 -3083345 -1984569
11173 -1984569 -1779777 -243639 -2650447 -3081780 -1505649 -2195291 -874747 328614 -35167
11164 -35167 -2830674 -2106261 -1525174 -717892 -1995411 -1575954 -1216272 1100076 -2161691
11155 -2161691 -1897781 -1945697 86369 887977 -2320848 56348 -1763857 -411225 -2488936
11146 -2488936 -3086389 -386689 -3382404 -1320796 -3330816 -2616318 -1507251 -817448 -2377149
11137 -2377149 549712 -708222 443822 -1336648 -1647228 -819025 -2548926 -757447
11129 -757447 -748206 -132037 -2394911 -2145770 -844281 -1601912 -2908359 -1945191 -1315697
11120 -1315697 1181359 -503768 -30965 -960129 -1115170 -1909521 -2027255 767614 -2762912
11111 -2762912 -1604746 -1958655 1735334 -566290 -2274806 -960444 -907450 -1724758 -2095402
11102 -2095402 -873177 -1688574 -3115508 -162376 1544150 -782499 -2510016 -257570
11094 -257570 -1224385 -824339 -2379484 -2112415 -1961630 -817340 -959133 355845 -1316546
11085 -1316546 -1379933 -1752000 -3030138 -4581275 -1732723 914146 -1046721 -882963 -116547
11076 -116547 -719764 -2853990 -826033 -2263196 -1323437 -859645 -2377017 2511007 844209
11067 844209 -2948495 582319 1709571 -40281 -2594166 -1461447 636720 225873
11059 225873 778308 -1908666 -916655 -575489 -2472655 -893547 -2269312 -1142815 -234304
11050 -234304 -3140975 -2114393 914432 -922705 -2124883 -2949920 880763 -2946639
11042 -2946639 -1639017 -528988 -1052737 -750218 -2992907 -1464409 725347 -4116194
11034 -4116194 -1015254 357937 -1589506 -5346404 -1188865 -1706311 -1015240 -6188500
11026 -6188500 -30178 -2570805 -4135600 234933 -1899196 -409276 -2372685 1090304
11018 1090304 -1387534 -1665582 -137371 -964485 -572905 -2279122 -967443 615780 -2738823
11009 -2738823 -897843 268774 -352850 -770119 -522987 -3221194 109949 -3002022 347221
11000 347221 -2532465 -321628 797811 30622 15040 -232249 1521454 1897183 -1267536
10991 -1267536 -2491722 -2841504 -1017199 -221079 -1399494 -1427956 462011 3759303 596044
10982 596044 -1124233 -4157120 -418907 -792409 -681200 -887552 57646 -2909254 -574372
10973 -574372 202712 1784805 -2410710 1671941 1650314 -79930 -23268 -3467383 -2616944
10964 -2616944 -875135 374384 -2925341 -2400253 565786 -2272000 -2318621 1979763 -2686677
10955 -2686677 -1806235 -1397339 -327541 -1106842 -2026541 307764 -1004211 -2408812 -1036371
10946 -1036371 -2111321 1436714 -1986813 -734934 -1877795 365220 -3114543 -1361148
10938 -1361148 -81096 -35784 -3018083 -989058 349428 -1464519 -2863625 -2191658 -496889
10929 -496889 -1786483 1753968 -1388074 -4482506 -3991932 -356197 -690917 -202982 1241971
10920 1241971 -172143 -1649606 -1471119 265845 -1688711 -1203529 1211588 -111307
10912 -111307 -1891964 -1592769 -1171999 -1196983 -765576 -435232 -1418873 -18089 883111
10903 883111 477134 -1367534 -1048597 -1356333 -1519839 -2967752 1100239 -3403598 1115944
10894 1115944 -682372 -2228684 -2201983 -894010 -690737 385836 347883 447961 -2014951
10885 -2014951 -877539 -1484604 948180 -1900979 -2608213 214673 -1155455 -1659992 242194
10876 242194 -2145754 -2228847 -2858812 -2164387 -1340784 1815509 -9856 -3484673 -1952232
10867 -1952232 -2038935 -1457010 -2115901 -1546720 -2980651 -3393780 -1945867 -1794095 -2619605
10858 -2619605 -672199 -2400147 -1063848 -3984816 -2053360 -1789086 -502833 -989364
10850 -989364 308289 -1251937 -2575740 -873049 -472239 -1576066 -1463924 -1864011 1391494
10841 1391494 1026406 -878636 1202341 -854371 -1979400 369040 -2423205 -2254189
10833 -2254189 540956 1210899 169422 -4032145 -696216 -938525 -1082879 -2135858 -1199382
10824 -1199382 -3883477 -2123154 -205452 1598669 -400055 -2089705 -1703890 -2627027
10816 -2627027 -2673556 -263681 -388414 -1630591 -1062819 -2097296 1772252 -2042013 -710074
10807 -710074 -1450592 1047171 -1991985 -3074753 -1079414 -797738 -1159471 -537263 33890
10798 33890 -116251 -4777837 -1414815 -1097731 -3357241 -2499930 -3626577 -3090681 -3243111
10789 -3243111 -599275 2988493 -3975956 -1317196 1160390 -189911 -2331114 -1147169
10781 -1147169 -747347 -793489 -2200641 -2163131 99417 -38634 -196114 -1711228 -804600
10772 -804600 -4033151 921060 -1809997 -1672053 89690 786565 -1022047 -783134 -2338690
10763 -2338690 -3175603 213147 -334138 -1660470 -76045 -44207 -1746006 -807159 -2058901
10754 -2058901 -1459656 -649068 -307905 -2317541 -631588 -146448 -1228045 -484597 -2040052
10745 -2040052 2850958 -970123 -2342249 -1211821 1780507 -231260 -1852932 -1864089
10737 -1864089 -1955736 460870 -131260 -1863265 -4465364 -2085661 -917121 -480646 25823
10728 25823 -791341 -3063681 -1098678 -2223023 -1531423 -3762304 -3262506 -1313233 -1996857
10719 -1996857 -375665 -2016079 156471 -1025395 -2510979 -2840784 -2207736 -1075010
10711 -1075010 -1451012 318251 -2679052 29508 49954 -2615830 19676 -751053 -2998819
10702 -2998819 -1493124 -536372 -1161271 -91540 -1030032 -3057298 471799 -1256145 -2024852
10693 -2024852 -217714 -2451730 -1321400 -2118507 -324693 -888217 -2681273 -1832165 -779425
10684 -779425 -873244 -4308255 -3617173 -1339259 -2718899 -1361866 -1735035 -647815 -229072
10675 -229072 -1678954 351116 -2036446 -1353615 -1408972 -1972538 -1503917 -956702 -833401
10666 -833401 1100574 389606 773023 -33431 -3080781 -1701885 -1707343 1222837 -2086974
10657 -2086974 -3872478 -1993682 -754122 -1947585 65918 -1610165 -2713492 -3366110
10649 -3366110 -414010 255980 -979208 -2213549 1270277 -2124470 19634 -4178784
10641 -4178784 594374 -67246 291233 -543838 -483191 -708854 975797 -453726 103711
10632 103711 -2601401 -1151192 -1119226 1094124 2017143 -808852 272821 -1546400 -3301982
10623 -3301982 104606 -1892596 -2101377 -3071682 124002 -873105 -2101421 -2396793 -1943095
10614 -1943095 889988 -2072516 -1295037 -3613723 -1329052 -965111 -99800 705147 -3610602
10605 -3610602 -2009563 -1945796 -585875 -1752577 1633998 865831 177472 92095 1190493
10596 1190493 262544 1712582 864046 -613883 434725 -1040516 -729963 239261 -955701
10587 -955701 -20752 -4710070 -382149 -143229 -563407 -3324989 -4753043 -1410460 -1542314
10578 -1542314 -2289320 -2513584 -2866063 -500988 -3054630 544779 861376 1380098 300684
10569 300684 -1660145 1228955 -1916762 1889188 544234 224810 111006 -4437 -708396
10560 -708396 651968 1178838 1422584 -1632227 624230 751766 -1425170 41759 -927638
10551 -927638 -1752717 -1871740 -3154575 -2348863 -1358491 -767573 -237633 271380 -1160286
10542 -1160286 -2986599 291133 -1212854 746039 -691172 -3086357 28021 -1483693
10534 -1483693 609448 -1115701 728426 -988008 -1137451 -2376113 434094 1295643
10526 1295643 1841209 -1777052 -807789 1226347 1235515 -1001618 -789312 -666201 -420283
10517 -420283 100416 70546 -2018603 -974710 -1458693 341838 513165 -1329174 -1763498
10508 -1763498 125537 -3080884 -1919747 -2991531 -275884 572416 -2634000 393618
10500 393618 13657 -1581379 -102685 -857628 -1438560 -1551425 -761209 2315362 779833
10491 779833 747589 -945293 465807 854875 956966 -622567 961400 -3700830 66989
10482 66989 -988828 -811343 -1977750 -1163855 -706324 -117620 2462837 -939185 -797791
10473 -797791 -1668711 -1021633 1279080 1476321 -1389450 278393 -1567876 -2034448 -1816921
10464 -1816921 -341806 403891 -1496589 -1526918 1115930 1043625 709240 -1228910 -523735
10455 -523735 -316000 451402 645306 306540 -395698 -560694 -1153420 -347967 980933
10446 980933 105697 -997849 -796850 1274732 -2125870 -1282868 -826057 -2273852 -2147307
10437 -2147307 160076 -798362 -276456 -2036086 -1822202 -2072091 -1042896 -1607205 -3561865
10428 -3561865 -1197449 1227399 -252209 -1995190 -22462 125986 -874799 -3394059
10420 -3394059 1895069 -76857 336351 1754384 1333744 -352611 -893276 220168 740408
10411 740408 654184 811518 -2059071 449560 4858106 1589815 -1835842 -1354380 -1022633
10402 -1022633 -3061634 -1316459 -377365 -490612 -1060912 1365949 103748 3518825 -1268986
10393 -1268986 -974215 -700726 -1030875 1615202 -71215 -267752 2748624 -1660975 491987
10384 491987 463586 142590 1090055 1349337 554563 -945332 1940770 3308957 381462
10375 381462 333593 129393 148617 -785048 -1930423 1430568 -265320 -397520 -31883
10366 -31883 1147401 -1299905 462354 -821669 -262828 -849289 -835994 -1297555 31564
10357 31564 744713 904622 -2488384 -221554 -1106877 -615751 1776485 -905255 494855
10348 494855 -909144 277863 -517349 1435648 704390 -1182566 -1925572 2188850 -801559
10339 -801559 -588645 -438374 2112779 2634996 754024 949675 -1011901 -3650033 107170
10330 107170 -887830 -895063 232683 1995415 -2064048 3126176 555980 -720827 -2142278
10321 -2142278 -2278231 1198505 439222 1606437 316016 -808017 -1170208 -1356555 -460920
10312 -460920 -921534 -1639233 682527 957447 1847256 1692554 2667935 937292 2840065
10303 2840065 1215965 329604 -302781 2145999 -199752 2294967 -2283148 -639497
10295 -639497 2742717 -97878 2020447 985930 -501101 -571618 -529596 -985307 -405134
10286 -405134 799271 756054 -1022126 113873 756228 -1017458 1313765 -342083 3088829
10277 3088829 -184383 1752804 1287752 2597432 1775317 -1739372 -323750 481612 982655
10268 982655 605705 2764450 2884327 -253461 -674853 1453417 2843551 721013 950794
10259 950794 23510 1425306 207480 1339245 3726758 1825518 -598202 1458588
10251 1458588 -167910 445964 1109720 -225661 -1640326 -1034928 1418656 599673 1744157
10242 1744157 446132 1656275 1210582 889015 1471660 4140426 1606422 1510635 3371761
10233 3371761 2381984 -600196 527120 3218134 2527032 3059614 3330428 1773163 2094195
10224 2094195 171209 4588428 2112402 831676 1174320 2389535 583560 1496375
10216 1496375 3787488 3397507 -1152599 2336218 2748399 2793427 676089 2778167 1491780
10207 1491780 2562673 26296 2372473 5007533 1638112 3395240 3378852 2378359
10199 2378359 2135393 3481327 4926900 1732197 3633025 4601496 4732217 2264414 2381109
10190 2381109 4867014 5633512 3063078 4049439 5048877 3986376 2633719 4921732 4788633
10181 4788633 3937790 3729286 5622922 3952489 4964555 6362172 3343177 4433360
10173 4433360 3466023 6496423 6428533 3031662 3252290 6012913 3905621 4026343 5553312
10164 5553312 6836566 3450277 6003505 7707632 5145777 5987239 7722223 7006610
10156 7006610 7789274 7450881 8624647 9183901 7973398 6904302 8402729 7739034 7629155
10147 7629155 8398748 6512985 7694640 8641504 8527930 6787313 9189623 8980800 9794982
10138 9794982 7667901 8027478 7963520 8440497 5424266 7533115 9451111 8354857 7099513
10129 7099513 10012944 9157205 7433268 9160896 9424749 6917402 7985021 9963748
10121 9963748 8966601 8089700 7972893 10554040 10598920 8165192 8544741 7925793 7296536
10112 7296536 6380099 6681107 7044582 10236290 6203710 5609733 9521186 5895401 6820081
10103 6820081 8137489 8533907 6916465 7510288 7210662 8057252 7539619 6618040 4674215
10094 4674215 4985707 6645664 8181086 7811456 5662027 4394125 7171582 5709013
10086 5709013 6843895 8184402 3942130 4583991 6317408 6745927 5789958 8261728 3555415
10077 3555415 6259740 4305454 5351647 6491779 6832948 4055819 6912470 3937037
10069 3937037 3781008 6149461 2244037 3561888 4717151 1928832 3246607 4890810
10061 4890810 1678410 3120416 1855850 3530926 2978444 2440957 3285918 3121628 4715109
10052 4715109 2555579 3794157 3331415 6165502 2895573 3858715 2127975 2339050 5001778
10043 5001778 -618860 5312508 3522004 4679818 3801429 4565073 2148501 2439259 3630153
10034 3630153 3287940 728815 2164263 1157976 5026716 3273712 3416155 2646128 1404948
10025 1404948 2172361 -512406 -263126 3746437 909266 2427560 2559568 1002394 2996183
10016 2996183 -443426 2124303 -46428 2471731 4491382 2745791 2951703 3591276
10008 3591276 987057 3947425 3495829 2684227 2670405 4277898 2658130 2943242 -702164
9999 -702164 2475330 3236785 2134517 166749 4282219 -2866958 1665139 -420283 1263393
9990 1263393 2084286 3886725 686661 -182575 226206 971242 2620960 -152415 1152346
9981 1152346 1000382 904631 1605498 1487362 -514718 1890754 783472 3116543 1006914
9972 1006914 1455831 3602264 917252 1848960 1987256 1611848 3749095 954234 -8148
9963 -8148 3241722 900824 273880 1226534 3372080 -367289 4452436 552281 2421874
9954 2421874 1819346 -1205272 705449 -103505 636251 3268783 -933865 2280799 -389988
9945 -389988 1473526 -3302735 462699 492408 663317 651159 2400928 41857 2022074
9936 2022074 4893416 672272 624911 1828488 -347642 -331705 2098696 980798 385080
9927 385080 -1533002 1544410 -466604 1535776 378555 2090018 -2088792 -817611
9919 -817611 1037058 3627942 -1532802 487781 494582 2595822 -1088568 742835 265357
9910 265357 -143800 672776 -128202 1246346 2824745 1322216 -293617 1782420 1254439
9901 1254439 933274 307492 2355868 3615839 514555 1680521 223164 694622 665384
9892 665384 2026091 3773444 -1333822 -614053 1311253 3816639 2793794 1602623 638447
9883 638447 520437 907657 547086 179210 162788 -734076 -3775158 364109 -549090 490053
9873 490053 1422477 -1082352 2101851 -1654921 1071863 627382 -982247 3065856 -171498
9864 -171498 1399208 -1039672 2498573 2488168 1150320 1058920 1084786 -212466 1113021
9855 1113021 1571147 3086299 925534 128327 -121294 641242 218561 -931677 -566778
9846 -566778 2220009 -826738 556695 -674109 2202988 66577 -1072349 -169040 2989784
9837 2989784 -904741 2316577 440323 2740059 341325 1803779 1979473 1203512 843262
9828 843262 2168159 402619 879183 -2352887 472000 1786644 2586765 -497371 -2393024
9819 -2393024 1967025 1276036 -766810 -922071 -2142914 -2113738 3436260 800799 411607
9810 411607 1236828 -737002 1139767 1726426 1781364 31786 3219729 2315463 963241
9801 963241 630807 -327763 2303065 455214 1841332 -113735 1063126 -368773 1413685
9792 1413685 1107861 2959752 2659459 3000010 3594530 1856628 1132411 1045597 1008874 1028921
9782 1028921 351435 765809 898280 155486 2748619 1321688 388103 -659652 1740862
9773 1740862 2040219 3125357 1325532 3857168 2086131 -1221919 3282440 2962817 2045247
9764 2045247 1781759 916008 1804810 3552054 1091318 2356638 1544874 583459 1996516
9755 1996516 926993 33730 384969 1183882 -326873 2947939 5247562 2244031 650026
9746 650026 1281905 979154 -527850 -1123720 4904032 4171908 3059895 2385449 3834067
9737 3834067 5585734 239900 3140137 3257654 2921644 1674434 4410375 4765671 2530446
9728 2530446 876026 1463004 3302718 2068764 1542068 3684645 2689654 4743284 2235999
9719 2235999 372434 2782982 3758109 2380394 178162 3236539 2573434 766676 3006227
9710 3006227 3111014 3096178 7207413 5822371 2969218 2402888 1458476 3897107 3403853
9701 3403853 6379992 2943107 3589198 3011303 5941538 4227928 2805568 1330731 5731240
9692 5731240 592702 3794345 5082882 2494869 4582237 1908332 6297920 3887660
9684 3887660 1960448 4651794 5398917 4419559 4387358 4505379 6014318 6032451 4818466
9675 4818466 4263730 2602664 5445439 3160874 4718551 5801766 7785742 6733882
9667 6733882 5819891 7766785 5187612 3243068 5279792 7549996 6745989 5636110 7495393
9658 7495393 9535274 7174805 7956767 5805329 5599453 4786794 6565080 8925101 8843264
9649 8843264 6105149 7303674 4653438 6828658 7831933 4026901 6419690 7656309
9641 7656309 5396786 5860773 5426707 10324600 6832962 7529943 9187864 7780935 9062110
9632 9062110 11807973 7976304 11436765 9028552 8966883 9559623 13502880 13306090 10734788
9623 10734788 9596789 10161499 11316838 13022095 12916416 13735111 11245834 11122185 12708949
9614 12708949 12712244 10767140 12849101 11997468 10801045 11186255 15405787 14889302 13877304
9605 13877304 14004385 12870098 15683301 14552835 16390654 16774469 15478815 15951471 17391577
9596 17391577 17233600 18424959 18771762 19952079 17447851 17534102 18067637 20340652 21085362
9587 21085362 19209671 20725758 21738008 21190849 15633525 22849492 19542514 21026707
9579 21026707 22557652 19284851 21381059 22927155 21661921 24006486 22503785 23325596
9571 23325596 22309127 23061489 26110101 26529658 26566599 25403218 23463161 27799963 26051360
9562 26051360 29993494 28030773 26616116 26590534 29496058 27686020 27847598 29321176 29812974
9553 29812974 28890744 28681299 30179462 29482307 31440757 27746986 31104909 27122431 27720875
9544 27720875 31321119 29097462 29315151 29462589 27332902 26886372 28070085 31149488 29896468
9535 29896468 26552093 27042807 27742054 28525678 28931823 29311364 26980355 28937730 26294559
9526 26294559 24803242 24878849 27046521 25874731 26887264 27964450 25629829 27123059
9518 27123059 26731675 25504181 23692646 23368815 23525975 21881974 23391919 24286116 23028332
9509 23028332 22632489 21519338 18743479 22881064 21085951 25536769 19545596 16637677
9501 16637677 18928672 18881746 19693953 19326231 20165363 16321248 17074519 16018872 20317049
9492 20317049 16097755 15075406 16035997 17174567 16856405 19177832 17644452 13825595
9484 13825595 14297102 14436311 14785477 14242772 17039423 17106946 14826232 13609151 12102520
9475 12102520 14628388 15737785 13774700 11230976 12996450 13415964 13180336 13022222 12828986
9466 12828986 9671396 8680889 10983459 13930755 10391954 11516728 12359926 9351363
9458 9351363 10385986 13812804 10549180 10345059 9328682 10798755 11137238 10166704 9284455
9449 9284455 11434800 9626303 11460053 8444969 10548530 8989472 9005316 7823457 10314530
9440 10314530 8442900 9082853 9427693 10794670 9031014 6750705 5226548 7426008
9432 7426008 6934043 8102228 7458294 6740036 6385377 7324199 6779772 7536396 7776160
9423 7776160 7700713 5832992 5196286 9155892 7263026 8388370 9187221 6792238 6428692
9414 6428692 8660669 6316374 6437157 6267414 4750700 5349636 7780243 6957572 6340458
9405 6340458 5491849 6534887 5126439 3797126 7166363 8133303 6056461 5631843 6232572
9396 6232572 7339379 3776009 3638496 4458789 5377285 5911125 5016475 5011504 5542587 6683597
9386 6683597 5608775 5130007 6540789 1933227 3944725 7411093 6036525 4977004
9378 4977004 3992729 5977497 4987257 4839803 6788704 6512992 4339830 4326477 4525062
9369 4525062 6243509 4886197 6455588 6392726 4002694 4796612 4161419 3594894 1545933
9360 1545933 5193862 5029005 6032878 2774872 6243566 4814125 2090603 3023067 1222374
9351 1222374 3262657 2020509 4150355 3548276 2539799 1665768 3936678 1399333 762464
9342 762464 3528738 4546897 3175110 1566245 4281309 4014942 2090428 3114813 885989
9333 885989 2681055 2663444 2963659 4176710 5373511 918650 2920752 1017926 2235780
9324 2235780 5479502 2961644 2024522 1815543 2558717 1897133 2336712 2438191 1570993
9315 1570993 2555492 2479188 2176477 3676924 -438840 3256664 4474430 2050594 -772736
9306 -772736 1440862 5205797 4447459 684610 4177977 -867840 4049430 3024396 4183420
9297 4183420 3345305 1085974 -92857 4564515 3080642 -506797 4373073 4350902 2526458
9288 2526458 1903572 3113862 1745908 2936346 -1257540 2537129 -229908 1459245
9280 1459245 1495822 3318896 999362 -627590 -837756 3015419 3005327 1129821 1851223
9271 1851223 737261 335598 1835694 2461905 320999 789960 403079 1817593 -1810877
9262 -1810877 -1215735 2026596 1021020 1495917 1543656 767191 1081796 -1906544 982297
9253 982297 666696 666004 2252705 2329095 -1210482 -454693 857960 -771129 1986734 4423283
9243 4423283 -245817 -557436 1822683 3293326 674466 1204389 3214526 1161675 1604490
9234 1604490 4058521 3901347 381723 565260 1429773 1910635 -530842 2607392 2539877
9225 2539877 534396 2103095 4049706 611807 1670893 2623681 2273856 888250 2089647
9216 2089647 -428228 806853 1660463 802643 2794895 1304150 1652577 889465 1827905
9207 1827905 931639 84110 -828911 703516 -1639382 -333917 611424 1374408 1176620
9198 1176620 765803 -443202 -785334 -1076638 3345260 406641 53256 660983 2080642
9189 2080642 -2054759 1267489 -162467 1244311 517474 2467791 691169 3141821
9181 3141821 251177 -870187 -176006 1490491 -281043 48589 242314 3111980 -1175227
9172 -1175227 -1354309 372259 163124 -206267 -1070073 -251656 771065 -40016 144378
9163 144378 -604181 2227732 1390697 -287063 1694000 389256 779826 -857932 -732704
9154 -732704 2216676 2649345 1516523 2106559 410868 -73096 877234 -77042 1851648
9145 1851648 1152707 452419 484160 3414454 32950 664948 -1161130 937204 -792367
9136 -792367 642297 2850448 902801 550077 -435745 2163787 -739384 -111501 1657708
9127 1657708 2060424 914023 -2027073 1341530 251756 1586282 1576344 1072696 -910398
9118 -910398 -970159 1096637 -473909 -694313 503273 785884 -2897663 -664503 2193284
9109 2193284 127556 -2774876 -1370261 -1405005 -1186853 1910013 216309 -275633 -55455
9100 -55455 -727143 -2731135 -1497907 540242 -420630 1399339 -456039 2087395 545799
9091 545799 1529948 -599888 -3204764 423008 749135 1713013 -1422239 533865 -837120
9082 -837120 1194551 -674477 -381279 -1839443 1252436 -1120307 -1204443 2642246 739338
9073 739338 -229810 -231558 4210292 -1363765 -1342238 -2745090 1448683 2702216 -483770
9064 -483770 1556593 740750 1472114 -474941 1793555 1845180 -168538 87450 1327336
9055 1327336 1234996 1835473 1056887 968479 1499638 -2171413 -2327449 -1250195 2623093
9046 2623093 324750 -1505674 -1707738 722415 170782 -1580169 1510508 1169995 -1474659
9037 -1474659 -1687200 -12170 367720 -237558 -874817 730776 164271 705202 2456458
9028 2456458 -1156821 1224829 1263232 2430302 807753 1845377 -563792 1604221 -365427
9019 -365427 -921491 -527400 2544160 -1349033 55851 -70867 292604 -1391159 -924670
9010 -924670 -322350 -902630 1989383 -172872 -361170 -743481 -1329047 -786897 2052061
9001 2052061 -240087 -500445 -669877 -1349354 488118 -483582 1667578 -170582 -2022404
8992 -2022404 -460686 1575101 -984650 -1385164 1208296 534092 124021 32574 556169
8983 556169 -392486 -2302589 -157200 417797 276276 912920 265449 -42609 935901
8974 935901 -2866280 571827 3523880 116702 -1500346 288501 -233678 1803071 -1436286
8965 -1436286 1523472 -372163 -2135739 1776981 1173821 1272852 -1742437 -1015120 423041
8956 423041 -201417 498575 317130 497736 916466 133500 928515 -433124 -1633126
8947 -1633126 660771 564867 612621 403139 -1981810 389560 -510908 -1110131 -597461
8938 -597461 -1882874 149865 -995459 -2607946 -221958 -949482 -1738389 2033371 -1994722
8929 -1994722 96666 569191 1953520 118030 -617718 -530094 778848 -2045862 3041632
8920 3041632 -838094 -293205 -1256509 -1622003 -664160 -206091 -576785 -576303 -1108615 -402051
8910 -402051 1801560 -135189 -149131 928360 1700608 368440 397008 -733344 122045
8901 122045 -1482053 -2475869 470977 -73824 -734154 1460192 -307226 352801 981289
8892 981289 1787259 -2268243 -361155 1751458 2806783 -302224 1361395 -293016 1421283
8883 1421283 1249733 2194207 839621 -2669487 -224025 -499326 1650885 1852328 2410023
8874 2410023 -723105 2185557 -275652 809894 -687579 2010112 -2147577 729487
8866 729487 -1093038 1556271 -249059 486161 1135479 -650279 -539486 2545916 575952
8857 575952 2182972 -138732 1374976 -1762382 -615820 1737263 864835 2863829 -919546
8848 -919546 -817780 1587619 200520 -762134 465889 595265 1430693 -1051324 -20669
8839 -20669 -110341 1435577 32173 -94155 -620775 -330083 -1776771 2969826 -175691
8830 -175691 -632285 -2167792 1514 508765 1774709 140091 -312498 -421945 -102880
8821 -102880 562899 2120766 1266618 -82774 1496817 -1543501 2297344 201432 616402
8812 616402 -1004468 1426985 62818 2373929 -794821 1826760 973384 1932615 700804
8803 700804 561749 644741 2137429 -1543618 1207148 707495 1011527 -1511338 1533023
8794 1533023 2273575 821868 480842 1084512 622286 429767 2694867 1561616 -1335990
8785 -1335990 1245752 1845894 -761905 45591 423909 2366120 400368 -598657 186266
8776 186266 2533180 1696146 392358 871254 1282041 1082892 398422 888397 1936049
8767 1936049 496885 1997283 2646033 384107 1417044 1903717 -576134 689873 712949
8758 712949 260104 -612264 -1922186 182133 -2480766 915640 1410742 2946707 -1325860
8749 -1325860 1663690 850036 1287903 30495 -1394392 1976983 442230 1222389 -1238946
8740 -1238946 1558774 1992893 45852 643604 2992829 -1249458 -49024 125954 1247245
8731 1247245 1442832 1534420 -729448 -1034466 -207762 2369372 178970 456422 685924
8722 685924 4944288 -1647247 1659140 3268097 1664596 -1365442 1405844 -419962
8714 -419962 1969071 2468205 1504280 2719918 1944343 565678 -1177051 1783346 542116
8705 542116 72304 1177231 1017781 1092591 2954419 -301308 36566 931884 1335349
8696 1335349 1232398 1353598 -246035 2825066 1741712 1342330 1088704 2388993 1953236
8687 1953236 2371968 1032062 2121542 2208009 2643636 1052891 911432 626955 1045635
8678 1045635 -637353 1446256 1126964 1963851 1525945 2580629 13885 -1414300 2894249
8669 2894249 353399 1183607 -625009 1781897 2090329 -601119 -702547 956140 1337019
8660 1337019 2663001 455581 601950 3364635 1579726 1179179 523714 1302183 805979
8651 805979 449411 666268 246789 2833687 4268791 -378303 746066 2106286 372378
8642 372378 431977 3774948 2104484 931264 2704835 2529419 2542974 2332722 3320137
8633 3320137 -184185 263325 1927010 2693446 1006435 805484 1311745 1837314 340577
8624 340577 3520419 1549359 3559779 1520114 591578 1375456 2529147 2989396 1131772
8615 1131772 1976597 1691282 1674082 3844985 2722317 -1686256 2386057 -135499 1713226
8606 1713226 3768170 1146924 2374021 2218832 1903820 4044028 1876575 948275 1633192
8597 1633192 1612055 -313467 5242402 3455304 91679 565127 1472715 2296467 3031310
8588 3031310 2674397 3415047 3878224 3061379 1730644 3755408 2410093 -18795 658681
8579 658681 1925035 3901790 2438897 1755453 3719630 2058838 2318049 1573702 2391986
8570 2391986 5850 2061868 3623592 350675 5262088 4087940 1320315 2299827
8562 2299827 3999795 3295099 3794630 4321486 2776697 441116 3107904 4678069 3834801
8553 3834801 4395849 3878207 2953270 4888254 5158035 2361631 2233416 2538493 4605090
8544 4605090 3290949 5468324 6793083 1986435 2210230 5166205 6828902 5478851
8536 5478851 6584432 7559187 11751324 755404 1641125 355079 2646173 3678026
8528 3678026 2207275 5406011 6011516 5924238 3905678 4887307 4062894 4282796 5164091
8519 5164091 5728564 5465740 4538095 3007679 4952740 5044407 5583158 6210800 4179597
8510 4179597 6719156 6413714 4863164 8192608 5193669 3839029 6351734 5763589 7529814
8501 7529814 4299212 4993969 6639030 6274003 6324663 6221347 8192870 5636045 7921016
8492 7921016 7779882 5941593 7036858 7654491 6505875 8572768 7647100 8614544 10936775
8483 10936775 7949395 7382960 6730593 8551341 8647918 7606219 8538061 7455996 9825810
8474 9825810 10275872 9821552 7989075 9217883 11037227 11532470 13325365 9771754 11128341
8465 11128341 8937831 10271405 13614335 9980504 11642478 12512695 12095178 11895489 13217817
8456 13217817 12437764 14183513 14368909 13446846 12804087 16189587 15377789 14015925 15381080
8447 15381080 16405700 16328612 16116885 16405712 17571433 18433965 16080059 16595494 18988181
8438 18988181 16894613 17881679 20987816 19958270 18794569 16628170 20773169 19691170
8430 19691170 20110964 19111184 20660189 20086999 19406538 21618066 23283639 24037092 21723821
8421 21723821 21911458 21156366 24389436 24237297 23551523 24802743 26539874 24754847 25262700
8412 25262700 24845707 27243755 27150151 25899019 26235686 26969475 27529623 27853020 29637097
8403 29637097 27833048 28774242 28657905 29103098 30324905 29255023 29042304 30592269 29210944
8394 29210944 30015405 31490020 31913714 31886788 31615945 31974996 30203939 30331722 31876299
8385 31876299 29228653 29393189 31238294 32150473 29711318 32059381 31769317 33869445 30106146
8376 30106146 31292288 28819817 30649924 28988237 31502658 31671129 29165531 30008359
8368 30008359 29308699 29831897 29837796 28020751 27927939 27192440 25558362 28497427 28513999 26162393
8358 26162393 25654245 24422395 25499170 26524366 24102927 24339638 24568656 24650670 22411526
8349 22411526 26242535 23969108 22659830 22384891 21044685 22314049 23939033 19610729
8341 19610729 22426266 20246016 21829406 18820553 20655737 22824669 18949757 15880944
8333 15880944 20620101 19844409 16320602 16459275 17604766 18050077 14494280 18391277 14269619
8324 14269619 15749349 14931593 13640704 13426915 15321194 12346629 13637864 15531324
8316 15531324 14642658 12870986 15365847 13423712 13652643 12418550 12872622 13350202 14180769
8307 14180769 13546444 14326459 10721037 12239973 13311778 12039645 8878625 11305971
8299 11305971 10469264 10697659 11826690 10352836 11247334 9254817 9100981 10212109 9662442
8290 9662442 7796745 9984687 6520002 7973890 11140488 10425378 9826296 8089028 9355381
8281 9355381 8319918 9685635 9837804 9619975 8866758 9446587 9288744 10579409 8640509
8272 8640509 6728193 7981760 9505439 7951051 7412255 9891834 8633729 7454185
8264 7454185 8752392 6598325 8618782 6932444 6268243 7676625 7989232 6413129 6313109
8255 6313109 5786068 9433459 7312064 6960008 5067449 6586061 4598502 2441950 8160454
8246 8160454 5734013 5805068 6256011 6713868 9829651 6928146 6071232 5363742 3337272
8237 3337272 7513045 5278723 9120837 6086861 6134767 4592820 4390509 4106005 5349366
8228 5349366 6694609 6609653 5482561 4497651 7610508 4955859 6067890 4436258 6654323
8219 6654323 5922800 5846580 4867138 6518667 7583052 6841202 3331854 5032203 5255489
8210 5255489 3169466 1315222 6378801 2770933 5653143 5490824 7582150 4814869
8202 4814869 4385750 2415096 4811914 4410779 2105549 5560693 7598542 3512994 5173329
8193 5173329 4196795 -7070042 9138227 5140508 9243085 5993066 7256533 4098599
8185 4098599 5155052 6677226 5158817 4188693 4538177 4272375 5396982 4766169 5434477
8176 5434477 4648365 5675738 5142108 7343840 6411781 7412376 3366667 2168562 4914441
8167 4914441 8120438 6053746 7687385 7077201 7367799 5649560 5459040 9753655 4887812
8158 4887812 2734527 4128704 5370091 7737998 6787547 4204451 5209036 4405109 5000072
8149 5000072 4720382 6065144 6741246 4142618 3692460 6528820 6193003 4724628 4899475
8140 4899475 3394600 5573017 3419262 5352933 5617589 4497182 2909851 7212407
8132 7212407 5368033 6465521 1541331 6566084 6406979 5282170 4902869 7188100 5904059
8123 5904059 6585121 5844963 8895161 5512714 5344974 4888327 6533934 5164139 7952589
8114 7952589 5086422 8448070 6641358 6811199 3885778 7382756 6198320 4694070
8106 4694070 5015748 5534677 5871284 5156540 8005081 5858468 5968503 2420743 5773847
8097 5773847 5798272 5823469 7117258 4873694 6268373 7360528 7837280 6608395 5432565
8088 5432565 7121323 6974630 4617708 7591666 7107779 5471640 5602523 5182927 7518657
8079 7518657 6611158 4099017 4601238 7930547 5566037 5328932 4191998 4861079 5170581
8070 5170581 3577040 6152687 6052002 6092480 1928464 3947522 4343496 5653117 3121240
8061 3121240 7448793 3921059 3926477 4248473 6419229 5669800 4315686 2416122 3674498
8052 3674498 7808537 7033403 3193208 7313183 3718468 4397782 3611874 3100641 5784630
8043 5784630 2768935 1919563 3940858 5035543 4593996 2199441 6734579 5287858 2676922
8034 2676922 2991138 3575095 4057190 3975269 2875959 3007776 3446390 4822752 5037746
8025 5037746 4611580 3151847 3380251 5789822 4160529 3627692 5080643 7190287 4455805
8016 4455805 4828086 3229621 5755515 4558397 3947952 5038531 4975324 4964025 2436047
8007 2436047 6017878 5524806 2879827 4101561 5293424 1455484 3713873 4560505 4776975
7998 4776975 3646941 2828399 6149592 4727227 3348915 5422826 3106822 2269629 -1123110
7989 -1123110 5047192 3981515 4293619 4607445 3636146 4751746 2091299 2258092 4421231
7980 4421231 4217563 2598048 3589363 5706262 2057118 5236589 4800012 2206297 2374179
7971 2374179 1992383 2328679 3890857 3104209 2866011 3948714 4488062 1720793 1140533
7962 1140533 2888808 1367226 2768825 3425120 4157011 1771377 3970651 4540826 3922319
7953 3922319 1354438 3621746 3311600 4289455 2959120 4911226 817229 2963634 2730571
7944 2730571 4677119 5369404 1384910 3597682 3609787 2334648 1761140 1980050 929392
7935 929392 3299031 4364810 4046509 1440457 3035920 2737354 2511418 3899493 1098190
7926 1098190 3912101 4747080 4654233 1236132 4393925 1628141 1418632 4269428 3563899
7917 3563899 2053275 856044 4114496 2476832 4971621 1303779 4590280 3317099
7909 3317099 4481857 5785384 4355617 672732 3851770 4305902 4955220 3409204 2623325
7900 2623325 3736803 3018272 5093517 4325242 2566888 4519781 2247172 3711254 1830474
7891 1830474 1439690 5651341 2119889 1291143 3860965 5046191 3303503 717395 4016828
7882 4016828 4160007 1540845 3270941 1586528 3889593 2350978 1111093 2372629
7874 2372629 2215506 2357108 642996 4159284 5301758 1938836 2619778 5196578 2303573
7865 2303573 1482115 4058181 3518133 2386444 1870034 4324321 2346245 1337875 2896628
7856 2896628 5262409 3577131 1444546 1952069 555053 8536752 6210270 12085688
7848 12085688 3424630 4002961 2643143 2675736 3957662 2971704 3145126 4614806 1269721
7839 1269721 2554442 6001798 5675442 4613752 1871608 2020655 2316461 1913746 1856113
7830 1856113 6812112 1590671 2199580 2984019 6248764 1423233 4516240 3662446 3032013
7821 3032013 2020013 4003184 4022852 1909648 2012717 4235188 5681266 2308694 5729602
7812 5729602 3397532 5166193 2616392 5294458 3129995 2782438 4824664 2939776
7804 2939776 4534418 3619497 2028472 3735328 2612925 5329357 5587144 3432271 3163351
7795 3163351 4892223 1601968 1937465 496925 3659777 1164741 3340646 1119913
7787 1119913 2768992 2147350 4677136 2534750 1322909 679500 2678873 6911801 1931038
7778 1931038 2838128 851859 3479929 5138802 6391414 1712043 5886050 2562695
7770 2562695 2164025 3090637 6494349 1016032 3135251 5983348 389028 -503395 4488588
7761 4488588 2692044 40687 1016161 5650985 4218067 4568364 3295168 2624226 1601001
7752 1601001 3920461 3088599 5861689 3143912 7218731 1919790 3095996 3954849 4018533
7743 4018533 1794729 4266873 5863309 3687943 7881684 2283059 4700337 2026321
7735 2026321 4055708 3702376 4867242 4361535 3969830 3286959 2494408 2570424 4312182
7726 4312182 2735811 2672844 4782409 3572892 6129185 3329140 3693212 2389331 2376206
7717 2376206 5361868 5926594 6784799 1911009 1257786 3110865 2932926 2898106 3115142
7708 3115142 4926812 2542345 2695621 4955993 6127504 3051483 3073369 4481898 4678291
7699 4678291 3676155 2917130 999526 3146637 2123299 3925620 3708892 4278805 2049621
7690 2049621 6142896 670167 4155589 1695152 3071141 4708332 4639143 4833653 4922035
7681 4922035 5496600 3623706 6891436 4237245 5074195 4624596 5906421 3575282 6061338
7672 6061338 5457463 5399160 1624343 4691738 6334682 4747402 5610135 5958534 4828193
7663 4828193 4071232 4131018 3488325 2588740 3946275 6068822 3767731 4072476 6823373
7654 6823373 3441984 5463224 6395435 4649511 5584431 6543606 3229597 4513120 4746859
7645 4746859 4212869 3419447 5724553 6139250 2131937 6980376 5469321 5857403 3072384
7636 3072384 6690354 4903348 5483606 6358589 7851152 6700153 5501663 3629052 6433720
7627 6433720 5078671 4578341 4177966 3902509 4832230 6160630 5540570 5279155 5094828
7618 5094828 -223392 4106746 5873093 7978661 1586650 5726299 4668057 5834375
7610 5834375 4092025 7009829 4284233 4118148 5571549 6306707 8357267 7791297 5682171
7601 5682171 5804308 3740965 5078140 8613247 3442611 6650268 7757201 5917480
7593 5917480 7433980 5792537 7020756 5102149 5749794 7633101 6003184 4827600
7585 4827600 3769078 8221439 6931529 8307315 6736557 10437873 5155684 7063600
7577 7063600 6085211 8069830 9122968 9231877 5778011 6546764 9520973 8072288 6804511
7568 6804511 10613339 8650575 7213338 7466926 7091070 9036546 10130597 6912652 7687771
7559 7687771 7463952 6907369 9383824 9133115 8806884 7670077 8999272 8416514 9280144
7550 9280144 8571490 6603295 5735985 9149485 7706484 9375182 9278599 9587025 8706875
7541 8706875 10345657 9314048 7635911 8465333 8650867 13706606 8701847 10468242 11123570
7532 11123570 11926018 9668813 12723437 8544257 11663588 10515609 11178469 14541902
7524 14541902 10270361 11351456 10046462 12234003 11037569 9929346 10683821 10847254
7516 10847254 9779465 9336894 10099454 11995430 11688939 8338624 10303473 8154725 10805794
7507 10805794 10952433 8944305 9211108 12101539 12382267 9871505 10836297 11520196 9423929
7498 9423929 8361315 12412799 11818198 11735134 8407264 13517868 11524426 10488309 10343907
7489 10343907 10131549 9420284 12036482 11275847 9616811 8995575 10201597 9070356 10344569
7480 10344569 10976789 9533838 8151492 6785454 11529048 12264394 9998715 9915839 10909378
7471 10909378 9017212 7638183 7483187 10088184 11070486 9790847 8957545 9572744 12765493
7462 12765493 10584433 9091137 9394765 8836140 7385334 10926802 10088269 9934565 7798286
7453 7798286 7514174 8570996 7933876 10739969 7795222 4310709 5168452 9471365 8108670
7444 8108670 5516253 7531323 7941673 6751595 6719807 8496670 6016180 7699134 6916632
7435 6916632 9761884 9176013 7715477 7650012 10261501 7383276 7191262 8189617 9925306
7426 9925306 7025244 6286086 8418413 10502323 8546566 8042440 7908090 5637623 6034713
7417 6034713 9598960 7829613 7261633 5355024 8423332 9036006 7527957 7433005 8119525
7408 8119525 5838734 7670172 8737604 8803901 7704502 6659045 6959231 8076565 9349827
7399 9349827 7332785 8141352 7065642 6423761 7018879 9548224 10256973 9894205 6284644
7390 6284644 6067944 8617554 9077382 7555181 7887982 6207174 8598617 9528010 8043255
7381 8043255 9315704 7129060 8544978 7380917 9358460 7714928 8053345 4767637
7373 4767637 8565416 7169727 7793914 4478464 6107465 5262786 7094216 5230035 6657763
7364 6657763 8024482 7257381 8963838 6422977 6513093 9287381 7252881 6365368 6741293
7355 6741293 6714874 7369037 7790043 8061640 6135187 6781423 10171376 8535881 8058480
7346 8058480 6408517 5337716 7734460 8274303 7289725 4306704 11562809 6620123 6188363
7337 6188363 8010257 9405544 10224494 8012040 6695533 9216019 6017153 9347282
7329 9347282 7743229 8615551 6334217 7487546 10380446 7411734 8990208 7822765
7321 7822765 10113388 7388773 8357748 7160570 9093476 6662498 11259491 9133243
7313 9133243 11330796 8073722 10840940 10994096 12341961 8507885 9134494 9576011 9208484
7304 9208484 8551850 7807439 11417156 6415432 6039485 12199419 8631792 8572749 9069000
7295 9069000 9711565 7247022 9491480 10271004 9563644 9677816 8282590 7708711 10205856
7286 10205856 8903966 8256261 10739240 7792134 12581802 6887282 9686987 10545020
7278 10545020 10337782 8137854 7399359 8551601 9214308 9691925 11218335 7827092 9433484
7269 9433484 8720989 8031251 9996504 9064762 7553533 8692817 8495170 8631542 9391670
7260 9391670 9583011 7838855 9272968 8611973 9852087 11739021 9031585 11412462 9982635
7251 9982635 9556525 10058249 8116984 9999021 9768462 11525569 8943366 12020028 11347202
7242 11347202 11896941 11462482 12429670 9764509 10401617 10223365 9916246 10888351 12580865
7233 12580865 11232907 8867994 11111213 11762076 11318983 10971041 9276841 10141109 11060070
7224 11060070 10742031 11463977 11978287 12144334 9342788 10744589 10388583 11648384 12516879
7215 12516879 12629527 9207509 11491825 9934627 12840291 11275845 11051399 11126685 12189162
7206 12189162 11730240 10804309 10483075 12183230 8053114 10598588 9502090 13997699 14369258
7197 14369258 9478934 12954388 12769276 9704020 10128095 12159015 13624068 11369280
7189 11369280 10936505 12629169 11099292 13670937 11084859 10308717 12333207 12661286 10644260
7180 10644260 11780846 10357792 9737500 11255216 12855610 10985458 11991397 11318427
7172 11318427 13006949 15863949 12059832 12019030 15082188 15133142 12290927 13196887 12772751
7163 12772751 13650431 9792629 11979864 14098932 15342553 14094698 11943510 13475987
7155 13475987 13173588 12613317 14476033 14910266 15328590 13865308 12349119 12872460 15407878
7146 15407878 14378046 17057982 13057657 13806489 16781708 16407171 14191105 14927045 15313548
7137 15313548 12114257 13726594 18144257 16349144 16100686 13667085 14108991 14426365 13384320
7128 13384320 13864407 13898112 16550560 14707121 14874865 15360242 16814097 13786807 14642070
7119 14642070 14155460 14986662 12443370 14862454 17661751 15573440 12357613 14170958
7111 14170958 15795180 15624869 18645807 15165207 15385460 14975974 16565296 14922644 16996751
7102 16996751 19365606 19978804 16350403 16415737 17919704 19000982 17549934 18176768 19330639
7093 19330639 18612149 17950259 17835646 19423086 19092859 14880225 18399754 19850998 18093432
7084 18093432 19663909 20393801 18874129 17146369 19250719 17699736 17747738 18781140 19608445
7075 19608445 20191324 19280478 19902971 22791211 21629483 19339796 22470607 21094250 17958892
7066 17958892 19072658 20067103 19862526 20816250 18523191 21191329 19973960 22060162 18926374
7057 18926374 17705896 18048176 21268913 21036593 21541071 20416107 22679582 21293170 20576624
7048 20576624 23108319 21698821 21293426 21206602 23469260 22071685 20861220 23133933 21605706
7039 21605706 21572753 22488434 24488876 21884342 22706357 21484384 22132495 23326169 20728969
7030 20728969 23903183 23917726 24701712 24235530 24617933 21650306 24829857 24370735 26670694
7021 26670694 22665270 25739798 24706599 27311064 23687354 22382000 23649088 24590096
7013 24590096 22924259 24868944 24943532 26518203 23544107 25504989 25089779 26012331 27622705
7004 27622705 26155301 28202571 26334742 26416219 27383411 28202855 26218293 26837401 25595617
6995 25595617 27550456 28746946 30188985 28113504 28147622 26700779 27924779 30369478
6987 30369478 28704158 29868975 27982984 29147729 28235934 29046319 32786945 29992619
6979 29992619 29878065 29555707 32801410 29557539 29998487 30009449 32401998 30102940 29487260
6970 29487260 30913910 31958835 33514711 31688551 30919903 30990618 34459043 29855986 33206350
6961 33206350 31151878 31624016 33516142 33344645 34933475 31826102 31927658 33862099 33613596
6952 33613596 33060801 34823118 34750779 35968549 36938731 34637795 34450416 37233375 35200907
6943 35200907 36951703 34406934 39511330 35824860 38790110 37323887 37506224 38158137
6935 38158137 38529537 36442100 36701643 41068575 37890930 37284420 38401681 41518317 41327632
6926 41327632 39871689 39104956 40819573 38612972 39897750 41406243 39953011 41754059
6918 41754059 43214129 40924338 42896877 42645666 41977570 42243385 44849233 42288551 42696033
6909 42696033 41396383 45073704 45349953 46134296 45392371 44582200 45228443 48562761 45395569
6900 45395569 48054632 44760878 45301248 47114242 48136815 49388793 46196676 48083077
6892 48083077 47855803 47133821 46036817 51994011 49810653 49957988 51909539 50420723 47991775
6883 47991775 52114689 52945684 52048523 51728129 51890247 53887119 52715188 54115617 54860425
6874 54860425 52793560 54343670 53907917 55342965 53913511 57052180 57219084 58750947
6866 58750947 56513913 57779517 56066133 58108248 59335438 56184768 58733233 59115744
6858 59115744 59339737 60174401 64198562 61251926 61536107 60292582 62837435 60446176 61409955
6849 61409955 62309112 65655387 62279172 64165127 66943562 66481298 68657051 68512766 64575922
6840 64575922 68759368 68051444 69955376 70855843 70604523 69873687 68990971 72623039 72208234
6831 72208234 71722876 74768001 72308953 72729320 73252971 73636741 75152241 75069760 78151315
6822 78151315 76027473 75118388 78744471 77562150 78483321 81728888 80897962 81445911 81884716
6813 81884716 84182528 83003052 85507195 85741112 86726991 86038278 87042948 89384434 91078000
6804 91078000 89056240 91877424 91299924 91237624 93840199 93182957 94463540 93889238 95005310
6795 95005310 93489783 96237306 98528966 97416581 99467924 99888239 99505539 104048584
6787 104048584 103588375 104003575 105930281 106053928 104938547 107844482 108643166 111316167 107894807
6778 107894807 109960770 110548429 112649773 112630493 113478554 117287588 115790793 117085584 118464254
6769 118464254 118465068 122578515 125755524 121027178 126106701 124477974 127428570 128268366 127420951
6760 127420951 130121832 131678616 132504484 134858819 135293698 135171873 137259280 139547477
6752 139547477 138492482 139088328 141293339 144609665 144900377 148313037 147049101 148415974
6744 148415974 148293591 152344317 152511447 156961942 154868197 159485955 159684608 161560206
6736 161560206 163847800 165013894 166446535 167394519 171411641 169916809 173058970 174037579
6728 174037579 176889981 179451201 179206247 180960212 186305351 183685081 186655911 188034795
6720 188034795 190442169 193432818 196864471 198010883 198085078 199527117 202228771 205754776
6712 205754776 208508446 208437969 210298731 214098974 215966869 218031028 219828291 220729443
6704 220729443 223465248 225592395 230491484 233014813 232892255 237323900 238429044 242404972
6696 242404972 242494471 246405857 248408577 252218274 253337692 255207819 255746727 261188228
6688 261188228 262436759 265979389 269751643 272660713 273031780 277826452 280099947 282213628
6680 282213628 283870829 288856731 291680863 293191859 298371867 303155935 306904824 308969704
6672 308969704 312532622 312805892 317378778 322314989 325470025 328098689 334574601 335822052
6664 335822052 337861919 340377603 345599711 348268149 353067225 353641158 357955091 363559079
6656 363559079 364898707 368529863 371044010 372978422 377802031 378347457 386156326 388400184
6648 388400184 392319072 395473709 397438706 403450751 405820789 410730155 411904496 417256641
6640 417256641 421297108 424917613 426242934 434292002 435888367 437725691 443553436 447153883
6632 447153883 448651038 453453194 454861060 458244357 461481733 463936062 467299707 472948458
6624 472948458 472673215 476248720 482660592 485425895 486081211 488047312 488854880 493327518
6616 493327518 497974030 499580735 500005044 502697678 505596135 507789052 512232047 508666867
6608 508666867 512285226 515954188 517016045 518468140 520517321 521030937 523008309 523958225
6600 523958225 524467617 525804704 526476397 529271214 530458145 530093025 527101730 534129273
6592 534129273 529443247 530628321 529187995 530493488 527214770 528585125 528129970 527431100
6584 527431100 525587814 528923559 527950724 524634191 526183178 521026755 521492885 520079948
6576 520079948 520385789 520325588 514988214 511976637 513580088 509953221 510754249 506817689 506076039
6567 506076039 501229128 501555693 497805084 496304054 494547902 489184935 485389390 484024880
6559 484024880 481044013 480700077 476966571 474733562 469161849 466055157 463601351 463490223
6551 463490223 457872932 455603757 450664162 447718832 443603636 444078632 439811684 434916254
6543 434916254 427902321 430019540 424601262 423741392 418727078 413631772 411952315 410084464
6535 410084464 404999985 401359907 398973280 395620137 393590764 388881548 385816894 382976875
6527 382976875 378553501 375779550 374003646 368985541 367022811 360488818 359228742 356758576
6519 356758576 354455889 351267421 344490646 344726726 341613934 338657263 335268525 333090628
6511 333090628 331638370 326714187 322824877 319039731 319215937 315350564 313307450 307692542
6503 307692542 306158691 299926346 303141453 296015113 295497625 290212810 289060478 286464077
6495 286464077 287078698 283644200 278548971 277773408 275319395 272019589 270964480 267629079
6487 267629079 263696832 263280344 259423381 257123460 255840416 252522283 251450495 249541298
6479 249541298 246927119 244535144 241944867 240136921 238510640 237075608 233837899 230812570
6471 230812570 230247489 227870991 223725502 226100339 221065164 222304762 217353361 213936980
6463 213936980 210993204 211580622 211215390 209670097 205374880 205020213 202763250 203632733 200211854
6454 200211854 197382437 197283690 191345601 190243826 191064329 191038665 186700505 185284763 183252555
6445 183252555 181573416 182823964 180953605 178170661 175843912 176485024 173265697 173614036
6437 173614036 169677773 171073575 167888822 167958301 167699924 163828948 162381849 161972713 163297460
6428 163297460 158363631 160012292 157220083 157480589 154591132 154403482 153586370 151747836
6420 151747836 150100939 150253330 145712957 147967656 147108024 143624545 147543568 142801954
6412 142801954 141178667 140838496 139661532 138916118 138148938 134422659 134752824 134105908 133455606
6403 133455606 135364159 130223461 130479573 127906278 128947463 126502010 125767972 127595450
6395 127595450 126275277 124045622 124869022 123211915 122350735 121450366 119629771 120036307 118156699
6386 118156699 117647026 118116264 117018706 115736344 114739212 114893318 111948805 110626508 111692680
6377 111692680 111951524 109267461 110751253 109192710 110467383 106194995 105763135 106020586
6369 106020586 107018577 104295982 105007959 103254752 104662542 104863195 104769955 103137656 99952883
6360 99952883 99756929 98863143 102168054 98004200 97555950 95439103 96526103 95523226 96855979
6351 96855979 92744586 94773944 92682031 92212784 92922515 94966924 92068530 91391410 92145859
6342 92145859 92785177 92351908 88540785 89189960 92516005 88293259 89389243 88937695 88495532
6333 88495532 84811464 88463364 91116229 84536982 85448646 84624452 84261570 82793372 84923732
6324 84923732 82887315 84843028 82076099 84893352 81507108 83621611 79314937 83042855
6316 83042855 79161608 79509959 80170562 81376366 79339993 80568150 77551630 78450039 77805602
6307 77805602 78063657 79309216 78605743 76886344 77651124 78064004 78798983 76280432 74989616
6298 74989616 76119998 73231961 75151484 74874817 75580178 75794650 77166996 75344564 76513495
6289 76513495 76108848 74901849 73957972 75370447 72920010 74200754 72803389 73655392 73105889
6280 73105889 72200833 71455224 73303976 70238838 71436655 70392150 73621076 70372115
6272 70372115 72346005 73219714 71007581 71583614 71545700 74437488 70869977 70461331 69852255
6263 69852255 73575360 72516989 72506023 74654026 72180481 69419409 70995397 72402518
6255 72402518 72473429 71815583 71621072 72722237 72192428 71852236 72474285 73134047 71550942
6246 71550942 71470946 69830903 70255106 72622038 74808964 71456949 72989300 72808650 73659408
6237 73659408 73042858 74748202 74000355 73954869 74471593 76505827 73975669 74646468 73943394
6228 73943394 74890951 75151696 77309747 73424625 78816436 76329234 79122254 78000571
6220 78000571 77174674 78458325 75520281 79695760 79037952 80374809 76580854 81017947
6212 81017947 79142628 83851029 82008568 81347782 79864617 83219219 83722689 82503031
6204 82503031 85683148 85096242 84744139 85964272 86725722 85703627 88241372 86599663 88439768
6195 88439768 93291195 91057637 91478294 93929016 94282780 93846737 92564634 96282471 96739853
6186 96739853 98163881 97504330 100448440 101700236 100238983 101918690 102712085 101396701
6178 101396701 104718205 104599511 105608992 109106578 110665485 108091468 111691951 113675145
6170 113675145 114466645 115814232 120527998 117653763 120144733 122214015 122287871 122010008 125123204
6161 125123204 127189472 125787941 132807414 131470920 133651519 135149200 136050976 138186844
6153 138186844 140666773 140382801 143846042 144431120 148269652 150098757 152248885 154235629
6145 154235629 153414114 156408716 162772895 160623299 165691677 168071307 168355544 170594075
6137 170594075 172611580 174273281 177725627 177867943 180931867 183341091 188510351 186876860
6129 186876860 189008714 191219834 194142071 196083044 197309670 201096734 204691854 205315841
6121 205315841 208402760 212012540 210961233 211310682 215349221 216454891 216389376 220054485
6113 220054485 222094746 221949349 224688900 226498303 226481881 228465215 227288373 230119943
6105 230119943 231945551 232927196 233594734 235636898 233349531 234790840 236659123 236770616
6097 236770616 234480949 236650708 235540290 236816982 237103672 238569481 240721160 235424095
6089 235424095 237372378 237469915 236822561 235608615 234361307 234875456 234332506 234100973 232226084
6080 232226084 228915915 232717707 229564155 229950518 230282148 226978906 223132436 224474254
6072 224474254 222820032 219942725 217492394 219799258 215401538 211529628 213384629 209891601
6064 209891601 208355025 205408516 203801373 201431528 198569145 198935708 200651917 194313495
6056 194313495 192509733 190060461 186684732 186276021 188479497 183848024 181286058 180141886
6048 180141886 174696369 175632114 175864673 171719571 168592720 170998663 163274549 165641425
6040 165641425 163275892 161541160 160985078 156642162 155567239 152731357 152791415 149415825
6032 149415825 148810810 147305720 143520645 144025599 143560201 141224877 139593867 139429593 132938149
6023 132938149 134704129 134558693 131754010 130614148 127766941 128890947 123488752 122719098
6015 122719098 123689517 123130980 120291472 118137218 118249725 115855090 114452021 116540095
6007 116540095 114783029 113857945 110879025 109143740 110158546 110143483 106268231 108100502
5999 108100502 104886668 105122990 105046067 102209288 103121367 101003422 97485774 98341119 98861534
5990 98861534 95278088 96384051 94859715 95063003 94565492 92587919 91992392 91773314 90449577
5981 90449577 87793558 90500419 88146274 89603822 88983254 88080258 87025485 85731609
5973 85731609 83016461 85142633 86921841 83603959 81839285 85029012 83921368 80714571
5965 80714571 82266373 82262029 80975529 79052983 80035033 78006687 80072333 77026415 79783995
5956 79783995 77279258 76884030 75040915 77646068 74369207 75641755 76034434 76994548 71522925
5947 71522925 77591303 74351965 75132176 73996148 73277227 72108255 74352606 74489510 73543030
5938 73543030 73904742 72277232 73632082 73895790 73111669 70037134 73501452 70458407 73582815
5929 73582815 72638242 72230078 72829542 72059169 71178280 69911530 73488707 71947141 70160493
5920 70160493 72647147 72733275 72788770 71026361 70283833 72131032 73268415 69131927 71422068
5911 71422068 71666537 72607251 69971024 74555110 71960328 72528608 70494142 74202331 74696185
5902 74696185 74395628 77092668 76092615 77509515 75207532 75660127 73312687 78211800
5894 78211800 75608442 77992048 76180047 76770456 77451192 79444706 79230322 79734139 78938780
5885 78938780 78406567 82805817 79916978 83751204 82486832 81755595 82013650 84618226 86161993
5876 86161993 84256098 85292955 87230703 85601032 86836256 90090853 88941066 90152170
5868 90152170 87312661 89394883 91265820 93550864 90115966 91598875 91926681 90968453
5860 90968453 92546751 94499631 96807921 95523484 95393491 97666444 98997182 96745612
5852 96745612 99295496 100162640 100134705 100321687 101080664 102806152 100907343 101535442 101881493
5843 101881493 104232603 104436294 105308966 102477655 106916156 105747290 107378300 107329940 107622578
5834 107622578 107860894 108542636 108718190 107698560 108877133 106214533 109407232 109963257 112103370
5825 112103370 108113838 108365119 108257501 109185636 109713865 111242296 110986973 109142717 107384369
5816 107384369 110024094 108881677 111314922 108169865 110867474 107743972 110096143 107308751
5808 107308751 111215504 106229093 104986450 104765813 106137653 107397415 108010382 106792812
5800 106792812 104717684 106910744 107078904 105033718 103459914 104431142 103898510 105284156
5792 105284156 103783789 103712728 103199311 99732684 100048337 101520110 102055795 100035591 97252519
5783 97252519 99881252 99923026 93751710 94944405 100040324 97735090 94722475 95562501 95789321
5774 95789321 92551415 93084284 95623312 93261029 92826478 90737229 92591975 93847726
5766 93847726 93596563 90776518 87961718 89866332 92691022 87566776 88716144 88200978
5758 88200978 91030665 87847111 88210807 87609520 89006215 89885839 88434622 86941418 83802338
5749 83802338 87020264 82259998 86707182 87121758 86768226 82986050 86497503 85489949
5741 85489949 83720206 83864081 85916046 83646813 83735728 85552264 85039860 85843207 83969554
5732 83969554 84986289 84453315 80578830 83362938 83607605 83032298 83565695 82593121 82788422
5723 82788422 79255287 86924755 83642111 84422915 83393635 85054879 83687664 87769663
5715 87769663 83507764 84609103 85971829 85964736 83776448 84711130 83897360 85529697 82854294
5706 82854294 84910835 85626782 88883901 86058637 87699440 88330060 88571870 86565588 88997198
5697 88997198 88278681 87981717 90342988 88447654 92294541 91440771 91995279 88838009 90508599
5688 90508599 92029326 91253569 91713887 91103429 92159816 94487605 92755970 93107599 92639369
5679 92639369 93178386 94392652 97522428 94838751 96466881 98279012 98468787 95469771
5671 95469771 98889898 100019297 101240726 101949892 103027468 104453912 104380163 104695483 105058700
5662 105058700 106987931 107646843 105727190 109502859 110543715 110159255 112522725 113545691
5654 113545691 111787527 115103661 114328823 115605012 119137913 116515500 121614896 124073946
5646 124073946 121593887 124752065 127611128 126012144 129761581 130175606 130748858 129438902
5638 129438902 134470723 135544469 133027069 138064026 139264868 138706140 142856720 142169626
5630 142169626 147718747 150220666 146949388 150673104 153079529 155057012 155975346 160771529
5622 160771529 163676467 165732080 166680825 167921591 170487789 173395745 177211693 176392787
5614 176392787 182162408 181146548 187320687 188885434 191248597 193281972 195009441 197043874
5606 197043874 200554358 201567295 206291097 210413885 212691336 216220333 215890849 222237959
5598 222237959 223374139 226151021 230969578 230807846 237172536 238820091 242801178 246200165
5590 246200165 250905450 247607160 254133572 256960594 261965614 262535739 263742856 270126584
5582 270126584 273319122 277107287 279540781 282387989 285159850 289981472 289248682 291219646
5574 291219646 294781281 298565525 302710247 305566294 305505419 306433612 310794940 315541089
5566 315541089 318650710 317883349 320553248 322233796 323678439 325373737 331696264 332319957
5558 332319957 334324910 332491952 338724367 336619479 343142045 343134822 344434683 347431024
5550 347431024 347321709 346513559 353831339 352797266 352684162 353056914 352703138 355839386 357005824
5541 357005824 358096724 357395271 358835957 355520429 356533583 358116785 357019976 357344319
5533 357344319 358073821 357896653 358421534 359977169 358830914 358437016 360359484 355856491 358755306
5524 358755306 359605623 358631399 354881586 358358591 357717190 355305711 355189782 354874546 355015017
5515 355015017 352531867 350579159 352336865 350279987 346786224 346795334 348053026 344855277
5507 344855277 345641926 344502432 338073863 338457781 339866148 340319411 338088015 335980847
5499 335980847 332477187 332663699 331519064 329733526 326223897 326807002 321263575 321920350
5491 321920350 322703741 319329286 317916233 315829661 311066578 311579188 310478037 307352710
5483 307352710 305143810 302886891 300327464 299172447 299552316 293769247 294055968 290919634
5475 290919634 290840703 286367079 285481565 285315824 280512630 278666243 278950678 273419765 274287253
5466 274287253 271706511 270345330 264763723 263386760 262729580 260522833 256932067 256588698
5458 256588698 255655090 251203997 249409800 250489140 245020469 245214267 239473173 239879425
5450 239879425 238599858 237973363 232611151 231900387 230725763 229526145 226378028 224869805
5442 224869805 225033097 220362364 219078074 218152571 216772105 214994677 212334622 209288256
5434 209288256 210239039 209037306 208129529 208495085 203484723 202882241 204667538 201573932 201419226
5425 201419226 198571304 196345589 196210275 194469010 193450117 191543174 190237687 187315301
5417 187315301 187281370 186849009 185907832 187023673 182218114 180890021 182068898 182633669 179793153
5408 179793153 177215435 180549704 178045471 178202175 176390472 176919357 176621196 175473627
5400 175473627 172644714 170556490 171703932 173080603 172075475 172742672 170492914 171330023
5392 171330023 168078575 169765894 166026689 164654082 166146760 166474991 165624385 167073128
5384 167073128 169316048 163987113 164078676 165902305 161506923 162473385 163482784 164960175
5376 164960175 163675545 166862239 166961673 164636376 160728493 163325077 163736187 162681430
5368 162681430 161513889 162944514 162991022 163270750 162653350 162212090 161460226 163308548 161828090
5359 161828090 163299693 161338438 161747738 165043018 163747642 163468477 161906537 163877872
5351 163877872 159404846 162226835 162347993 164621770 161430406 162370483 161665591 162985509
5343 162985509 160756004 161055357 160419449 160859260 160643351 160880887 157727518 159675895 158443633
5334 158443633 159739440 157953155 159132199 159372512 158104383 155547060 155495532 153320908
5326 153320908 156977085 155992651 154609037 154292909 152504735 151916700 150640773 153496669
5318 153496669 150285055 150669502 147890877 148019774 147947797 148646124 146513820 144454644 144185805
5309 144185805 144053566 143527558 142881209 141047536 138573479 140659275 136288380 136607069 135702487
5300 135702487 133853966 134858968 131702873 131697158 129243886 127757888 129991581 126270354
5292 126270354 125737910 123108284 121542612 121421039 120239081 119911947 117471212 116543665 112914510
5283 112914510 113274952 113806105 113967173 110130166 110384227 106348749 107414442 106378837 102747504
5274 102747504 103426625 104957621 102213215 98174638 97951580 98852193 97832652 95642643
5266 95642643 93820147 95621626 93112322 90135245 91472118 93583390 89565332 87455532
5258 87455532 87293418 90308240 86901810 86161885 85384835 84848137 81775351 83662362 83623889
5249 83623889 79678487 81521083 80512677 79848594 75352566 77941117 79528267 79001217
5241 79001217 74349722 74139643 74917473 75198801 73748238 74160693 71202333 73210211 72547459
5232 72547459 70777677 70330622 71282383 70588645 69541360 69985011 67907116 67898253 69815698
5223 69815698 69342870 66641413 67153475 66343871 66033761 64942692 65683468 64124753 63327832
5214 63327832 62215452 64965514 63328551 63764993 64126070 62453475 62310245 64287649 62034014
5205 62034014 59596103 62141741 60925570 59449699 60418917 58271818 61149403 62044581
5197 62044581 60707162 54474411 58221526 58201040 59318380 58445670 59055391 56916727 55614729
5188 55614729 54794694 57036362 57044868 55937631 55238176 54976911 51847673 53837969 54089036
5179 54089036 54013555 55324890 53770687 52898154 52749134 54484580 53193063 53337805 51241853
5170 51241853 52134689 52035835 54075373 53463552 54047032 49929313 53358052 52983821 50835265
5161 50835265 49665368 51636607 52319785 49456609 50427354 49389909 49799147 50934215 48159698
5152 48159698 45830517 47176579 46713367 46970390 50143819 47290483 47260035 46312620 48714041
5143 48714041 45693067 46945553 45651890 46563568 45333377 45194574 48461523 45581509
5135 45581509 43444400 45281931 45592337 44625545 45314354 44591704 45344735 44217766 43787100
5126 43787100 43988732 43858877 43989571 43417270 46024939 41534096 42706330 43663125 47575257
5117 47575257 41713902 42412703 39816731 43384302 41687888 39864300 42311739 42042887
5109 42042887 40317596 43060011 42938706 39889390 42934748 41151241 42535130 42184322
5101 42184322 42704812 42114797 42556650 42537279 43546245 41056402 38663045 39963823 40727458
5092 40727458 41785194 43234838 41861554 41200754 41950315 37832607 38777924 42413882 41435999
5083 41435999 38938541 39332502 42653210 39290359 42915520 41720376 42891138 37401148
5075 37401148 41116432 42961477 42660680 40563510 42133554 43752352 39711395 43208589
5067 43208589 42487060 43698803 39686758 43116080 42169364 39855231 41323570 45856726
5059 45856726 41617674 42611088 44711030 42571096 39090294 41514921 43553860 41642817
5051 41642817 42247391 42553508 44175605 43876147 43127915 44406583 42355223 44383430 41582131
5042 41582131 45200399 43730125 44311988 43591850 46845379 41295974 42741464 42906242 48841801
5033 48841801 40859856 45440809 47613974 43896557 44572001 46930500 48325695 45925140
5025 45925140 47472349 47536782 50569207 49346368 50461130 49685629 50367849 49059351 51474995
5016 51474995 50859910 50496041 51502364 49878667 50945171 51322311 53132431 54118175 54739260
5007 54739260 53375044 54007835 54527226 52347431 56356635 55297430 55903212 55062050 55743969
4998 55743969 59191222 57708135 57985739 59252170 55714356 58756665 59745713 61080250
4990 61080250 61155978 58267399 62648993 62617238 64930618 64935132 64522566 64421036 64660335 64847670
4980 64847670 68386916 69317628 68369126 70179969 70531894 68698169 71322181 69617978 71136931
4971 71136931 72678361 72755648 75047471 74266524 75114803 75800389 77893530 76218612 78856119
4962 78856119 76683687 77793723 79609652 79893620 83992894 83138146 86712869 84425494
4954 84425494 85464842 86661192 89511916 87594598 90122727 88344093 89220920 92741384
4946 92741384 90300055 93273852 92321734 94093881 93586486 97160301 97652951 99578971 96959588
4937 96959588 96413220 100131464 103006288 99870827 104752221 104657037 104066773 105566278 107540796
4928 107540796 103134581 104797077 107536137 107840533 109976508 109245718 113302137 107116564
4920 107116564 112112944 112447906 111463041 114093595 113814341 115233483 116422660 115735252 118977288
4911 118977288 115097400 117279698 118944260 119709514 118193794 119974443 118357550 123569796
4903 123569796 120750689 119602428 121019052 122819726 121444636 122074410 121578720 122531862
4895 122531862 120025599 123544956 125451313 123191007 122080383 125715581 126278095 123455208
4887 123455208 125289666 126177779 123716565 123260400 127330212 125224762 125062553 126523747
4879 126523747 124860832 125677505 126261631 127089572 126180281 125534333 127234441 125624241 126572860
4870 126572860 127152319 126549222 129356043 124474688 124087386 124292203 124996731 124731294 126254308
4861 126254308 125828397 127181341 123814021 122649875 124633591 124553843 123671308 125859106 125151769
4852 125151769 122498393 126373564 125278300 127582540 122572691 125436366 121959202 124590729
4844 124590729 124639350 125735869 125630565 124637114 125265684 126660842 126632249 124608803 124683496
4835 124683496 126228397 124079338 126250966 128194855 125868840 128990736 129046519 127433079
4827 127433079 128281752 128826268 130306849 129722097 130448684 130661903 130027403 132689063 134669455
4818 134669455 133866683 133922999 135336762 136201022 135621313 135407503 139416681 140806853 139115998
4809 139115998 141332286 144806740 142738922 143923707 142993916 146178542 148507187 148178943
4801 148178943 150379176 151190839 155903835 152691281 157511436 156328926 157136360 159214143
4793 159214143 161437159 164643137 161542549 167908765 166605498 167138871 170596094 174676774
4785 174676774 174895869 173551181 174896774 179779573 179807905 181315350 183847204 186257520
4777 186257520 187950918 190703327 191585122 192935241 198192987 196864642 200173734 203654358
4769 203654358 203112831 205398885 209920394 210876332 211252582 211321585 216949515 215898603 219505277
4760 219505277 221289063 223689327 226096643 227732891 229205396 232224889 232483598 237304115
4752 237304115 238439375 241502991 239313409 242283168 245298286 248397633 250936774 250532958
4744 250532958 250362213 255278557 254039130 258867215 256349919 260793514 260120827 263263643
4736 263263643 267178827 265319182 267985354 265764427 269833852 267649915 270738940 273444703
4728 273444703 274103701 276807422 275628393 277282741 274622868 278253012 277741407 278737119
4720 278737119 281478541 277882101 278884632 282387085 282664372 281635694 282239735 282348925
4712 282348925 282032373 280804747 284912745 282017079 281362846 283885967 283186999 282794897 282333099
4703 282333099 283936223 284449904 282716931 281170412 280722165 281613289 281437448 283112144 283029966
4694 283029966 281874732 277944273 278365614 280717652 278126353 274303227 277993172 275988157
4686 275988157 275964297 276389275 275424015 274449969 275041976 275394429 272448420 272868448 272578018
4677 272578018 274545842 267004494 272085240 274088054 268229020 268036278 270437563 265382763
4669 265382763 265946871 265229221 263855386 263386038 264194307 262887759 260008940 260816236 260960540
4660 260960540 258025319 257172495 257558517 258382448 256271053 254874847 252696671 251540028
4652 251540028 251729012 252943359 248248548 249671615 247290336 245421731 247128159 247026712
4644 247026712 244333966 238690510 244071366 240401273 238314221 238764591 237826622 233113750
4636 233113750 235279389 232763834 235138656 227981079 227808969 230745928 225976031 225165371
4628 225165371 223563106 222441802 223762750 219143491 218395793 214909020 217854546 215157342
4620 215157342 212653114 211444094 210366192 209225152 209192994 208781744 205087297 203460190
4612 203460190 205223006 203228785 201427042 201246860 200664411 199952051 197028047 196018966
4604 196018966 194646074 194252731 193211965 191643051 191368479 191292056 189726739 185811189 185614221
4595 185614221 185472657 182839207 184122651 181404215 179766743 179188693 179630311 179339331 174994556
4586 174994556 177330771 171815148 172414443 172646656 173749613 167619009 167064465 167575655 166501743
4577 166501743 165194941 165017021 163980882 163971966 161319351 161771828 158334125 157803708 159446633
4568 159446633 157102389 153921432 153930218 152213502 152309984 151153294 150524045 148785658 144202552
4559 144202552 145194578 144024924 145772361 141324369 141299761 137610052 139674968 138723406 137190661
4550 137190661 133859805 133793876 131293914 131498091 130436382 129422569 129618312 126468655 125761704
4541 125761704 123061226 122220099 122465039 123357303 119837673 119918221 119974717 116539125 114781166
4532 114781166 113383846 112765164 111742105 111493470 111935898 107376779 107028809 106790642 106875992
4523 106875992 103128057 102630699 102469813 101609505 98225445 100785779 98008954 98702438 93305390
4514 93305390 95392166 93007036 94445887 93116394 89263028 90006285 87609493 89976195
4506 89976195 88895659 87097064 85051476 86169221 83475185 82059846 81320390 81242267 82343161
4497 82343161 78156288 78709252 79141943 80295891 78102541 75133691 74188138 73508391 74266723
4488 74266723 74115493 74368204 70802382 72731662 67275242 70522577 70889071 69106229 65318452
4479 65318452 65078455 63952893 66277949 67232771 63238336 60811550 63571943 62894432 62327291
4470 62327291 60222124 59400197 60345943 59243703 58322614 59833225 56826743 57730865 57096417
4461 57096417 56867641 53237338 55929968 54890239 53641177 56782766 53160567 53863018
4453 53863018 49821764 53145074 49415592 51518055 51289120 50175786 48703340 51309164
4445 51309164 47586247 50851669 50051913 51741562 47003184 49140774 45026595 47655402
4437 47655402 47926279 48840693 44642635 45603724 44745870 48287875 43981222 44627450 43541390
4428 43541390 41122408 41657926 43737284 42098503 42383641 44167613 44057757 40411155 40183328
4419 40183328 43876665 42473148 40100824 41000163 38850971 38338020 42709110 38070733
4411 38070733 40793683 38470958 37980405 39210938 38490107 37169037 38347493 34157811
4403 34157811 38532514 37795185 39441987 35700486 36595041 37605686 35596844 35787416 35526449
4394 35526449 35946564 36064819 38719277 35637442 34815225 36397071 33583556 33455002 36371682
4385 36371682 33581069 33310024 35409718 33912619 34871424 36512203 35796193 34054127 31416417
4376 31416417 33202470 36309212 35130422 31629500 35484695 32740971 32933613 34882907
4368 34882907 35570756 33734831 32763956 32308067 31410611 31699188 32944003 33173072 31517371
4359 31517371 31846545 32404335 32542276 31598484 30463003 31329325 31521513 29391838 30921442
4350 30921442 34343021 30659694 32444766 28585499 29053350 30267980 31072997 30856169 31600846
4341 31600846 30109942 31004007 33452102 29627477 29989484 29551694 30825230 28272584 30837689
4332 30837689 28791332 30057662 31065940 31474715 28790044 28999012 29502497 25317675 29806392
4323 29806392 28893795 27242743 29668769 28328245 29014229 30085998 30141099 27014760 28348986
4314 28348986 27966335 31020971 28709240 29828135 29960459 30610636 26080516 28668357 30344704
4305 30344704 29044658 29049560 29810258 30660439 27810218 28224281 31475315 26986190 28211058
4296 28211058 24400073 27710055 26802029 29510076 26497402 27883610 25408479 26826729
4288 26826729 26629914 27450082 26399427 25644260 24125084 24676263 24991018 24003118 25993922
4279 25993922 26866794 25365609 24201649 26180360 24196253 26134021 25673246 25514650 21683425
4270 21683425 24631936 26020324 24378526 23427494 24362422 22127699 22864627 22287416 20653808
4261 20653808 23608323 19735280 21534851 20272901 21366471 20576492 22346541 22383169 22099652
4252 22099652 19338214 19170101 21724695 22215603 20299295 20019388 19219257 17925107 20599526
4243 20599526 21456361 21669801 17871397 21546113 21065013 19327805 20175020 17893608 18368189
4234 18368189 20850143 18227314 17481921 19643620 18811215 19654578 17259929 18099128 16781684
4225 16781684 17048643 19942364 20091532 17186938 16187120 16572776 17047530 17237137 17016775
4216 17016775 17959224 13546627 17041194 18529514 17114558 16436134 18840044 16940918
4208 16940918 14835452 19018052 16622344 17861710 18201134 17549987 16839410 17646145 17423911
4199 17423911 16425334 17792243 16428918 13315496 13865533 15853877 18360272 14793993
4191 14793993 16758075 15150348 14068310 13403631 12968967 17277526 14193123 15805717
4183 15805717 13733529 14491156 14411364 14576405 11950998 14746779 13575500 13831721 13834879
4174 13834879 14561975 12645753 10343812 14718484 13861254 12749655 13197895 14132365 13743357
4165 13743357 13747296 15450228 13237156 10973379 15312947 14744730 12724397 15513763 14191455
4156 14191455 13382373 11485283 15928570 13646407 15060269 12499451 13656711 14234275
4148 14234275 10898508 15416673 11530702 12843736 12978862 13189581 12488658 14469013 14702960
4139 14702960 11310075 13677416 13189561 12573067 14498986 9831596 11240508 12209445 11563795
4130 11563795 13049632 14421255 13853443 12406351 12660654 14473842 9519955 11959534
4122 11959534 10417816 12233340 11351225 11045863 10329900 12854922 9522835 11983815 12166049
4113 12166049 11240455 12366074 11998869 11671967 10743570 13038612 8869360 13727596 13656096
4104 13656096 11244262 12249327 11929145 8931318 14686570 10850165 9585790 6675119
4096 6675119 11567603 10993608 11207546 10230617 9589836 12281046 11367184 10711685 12526108
4087 12526108 10990198 8379140 10340602 12729825 10021527 9815626 10111174 8924206
4079 8924206 10007686 11383010 10950912 10643407 8533632 8651288 12918178 11846949 9372767
4070 9372767 12080011 10006520 9283693 11670302 10897766 14393400 10347338 10423528 11991640
4061 11991640 13549299 10803240 13067782 11716484 13151380 11694031 11416006 13186777
4053 13186777 9119592 8536442 12020026 12263937 9958285 11980092 10921993 13075725
4045 13075725 9693561 12422404 10632283 10188194 9262198 11241560 10809140 10452168 10090105
4036 10090105 12089074 8015392 9084907 11778008 10581701 9511215 10335602 9110639
4028 9110639 10313121 9728883 9288262 11094851 12650485 8909297 9890488 8477936 10194360
4019 10194360 10770046 9571979 9577569 11952562 11972659 10365612 10667219 10078057 9274727
4010 9274727 10770717 9395871 10915233 12382124 11710679 10213966 10066645 10933526 8555744
4001 8555744 13059076 7858442 6472737 10424856 13169939 7812510 11424101 9837074
3993 9837074 9462703 8725458 10502059 11120700 8751538 8042402 11934820 13369438 11445552
3984 11445552 12675195 7839598 8598765 8313116 8890297 8087220 9416029 9493052 9330127
3975 9330127 13284469 9992959 7635879 8155728 8808940 11145888 7673536 9259035 8629816
3966 8629816 8116272 7603177 8491035 9913032 10862752 5836049 8922361 10098897 9720327
3957 9720327 8253376 5943143 8876091 8078989 4576868 8691943 9488999 5559343 7556082
3948 7556082 8960695 5995081 8439585 8843364 8561147 8564385 7249263 8739903 8369615
3939 8369615 6970058 6685046 9845592 10324609 6364500 5503925 8547188 7546869 4996728
3930 4996728 5067202 6846767 8231202 7612167 10097287 5868616 6581948 8317651 9927543
3921 9927543 8068311 8881865 6965633 8945612 8381350 10926993 8837615 5471096 6061488
3912 6061488 7808238 8550292 8215585 7198212 8039961 8422881 9846394 6701020 6305875
3903 6305875 7448473 6388114 7017761 6970715 6064962 7029591 6927203 9364844 6672490
3894 6672490 4926726 6650042 6815667 9021729 7956137 6072497 8290342 8711643 8019896
3885 8019896 8168631 5307291 6598292 4736385 7225909 6619926 4808989 5536166 9117660
3876 9117660 5898380 8510157 5749737 8397051 6478903 4624950 6293503 5920859
3868 5920859 5226072 5760469 8111496 6289197 6339746 3693983 4803677 4369961 5869005
3859 5869005 3802665 7055981 5671785 3921620 7643860 5842310 7646198 5122188
3851 5122188 3424162 5042302 7313978 5465041 6707436 6865520 5738770 6452717 1919008
3842 1919008 7035809 5417609 8778014 3789029 6593559 6259455 6030974 4204680 6226616
3833 6226616 5962874 7885818 4118179 3880882 6078456 7382461 6502430 5917905 5521770
3824 5521770 5641454 5633139 3608106 5909988 7227811 5593581 5377846 7832737 5188665
3815 5188665 5083258 5401285 3798652 4839119 5435559 4861339 5536891 5757562 6598814
3806 6598814 5309847 6256113 6687847 4117445 7030560 5336533 6586179 3148636 2453430
3797 2453430 5676605 4009288 7901429 5931455 3335256 3176117 5256151 6049138 4483972
3788 4483972 3925022 4847018 2701838 6458287 5241327 5042682 7664542 3195716 5961852
3779 5961852 5356741 6075928 5993274 6612332 3735185 6751997 4625820 6586306 7219445
3770 7219445 6451009 7759730 4442025 6523480 7189234 6060431 5213987 4764396 5068038
3761 5068038 4329402 4487780 4630196 5972258 5591775 5114565 5271250 6357326 6167799
3752 6167799 3836386 4401083 4964390 4561555 4307028 5762294 4762758 5316808 3070705
3743 3070705 6160024 6827975 4563482 4405319 4663428 3870337 6388882 8142710 4763058
3734 4763058 2159253 5551988 5155602 6599514 4415761 4470686 5877246 3065936 3698529
3725 3698529 5278738 4508375 5185728 7724519 5974473 6506157 5181776 5376133 4508428
3716 4508428 2843867 3350822 4223439 4743419 5949503 3855435 7537534 4165464 5022699
3707 5022699 5743221 4683647 4546728 8772454 4864495 5198684 4595099 5985350 4588953
3698 4588953 6487466 4814943 7378516 3790965 3730940 6126452 6869031 4788669 5974232
3689 5974232 5605543 4540715 6306888 4184165 6876413 3061079 6316247 6243552 5112069
3680 5112069 5799742 6140127 7375330 5388423 5994424 5899178 2848992 6368111 5109671
3671 5109671 6147205 4647650 5052008 5965649 5562512 6921434 3441540 4994646 7192486
3662 7192486 1221523 4283871 6411956 4825217 2013029 5093692 6574327 3356793
3654 3356793 4569188 6478685 5638826 2828038 5936717 6682315 5037529 3505851 5307806
3645 5307806 4308914 5414493 3949058 4236760 4137572 7162403 4221174 4675714 7503502
3636 7503502 6307196 3025414 5159931 5502855 3480727 5253336 4441788 5071695 7126922
3627 7126922 5716892 5943582 3359353 4782816 4660870 5165654 4722599 4690597 6530087
3618 6530087 3320701 6304709 6001291 4166351 6407581 6438420 3055833 7050344 3095767
3609 3095767 7187999 6288978 6544283 6754896 5555073 6788767 4546662 5774604 6738945
3600 6738945 4576566 6534598 4722373 6742297 7760744 4078488 6055933 3227706
3592 3227706 7016309 5133605 3844061 5674444 7788649 6515175 4611177 6465153
3584 6465153 7889981 3814112 4472152 7308637 6098202 6005455 5592698 6094366 7361190
3575 7361190 5613528 10016645 8586286 6914177 3805462 5160603 3376541 7064889
3567 7064889 7326646 6099364 5161493 5682563 6908068 5968298 8305477 4715085 5214140
3558 5214140 7192748 6540423 5435082 8757213 6670542 7238081 6242918 8369637 6321529
3549 6321529 7191832 7138580 3970914 6101022 7330876 6419925 8408139 5818263 6847824
3540 6847824 5966453 5852409 8873118 8834667 8034592 7576445 6095907 5395860 7287926
3531 7287926 7988183 5906366 7308219 7781139 8094262 5500548 8532835 7045286 6811190
3522 6811190 8521518 5577616 7423148 5792139 9072081 6753057 7254368 7872495 6632633
3513 6632633 10256843 7133005 5589464 7665020 8750646 7873400 3535164 6148397
3505 6148397 7343900 10563887 9116486 9156308 6033635 5580890 6988616 6169987 9428684
3496 9428684 6663686 7616422 7777978 10949692 9372025 9911595 9599210 8383016 7247636
3487 7247636 9160901 8138967 8067610 7800414 9172571 8355305 8937909 9789485 10016214
3478 10016214 8949662 6425235 8742334 11028272 8312725 11221248 10164511 12648171
3470 12648171 10802807 10752273 8855611 10388133 6862192 9770422 13532767 8747346
3462 8747346 9701253 9842868 11485258 9082822 12798153 9929751 9385473 11264480 12731763
3453 12731763 13326143 11456355 9894523 12492141 10439443 13174885 11292577 12542211
3445 12542211 12531233 12163826 11427201 13807908 14669683 14135632 16706484 13496811 11888865
3436 11888865 14695860 14200332 13071713 14578705 14604827 15350437 15726070 15571910 16517872
3427 16517872 16373648 16770119 13813797 16305393 15790870 18364073 19767125 15046163 16594342
3418 16594342 18777913 16795463 17841102 19221737 18116594 18099758 19242330 18899507 20558710
3409 20558710 23088993 18088552 20310093 18637242 21229074 20664704 20689234 20927140 23390559
3400 23390559 24648878 23826524 23925687 21965652 24032182 27140671 23293621 25201080 28738004
3391 28738004 28230744 23845262 28086147 30178395 25939181 27343771 29436031 30142351
3383 30142351 30667300 30793475 31571717 31661669 32813805 32544798 32637242 34367996 31844070
3374 31844070 35297572 36093900 36526483 39073541 39111131 40922786 40742838 39653753 40338635
3365 40338635 41033989 40997045 43022612 44622095 43951289 45184210 46728009 48092839 43682757
3356 43682757 47819689 49531382 49880567 47589275 51435358 53049875 50411380 53766404
3348 53766404 55309537 54635861 54938902 59004123 57295849 59849776 61491758 60869685 61408818
3339 61408818 63068450 63209532 64509853 65726367 67238829 67388569 66345182 68010662
3331 68010662 68961042 71974689 70527792 71157684 69152297 72558470 71367904 72384153
3323 72384153 72730531 73520531 74669296 74411809 76216580 73281914 73189613 72264254 74682851
3314 74682851 73233366 70529208 72066056 73650252 70921032 72824840 71519022 70296905
3306 70296905 68655146 68726991 67340871 67009569 68098032 63844525 65046319 62145886 61236636
3297 61236636 62398476 59325034 59156145 58257573 59012352 57120559 56599789 53691625 53672377
3288 53672377 52884896 51302449 49399294 52656228 47422123 46443133 50974344 45013009
3280 45013009 46632538 45377274 44218578 41698542 42527978 40857978 40806204 39191560 40497295
3271 40497295 39765283 39645588 38576278 37367999 36958463 35898992 36154814 34799055 35629844
3262 35629844 34033700 35736483 30905459 30382238 32931580 30288710 29915006 30326096 28879362
3253 28879362 26407752 30430705 26968659 27241277 29312657 28783941 25719828 27466799
3245 27466799 28498615 25484436 25434164 25237433 26034494 21806262 24925881 25168980 25106016
3236 25106016 25351011 23800594 22258467 20845082 23253327 22072806 22471675 23646615
3228 23646615 23368380 22006677 20280128 20951118 19491672 19053474 19310674 18278472 18392841
3219 18392841 19658079 20390661 19526852 18359429 18603541 15450649 18783762 15871647 15946928
3210 15946928 15649135 17075105 16986200 16725951 17072364 14744638 14425544 14443734 15414488
3201 15414488 15103395 13883759 15153225 14861356 16209208 12372149 15958668 11639408
3193 11639408 14263689 13740959 14030300 12958589 14995908 14689176 14779324 14410478 14279311
3184 14279311 10999557 13053796 12251070 10938641 9003728 11290845 11080502 12180768
3176 12180768 10769127 9915755 9990857 10329022 11776101 10094278 9993867 11229539 10623096
3167 10623096 12436145 13546432 10792206 10186042 7933567 9477848 11324134 10705120
3159 10705120 6123088 10554316 12082910 10129055 12354506 10672575 10072327 6587533
3151 6587533 6540144 9528662 9824588 9494810 8862064 8203848 9664846 7526528 9575888
3142 9575888 8122816 10276943 6624256 7962198 7539431 8915735 8075843 9268960 5933893
3133 5933893 6370706 6061598 9284117 8976915 6695611 8081604 9089163 7596498 6620988
3124 6620988 6600740 5291388 7202712 9333278 8724114 7156477 7186230 5841462 8431317
3115 8431317 8160003 6141068 4363608 4974696 6037100 4978191 6239688 7227821 8207119
3106 8207119 6163240 2239521 8493208 6380861 7162292 5143339 7399447 4950544
3098 4950544 5330788 5877178 6356844 6553564 3215438 3159504 7474465 8512270 5173920
3089 5173920 5820917 5888732 6339265 5943927 7456090 5071013 7721988 7363744 7730086
3080 7730086 6760756 5873139 6704768 5301236 6202755 8407437 6460399 4824574 5081132
3071 5081132 6042491 5644566 7597281 4535632 5761362 4162610 6772221 4650995 5683135
3062 5683135 4695164 3802660 3921349 4859069 4567789 3435591 4129636 6383160 4229375
3053 4229375 2424574 7324998 7659387 4417160 5471577 6361256 4364495 3026710 3967187
3044 3967187 3645555 4737091 3734052 4904864 5347413 4341442 5024890 2940497 3130955
3035 3130955 2765799 3107512 2428852 5740772 5387764 5593128 3817717 4529317 3940273
3026 3940273 -253384 3736102 2535364 3406420 2926195 4089016 4163878 2310775 3419683
3017 3419683 2468996 3312739 4487202 1401240 2238419 5593096 4274663 5838603 7993134
3008 7993134 3848652 3055694 2916049 6845711 3374014 3188796 5181926 5099950 2527648
2999 2527648 5028864 6874823 2054729 4597389 2905888 4562299 4116702 1601140
2991 1601140 3199880 4252819 2763926 916925 4053499 4616726 1798040 2668422 3432594
2982 3432594 4824459 4461207 4757088 4756341 3121910 3487162 3894095 2597189 2712321 2834274
2972 2834274 4319510 2933628 4173792 6017325 3664084 1384095 5058551 2835048
2964 2835048 2127972 3983435 3561059 3031134 3062370 3935899 2266782 3124511 1045878
2955 1045878 3354899 2704635 2989514 3046976 1310035 748846 3251754 2095883 2131675
2946 2131675 830101 1108894 1971408 3148516 3184269 508557 1197722 3287070 1374617
2937 1374617 4801747 3314352 362334 2121959 3599619 5207471 2714743 824730
2929 824730 46194 4297265 2491183 4837152 3037178 2753570 1246768 2829521 301081
2920 301081 -83971 3488482 2867079 -142277 2472102 1730933 4239420 536921 1864589
2911 1864589 1693190 4124167 2391981 3722983 2653358 4024718 1518748 1772234 3762953
2902 3762953 4898880 3556023 2771667 3969580 5817271 5048169 2774061 3099167 3964163
2893 3964163 5126480 1784462 2273965 1190791 2500235 620564 3770107 1067674
2885 1067674 2496895 -1265140 1516043 2472347 780375 1383605 3892081 3654995 -1652700
2876 -1652700 2587145 4843913 1623714 1310493 1117700 1115513 1657486 2320167 2953815
2867 2953815 4624594 4127388 640757 3930469 3634417 3971891 4479155 3429720 753910
2858 753910 4100071 4039553 2803078 3362591 4260560 2505172 2204088 46904 2877304
2849 2877304 1506994 1566991 2180105 2923584 2587968 3803410 1600744 1347168 -258832
2840 -258832 2435307 761465 282452 3983473 1819113 2448624 2311535 4238904 4383433
2831 4383433 2486971 3129398 2328151 1564225 5821382 1540438 2653842 2868536 2197519
2822 2197519 2376440 2715941 2913889 -1425335 1698100 4812166 47345 2185675 3449318
2813 3449318 2000704 1018774 1595354 3358900 1594909 -827789 -446091 2627388 1078557
2804 1078557 2257225 1036007 1082160 547010 1484359 2742788 767387 2269873 4415371
2795 4415371 1742867 4499123 3127210 2653799 2219388 4034752 -1205071 2127433 652418
2786 652418 3545469 2201794 571816 2660357 3067267 1048665 15482 1820474 775321
2777 775321 82916 867467 2208005 2067678 2799763 2018026 4032655 418530 3323094
2768 3323094 -616991 3027188 665061 3802285 2889706 3726892 948737 1597526 211846
2759 211846 503386 -530048 5000844 3165967 1046118 2546547 987737 1776856 2177487
2750 2177487 1529746 1905428 3968944 2064317 1490731 3429447 2733567 1635247 2085358
2741 2085358 543860 205340 4588209 2676132 2929491 -1011605 1661017 3527365 2218690
2732 2218690 -928924 -35354 2972806 1774847 2472447 1537741 803302 2073075 2022856
2723 2022856 694811 2799768 1648594 -26743 1142354 1786072 1194858 -696086 3996991
2714 3996991 2606879 2060634 426640 1776075 2747061 4100695 72023 -934201 2561158
2705 2561158 3104953 3639722 926785 2347985 -1751490 1495896 4517373 2344405 851102
2696 851102 2914886 1706842 3106077 2407929 4044469 3763302 -2772751 230221 3274094
2687 3274094 1657241 4195582 1232421 556248 -475919 2418605 4006474 1966841
2679 1966841 3507762 -829711 3542071 6088406 1702183 3241364 -13808 -177728
2671 -177728 157060 2168844 2159121 824726 1067508 694952 3361146 1225945 -27997
2662 -27997 -690423 1412834 -276167 -435397 -1062691 2775756 1340193 20367 915460
2653 915460 2465648 1860580 -1102494 2208136 -79808 2813836 3070492 3108042 1361760
2644 1361760 3150456 1598445 3113352 839333 304401 -648741 2361100 991308 1883055
2635 1883055 -95222 3160412 2839383 263421 295284 2789895 2396069 776841 1536152
2626 1536152 1966113 -739967 1691636 927096 3820373 1270079 -612427 999821 1387000
2617 1387000 -595103 989307 1516025 1283498 1305082 694318 4152229 875451 327623
2608 327623 937660 4096421 287533 2252061 2820286 1323865 2114610 2737263 3546531
2599 3546531 66177 2082735 2392502 794626 1910431 2394445 1571100 -937244 1696056
2590 1696056 2239972 -19458 -411246 1025892 1219695 -427301 -1187575 716887 3953640
2581 3953640 2427269 -96538 -693317 3603105 1238048 -618689 552121 1479291 3171182
2572 3171182 992243 2337992 2819539 701207 649495 250598 1245404 1066185 2185480
2563 2185480 1427954 42563 1152615 1194090 1281093 1846163 218873 698639 1141565
2554 1141565 736472 -680847 2202361 3329886 774191 710777 -372215 587632 70535
2545 70535 2380175 1155773 1280096 2715411 907998 1802177 2425547 2764858 3078781
2536 3078781 -933418 586598 3714620 2191843 2191766 2111136 3266050 2169859 3320371
2527 3320371 -69855 2854886 1044143 1131865 1817255 1452133 -720305 2581837 1263280
2518 1263280 -78177 -794029 -791663 -231944 1422272 -1385281 1597037 1755795 -500517
2509 -500517 1272453 2156255 1743115 980493 1853684 1002660 156394 1728433 -846241
2500 -846241 2126853 1632471 2810533 -84523 1109374 323458 2099432 176103 2337940
2491 2337940 2491158 -592748 -766854 179125 1399974 -794077 290020 2837437 -858068
2482 -858068 1251630 4269889 1848583 -920921 -251858 559155 956556 -68029 1939108
2473 1939108 3140574 1229779 2641503 -561105 1866843 -140276 -505851 429344 448383
2464 448383 772074 385999 1325633 2602508 689966 1871464 828389 740164 -61054
2455 -61054 -591515 2898563 886514 -293454 -496737 1445892 897884 627128 -1397712
2446 -1397712 1197426 -1910609 1128037 771238 1079965 -2397207 -240579 3285685 1503361
2437 1503361 352145 1452696 161033 408082 489748 1996533 728891 170280 912341
2428 912341 2478572 1397743 1293405 -2882810 79782 -1252324 486671 1719386 1139349
2419 1139349 2747492 1495851 11858 364096 914557 -1881203 551414 559774 697884
2410 697884 303421 3433529 3136993 -927275 -660774 -418795 1187454 2288480 -392734
2401 -392734 2124750 2242468 3192594 -1458026 1820393 2186831 -323092 101130 5012028
2392 5012028 389583 510099 3548687 2015569 910314 -315821 4086233 830858
2384 830858 356575 -1157512 2304368 537997 -261114 2626985 200150 305403 1170402
2375 1170402 -695952 -386224 1281653 425592 883892 1111691 3038307 -195394 3040612
2366 3040612 1009196 78612 2545580 4246509 1918328 1179281 920882 403123 -1317837
2357 -1317837 1898991 1814242 489430 -1878269 2333712 -1678063 -240910 -181505 2666244
2348 2666244 -4005196 -895002 -95969 105855 141214 -859448 365483 -1699040 43492
2339 43492 -187580 1461405 -292100 1681125 -1308055 817338 313330 204694 -1301162
2330 -1301162 780505 941681 -1924648 3228 262182 523574 2658098 1005954 1028757
2321 1028757 1187358 3662186 275364 910103 1278905 1683669 -1851641 -1617702 1003052
2312 1003052 344573 26009 1856715 644588 -448555 702729 161167 -666406 134242
2303 134242 642441 -297679 1576475 841432 830223 -672120 2376915 -1275416 603474
2294 603474 1873024 3674170 324545 2973199 -231190 2757042 532940 -286998 3616275
2285 3616275 -1709572 372951 -1515888 608501 1300367 1459699 -587722 -764307 2298623
2276 2298623 1591927 688522 2142287 554884 -978017 1917590 1067568 2618916 1241433
2267 1241433 1167805 882758 358403 2396724 132374 1252255 -1332716 881788 1135353
2258 1135353 1233559 623804 -2065475 -3028083 1058730 1807022 -918330 -288669 1173731
2249 1173731 1491321 944532 591623 -1441487 2854437 2608760 965958 2153769 -267477
2240 -267477 -1401605 317111 2004719 305927 72574 -1441947 -2402650 2234667 732570
2231 732570 1123758 -846523 -558663 4387639 -825871 961792 2194499 2659213 -762496
2222 -762496 109890 4757761 1378791 835522 2670114 1256127 -746955 1500942 1538499
2213 1538499 2785621 1572753 1539789 1878575 1563054 2382250 596851 945647 299919
2204 299919 672492 -942833 342578 2314577 793933 2997991 -1067921 -1854584 -975378
2195 -975378 1139315 1498827 1169747 652775 -808343 195252 2525046 1402012 1887373
2186 1887373 986609 -889788 54376 2151894 2406333 1785070 -1086438 527853 -754341
2177 -754341 -276691 940872 4225985 1939386 520164 -874360 1728940 3138124 -701814
2168 -701814 1602260 -257194 -716979 -30036 -278825 1668820 2424040 758983 -1817828
2159 -1817828 2509723 -55094 378320 2489990 974432 -825729 -1711043 1899120 2516984
2150 2516984 524602 952918 1258509 165656 -637648 -459562 1508983 893866 2061943
2141 2061943 849316 -821063 3711499 4152678 -44264 1636971 -621384 2285250
2133 2285250 -654462 3343691 1422653 1338706 2180291 1124188 -1351631 3594670 -499254
2124 -499254 2698301 1649476 923114 711627 1626584 134018 770541 688213 328782
2115 328782 -1294357 1190614 664801 2980965 959304 -380447 1118279 -313334 1011030
2106 1011030 3432779 -183388 -1504919 583693 2058698 680728 776393 3785987 367576
2097 367576 2199963 -816223 1036934 -47869 2914329 -236629 610370 -161295 -1009903
2088 -1009903 -245979 3112732 1631819 -2327295 -369433 1345887 1410073 100356 1523576
2079 1523576 1790482 356543 -1027911 4373706 622987 687055 -895028 49715 1488733
2070 1488733 -1349535 1895593 1115393 -1930195 2350186 -368563 3799606 -115917
2062 -115917 -621977 -398541 1509033 -565575 1797899 -925293 1559490 759182 2306908
2053 2306908 96813 302753 -148853 -173779 345175 -1014760 670506 2491662 -1326870
2044 -1326870 490310 1695149 -519176 -144191 1001456 -1016794 2688506 1665386
2036 1665386 -300660 3240127 508355 2140942 -461270 3048501 4250547 950025
2028 950025 -135063 1318992 973001 853626 -342650 -492635 597162 -292714 -757136
2019 -757136 -2934033 776434 -401872 -2077899 -28521 -1419761 45451 80119 838208
2010 838208 2409425 -1210207 131239 -764278 1424459 -1455085 -167061 -257830 1324224
2001 1324224 1047494 2119873 2492542 1512897 262965 -1161855 346902 732128 596748
$$ [...]
##END NTUPLES=NMR SPECTRUM
##END=
