##TITLE=abcd
##JCAMPDX= 6.0         $$ Bruker NMR JCAMP-DX V2.0
##DATA TYPE= NMR SPECTRUM
##DATA CLASS= NTUPLES
##ORIGIN= UXNMR, Bruker Analytische Messtechnik GmbH
##OWNER= root
$$ XWIN-NMR		Version 3.5
$$ Wed Oct 15 19:33:19 2025 Russian Standard Time (UT+4h)  servis@DPX200
##.OBSERVE FREQUENCY= 200.131235884673
##.OBSERVE NUCLEUS= ^1H
##.ACQUISITION MODE= SIMULTANEOUS
##.ACQUISITION SCHEME= undefined
##.AVERAGES= 32
##.DIGITISER RES= 18
##SPECTROMETER/DATA SYSTEM= spect
##.PULSE SEQUENCE= zg
##.SOLVENT NAME= CDCl3
##.SHIFT REFERENCE= (INTERNAL, CDCl3, 0, 16.4885)
##AUDIT TRAIL= $$ (NUMBER, WHEN, WHO, WHERE, WHAT)
$$ ##TITLE= Audit trail, XWIN-NMR		Version 3.5
$$ ##JCAMPDX= 5.01
$$ ##ORIGIN= Bruker BioSpin GmbH
$$ ##OWNER= servis
$$ F:\spectra/data/av/nmr/H1/1/pdata/1/auditp.txt
$$ ##AUDIT TRAIL=  $$ (NUMBER, WHEN, WHO, WHERE, WHAT)
(   1,<2025-10-15 19:26:33.50 +0400>,<servis>,<DPX200>,
      <created by zg, POWCHK disabled, PULCHK disabled
       configuration hash MD5:
       00 E9 B6 7A A2 85 ED C7 34 08 36 98 17 FE 4E 26
       data hash MD5: 32K
       CB BB FD 68 E9 6D E3 6C 3C 75 2E 78 E5 F1 92 61>)
(   2,<2025-10-15 19:32:50.15 +0400>,<servis>,<DPX200>,
      <Start of raw data processing
       efp BC_mod = 2 LB = 0.05 FT_mod = 6 PKNL = 1 PHC0 = -274.2701 PHC1 = 2.101565 SI = 16K 
       data hash MD5: 16K
       C8 DB 4B 5B 57 D9 0B B0 FB ED 16 3E 9E 6B 02 79>)
(   3,<2025-10-15 19:33:02.26 +0400>,<servis>,<DPX200>,
      <pk PHC0 = 5.2 PHC1 = 0 
       data hash MD5: 16K
       D0 4F 1D BA B3 DE 4C 19 C5 4D AB 72 98 EB B4 89>)
$$ ##END=
$$ 
$$ hash MD5
$$ BE 67 8A 2E 30 4D B8 44 AF 9A 3E CD 16 F4 D0 0E
##$RELAX= 
##$RELAX= 
##$RELAX= 
##$RELAX= 
##$RELAX= 
##$RELAX= 
##$RELAX= 
##$RELAX= 
$$ Bruker specific parameters
$$ --------------------------
##$DU= <F:\spectra>
##$EXPNO= 1
##$NAME= <H1>
##$PROCNO= 1
##$TYPE= <nmr>
##$USER= <av>
##$AMP= (0..31)
100 100 100 100 100 100 100 100 100 100 100 100 100 100 100 100 100 100 
100 100 100 100 100 100 100 100 100 100 100 100 100 100 
##$AQSEQ= 0
##$AQ_mod= 1
##$AUNM= <au_zg>
##$AUTOPOS= <>
##$BF1= 200.13
##$BF2= 200.13
##$BF3= 200.13
##$BF4= 200.13
##$BF5= 500.13
##$BF6= 500.13
##$BF7= 500.13
##$BF8= 500.13
##$BYTORDA= 1
##$CFDGTYP= 0
##$CFRGTYP= 5
##$CHEMSTR= <none>
##$CNST= (0..31)
1 1 145 1 1 1 1 1 1 1 1 1 1 1 1 1 1 1 1 1 1 1 1 1 1 1 1 1 1 1 1 1 
##$CPDPRG= <>
##$CPDPRG1= <>
##$CPDPRG2= <>
##$CPDPRG3= <>
##$CPDPRG4= <mlev>
##$CPDPRG5= <mlev>
##$CPDPRG6= <mlev>
##$CPDPRG7= <mlev>
##$CPDPRG8= <mlev>
##$CPDPRGB= <>
##$CPDPRGT= <>
##$D= (0..31)
0 2 0 0 0 0 0 0 0 0.06 0 0 0 0 0 0 0.0002 0 0 0 0 0 0 0 0 0 0 0 0 0 0 
0 
##$DATE= 1760541993
##$DBL= (0..7)
120 120 120 120 120 120 120 120 
##$DBP= (0..7)
150 150 150 150 150 150 150 150 
##$DBP07= 0
##$DBPNAM0= <>
##$DBPNAM1= <>
##$DBPNAM2= <>
##$DBPNAM3= <>
##$DBPNAM4= <>
##$DBPNAM5= <>
##$DBPNAM6= <>
##$DBPNAM7= <>
##$DBPOAL= (0..7)
0.5 0.5 0.5 0.5 0.5 0.5 0.5 0.5 
##$DBPOFFS= (0..7)
0 0 0 0 0 0 0 0 
##$DE= 6
##$DECBNUC= <off>
##$DECIM= 32
$$ [...]
##$SUBNAM4= <"">
##$SUBNAM5= <"">
##$SUBNAM6= <"">
##$SUBNAM7= <"">
##$SUBNAM8= <"">
##$SUBNAM9= <"">
##$SW= 20.6817932712277
##$SWIBOX= (0..15)
0 0 3 0 0 0 0 0 0 0 0 0 0 0 0 0 
##$SW_h= 4139.07284768212
##$TD= 32768
##$TD0= 1
##$TE= 0
##$TE2= 300
##$TE3= 300
##$TEG= 300
##$TL= (0..7)
0 120 120 120 120 120 120 120 
##$TP= (0..7)
150 150 150 150 150 150 150 150 
##$TP07= 0
##$TPNAME0= <>
##$TPNAME1= <>
##$TPNAME2= <>
##$TPNAME3= <>
##$TPNAME4= <>
##$TPNAME5= <>
##$TPNAME6= <>
##$TPNAME7= <>
##$TPOAL= (0..7)
0.5 0.5 0.5 0.5 0.5 0.5 0.5 0.5 
##$TPOFFS= (0..7)
0 0 0 0 0 0 0 0 
##$TUNHIN= 0
##$TUNHOUT= 0
##$TUNXOUT= 0
##$USERA1= <user>
##$USERA2= <user>
##$USERA3= <user>
##$USERA4= <user>
##$USERA5= <user>
##$V9= 5
##$VALIST= <valist>
##$VCLIST= <CCCCCCCCCCCCCCC>
##$VD= 0
##$VDLIST= <DDDDDDDDDDDDDDD>
##$VPLIST= <PPPPPPPPPPPPPPP>
##$VTLIST= <TTTTTTTTTTTTTTT>
##$WBST= 1024
##$WBSW= 30
##$XGAIN= (0..3)
0 0 0 0 
##$XL= 0
##$YL= 0
##$YMAX_a= 517956
##$YMIN_a= -423511
##$ZGOPTNS= <>
##$ZL1= 120
##$ZL2= 120
##$ZL3= 120
##$ZL4= 120
##$ABSF1= 0
##$ABSF2= 0
##$ABSG= 0
##$ABSL= 0
##$ALPHA= 0
##$AQORDER= 0
##$ASSFAC= 0
##$ASSFACI= 0
##$ASSFACX= 0
##$ASSWID= 0
##$AUNMP= <proc_1d>
##$AZFE= 0.1
##$AZFW= 0.1
##$BCFW= 0
##$BC_mod= 2
##$BYTORDP= 0
##$COROFFS= 0
##$CY= 18.4799938201904
##$DATMOD= 1
##$DC= 0
##$DFILT= <>
##$DTYPP= 0
##$F1P= 9.9274215381318
##$F2P= -0.165520771350173
##$FCOR= 1
##$FTSIZE= 16384
##$FT_mod= 6
##$GAMMA= 0
##$GB= 0
##$INTBC= 1
##$INTSCL= 4.127829e-11
##$ISEN= 128
##$LB= 0.05
##$LEV0= 0
##$LPBIN= 0
##$MAXI= 10000
##$MC2= 0
##$MEAN= 0
##$ME_mod= 0
##$MI= 50
##$NCOEF= 0
##$NC_proc= -8
##$NLEV= 6
##$NOISF1= 3.799351
##$NOISF2= 2.8
##$NSP= 0
##$NTH_PI= 0
##$NZP= 0
##$OFFSET= 16.48848
##$PC= 4
##$PHC0= -269.0701
##$PHC1= 2.101565
##$PH_mod= 1
##$PKNL= yes
##$PPARMOD= 0
##$PSCAL= 4
##$PSIGN= 0
##$REVERSE= no
##$SF= 200.130005582386
##$SI= 16384
##$SIGF1= 3
##$SIGF2= 2
##$SINO= 400
##$SIOLD= 16384
##$SREGLST= <1H.CDCl3>
##$SSB= 0
##$STSI= 16384
##$STSR= 0
##$SW_p= 4139.07284768211
##$SYMM= 0
##$S_DEV= 0
##$TDeff= 32768
##$TDoff= 0
##$TI= <>
##$TILT= no
##$TM1= 0
##$TM2= 0
##$TOPLEV= 0
##$USERP1= <user>
##$USERP2= <user>
##$USERP3= <user>
##$USERP4= <user>
##$USERP5= <user>
##$WDW= 1
##$XDIM= 16384
##$YMAX_p= 514255315
##$YMIN_p= -3829512
$$ End of Bruker specific parameters
$$ ---------------------------------
##NTUPLES= NMR SPECTRUM
##VAR_NAME=  FREQUENCY,     SPECTRUM/REAL,   SPECTRUM/IMAG
##SYMBOL=    X,             R,               I
##VAR_TYPE=  INDEPENDENT,   DEPENDENT,       DEPENDENT
##VAR_FORM=  AFFN,          ASDF,            ASDF
##VAR_DIM=   16384,         16384,           16384
##UNITS=     HZ,            ARBITRARY UNITS, ARBITRARY UNITS
##FACTOR=    0.252644378177508, 1,           1
##FIRST=     3299.83951724647, 0,            0
##LAST=      -839.233330435636, 0,           0
##MIN=       -839.233330435636, -3829512,    0
##MAX=       3299.83951724647, 514255315,    0
$$ Real data points
##PAGE= N=1
##DATA TABLE= (X++(R..R)), XYDATA
$$ [...]
5636H109124J04192L1739n38132M88188k86091Q1304K78461J52773K58095m04395
5626H275258O07907M33670J425803j553996J53627N95443N14184J87549M5755
5617A0685200j12110N06449J70390k99680J743031l26483n95055K05083l6653
5608A1940172M57889K34907O05721m23238J983730j276709N57506J163463N84991
5599A5828432J1991J21220P22942J303152P57043m27648J021673M40313L63070
5590B0142188j08701J658042M23212P79908J210593K93608r0165R31370P28565
5581B5968620Q03009M03169M87386J340317M00632Q13965J131751Q41081J104526
5572C3294456J460923M71530J144206R55328M77699J038389J618338P31769J732121
$$ plain form
5636 8109124 8213316 8245055 7706923 8195111 7909020 7990324 8268785 8421558 8679653 8275258
5626 8275258 8883165 9316835 10742638 9188642 9342269 9937712 10451896 10639445 10685200
5617 10685200 10573090 11079539 11249929 10950249 12693280 12366797 11771742 11976825 11940172
5608 11940172 12398061 12632968 13238689 12815451 14799181 13522472 14079978 15243441 15828432
5599 15828432 15840423 15961643 16684585 17987737 18744780 18317132 19338805 19779118 20142188
5590 20142188 20033487 21691529 22114741 22894649 24105242 24398850 24308685 25240055 25968620
5581 25968620 26771629 27174798 27662184 29002501 29403133 30217098 31348849 32189930 33294456
5572 33294456 34755379 35226909 36371115 37326443 37804142 38842531 40460869 41192638 42924759
5563D2924759J98713O62338J658035J210949J257643J333508M24464J768289Q04763
5554E2243461K454089J047008N25364K154267N23415N38470J535905J124693l79996
5545F1766676J623934P32966j19722J595274N29079J686343J792927J120054J779150
5536G2506681R17685M49925N58227j99792P3461j52832k67395p5514K75464R54162
5526G5040072j31819P96356J288404O42114Q41751O77954j73061k59065j51094
5517G8571612j110495j577569j780564j38371n1536j535896L68083M14002J119893
5508G4279159k80623P20714J82661k41508j494522j016875q65906k725241k356402
5499F6201457r07795k255820n65400j167733K34189j37134j684476P16707j082975
$$ plain form
5563 42924759 43123472 43785810 45443845 46654794 47912437 49245945 49670409 51438698 52243461
5554 52243461 54697550 55744558 56269922 58424189 58947604 59486074 61021979 62146672 61766676
5545 61766676 63390610 64123576 64003854 65599128 66128207 67814550 69607477 70727531 72506681
5536 72506681 73424366 73874291 74432518 74232726 74306187 74153355 73885960 73810446 74085910 75040072
5526 75040072 74908253 75704609 76993013 77635127 78476878 79154832 78981771 78722706 78571612
5517 78571612 77461117 75883548 74102984 73964613 73913077 72377181 72745264 73159266 74279159
5508 74279159 73998536 74719250 74901911 74660403 73165881 72149006 71283100 68557859 66201457
5499 66201457 65293662 63037842 62472442 61304709 61538898 61401764 59717288 60433995 59351020
5490E9351020m50374j119073j087043j355900k186676j598127r37930p60475k518675
5481D7336747o90530k55419j37864j253056j11831p49388q93323j265345j59751
5472D1820240j800888j231505m13831j378059j112508n57822k08913j242987n75469
5463C3298258J95421r58197P95225j027281K56663r40158Q81835j281686o51201
5454C0568879n46262Q6901o04754r57020J84868j580047J019799j216333N86453
5445B7542484n15253k19589N440o70425J75646j82634M00096L68458L24388j037778
5435B6190833L29110N19205l76374Q09054n94585m16882K33871q54757L66533
5426B6206008k53637n6448j92928p80766m0886J139154J91605o67840l89056q4329
$$ plain form
5490 59351020 58900646 57781573 56694530 55338630 53151954 51553827 50615897 49855422 47336747
5481 47336747 46646217 46390798 46252934 44999878 44888047 44138659 43245336 41979991 41820240
5472 41820240 40019352 38787847 38374016 36995957 35883449 35325627 35116714 33873727 33298258
5463 33298258 33493679 32535482 33330707 32303426 32560089 31619931 32501766 31220080 30568879
5454 30568879 30022617 30109518 29504764 28547744 28732612 27152565 28172364 26956031 27542484
5445 27542484 27027231 26807642 26813082 26142657 26318303 26135669 26535765 26904223 27228611 26190833
5435 26190833 26519943 27039148 26662774 27471828 26877243 26460361 26694232 25839475 26206008
5426 26206008 25952371 25895923 25702995 24922229 24881343 26020497 26212102 25544262 25155206 25070877
5416B5070877K36498O61960j049717O56212M60508o12422p1102O11941p18976
5407B5245779J70340o34824Q18826m97955J67499J98224j555807J270751j126133
5398B4056700O94551j039674m63922M23020k48563J385281p29861N19768p39897
5389B3857403O37505J18583o46016Q28117o82338M35336j78564m18091m84329
5380B3467606M37977J22776m24812K0247J45159p75254l74215p62369O53125n21750
5370B1988490j45553j79316M29104N9702q73501n86002O24199j124841P47432
5361B0939714k89507j046916M69231k93494k57927m99548k14383Q41565o73982
5352A8974753j42313n17116k9540M66648k63694k62514l25656K36577M4659j89319
$$ plain form
5416 25070877 25307375 25969335 24919618 25575830 26036338 25423916 25352814 25964755 25245779
5407 25245779 25416119 24781295 25600121 25102166 25269665 25467889 23912082 25182833 24056700
5398 24056700 24751251 23711577 23247655 23670675 23422112 24807393 24077532 24597300 23857403
5389 23857403 24494908 24613491 23967475 24795592 24113254 24548590 24370026 23951935 23467606
5380 23467606 23905583 24028359 23603547 23623794 23768953 22993699 22619484 21857115 22510240 21988490
5370 21988490 21842937 21663621 22092725 22152427 21278926 20692924 21317123 20192282 20939714
5361 20939714 20650207 19603291 20072522 19779028 19521101 19021553 18807170 19648735 18974753
5352 18974753 18832440 18315324 18285784 18752432 18488738 18226224 17900568 18137145 18181804 17992485
5342A7992485j46358p08382J36163M43731k45857m93009j71705L33970L10301
5333A7451339j33082j80490N03860k39993m34134P27406j448062J282566p97498
5324A6731912N03122m5097J05631j91839j35036K08443j78877j35300j13350P35912
5314A7485521l78359Q68234m12987K41283j56940o84768P76282j022953J37825
5305A6853138J218615r26453K37866K46773P0691j86258O04547n74361Q78526
5296A8423084J60987J20652l59347M59725N76613K46953k84323P86117m0729l2392
5286B0057340M93273j03925O91840l32945K9194j30408m55104L85207L64514k06422
5276B0792564j38894M74545K7125p24444J22895J33183j60122n20438l91848j42563
$$ plain form
5342 17992485 17846127 17137745 17273908 17717639 17471782 16978773 16807068 17141038 17451339
5333 17451339 17318257 17137767 17641627 17401634 16967500 17694906 16246844 17529410 16731912
5324 16731912 17235034 17189937 17295568 17103729 16968693 17177136 16998259 16862959 16749609 17485521
5314 17485521 17107162 17975396 17562409 17803692 17646752 16961984 17738266 16715313 16853138
5305 16853138 18071753 17145300 17383166 17629939 17700630 17514372 18118919 17544558 18423084
5296 18423084 18584071 18704723 18345376 18805101 19381714 19628667 19344344 20130461 20089732 20057340
5286 20057340 20550613 20446688 21138528 20805583 20834777 20704369 20249265 20634472 20998986 20792564
5276 20792564 20653670 21128215 21155340 20430896 20553791 20686974 20526852 20006414 19614566 19472003
5266A9472003n47067q98542l80996p64809m65745K69165j129468l52695O1348
5257A5263194n67110p06042o11291L61656r94879L87338o97980j26216n84064
5248A1724606o6760j71819p1589M23420k76114o52671M34724l70009n6599J0922
5238A0928111q41685l52978q53120N12336p4469k88987j030041L06767M84146
5229H790080P16701q21966O3917j488075J274900j60665L2422l86492L20708J7190
5219H358720k35483r84608P89078j68933M14932p32360k29689k03947L82015L36772
5209G726497n38358j1850L27347J11086r80749P83616J86878O1175k50136n38935
5199F876571l66123P71681j72452l34932j23635P02161n54559k03671O8886R3297
$$ plain form
5266 19472003 18924936 18026394 17645398 16880589 16414844 16684009 15554541 15201846 15263194
5257 15263194 14696084 13990042 13378751 13740407 12745528 13132866 12434886 12308670 11724606
5248 11724606 11657846 11486027 11414438 11837858 11561744 10909073 11343797 10973788 10917189 10928111
5238 10928111 10086426 9733448 8880328 9392664 9318195 9029208 7999167 8305934 8790080
5229 8790080 9506781 8684815 8748732 7260657 8535557 8374892 8407314 8020822 8341530 8358720
5219 8358720 8123237 7138629 7927707 7758774 8173706 7441346 7211657 7007710 7389725 7726497
5209 7726497 7188139 7176289 7503636 7614722 6633973 7417589 7604467 7665642 7415506 6876571
5199 6876571 6510448 7282129 7109677 6774745 6651110 7353271 6798712 6595041 6663927 6757224
5189F757224n11016j4748K18835N7395m18546J72720j4453Q28223l40660k20963
5179F514011k72178Q31623m9324n86244q56244K99097m9099J122653q55151m15501
5169E683643Q76355l24970o0268l77195Q2649K75312O00598p04567l61757l14626
5159E375174J434505L4367o0781n41715L69918K38799J63548n59741K68307R60278
5149G682659n55667m56818m4827R65644O31377J621o19388J073138k85434K38999
5139H631304j15150P15720q71198k83104L85890M53834j064239J39532n62163
5130G430426J057645r61272N76254o27990L2016R86523o31943K32906m81215r9973
5120G513377o7908k1621O81575k40254P1414r64874M06928p24330j21843j69845
$$ plain form
5189 6757224 6246208 6231460 6450295 6507690 6089144 6261864 6247411 7075634 6734974 6514011
5179 6514011 6241833 7073456 7024132 6437888 5581644 5880741 5831642 6954295 6099144 5683643
5169 5683643 6559998 6235028 6174760 5797565 5880214 6155526 6756124 6051557 5689800 5375174
5159 5375174 6809679 6844046 6783265 6241550 6611468 6850267 7013815 6454074 6722381 7682659
5149 7682659 7126992 6670174 6625347 7590991 8222368 8223989 7604601 8677739 8392305 8631304
5139 8631304 8516154 9231874 8360676 8077572 8463462 8917296 7853057 7992589 7430426
5130 7430426 8488071 7526799 8103053 7475063 7507079 8493602 7861659 8094565 7613350 7513377
5120 7513377 7445469 7423848 8105423 7865169 7936583 6971709 7378637 6654307 6532464 6362619
5110F362619l55567K92013j37076o31732P15995l76175l58159O47336o61984J170149
5100F667419j219998R24628j70545l34951n35805k64143J380401m59950r14020
5091E073036K10397l12305M17427r12261L151p47795L59404Q52426r03998l22070
5081C717412K36091l30988R51781L62289p25320j48438J52411J63750j61745l25424
5071C891819m99939N85337p20948N75385l07992m64909K5075l27858K35704N27726
5061C519400q74149L25779O71059k07694L9604k61552P88975j006371O37696j248348
5051B384399J025367o13287M75851j58712L99745p94294Q24588j245834O61783
5042B959606N37748K74209j039807R18881o55879M64633m28860L1135l10084l87486
$$ plain form
5110 6362619 6007052 6299065 6161989 5530257 6246252 5870077 5511918 6159254 5497270 6667419
5100 6667419 5447421 6372049 6201504 5866553 5330748 5066605 6447006 5987056 5073036
5091 5073036 5283433 4971128 5388555 4476294 4479445 3731650 4091054 4943480 4039482 3717412
5081 3717412 3953503 3622515 4574296 4936585 4211265 4062827 4215238 4378988 4217243 3891819
5071 3891819 3391880 3977217 3256269 3831654 3523662 3058753 3083828 2755970 2991674 3519400
5061 3519400 2645251 2971030 3642089 3434395 3473999 3212447 4001422 2995051 3632747 2384399
5051 2384399 3409766 2796479 3272330 3113618 3513363 2719069 3543657 2297823 2959606
5042 2959606 3497354 3771563 2731756 3650637 2994758 3459391 3030531 3061666 2751582 2364096
5032B364096O02000k4541M10117j47797m76786J40175J89822O11769n84624M55151
5022C539382n63515O84100O9039n29574P5649o80169O68918L41989n24219Q67618
5012C949218j58543L3882j88437n84077J080738k82669o06776L14557J35522j13642
5002C579773n23337n0298L67570l16129N60546m85760l35437J90889o03063P08372
4992C093126K22113j44603m65933N98267m43538J001518m48977Q57498r04002
4983C365469J93498m00417L67468K22409N49971p47599Q6624j55705k7735Q47347
4973D301330q78756J08425Q0593j56573K6256k66841Q61825k63226N55204o26258
4963C741979j24877N06706k81179n73926O64981K66922M96784l02021k92775O03258
$$ plain form
5032 2364096 2966096 2941555 3351672 3203875 2727089 2867264 3057086 3668855 3084231 3539382
5022 3539382 2975867 3659967 3729006 3199432 3275081 2594912 3263830 3605819 3081600 3949218
5012 3949218 3790675 3824557 3636120 3052043 4132781 3850112 3243336 3557893 3693415 3579773
5002 3579773 3056436 3006138 3373708 3057579 3618125 3132365 2796928 2987817 2384754 3093126
4992 3093126 3315239 3170636 2704703 3302970 2859432 3860950 3411973 4269471 3365469
4983 3365469 3558967 3158550 3526018 3748427 4298398 3550799 3637423 3481718 3453983 4301330
4973 4301330 3422574 3530999 3611592 3455019 3481275 3214434 4076259 3813033 4368237 3741979
4963 3741979 3617102 4123808 3842629 3268703 3933684 4200606 4697390 4395369 4102594 4705852
4953D705852j67728K39599o15264Q36497j76843r03853M18042l279L95470P6950
4943D805443P4733J073694K07223j67296O76j65254M72290P44497N42798n7969
4933G530835j71057J933008o92243k17539J169444J168753j030966m6778J256759
4924A0900216M25143l25857J47001L07850l46666R09247o39551n38663N28332
4915A1367052l2209m17097l24600r69037o18002J45340n04667k60083J109945
4906I496642j052084k13622m43166k70268K68953j134235L3155j05889K11809
4897F791295p9001K32164j778789J053462K74499p60249L2393L38894J75587j23347
4887F156908j44497k21403K32007J32766M01416L43961j54441O94381J105J663318
$$ plain form
4953 4705852 4538124 4777723 4162459 4998956 4822113 3918260 4336302 4333023 4728493 4805443
4943 4805443 4880176 5953870 6161093 5993797 5994473 5829219 6301509 7046006 7588804 7530835
4933 7530835 7359778 9292786 8600543 8383004 9552448 10721201 9690235 9643457 10900216
4924 10900216 11325359 10999502 11146503 11454353 11107687 12016934 11377383 10838720 11367052
4915 11367052 11334843 10917746 10593146 9624109 9006107 9151447 8646780 8386697 9496642
4906 9496642 8444558 8230936 7787770 7517502 7786455 6652220 6685375 6579486 6791295
4897 6791295 6712294 6944458 5165669 6219131 6493630 5733381 5765774 6104668 6280255 6156908
4887 6156908 6012411 5791008 6023015 6155781 6557197 6901158 6746717 7441098 7442203 9105521
4877I105521j34532O7397J266453m08059m72658O48089o79484j033539l89066
4868G970122K77466m62410R5816p52306Q42025n04038R51239j125842J279870
4859H571942l40289J227306L4691J375773O51488K57703L46936K20432P98292
4850A3144274J101704j004528L8556r69238k14299o20062n41839j553814q3963
4841I296791j00650j328696N56641m36484k67492N5831M11996o67606L9765J990159
4831I550255l07727J030867k75182m14706O60473J46228N4163q49834K50896j184947
4821H660486j337946m75574L88874q09678J9289M13473j245874M63166M5046o10833
4811E510429j17954M67555l49246n32088N23912l78582N22726r63390n6N45537
$$ plain form
4877 9105521 8970989 9038386 10304839 9896780 9424122 10072211 9392727 8359188 7970122
4868 7970122 8247588 7785178 7880994 7128688 7970713 7466675 8417914 7292072 8571942
4859 8571942 8231653 9458959 9493650 10869423 11520911 11778614 12125550 12345982 13144274
4850 13144274 14245978 13241450 13280006 12310768 12096469 11476407 10934568 9380754 9296791
4841 9296791 9196141 7867445 8424086 7987602 7720110 7775941 8187937 7520331 7560096 9550255
4831 9550255 9242528 10273395 9998213 9583507 10243980 10390208 10444371 9594537 9845433 8660486
4821 8660486 7322540 6846966 7235840 6426162 6445451 6858924 5613050 6076216 6121262 5510429
4811 5510429 5392475 5860030 5510784 4978696 5502608 5124026 5646752 4683362 4683306 5228843
4801E228843p68504P42650R2133j025217M98047Q30136n85813l37695P30206r40822
4791D463964J940644j303555l59832L31623j57132r14027Q00209K35751j01243
4782D936402O03818l74927K77253k6955m0245k00304k6513j00131M84696q1107
4772E451987N44947m00503J15325L18753k73996j04003L17745m27554O31039j235417
4762D938323P28769l0514L13584j6330P23121j53076K00577l02012N53570O3219
4752G019231m31132n39520R51920K35631p32994k79932K070715n8843n06426P84610
4742H513260j55251J21845O00266m26340L7750j008263L76862K06690k76662O26917
4732H617074K442N04528l84516J83930L32029l09078O09693k63160M32803K07797
$$ plain form
4801 5228843 4460339 5202989 5295122 4269905 4767952 5598088 5012275 4674580 5404786 4463964
4791 4463964 6404608 5101053 4741221 5072844 4915712 4001685 4801894 5037645 4936402
4782 4936402 5540220 5165293 5442546 5415591 5375346 5175042 5148529 5048398 5533094 5451987
4772 5451987 5996934 5596431 5711756 6030509 5756513 5652510 5970255 5542701 6173740 4938323
4762 4938323 5667092 5636578 5950162 5933832 6656953 6503877 6704454 6402442 6956012 7019231
4752 7019231 6588099 6048579 7000499 7236130 6503136 6223204 8293919 8235076 7728650 8513260
4742 8513260 8358009 8479854 9080120 8653780 8691530 7683267 8060129 8266819 7990157 8617074
4732 8617074 8619516 9124044 8739528 8923458 9255487 8946409 9556102 9292942 9725745 9933542
4722I933542k9306j22011j49752K59103q5308O247O43005R08657J8262n06414
4712A0876025J112942o88635j51734L40808N3909k77823J75948J78120m74570
4703A1144990Q54997k90310Q00001K14738K89860O88614r8875r3497J240530n3807
4693A4697241q61741M52761L45563j18394J2544J02448L35616l14752m7932r9534
4683A4503820O50214O15232J12476J75028n19949P50615L21050M64019j45419
4674A6927086L18642J894828k88309Q11792J112467K441482K09863J184988O17371
4665B5230210L56855O54796O09040k247260j90382r0288j78834j00948j210876
4656B2832313J585236q28010k43362k51358P25874M7482m21368L82655L35387
$$ plain form
4722 9933542 9904236 9782225 9632473 9891576 9806268 9812515 10455520 11364177 11382439 10876025
4712 10876025 11988967 11300332 11148598 11489406 11543315 11265492 11441440 11619560 11144990
4703 11144990 11999987 11709677 12509678 12724416 13014276 13702890 13604015 13510518 14751048 14697241
4693 14697241 13835500 14288261 14633824 14515430 14527974 14630422 14966038 14651286 14603354 14503820
4683 14503820 15154034 15769266 15881742 16056770 15536821 16287436 16608486 17072505 16927086
4674 16927086 17245728 19140556 18852247 19664039 20776506 23217988 23427851 24612839 25230210
4665 25230210 25587065 26241861 26850901 24603641 24413259 24322971 24144137 24043189 22832313
4656 22832313 24417549 23589539 23346177 23094819 23820693 23868175 23446807 23829462 24164849
4647B4164849j3357Q82853M38482R97582K22403J555209P33578J866727R41431
4638C1789757L15125O09643J397678n93109l06158p56023K24403j251774n82489
4629C0847053O92957j87013l23207M4914j184365O70074o5194j336103N09508
4620B9668624L32187o02611J178916l69266j80714P18264J41389J028198M76219
4611C2391206J36912R41228L25228K16649M22302M20485L1082j65964q32421k78101
4601C3608606M87841m1329M34558M76253K7083j00732l0784m77334R11642k88361
4591C5007443j14651N70289k95271J583023n27984L15493M83128P24558P04290
4582C8450318k37450L32698R53037O9259k04686L60304O16164N5993J064332l31510
$$ plain form
4647 24164849 24151492 25034345 25472827 26470409 26692812 28248021 28981599 30848326 31789757
4638 31789757 32104882 32714525 34112203 33519094 33212936 32456913 32681316 31429542 30847053
4629 30847053 31540010 31352997 31029790 31074704 29890339 30560413 30495219 29159116 29668624
4620 29668624 30000811 29398200 30577116 30207850 30027136 30745400 30886789 31914987 32391206
4611 32391206 32528118 33469346 33794574 34011223 34433525 34854010 34885092 34719128 33886707 33608606
4601 33608606 34096447 34055118 34489676 34965929 34993012 34892280 34861496 34384162 35295804 35007443
4591 35007443 34892792 35463081 35167810 36750833 36222849 36538342 37021470 37746028 38450318
4582 38450318 38212868 38545566 39498603 39567862 39363176 39723480 40339644 40395637 41459969 41128459
4572D1128459n85723M55116l37087P874k45287J40724n93428R02513k45063n36645
4562D0091453K06347K96328M59351j736180m7666J032685J072165l15386J389
4553D1060486O30699j38238M03885j55115j39987o25111L80356k32886O20392
4544D1804481r71391r49814N50591n60563K01714l33017K05178o54711L80761
4535C9673229k82282n49861k42627k76622n0912M43975j592662N00377M76552
4526C8099167m35521j584313M42788K04061P8772j550389O48778R3992k28736
4517C5768599q40341M56021p43131m92877L44126l18475L61154L6561r9185m57500
4507C4014952L32100m31577l10207l10445K11771n63405R8937M57595j08829j262729
$$ plain form
4572 41128459 40542736 40997852 40660765 40668639 40423352 40564076 39970648 40873161 40628098 40091453
4562 40091453 40297800 40594128 41053479 39317299 39269633 40302318 41374483 41059097 41060486
4553 41060486 41691185 41552947 41956832 41801717 41661730 41036619 41416975 41184089 41804481
4544 41804481 40833090 39883276 40433867 39873304 40075018 39742001 39947179 39292468 39673229
4535 39673229 39390947 38841086 38598459 38321837 38270925 38714900 37122238 37622615 38099167
4526 38099167 37663646 36079333 36522121 36726182 36804954 35254565 35903343 35997335 35768599
4517 35768599 34928258 35384279 34641148 34148271 34492397 34173922 34535076 34571637 34472452 34014952
4507 34014952 34347052 33915475 33605268 33294823 33506594 32943189 33042126 33499721 33390892 32128163
4497C2128163Q10543j04155Q0636N48770j95458P0258M40480P87224J23593m19077
4487C4270977j47586Q11001j77035L36032K36556K25363Q62513J148831j245911
4478C6320741J33236L16250o78713l03391P69684M27438k44526P72911m88044
4469C7025586R1488N41769j118636J297126M86084P32240K74020n37369J547140
4460D0339448N23754N26174J022235J094597R25090L59810J508270N05746P37406
4451D7542530J672965M97947J802437J622003L38075J360215Q19150L64004Q52766
4442E6872092J143041l4958R08090L93310J43150L31237O49321J444709J096843
4433F2946835R04827R55514J480227J282824J134881L18078P64244R8082M01528
$$ plain form
4497 32128163 32938706 32834551 32915187 33463957 33268499 33338757 33779237 34566461 34690054 34270977
4487 34270977 34123391 34934392 34757357 35093389 35329945 35555308 36417821 37566652 36320741
4478 36320741 36453977 36770227 36091514 35788123 36557807 36985245 36740719 37513630 37025586
4469 37025586 37117074 37658843 36540207 37837333 38323417 39055657 39329677 38792308 40339448
4460 40339448 40863202 41389376 42411611 43506208 44431298 44791108 46299378 46805124 47542530
4451 47542530 49215495 49713442 51515879 53137882 53475957 54836172 55655322 56019326 56872092
4442 56872092 58015133 57980175 58888265 59281575 59424725 59755962 60405283 61849992 62946835
4433 62946835 63851662 64807176 66287403 67570227 68705108 69023186 69787430 69885512 70287040
4424G0287040K26465J86099j081616M63279M24460n82494K3860N35398l12470
4415G0170021J056171n97312k9090O8356K59998O01140K60899o6591J147718j20404
4405G2750906P03951J150935J27463P1592O71447O39532j01813J101056K64717
4396G7379786N86902J238194j01253J017152J442048k87486m3119J244743o29253
4387H1847714K15034J0850R6763p04645M80639P81336K59123M60665K64627J700675
4377H5412781J536231M04092J734632J159840P03337m30505j257k23480j165830
4368H9129841m31202M13609p42721N9691P51946l47550l3296j54785n83569p33529
4358H7328435j268154O56984L98761j064393J186535Q15872k10238J356297J285229
$$ plain form
4424 70287040 70513505 70699604 69617988 70081267 70505727 69923233 69947093 70482491 70170021
4415 70170021 71226192 70628880 70599790 70668146 70928144 71529284 71790183 71723592 72871310 72750906
4405 72750906 73454857 74605792 74733255 74804847 75476294 76115826 76014013 77115069 77379786
4396 77379786 77966688 79204882 79103629 80120781 81562829 81275343 81232224 82476967 81847714
4387 81847714 82062748 82073598 82170361 81465716 81946355 82727691 82986814 83447479 83712106 85412781
4377 85412781 86949012 87353104 89087736 90247576 90950913 90520408 90519151 90295671 89129841
4368 89129841 88698639 89112248 88369527 88429218 89181164 88833614 88800318 88645533 88061964 87328435
4358 87328435 86060281 86717265 87116026 86051633 87238168 88054040 87843802 89200099 90485328
4349I0485328K341697R70573J707497o56952j70190p74885k268666l102073l511729
4340H5020600k300658k243497j746535k155099o13681k540377j477695r52319
4332G0990739j672977q45400j379232o91974o84590j250586m7551l47749J095127
4323F5165807J155278R98069K161927R55952J469493N36231L0128n31119j681408
4314G0260358k120622j794038j366414r16457q56741j164440l79077q17245O24580
4305F1469904o25408n16946o37700l10149p49708L85209n64070m67877j145319
4296E6837936N09428J17207J251990m3220J482926n61641J270736j18673j415773
4287E9330916P00777n65719j306507J032169r15018j32626o64483K08911O19873
$$ plain form
4349 90485328 92827025 93797598 95505095 94848143 94677953 93903068 91634402 88532329 85020600
4340 85020600 82719942 80476445 78729910 76574811 75961130 73420753 71943058 70990739
4332 70990739 69317762 68472362 67093130 66401156 65716566 64465980 64418429 64070680 65165807
4323 65165807 66321085 67319154 69481081 70437033 71906526 72442757 72472885 71941766 70260358
4314 70260358 68139736 66345698 64979284 64062827 63206086 62041646 61662569 60845324 61469904
4305 61469904 60844496 60327550 59689850 59379701 58629993 59015202 58451132 57983255 56837936
4296 56837936 57347364 57464571 58716561 58673341 60156267 59594626 60865362 60746689 59330916
4287 59330916 60031693 59465974 58159467 59191636 58276618 58143992 57479509 57688420 58308293
4278E8308293K18458N18847m49139L014L5600N20453p15501j70847r36085L58744
4268E7691837m47131j562674N80094k203230J088662J49010n20311N81391l58233
4259E4999415L57563k31398o06716J35662M99876l41985Q39629o47796J102302
4250E6106552k02721N89984J1060O17677K74333K02673K71051r45762O22212M11662
4240E7958721m05325n27441P5318R16872R8864l41121K29512k08792r32889K41481
4230E7105200L84136n70675k81777M96250J8465L60595N30343o18840L65065Q73831
4220E8662593J99937N49959m85559l85303Q45950k20440K56960R836Q7542M69126
4210E9990601J16230J31896J416975j77692J9139L80409P80693l9436R84972o78354
$$ plain form
4278 58308293 58526751 59045598 58596459 58599473 58635073 59155526 58440025 58269178 57333093 57691837
4268 57691837 57244706 55682032 56262126 54058896 55147558 55296568 54776257 55357648 54999415
4259 54999415 55356978 55125580 54518864 54654526 55154402 54812417 55652046 55004250 56106552
4250 56106552 55903831 56493815 56504875 57122552 57396885 57599558 57870609 56924847 57547059 57958721
4240 57958721 57553396 57025955 57101273 58018145 58117009 57775888 58005400 57796608 56863719 57105200
4230 57105200 57489336 56918661 56636884 57133134 57151599 57512194 58042537 57423697 57788762 58662593
4220 58662593 58862530 59412489 58926930 58541627 59387577 59167137 59424097 59433933 59521475 59990601
4210 59990601 60106831 60238727 61655702 61478010 61497149 61877558 62658251 62618815 63603787 62925433
4200F2925433L31239R17328k66063K79776k02636K06263M6713K56584K13718Q12833
4190F5521188k06014P75771J31929Q55542O57870J227640j71545P24699k33795
4181F9283285j148687M03715o00306l25720m78896j14950N43265m46766M7152
4172F7162092J214413L50457J005150P81359Q47928l17942J726540L93423J037786
4163G4201206J554759J129640R93761K647635M69022J908358J645368J416933
4155H5966682L5575M03558q57885R88973j089432k30715q9978Q66185J88985j72504
4145H6009444Q82585O69617k15992q28062K36698q65837o77452p62442j698896
4136H2749663J65194j412354p96185m88892J628384l20881J737358m04006J170050
$$ plain form
4200 62925433 63256672 64174000 63907937 64187713 63985077 64191340 64238053 64494637 64708355 65521188
4190 65521188 65315174 66090945 66222874 67078416 67736286 68963926 68792381 69517080 69283285
4181 69283285 68134598 68538313 67938007 67612287 67133391 67018441 67561706 67114940 67162092
4172 67162092 68376505 68726962 69732112 70513471 71361399 71043457 72769997 73163420 74201206
4163 74201206 75755965 76885605 77879366 80527001 80996023 82904381 84549749 85966682
4155 85966682 86002257 86405815 85547930 86536903 85447471 85216756 85126778 85992963 86181948 86009444
4145 86009444 86892029 87561646 87345654 86517592 86754290 85888453 85211001 84448559 82749663
4136 82749663 82914857 81502503 80706318 80217426 81845810 81524929 83262287 82858281 84028331
4127H4028331J146457l5862K01012M48448j54392l07520j283737k59584r55972
4118H2827181L90674r05162R21797K59741L71374J209622o09969R29065J41950
4109H5536273m93592L59339j7359r15788Q04633q78741n68341k72371n96634k86236
4099H2671183j72451r98058o76321o95849j157028j221842p03268p24726q34755
4090G5486885L0162m78325o03795m59940q23167n31572q13264q370q05695j281511
4080F9711408o9130m60096P11444p02007K52103J55695R58160J083107l73724
4071G1266960L73786R58959M30755p52584o76134o18093j313976r3730j568071
4062F8007872k74630q84312r11779J84495N83558r07570j701730J007520j081191
$$ plain form
4127 84028331 85174788 85138926 85339938 85788386 85633994 85326474 84042737 83783153 82827181
4118 82827181 83217855 82312693 83234490 83494231 83865605 85075227 84465258 85394323 85536273
4109 85536273 85042681 85402020 85384661 84468873 85273506 84394765 83826424 83554053 82957419 82671183
4099 82671183 82498732 81500674 80824353 80128504 78971476 77749634 77046366 76321640 75486885
4090 75486885 75517047 75038722 74434927 73974987 73151820 72620248 71806984 71798614 70992919 69711408
4080 69711408 69642278 69182182 69893626 69191619 69443722 69599417 70557577 71640684 71266960
4071 71266960 71640746 72599705 73030460 72277876 71601742 70983649 69669673 69575943 68007872
4062 68007872 67733242 66848930 65937151 66121646 66705204 65797634 64095904 65103424 64022233
4053F4022233l95673q33145q92516o03464j508905k23863k185593l07791p17780
4044E6353503l54127j591836l18260l32438l23317p82167o00023N62349l36958
4035E2276726l12686k98124l1579K42643o06250Q54720k166737N08070p74840
4026D9691943o36222k17050n11085j220015L09872Q8444k91223n18214j81131
4017D6515319o19958J31505P80077Q47692l47482J1533N5876R4123p42297j68103
4007D6558285K94601j232588K84515q97216l213M00796o14292j007462J54968
3998D3938394K95005r05590L14888r24655q70488P77451j884141o1726k05553
3989D0473585j064545J5940l71977O2781q6340j68382l91310l49639R27056q93447
$$ plain form
4053 64022233 63626560 62793415 61900899 61297435 59788530 59564667 57379074 57071283 56353503
4044 56353503 55999376 54407540 54089280 53756842 53433525 52651358 52051335 52613684 52276726
4035 52276726 51964040 51665916 51634337 51876980 51270730 52125450 49958713 50466783 49691943
4026 49691943 49055721 48838671 48327586 47107571 47417443 47505887 47214664 46696450 46515319
4017 46515319 45895361 46026866 46806943 47654635 47307153 47318686 47374562 47468685 46726388 46558285
4007 46558285 46852886 45620298 45904813 45007597 45004384 45405180 44790888 43783426 43938394
3998 43938394 44233399 43327809 43642697 42718042 41847554 42625005 40740864 40679138 40473585
3989 40473585 39409040 39424980 39053003 39115784 39029444 38861062 38469752 38120113 39047169 38153722
3979C8153722j1603m68155Q24590j233949l99673j087620K47029k65256j275953
3970C4483132j52608m01788m39113l73137k34936k85440M18250j856255J025233
3961C2183338m35130J74460m85102l23453L29376j139578J88000R2491M94097
3952C1078499K00674l9271P76993p60008M31463m37864J91073n1221j1779R7760
3942C1476319K07063j0342j0799R952K80769p58842N87865o13649N49692j87376
3932C1530652J04381m19906O10855M45378K33102m3093l36200L99726q24519R43612
3922C2643988n70709O16750M12284p22469k0355K53908l32647K06092k35542J026966
3912C3278266k44137L35863l46481M61085l08528l99243J46331O72043N52034
$$ plain form
3979 38153722 38142119 37673964 38498554 37264605 36864932 35777312 36024341 35759085 34483132
3970 34483132 34330524 33928736 33489623 33116486 32881550 32596110 33014360 31158105 32183338
3961 32183338 31748208 31922668 31437566 31114113 31443489 30303911 30491911 30584402 31078499
3952 31078499 31279173 31239902 32016895 31256887 31688350 31250486 31441559 31390338 31378559 31476319
3942 31476319 31683382 31673040 31662241 31672193 31952962 31194120 31781985 31168336 31718028 31530652
3932 31530652 31635033 31215127 31825982 32271360 32504462 32461369 32125169 32524895 31700376 32643988
3922 32643988 32073279 32690029 33102313 32379844 32359489 32613397 32280750 32486842 32251300 33278266
3912 33278266 33034129 33369992 33023511 33484596 33176068 32776825 32923156 33595199 34147233
3903C4147233Q57870o32165n1622R72967J28854n54549P57590l220M83723J96160
3893C6302841P75332k63524P06884N65M76803P89731K82274N01575p8640N93415
3883D0087256n62444O56385k39696J05812q662J07142R953K84784J159564l80706
3873D1219388P81010o0914J55216L93799R0431Q16905R46005K96724R88188j00580
3863D5526172M60006P25943M42107L06828J236337j65824j16179k8306l50528
3854D8036556J550747k78192P53843j190711Q07645M41884j26112N51946P96771
3845E1344377Q5941N50747p7939j84198K041172J87291J15288J261696Q56342
3836E6180717N90474L13480J517320K53497Q08968J088971n00882J86559Q01646
$$ plain form
3903 34147233 35005103 34372938 34321316 35294283 35423137 34868588 35626178 35622958 36106681 36302841
3893 36302841 37078173 36814649 37521533 37522098 37998901 38788632 39070906 39572481 39493841 40087256
3883 40087256 39524812 40181197 39941501 40047313 40038651 40145793 40155746 40440530 41600094 41219388
3873 41219388 42000398 41939484 42094700 42488499 42578930 43395835 44341840 44638564 45626752 45526172
3863 45526172 45986178 46712121 47154228 47461056 48697393 48531569 48415390 48387084 48036556
3854 48036556 49587303 49309111 50062954 48872243 49679888 50121772 49995660 50547606 51344377
3845 51344377 51430318 51981065 51903126 51718928 53760100 53947391 54062679 55324375 56180717
3836 56180717 56771191 57084671 58601991 58855488 59664456 60753427 60252545 60439104 61240750
3827F1240750j8297J199375N53124q2968J501827k24182M89489O68263J902511
3818F7229892J27894J107853J666426P77657J807473J588142J053408J894279
3810G7253024L158442K702658J912756K791677K097361K867853K966691J599846
3802I7350308K068119J815119K074938J517239J153616J189283K395919J004718
3794A10569259J295896K757476K155969J961179K656128J718807K167343L831447
3786A29113504K354276M145252K657045L997323M538919M952959M183959M855135
3778A60798372M469110O056671N048291M608460M793709M053037L994010M350297
3770A98171957K867867K818912J725546J627018j522K403827N11652J42704J069144
$$ plain form
3827 61240750 61222453 62421828 62974952 62891984 64393811 64169629 64659118 65327381 67229892
3818 67229892 67357786 68465639 70132065 70909722 72717195 74305337 75358745 77253024
3810 77253024 80411466 83114124 85026880 87818557 89915918 92783771 95750462 97350308
3802 97350308 99418427 101233546 103308484 104825723 105979339 107168622 109564541 110569259
3794 110569259 111865155 114622631 116778600 118739779 121395907 123114714 125282057 129113504
3786 129113504 131467780 135613032 138270077 142267400 146806319 151759278 155943237 160798372
3778 160798372 165267482 171324153 176372444 180980904 185774613 189827650 193821660 198171957
3770 198171957 201039824 203858736 205584282 207211300 207209778 209613605 210125257 210267961 211337105
3761B11337105R77515P57588J233570M36660Q41349J160271Q29089K244931J546901
3752B21364979K753593L571721L438744M089174M023262M578595N095900M961692
3744B53877660M218447N267587L884679L385804J992703N88845K078785K93574
3736B75588084k045808j455174k028473l009760l629132l336404l510682k483012
3728B54089639l888634k868999k269530k172332j041808p70659p61679m91330
3720B39824668J127797O62851J038482J952418K357004J027687K792837K181870
3712B52965614K023047K013974J902985K555690Q8452J380375O52932R27853N99127
3703B65110049n36318j071052j37057k076438M75582j794772j725649j786106
$$ plain form
3761 211337105 212314620 213072208 214305778 214742438 215583787 216744058 217573147 219818078 221364979
3752 221364979 224118572 227690293 231129037 235218211 239241473 243820068 248915968 253877660
3744 253877660 258096107 263363694 267248373 270634177 272626880 273215725 275294510 275588084
3736 275588084 273542276 272087102 270058629 267048869 263419737 260083333 256572651 254089639
3728 254089639 250201005 247332006 245062476 242890144 241848336 241077677 240315998 239824668
3720 239824668 240952465 241615316 242653798 244606216 246963220 247990907 250783744 252965614
3712 252965614 254988661 257002635 258905620 261461310 261549762 262930137 263583069 264510922 265110049
3703 265110049 264573731 263502679 263365622 261289184 261764766 259969994 258244345 256458239
3695B56458239j545381j238848j530725j211094j472264l08433j251670r3261
3687B47806563O0725r5474m67937J563438j203259J234869p20982k24174N6236
3678B48010005j30327j178556j006364j113052j346305l640553k335024k317695
3670B34942129k097554l280527l204664l147694k625793k066095k413288k831976
3662B13274538j239043k009340k280148j551751j638930j321247k529850k792160
3654A97912069j741005k830823l188830l210875l362561k669477k527361l104168
3646A75276969k981774k517440k975307k805697j860423k068652j006584k034248
3638A57026844j046413r12923n48091j473060j004628N8780J89336k35928m0885
$$ plain form
3695 256458239 254912858 253674010 252143285 250932191 249459927 249151494 247899824 247806563
3687 247806563 247867288 247771814 247303877 248867315 247664056 248898925 248177943 247953769 248010005
3678 248010005 247879678 246701122 245694758 244581706 243235401 239594848 237259824 234942129
3670 234942129 232844575 229564048 226359384 223211690 220585897 218519802 216106514 213274538
3662 213274538 212035495 210026155 207746007 206194256 204555326 203234079 200704229 197912069
3654 197912069 196171064 193340241 190151411 186940536 183577975 180908498 178381137 175276969
3646 175276969 172295195 169777755 166802448 163996751 162136328 160067676 159061092 157026844
3638 157026844 155980431 155067508 154519417 153046357 152041729 152100509 152289845 152053917 152013032
3629A52013032r48258m77065j83542O29043o53918l45311n85604L75977p59438
3620A49064916O01609R58820O73471O03773J597692J074069J733040Q99799M99677
3611A57706866J025749J41531m72283N32423o82260q66140N06256j399097k55730
3602A56237315q72199K34283k55043j015346k29202J177935o12436P44876O26198
3593A56036381J825071M16655J996887K440833K521427K198629K425258L507147
3585A73368288K177423J340720J457550J41082l08826j396356j713866k200740
3577A72865275k807316j962241k840653k144034l524988l284542j911635k392578
3569A51997288j740921k616927p85569k132572k13451k26768k97515m93500m59534
$$ plain form
3629 152013032 151064774 150587709 150404167 151033210 150379292 150033981 149448377 149824354 149064916
3620 149064916 149666525 150625345 151298816 151902589 153500281 154574350 156307390 157207189 157706866
3611 157706866 158732615 158874146 158401863 158934286 158252026 157385886 157892142 156493045 156237315
3602 156237315 155365116 155599399 155344356 154329010 154099808 155277743 154665307 155410183 156036381
3593 156036381 157861452 158278107 160274994 162715827 165237254 167435883 169861141 173368288
3585 173368288 175545711 176886431 178343981 178485063 178176237 176779881 175066015 172865275
3577 172865275 170057959 168095718 165255065 163111031 159586043 156301501 154389866 151997288
3569 151997288 150256367 147639440 146853871 144721299 144507848 144281080 143983565 143490065 143030531
3560A43030531J093055J215324K66912O25632J325535k64478L41219l86861K61761
3551A47508630j884603k312048j467632k593452j970766l202606j778561l320305
3543A28978657k529483j168379j963420j392882k057139j134448j87446j600392
3535A16945068j137468p94435j648163r1368m30348M97314j132627o10892Q76930
3526A12474011J51372n21874K98129J81417O64645n34402O69238q87205m1991
3517A12453340o75607k62788M89701q06766P5297l07861m85661j046291l2712
3508A09400652m37947j349568r16962j37746J20499m32697N86309K46561j4489
3499A07064612Q19715l41992J905184k85507K52342M53379K85765O33397Q1033
$$ plain form
3560 143030531 144123586 145338910 145605822 146231454 147556989 147292511 147633730 147246869 147508630
3551 147508630 145624027 143311979 141844347 139250895 137280129 134077523 132298962 128978657
3543 128978657 126449174 125280795 123317375 121924493 119867354 118732906 118545460 116945068
3535 116945068 115807600 115013165 113365002 113273634 112843286 113340600 112207973 111597081 112474011
3526 112474011 112625383 112103509 112401638 112583055 113247700 112713298 113382536 112495331 112453340
3517 112453340 111777733 111514945 112004646 111197880 111273177 110965316 110479655 109433364 109400652
3508 109400652 108962705 107613137 106696175 106558429 106678928 106246231 106832540 107079101 107064612
3499 107064612 107884327 107542335 109447519 109162012 109414354 109867733 110153498 110786895 110867928
3490A10867928J197717J345034J261524j01274J385472J669992J975754J191354
3482A20793501K849052K030104J630695J319377O06933m59717j073489j262061
3474A26434395k462511r54052q36082k194089j961571j122279Q2331p91364j58073
3465A16036705o30982k56418K49123p13704K074113M48105R80723J411019k30839
3456A19367845J951887J958899M95989J545323R36224J949529K109739J98789
3448A30514224J400505J227464J628839J9943Q30145K39948P6753J87375P38635
3439A36863831k31699P40748l22097R92433L59755L9300R71475m9280J815350
3430A41179816J396054j51922O49443J101791J941769L39915J952443Q97778K79987
$$ plain form
3490 110867928 112065645 113410679 114672203 114570929 115956401 117626393 119602147 120793501
3482 120793501 123642553 125672657 127303352 128622729 129229662 128769945 127696456 126434395
3474 126434395 123971884 123017832 122181750 119987661 118026090 116903811 116986142 116194778 116036705
3465 116036705 115405723 115149305 115398428 114684724 116758837 117206942 118187665 119598684 119367845
3456 119367845 121319732 123278631 123774620 125319943 126256167 128205696 130315435 130514224
3448 130514224 131914729 133142193 134771032 134790975 135621120 135861068 135937821 136125196 136863831
3439 136863831 136632132 137372880 137050783 138043216 138402971 138442271 139413746 139364466 141179816
3430 141179816 142575870 142423948 143073391 144175182 146116951 146456866 148409309 149307087 149587074
3421A49587074M35405J32976p13713l53458j356778j280109k113770j762930o50439
3412A41924258j634974k835328j319210j880443j519943j148005j252143k151989
3404A28182223j673825n52836k580589k808874j313185j927210j064889k387633
3396A13873182k392953k165535k524100k514952j713569k239753k862857j401421
3388I6058042k527093k160585j633209k055397j773022p36659j336024j405854
3380H2430199r86961l245511l62580j161917p30727j412927r92330r37257m71224
3371G2128765p10891p64348j008006j84799p71798K942q25439k90710J55400o02668
3361F7128448p52001O541L9079n95340O56573R38886p06692Q97209m80107m35132
$$ plain form
3421 149587074 150022479 150155455 149441742 149088284 147731506 146451397 144337627 142574697 141924258
3412 141924258 140289284 137453956 136134746 134254303 132734360 131586355 130334212 128182223
3404 128182223 126508398 125955562 123374973 120566099 119252914 117325704 116260815 113873182
3396 113873182 111480229 109314694 106790594 104275642 102562073 100322320 97459463 96058042
3388 96058042 93530949 91370364 89737155 87681758 85908736 85172077 83836053 82430199
3380 82430199 81443238 78197727 77835147 76673230 75942503 74529576 73537246 72599989 72128765
3371 72128765 71417874 70653526 69645520 69460721 68688923 68691865 67866426 67575716 67731116 67128448
3361 67128448 66376447 66382988 66422067 65826727 66483300 67422186 66715494 67612703 67132596 66697464
3351F6697464N5485q82463n16754J0303j4875P18059q42496m50655M3314m10352
3341F4407030J61459k06163o80333l69692j218976r1639N3070o41814j242768
3332F0170174p65782o52551o11360J22644j302013j63920j022401J63346j303450
3323E4634687m14269k49287j454983p39649J52248p8908j000316r90242l86571
3314D9472710j195180m50637J28745j35131r20560n84668n57473n75462j20952
3305D5061392j506935O41605o27204o26171k98002J66503j063954P00263r38964
3296D1508533p76181J554291j394806P2522L9297J99359o43706n58309O24606
3287D0625606l45002N328q95913L81492q5312L57321m84501k70669N78792n93677
$$ plain form
3351 66697464 66752949 65870486 65353732 65364035 65349160 66067219 65224723 64774068 64817382 64407030
3341 64407030 64568489 64362326 63681993 63312301 62093325 62001686 62054756 61412942 60170174
3332 60170174 59404392 58751841 58140481 58263125 56961112 56797192 55774791 55938137 54634687
3323 54634687 54220418 53971131 52516148 51776499 51928747 51849839 50849523 49859281 49472710
3314 49472710 48277530 47826893 47955638 47820507 46899947 46315279 45757806 45182344 45061392
3305 45061392 43554457 44196062 43568858 42942687 42644685 42811188 41747234 42447497 41508533
3296 41508533 40732352 42286643 40891837 40964359 41003656 41203015 40559309 40001000 40625606
3287 40625606 40280604 40285932 39390019 39771511 39686199 40043520 39559019 39288350 39867142 39273465
3277C9273465K27619M69040j346378N38620J60419l15407J31179k98374O5395
3268C8905578k17316n9790m82494j8207l31767L40045n62956j92097K87921j101678
3258C6567239P96910K69630p25112r84934Q04194o57404r57034N98091j616945
3249C4094635L75483j023000n89776j12660k15476l12153L29322j235318K36850
3240C1547907K7290l49850j38839J40627p11664P83894n21998K09635m91809J04017
3230C0599210M01026j78141k60579J82184j66162M58855l15910M43906j033384
3221C0131005J229334k79175m67791j11426p32657J810439j210167Q53871L38699
3212C1562132m80161M29578o75558N8157j95061J097215j86559k37907r9461J72385
$$ plain form
3277 39273465 39501084 39970124 38623746 39162366 39322785 39007378 39138557 38840183 38905578
3268 38905578 38688262 38628472 38145978 38127771 37796004 38136049 37573093 37380996 37668917 36567239
3258 36567239 37364149 37633779 36908667 35923733 36727927 36070523 35113489 35711580 34094635
3249 34094635 34470118 33447118 32857342 32744682 32529206 32217053 32546375 31311057 31547907
3240 31547907 31575197 31225347 31086508 31227135 30515471 31299365 30777367 30987002 30495193 30599210
3230 30599210 31000236 30822095 30561516 30743700 30577538 31036393 30720483 31164389 30131005
3221 30131005 31360339 31081164 30613373 30501947 29769290 31579729 30369562 31223433 31562132
3212 31562132 31081971 31511549 30835991 30894148 30699087 31796302 31609743 31371836 31272375 31444760
3202C1444760l03781J66735J101640m11232Q02174N1105O10358p6009o34029J566049
3192C4317770p26575J283054p40649M51848J00857M25918n97652J089351O31451
3183C6235373L15897j75186O35036O53603K81177l23657J072497o87541P57609
3174C8764808K99482L65301M8778R35224P08141j67204K79703O57851J3185K30331
3164D2135600Q50117J46966J201640J300966K24410O93549J375673Q97314J641898
3155E0468133N68480J108079O74082J997534K14286Q28480J802288J008679J646528
3146F0316569J212679J793287J143430J601010Q99985J802921J309322J347315
3138G1426518K309840N94788K318054J920055K611723J660216K481484K320170
$$ plain form
3202 31444760 31140979 31307714 32409354 31998122 32800296 32851401 33461759 33385750 32751721 34317770
3192 34317770 33591195 34874249 34133600 34585448 34686305 35112223 34514571 35603922 36235373
3183 36235373 36551270 36376084 37011120 37664723 37945900 37622243 38694740 38007199 38764808
3174 38764808 39064290 39429591 39478369 40413593 41121734 40954530 41234233 41892084 41905269 42135600
3164 42135600 42985717 43132683 44334323 45635289 45859699 46553248 47928921 48826235 50468133
3155 50468133 51036613 52144692 52818774 54816308 55030594 55859074 57661362 58670041 60316569
3146 60316569 61529248 63322535 64465965 66066975 66966960 68769881 70079203 71426518
3138 71426518 73736358 74331146 76649200 78569255 81180978 82841194 85322678 87642848
3130H7642848K492193K901152K909288L177268K457768L899814L959360M309912
3122A13749603N185734O230852N623376N185499N230577K521331J875968K169850
3114A47772790l34290j057345n91224r73922r4359R24008P41988J983697J690410
3105A50061753J446698J511392K623925K008858K582924J329597J141169J845595
3097A64551911J424180K221191J857272K171917K273166K634951L051152L211393
3089A83397133L511984L509019M069775L805452L608086L599994K835915L078723
3081B11416081K585269L036476K231531J786121J768025K778494K238930J892887
3073B29733814J749602K999794K376728L316511K978182L636984L642379K962407
$$ plain form
3130 87642848 90135041 93036193 95945481 99122749 101580517 105480331 109439691 113749603
3122 113749603 118935337 125166189 130789565 135975064 141205641 143726972 145602940 147772790
3114 147772790 147438500 146381155 145789931 144816009 144721650 145645658 146387646 148371343 150061753
3105 150061753 151508451 153019843 155643768 157652626 160235550 161565147 162706316 164551911
3097 164551911 165976091 168197282 170054554 172226471 174499637 177134588 180185740 183397133
3089 183397133 186909117 190418136 194487911 198293363 201901449 205501443 208337358 211416081
3081 211416081 214001350 217037826 219269357 221055478 222823503 225601997 227840927 229733814
3073 229733814 231483416 234483210 236859938 240176449 243154631 246791615 250433994 253396401
3065B53396401L795922M214595L742810M309029N138585M791882N678301N668499
3057B90736024N469078M733183M604050M888715L914879K426168P92333J427701
3049C18992131j02451j74672j427955o35281k45626P37015J075797L573233K372525
3040C24164716M140228L762544L768586L199226L423022J357750Q53043K28688
3032C44897803M80775J431822K829277L245521K740837L520170J940716L004266
3024C64091187K520816J412538K280088Q93435J225930K343959J927275M730843
3016C81426071O223675O157159P718738P227324J0069750J0476968J2272006J3977206
3008D55548897J4438045J3412210J3625657J0622081O608425j010936q355135
$$ plain form
3065 253396401 257192323 261406918 265149728 269458757 274597342 279389224 285067525 290736024
3057 290736024 296205102 300938285 305542335 310431050 314345929 316772097 317564430 318992131
3049 318992131 318889680 318715008 317287053 316651772 316406146 317143161 318218958 321792191 324164716
3040 324164716 328304944 332067488 335836074 339035300 342458322 343816072 344669115 344897803
3032 344897803 345378578 346810400 349639677 352885198 355626035 359146205 361086921 364091187
3024 364091187 366612003 368024541 370304629 371198064 372423994 374767953 376695228 381426071
3016 381426071 387649746 393806905 401525643 408752967 418822717 429299685 441571691 455548897
3008 455548897 469986942 483399152 497024809 507646890 514255315 513244379 504889244
3001E04889244j5928605k1367466k2840070k1508941j9630512j7208565j6571506
2994C69833579j4700963j2384619j1749554j1018799j0435534r303330r342746
2987B90898034q588279q303396p793492n702608p281304o879942n544958n316700
2979B35487355m577602m369212l098087l833590l753558k101615k886784k875147
2971B07991760k072800j658251k354724p22708k262070k445370j168336j426505
2963A93880996k581963j806345j123294k693983k024615j216713k446029j524327
2955A78463727j011495j863967j340175q73431k110143j883905o24315j583239
2947A67173057l28297j626694o57166M00993q9020k30400p12150Q15843p1978
$$ plain form
3001 504889244 488960639 467593173 444753103 423244162 403613650 386405085 369833579
2994 369833579 355132616 342747997 330998443 319979644 309544110 300240780 290898034
2987 290898034 282309755 274006359 266212867 260510259 253228955 246349013 240804055 235487355
2979 235487355 230909753 226540541 223442454 219608864 215855306 213753691 210866907 207991760
2971 207991760 205918960 204260709 201905985 201183277 198921207 196475837 195307501 193880996
2963 193880996 191299033 189492688 188369394 185675411 183650796 182434083 179988054 178463727
2955 178463727 177452232 175588265 174248090 173374659 171264516 169380611 168756296 167173057
2947 167173057 166844760 165218066 164560900 164961893 164872873 164642473 163930323 164746166 164674188
2938A64674188k88106j63854O57638n80831K48753M44266k05998n20637J134365
2929A65399784R30930L9201K163363J42715J548250J254904R36921Q69373Q04096
2920A74089537J386796P52233P24208J126433J151974J423512K002556J346701
2912A84003950J851237J645959J069159K678127J235703N69660J654784J521432
2904A96230011J672023J389235J569871K831946J940305K505009K789883J003960
2896B11932243K407173J723434J528448J007917K782114Q94990K207340K278172
2888B26761831J438674K931721K511964K986624J388145L346794L124422J498229
2880B45988404L039171Q17415J686755J070661J417432Q59210O78224J390114
$$ plain form
2938 164674188 164386082 164222228 164879866 164299035 164547788 164992054 164786056 164265419 165399784
2929 165399784 166330714 166369915 168533278 168675993 170224243 171479147 172416068 173285441 174089537
2920 174089537 175476333 176228566 176952774 178079207 179231181 180654693 182657249 184003950
2912 184003950 185855187 187501146 188570305 191248432 192484135 193053795 194708579 196230011
2904 196230011 197902034 199291269 200861140 203693086 205633391 208138400 210928283 211932243
2896 211932243 214339416 216062850 217591298 218599215 221381329 222276319 224483659 226761831
2888 226761831 228200505 231132226 233644190 236630814 238018959 241365753 244490175 245988404
2880 245988404 249027575 249844990 251531745 252602406 254019838 254879048 255557272 256947386
2872B56947386R98119J106903J969680J852175R46350K526834J794860J418991
2864B69561298K300156J785485J891831K057574K299012J724269L039930K379540
2856B87039095L302335J977119M924102L017694M156943L142133K532104K563024
2848C12654549K442913K214228K101898K243989L473679K706681K631899K999668
2840C33469504M279284L586678M656631M407191M907389L883252M274750L822590
2832C67287269M543900L246565J649919K886444J606505K827186J495476R26641
2824C86469905o86846J58116L07541j299924J74842j830880o92726p77673j450114
2815C80372241k102942l34968k721069k105948j199255l452031k153387l941912
$$ plain form
2872 256947386 257945505 259052408 261022088 262874263 263820613 266347447 268142307 269561298
2864 269561298 271861454 273646939 275538770 277596344 279895356 281619625 284659555 287039095
2856 287039095 290341430 292318549 297242651 300260345 304417288 307559421 310091525 312654549
2848 312654549 315097462 317311690 319413588 321657577 325131256 327837937 330469836 333469504
2840 333469504 337748788 341335466 345992097 350399288 355306677 359189929 363464679 367287269
2832 367287269 371831169 375077734 376727653 379614097 381220602 384047788 385543264 386469905
2824 386469905 385783059 385941175 386248716 384948792 385123634 383292754 382600028 381822355 380372241
2815 380372241 378269299 377934331 375213262 373107314 371908059 368456028 366302641 362360729
2807C62360729l833053m642288m675403n153862m337326n990786m802525m765906
2799C24159580m683430m882076l850792n232002m603628m530785m870084m199238
2791B87307545l678943m775365m650106l584243n113492l558168m431727m158057
2783B53357444l899676l905133m345031m069795n316168l456086l686637m014230
2775B20664688l306056m332570l559376l308220l343480k755834l164368l213063
2767A93681721k241314l855497j740862k116454m411019j985149l407432k677389
2759A71246605k656797j536600k804109k823314j865077k346245l157515j712360
2751A52344588k452583k777228k351008k527924k502896j422974k784151j428590
$$ plain form
2807 362360729 358527676 353885388 349209985 344056123 339718797 333728011 328925486 324159580
2799 324159580 319476150 314594074 310743282 305511280 300907652 296376867 291506783 287307545
2791 287307545 283628602 278853237 274203131 270618888 265505396 261947228 257515501 253357444
2783 253357444 249457768 245552635 241207604 237137809 231821641 228365555 224678918 220664688
2775 220664688 217358632 213026062 209466686 206158466 202814986 200059152 196894784 193681721
2767 193681721 191440407 187584910 185844048 183727594 179316575 177331426 173923994 171246605
2759 171246605 168589808 167053208 164249099 161425785 159560708 157214463 154056948 152344588
2751 152344588 149892005 147114777 144763769 142235845 139732949 138309975 135525824 134097234
2743A34097234k294247k468004j514796j303309k388536k089549j653602k464886
2735A17920305j756702j716662r76270k786110k49068k570174j227349j988075
2727A04649895o86144m21897j731039k295491l59170k095801r56134r46833j038862
2718I4118524j793677q22458m21541k212229j321094N0264j144932j042958j132636
2709H4277263p80515j258381r50065n13284j615835j019339j296967n55284j233081
2700G5054512j096079q26839p34998j302617n35634j148899l52560q26053j634198
2691F6596635j22015j471505J46563j585607l48717n40603j375165j43513k05626
2682F0950447q56094r55520n92524r11436m41535O8280n47949o6784j039288j135929
$$ plain form
2743 134097234 131802987 129334983 127820187 126516878 124128342 122038793 120385191 117920305
2735 117920305 116163603 114446941 113470671 110684561 110435493 107865319 106637970 104649895
2727 104649895 103963751 103541854 101810815 99515324 99156154 97060353 96104219 95157386 94118524
2718 94118524 92324847 91502389 91080848 88868619 87547525 87597789 86452857 85409899 84277263
2709 84277263 83496748 82238367 81288302 80775018 79159183 78139844 76842877 76287593 75054512
2700 75054512 73958433 73131594 72396596 71093979 70558345 69409446 69056886 68230833 66596635
2691 66596635 66474620 65003115 65149678 63564071 63215354 62674751 61299586 61156073 60950447
2682 60950447 60094353 59138833 58546309 57634873 57193338 57261618 56713669 56646885 55607597 54471668
2672E4471668j71491N17548m56545j088175K87183q3580q53315k35144P3290j89632
2662E2271807o66245J67557j88155q51805R38764j105178M6646l7291m70171l47519
2652D9758410P94629q13880k41958N07681K71868K53333P80862M23419K40032
2643E1974396R63329R73565m05568m16420j245848r88856j246199j597700q73715
2634D7136984p43734m36370k02372m666k76978j09643M62582K80709Q26649J388885
2624D8322046J66221o1437J682903J92798j55872j164879j092649j474234j838093
2615D4576804j017744n75584o37858j310283J55539q73657l66428k42741K0345
2606C9728393o83436r28013J33719o23622j85533o5181q88871p55200j17911J62586
$$ plain form
2672 54471668 54300177 54817725 54361180 53273005 53560188 53476608 52623293 52388149 52461439 52271807
2662 52271807 51605562 51773119 51584964 50733159 51671923 50566745 50613391 50576100 50105929 49758410
2652 49758410 50553039 49739159 49497201 50004882 50276750 50530083 51310945 51734364 51974396
2643 51974396 52937725 53911290 53505722 53089302 51843454 50854598 49608399 48010699 47136984
2634 47136984 46393250 45956880 45754508 45749842 45472864 45363221 45825803 46106512 46933161 48322046
2624 48322046 48488267 48426830 50109733 50302531 50146659 48981780 47889131 46414897 44576804
2615 44576804 43559060 42983476 42345618 41035335 41190874 40317217 39950789 39708048 39728393
2606 39728393 39044957 38116944 38250663 37627041 37441508 37376327 36487456 35732256 35614345 35776931
2596C5776931n73332r32787J5602m0308o58492n86455m03460L34397o65405m17624
2586C1849067K89114q34386O86418o95104K43681m67049J47319P5003l16060m0496
2576C0937507L41501N81568k77045L28234J91665P2850L63919J15805O32737P65308
2566C4054049r94786l05485L35576J62648n51246K15859L08315j53033J97077
2557C3268974K04834l44942K158436j05441j18371J072753L56681O35547N57105
2548C7685576j84881O78072k68657j03347l77020o35320J07014m41265K99072
2539C6759244j44067k6076O83745j66943m237K33499O5064N20327m09403O06130
2529C8117283K64541p75042K278161O82130P7932K90315m25614L29199K43273
$$ plain form
2596 35776931 35203599 34270812 34286414 34246106 33587614 33001159 32597699 32932096 32266691 31849067
2586 31849067 32138181 31303795 31990213 31295109 31538790 31071741 31219060 31294063 30978003 30937507
2576 30937507 31279008 31860576 31583531 31911765 32103430 32176280 32540199 32656004 33288741 34054049
2566 34054049 33059263 32753778 33089354 33252002 32700756 32916615 33224930 33071897 33268974
2557 33268974 33473808 33128866 35287302 35181861 35063490 36136243 36492924 37128471 37685576
2548 37685576 37500695 38178767 37910110 37806763 37429743 36794423 36901437 36460172 36759244
2539 36759244 36615177 36589101 37272846 37105903 37101666 37335165 37400229 37920556 37511153 38117283
2529 38117283 38381824 37606782 39884943 40567073 40645005 40935320 40509706 40838905 41082178
2520D1082178M40285J06065J411518k84309J389512J150393K053569M99674J858318
2511D9707203J105905M59360J79345j793289j14109k044359r45542j281261N64018
2502D5837271n91864k08183Q48496j47849O88733J571453J679328J084743K817244
2493E3579372R23321K353105K033896J305327M32343j6421j795105k860813k263308
2484E3691717j136093j329953p1363j334852K51847N29983J60547J594557r611
2475E2346779N33617M54642k90266O27832P82452J062279J005071Q78079J704628
2466E9105113m8642O49540l75667j39033J81720l65578L99927m40919J232017
2457F0198478l54344K68805q6445P48923k56761l58945j079944l58298M72321
$$ plain form
2520 41082178 41522463 41628528 43040046 42755737 44145249 45295642 47349211 47848885 49707203
2511 49707203 50813108 51272468 51451813 49658524 49544415 47500056 46554514 45273253 45837271
2502 45837271 45245407 45037224 45885720 45737871 46426604 47998057 49677385 50762128 53579372
2493 53579372 54502693 56855798 58889694 60195021 60627364 60610943 58815838 55955025 53691717
2484 53691717 52555624 51225671 51154308 49819456 50071303 50601286 50761833 52356390 52346779
2475 52346779 52880396 53335038 53044772 53672604 54455056 55517335 56522406 57400485 59105113
2466 59105113 59056471 59706011 59330344 59191311 59373031 59007453 59407380 58966461 60198478
2457 60198478 59844134 60112939 60026494 60775417 60518656 60159711 59079767 58721469 59193790
2448E9193790l63464M07285J676265R14647J408204Q15794J535053l34564j44724
2439F5108286o68020n0868k424368j197920j77882n87297j40825j805583R63794
2430E9019317m40442M97006l6181P78359k76481J064068J55571R40743Q47656
2421F2549616J590853J456244J45997J369575P04018m41387q08347j04173n57674
2412F5904722q98222j779073J02811M74881N09571k3495J959475J429456L028504
2403G0708630J301101L597678L538617M540751M857423N598570M651994M344625
2395A03139389M357308M391477L171175L879055L855851N561065O667831Q042501
2387A43065652J0106781R920458R715061J0038234O862703K047389N47171l172859
$$ plain form
2448 59193790 58830326 59237611 60913876 61828523 63236727 64052521 65587574 65253010 65108286
2439 65108286 64440266 64389398 61965030 60767110 60589228 60001931 59861106 58055523 59019317
2430 59019317 58578875 59075881 59039700 59818059 59541578 60605646 60761217 61701960 62549616
2421 62549616 64140469 65596713 65742710 67112285 67816303 67374916 66566569 66462396 65904722
2412 65904722 65006500 63227427 63330238 63805119 64314690 64291195 66250670 67680126 70708630
2403 70708630 72009731 75607409 79146026 83686777 88544200 94142770 98794764 103139389
2395 103139389 107496697 111888174 115059349 118938404 122794255 128355320 135023151 143065652
2387 143065652 153172433 163092891 172807952 182846186 189708889 191756278 192303449 189130590
2379A89130590p995403j0416525r539788p891811o389850m607813k817239j964796
2371A37507365r61273k15206J74179k316804j159897k963518m679418n319785
2363A20065643l365653m647702k883341k967125j951925j514736j186557n33283
2355A01015321o39849K08658j33701J254275J007358L48515J621l11821r53039
2346A01797338L97264L42715p52382r96677n50145j217155j310057p56422k575168
2337I4379311m112358k804858l159652k976063l171527j228355j277006j265622
2329G4383870j64598J95733K23268P08551k05820J659884m39044K72433k17634
2320G6416643r9928L50526p44051O96230M0268l01274j34781o66918r26250p98747
$$ plain form
2379 189130590 181135187 170718662 161178874 153287063 146897213 142289400 139472161 137507365
2371 137507365 136546092 136330886 136505065 134188261 133028364 130064846 125385428 120065643
2363 120065643 116699990 112052288 109168947 106201822 104249897 102735161 101548604 101015321
2355 101015321 100375472 100584130 100450429 101704704 102712062 103060577 103062198 102750377 101797338
2346 101797338 102194602 102537317 101784935 100788258 100238113 99020958 97710901 96954479 94379311
2337 94379311 90266953 87462095 84302443 81326380 78154853 76926498 75649492 74383870
2329 74383870 74219272 74415005 74638273 75346824 75141004 76800888 76361844 76634277 76416643
2320 76416643 76316715 76667241 75923190 76619420 76659688 76358414 76223633 75556715 74630465 73831718
2310G3831718k050316k420827j272068j770793j256234n05919j155654m78095
2302F2921812o33482o62065K39063j334210p16643n61489r86878k670060j416499
2293E4179549l35394k437403j81934j672285O99378j071448o30280m76609m92009
2284D7581565j92507N9498r85847r79437o94903p05986L71555j466681K37282
2275D3224539O98725j78677l69584n14486j450405j160168q16859j687400j742685
2266C6003000j276947j194250j521672j086914r90993p68024j567767l63601k35761
2257B6997071p38126p99062j576131k9327l19165j82481K8669o45149q01221l43934
2247B1591144j214421L27558J74132J65666Q57796n51185q29165o1714o86682
$$ plain form
2310 73831718 71781402 69360575 68088507 66317714 65061480 64555561 63399907 62921812
2302 62921812 62288330 61626265 61865328 60531118 59814475 59252986 58266108 55596048 54179549
2293 54179549 53844155 51406752 51224818 49552533 50251911 49180463 48550183 48073574 47581565
2284 47581565 47389058 47448556 46462709 45483272 44788369 44082383 44453938 42987257 43224539
2275 43224539 43923264 43744587 43375003 42860517 41410112 40249944 39433085 37745685 36003000
2266 36003000 34726053 33531803 32010131 30923217 29932224 29164200 27596433 27232832 26997071
2257 26997071 26258945 25459883 23883752 23854425 23535260 23352779 23381448 22736299 21935078 21591144
2247 21591144 20376723 20704281 20878413 21044079 21901875 21350690 20521525 20459811 19773129
2238A9773129N26440o93073o48224k72569j60577L63028P9230j021006Q34012
2229A8780390j412684N58277J87236p53770l65476N50149l50918L90674m29400
2220A7154478N4813q35376r11407J021530L27766j488766L00751P7417J06772
2211A5807978q39911P94226j12478j46711J71540L11100O3074l36566o40165j78493
2201A4893594m4316K91080m09315o50217N40759o05229M35411k56611L50718l64624
2191A4181250k03042r46018Q04964q5776M833K91997m83186l09101p8225l25232
2181A2852464K14193N10508R33910q18070M92266l5551n05860m0680K10176n85105
2171A3228251J45693m21351M72996p33832q3683l20764p1743L92228m07995n39463
$$ plain form
2238 19773129 20299569 19606496 18958272 18685703 18525126 18888154 18967384 17946378 18780390
2229 18780390 17367706 17925983 18113219 17359449 16993973 17544122 17193204 17583878 17154478
2220 17154478 17209291 16373915 15462508 16484038 16811804 15323038 15623789 15701206 15807978
2211 15807978 14968067 15762293 15649815 15503104 15674644 15985744 16048818 15712252 15072087 14893594
2201 14893594 14849278 15140358 14731043 14080826 14621585 14016356 14451767 14195156 14545874 14181250
2191 14181250 13978208 13032190 13837154 13751378 13756211 14048208 13565022 13255921 13177696 12852464
2181 12852464 13066657 13577165 14511075 13693005 14185271 14149720 13643860 13603180 13813356 13228251
2171 13228251 13373944 12952593 13425589 12691757 12608074 12287310 12215567 12607795 12199800 11660337
2161A1660337K83016N62666k91367j44957l6775O06198j190652M64058j76826
2152A1735698Q21293J73759p50618J100697j81983o96879j50507P90654q14003
2143A2028111K25747l95350j65647j00920R29521j351155Q14770k49458l17456
2134A1418163j9444l75686P24530q19176Q02831n86928M82611M18001k81455L69653
2124A2133100k47110R739O79982J87467r27021N76667K0524q08236Q55191N744
2114A2486047L97463K40682j68228j408535J572924q97764j42136L70200p08821
2105A1741832R78052L06830M14625p49285q71179J508440m05062J64158m02237
2096A2686174J00471J403271j039073R39188K07714o18481j71533M36609L73430
$$ plain form
2161 11660337 11943353 12506019 12214652 12069695 12032920 12639118 11448466 11912524 11735698
2152 11735698 12556991 12730750 11980132 13080829 12898846 12201967 12051460 12842114 12028111
2143 12028111 12253858 11858508 11692861 11591941 12521462 11170307 11985077 11735619 11418163
2134 11418163 11398719 11023033 11747563 10928387 11731218 11144290 11626901 12044902 11763447 12133100
2124 12133100 11885990 11895729 12575711 12763178 11836157 12412824 12433348 11625112 12480303 12486047
2114 12486047 12883510 13124192 12955964 11547429 13120353 12222589 12080453 12450653 11741832
2105 11741832 12719884 13026714 13441339 12692054 11820875 13329315 12924253 13088411 12686174
2096 12686174 12786645 14189916 13150843 14090031 14297745 13679264 13507731 13944340 14317770
2087A4317770O45240o19022J19018J78928O90266j133597m71304Q9977n77517
2078A3239759r4823L59082m77150l46505l67396O90433n95817O93107k72613N9621
2068A2887698k43981P81584o33593k32479Q53769j201159J037660j086105K26469
2059A2389863O59363o9517r55001J74517j70631k95331l39738M89213r48333j24487
2049A0809918n17639M8237K08547m63537q62921J007016l32672J19410k67413
2040I748946r32845L33973N00110j039185m15123j75775l82037K32031K54887
2031H124982j130471N71735N88823n75875o50347p0500M431J18697j22421l16058
2021F542996N98037o52763K1943j23050m06760R7044q99225K15524o29525J246603
$$ plain form
2087 14317770 14963010 14343988 14463006 14641934 15332200 14198603 13727299 13817276 13239759
2078 13239759 13144936 13504018 13026868 12680363 12312967 13003400 12407583 13100690 12828077 12887698
2068 12887698 12643717 13425301 12791708 12559229 13412998 12211839 13249499 12163394 12389863
2059 12389863 13049226 12979709 12024708 12199225 12028594 11733263 11393525 11882738 10934405 10809918
2049 10809918 10292279 10340516 10549063 10085526 9222605 10229621 9896949 10016359 9748946
2040 9748946 8816101 9150074 9650184 8610999 8195876 8020101 7638064 7870095 8124982
2031 8124982 6994511 7566246 8155069 7579194 6928847 6858347 6862778 6981475 6859054 6542996
2021 6542996 7141033 6488270 6510213 6387163 5980403 6077447 5178222 5393746 4764221 6010824
2011F010824p80902j4760M12656q33525J0804l42656K80548m24966N95353K38961
2001E152337o46486O45615p89069r4971k1329n39521R37920k10203k79527l70568
1991C784198K66277K18985L43460m75633r6568j26394K6668Q61J34736O7188n39384
1980C604394K19406m39940M77677o87904J40435m00243J36788K85708L64806m32018
1970C269109j04353N61088j96396m09487O33693j238878Q24391j56243k85743
1961B897181n5775K98812N80826m96411m01097K95304K66778q58836M77798k7118
1951B977462l61584O29762r65585R39119l42400o13969k7852m3098O94216K44279
1941C130350l22032k48253K82411k23286L79211o67269l95214J48837Q42646l04094
$$ plain form
2011 6010824 5229922 5215162 5627818 4794293 4805097 4462441 4742989 4318023 4913376 5152337
2001 5152337 4505851 5151466 4362397 4267426 4246097 3706576 4644496 4434293 4154766 3784198
1991 3784198 4050475 4269460 4612920 4137287 4040719 3914325 3940993 3941854 4076590 4143778 3604394
1980 3604394 3823800 3383860 3861537 3173633 3314068 2913825 3050613 3336321 3701127 3269109
1970 3269109 3164756 3725844 3529448 3119961 3753654 2514776 3339167 3182924 2897181
1961 2897181 2841406 3140218 3721044 3224633 2823536 3118840 3385618 2526782 3004580 2977462
1951 2977462 2615878 3245640 2280055 3219174 2876774 2262805 2234953 2191855 2886071 3130350
1941 3130350 2808318 2560065 2842476 2619190 2998401 2331132 1935918 2084755 2927401 2623307
1931B623307O47854j117341m40863J108387J38701o88597p4465R69753j148956
1922B017780J99865L30974l85451K51794J9471k91321J71247n05135J31871L21889
1912B262984o64733O33680j48202J149520j243322k22440j25716M78460J35731
1903B255962j63349R01816k61181p36684J49695p63794J409110j216594J229739
1894B804720n43930l96878M63208O4718N87219j318958L34530K9529J44602j89562
1884A979198k37337k64232Q36121l01799r73072P70738o06756N08006N42480q7354
1874B165993M00876p28013k413K34928o56292R78221k52943o92365Q52202l81072
1864A919122Q4869m21324P64087n16083n80861P30610j63874k00483R65554m40316
$$ plain form
1931 2623307 3271161 2153820 1712957 2821344 2960045 2271448 2196983 3166736 2017780
1922 2017780 2217645 2548619 2163168 2414962 2434433 2143112 2314359 1809224 1941095 2262984
1912 2262984 1598251 2231931 2083729 3233249 1989927 1767487 1641771 2120231 2255962
1903 2255962 2092613 2994429 2733248 1996564 2146259 1382465 2791575 1574981 2804720
1894 2804720 2260790 1863912 2327120 2391838 2979057 1660099 1994629 2024158 2168760 1979198
1884 1979198 1741861 1477629 2313750 2011951 1038879 1809617 1202861 1710867 2253347 2165993
1874 2165993 2566869 1838856 1836443 2071371 1415079 2393300 2140357 1447992 2300194 1919122
1864 1919122 2003991 1582667 2346754 1830671 1249810 1980420 1816546 1616063 2581617 2141301
1854B141301n28941m90665l20858J443335j58883p78268O60707L70662l47057
1845A991333o27908O63246m97760m61063O61035m39957J103267o20936m76276
1836A294981L12813m55930J147832l8509j543051M19556J214127q71100K33437
1827A714156j39950K3226O53880j406812K24930N40546O77586n0172M42615j160513
1817A519492J13432q4330M58652q19094K39175P8597J55325L2315p04016N16061
1807A505609M20908l50793m16576J7182K05917l2209j122330Q35340N61420k46633
1797A377835j35351m56784J233836m44882Q5964o53133J012948r31847o15863
1788D72723J453659o22787q767N86205j037109O22209m63230L31039K61633l24688
$$ plain form
1854 2141301 1612360 1121695 800837 2244172 2085289 1307021 1967728 2338390 1991333
1845 1991333 1363425 2026671 1528911 1067848 1728883 1288926 2392193 1771257 1294981
1836 1294981 1607794 1151864 2299696 2261187 718136 1137692 2351819 1480719 1714156
1827 1714156 1574206 1597432 2251312 844500 1069430 1609976 2287562 2237390 2680005 1519492
1817 1519492 1632924 1548594 2007246 1188152 1427327 1505924 1661249 1693564 989548 1505609
1807 1505609 1926517 1575724 1159148 1176330 1382247 1350038 227708 1063048 1624468 1377835
1797 1377835 1242484 785700 2019536 1574654 1660618 1007485 2020433 1088586 472723
1788 472723 1926382 1303595 1294828 1881033 843924 1466133 1002903 1333942 1595575 1270887
1778A270887m28365L29107k54802J167921N3678j120173L58757J48853n98761
1769I27102J20252K81805K2398l59006J72793J26006J27344n39488O77238k56487
1759A299957o97255O34797J26490k83876Q3799O23207q86891P04101K13339q5527
1749A732141p86460r1096K38328k57331L91200j62757M27371k78631L10736q10593
1739G12908l42086R81067m09348N15317R4020q93170O09096K32451K33738q58660
1729H75333P19534K09693p05826N31434j02268n99067p646k3375M70144J34479
1719A502435p75947J13800M82190l75484k2723N26403k64439J36398j26959K3980
1709A219654N51960p36995L64072J58482j75416m93485o23254O10197j55068J192210
$$ plain form
1778 1270887 842522 1171629 916827 2084748 2138426 1018253 1377010 1525863 927102
1769 927102 1047354 1329159 1351557 992551 1165344 1291350 1418694 879206 1556444 1299957
1759 1299957 602702 1237499 1363989 1080113 1163912 1787119 900228 1604329 1817668 1732141
1749 1732141 945681 854585 1092913 835582 1226782 1064025 1491396 1212765 1523501 712908
1739 712908 370822 1351889 942541 1457858 1551878 658708 1267804 1500255 1733993 875333
1729 875333 1594867 1804560 1098734 1630168 1527900 928833 921187 897812 1367956 1502435
1719 1502435 726488 840288 1322478 946994 924271 1450674 1186235 1322633 1195674 1219654
1709 1219654 1771614 1034619 1398691 1557173 1381757 888272 265018 875215 720147 1912357
1699A912357j093825L40670k69901q77210J166255l21774K04456J32021m21934
1690G71115L19964j2570N0764n2723M21165n65012J70445K4269L91256o43357
1680H75316J83840m93055P01298n44639P58994n27661L24595L85371l87939m43952
1670H32168O6545l45310K32640j69821O15967L82673o15464N6368j61103K60734
1660A155397O8400j98926Q52009p23122O79941j221068O04273p37886J12458m0017
1650E51459K17139j17147K45013K83396p8340m42102j49200O92592m08767m98879
1640B95164L55999j98749K95783L28826k65638Q5189q03264O07384N31672k72329
1630I60037l92314J69302K10043K65143n49781J81583j82961L10967K21460q53763
$$ plain form
1699 1912357 818532 1159202 889301 12091 1178346 856572 1061028 1193049 771115
1690 771115 1091079 1078509 1129273 1076550 1497715 932703 1103148 1127417 1518673 875316
1680 875316 1059156 566101 1267399 722760 1481754 954093 1278688 1664059 1276120 832168
1670 832168 898713 553403 786043 616222 1232189 1614862 999398 1055766 894663 1155397
1660 1155397 1223797 1024871 1876880 1153758 1833699 612631 1216904 479018 591476 551459
1650 551459 768598 651451 896464 1179860 1101520 659418 510218 1202810 794043 295164
1640 295164 651163 452414 748197 1077023 811385 896574 93310 700694 1232366 960037
1630 960037 567723 737025 947068 1212211 662430 844013 661052 972019 1193479 339716
1620C39716J03796M45398n49151J62901K4656R73481r18528l21520R45941l13513
1610H93177K96408k04456l37080O21566l20218p50256O90246K89897l00653j91097
1600F87534R56654j252075Q70126o77267j26297N71777m79860J66434o21999L5391
1590A30418Q36039n64884O66106p66561K49590L64178M67214q6501m86924K52366
1580A061041K9107q20206K54094M66417o74149P79118l84016J64814l71758K62397
1570G66859j63504K01152L85861k51729l93320r76736J205645j04098P2253j06617
1560F35766k09429J78880l55174J89080Q48663n25433j78737r5214K79065k23184
1550E44283O85672n58244Q61452l84307r24867O10921l39714N83255J15888J73489
$$ plain form
1620 339716 443512 888910 339759 502660 527316 1500797 582269 260749 1206690 893177
1610 893177 1189585 985129 648049 1269615 949397 199141 889387 1179284 878631 687534
1600 687534 1644188 392113 1262239 584972 458675 1030452 550592 717026 95027 130418
1590 130418 966457 401573 1067679 301118 550708 914886 1382100 1295599 808675 1061041
1580 1061041 1090148 269942 524036 990453 316304 1095422 711406 876220 504462 766859
1570 766859 603355 804507 1190368 938639 545319 -431417 774228 670130 742383 635766
1560 635766 426337 605217 250043 439123 1287786 762353 583616 488402 767467 544283
1550 544283 1229955 671711 1533163 1148856 223989 834910 495196 1078451 1194339 1367828
1540A367828o13398j53687L6684Q6763O34640l03076l98794P64777j316527M00023
1530E05233P27931O1490o14987P29114J62692r63893J37305M65569n93963J57437
1520G73928l58146l41996j10690R09874j55641m14874L93080J79577L47789q03378
1510D19523l3707P04990L0583j262369J159516J01970n07345k07941J50319J96560
1500G52099J1983K15160R16115j022192l65323k92285P52573k10874l49479L66538
1490G74315p10644K12644K81027j08867P45774J03037n10225j43515K89959K07598
1480A141103q7451J99050l46531Q9861l67901J11909M48892j69316K33634j75936
1470A077314L71263q423L2066r9207Q1353P39589k83035k95522Q07375q73499
$$ plain form
1540 1367828 754430 600743 637427 724190 1358830 1055754 656960 1421737 105210 505233
1530 505233 1233164 1294654 679667 1408781 1571473 607580 744885 1210454 616491 773928
1520 773928 415782 73786 -36904 872970 717329 302455 695535 875112 1222901 419523
1510 419523 385816 1090806 1121389 -140980 1018536 1120506 613161 405220 555539 752099
1500 752099 764082 979242 1895357 873165 507842 215557 968130 757256 407777 774315
1490 774315 63671 276315 557342 448475 1194249 1297286 787061 643546 933505 1141103
1480 1141103 1053652 1252702 906171 996032 628131 740040 1188932 1019616 1253250 1077314
1470 1077314 1448577 1440154 1472220 1373013 1454366 2193955 1910920 1615398 2422773 1549274
1460A549274P62356p59796J98543J132607k02282K11888m288P91289o14336J394229
1450D459484J46539O51896N42826P49506L98382k65602R21552o04265r1789r22271
1440E986258o96295l9765q19565p02513m12641o02847M0561r74204P96163J10953
1430B686105q08257Q88181o81463K38588L3377j285337L08573P00773j48490q91185
1420A040865O70512l46579j33824M16648r22345N60922l28866l21800M59289m20880
1410F73942K32067J54466m7467L18421m56672N06319q53927L73322Q96076r30687
1400H65860J69856K76369k71276m207l14548j60014m64406J345546o58516K98822
1390A083486M91576n60272L6162o76770P51857j35068O8077n06229m32586P5383
$$ plain form
1460 1549274 2311630 1551834 1750377 2882984 2680702 2892590 2888302 3679591 3065255 4459484
1450 4459484 4606023 5257919 5800745 6550251 6948633 6683031 7604583 7000318 6908529 5986258
1440 5986258 5289963 5250198 4430633 3728120 3315479 2712632 2753193 1778989 2575152 2686105
1430 2686105 1877848 2766029 2084566 2323154 2356531 1071194 1379767 2080540 1932050 1040865
1420 1040865 1711377 1364798 1230974 1647622 725277 1286199 957333 635533 1094822 673942
1410 673942 906009 1060475 1013008 1331429 874757 1381076 527149 900471 1796547 865860
1400 865860 1035716 1312085 1040809 1036602 722054 562040 97634 1443180 784664 1083486
1390 1083486 1575062 1014790 1050952 374182 1126039 990971 1059048 552819 120233 195616
1380A95616J98072P41397p07883L93058l29095j17546Q46432o34924L41254k72682
1370F53699l5600K62752n86996P96300j58515l97032q0787P41756j036889l0128
1360A28560N21588N51595r95158K86586k54194K64465J97813q51803N76735O33412
1350A059599L31866q45216p4322l17012L62958j195544J975725k46524m24882
1341F26648o69221P46604q61221O42372q01369L27634Q00524p64899j15310L51178
1331B82940K31289l64911P39648L80727j24667p13801k94327O70312J80331j007205
1321a9664Q62242m24690q6308k93910J75061j50989Q02356l45706K47627J90383
1311I56402m94944j039671K52495P30485p08003J445902m18421j11173r17731
$$ plain form
1380 195616 393688 1135085 427202 820260 491165 373619 1220051 585127 926381 653699
1370 653699 618099 880851 293855 1090155 931640 534608 453821 1195577 158688 128560
1360 128560 650148 1201743 206585 493171 238977 503442 701255 -150548 426187 1059599
1350 1059599 1391465 546249 471927 154915 517873 -677671 1298054 1051530 626648
1341 626648 -42573 704031 -157190 485182 -316187 11447 811971 47072 -68238 282940
1331 282940 514229 149318 888966 1269693 1145026 431225 136898 807210 987541 -19664
1321 -19664 842578 417888 331580 37670 212731 61742 864098 518392 766019 956402
1311 956402 461458 -578213 -325718 404767 -303236 1142666 724245 613072 -304659
1302c04659J070743q4643M53072l53740q65811L45764O91076k64803m56801k16108
1292A4090P05057j29522K11595p58213K98262L2843n57403L49675j23271R53623
1282I96736n20619n50497j33920N01623P503P40075o06098O79009o69880K89415
1272G33347o06970J88401q46759P39130J88119r67511R80980q24030J044716L16030
1262I45453j157163N82990l42714K7298K17075M0540l3915n59383N80178J92643
1252D93002M33100j476884J285169n92691P52084M96426m76876l78580k9528Q0676
1242E85898J41305k79501l2943k6302J63899n65365J00473Q23616n20961N87107
1232I77226m39164l91438J060085n47344N3439o3200l5881q39755M41342L41711
$$ plain form
1302 -304659 766084 681441 1134513 780773 -85038 260726 951802 686999 230198 14090
1292 14090 719147 589625 801220 43007 341269 374112 -183291 166384 43113 996736
1282 996736 476117 -74380 -208300 293323 300826 1040901 434803 1113812 443932 733347
1272 733347 126377 314778 -531981 207149 395268 -572243 408737 -415293 629423 945453
1262 945453 -211710 371280 28566 55864 272939 313479 279564 -279819 300359 493002
1252 493002 926102 -550782 734387 141696 893780 1390206 913330 534750 505222 585898
1242 585898 727203 447702 414759 388457 552356 -13009 87464 911080 390119 977226
1232 977226 538062 146624 1206709 659365 712804 649604 613723 -226032 215310 557021
1222E57021k42357k5195j54164K21421r86029P47923N86646m52772J35264N08947
1212H96705J90385k80822K52438p68288K30935K15135m11053n52363P25973k65525
1202B33520K81541l78328j86306L3651P14303l64671K80946j96267j83767n33539
1192b98917M98561M05238n74925Q43278q22406N57468P99192q89171l86430J062210
1182A194098q43971k63297O48216J28646j012251R09733j94406r16425Q28268
1173D78611j86581L54980m26482j28850J122520j371951M40464O04549n52089
1164C35171R0252k17873Q10994q38894j30622R43841j458715J455384L9670r34069
1154I5139j33092M27378l356O16114n43110K13668L63690l56353N0530m92035
$$ plain form
1222 557021 314664 289469 135305 356726 -629303 118620 705266 252494 387758 896705
1212 896705 1087090 806268 1058706 290418 521353 736488 325435 -226928 499045 233520
1202 233520 515061 136733 -49573 -15922 698381 333710 614656 418389 234622 -298917
1192 -298917 199644 604882 29957 873235 50829 608297 1407489 518318 131888 1194098
1182 1194098 350127 86830 735046 863692 -148559 761174 566768 -349657 478611
1173 478611 292030 647010 220528 91678 1214198 -157753 282711 887260 335171
1164 335171 425423 207550 1018544 179650 49028 992869 -465846 989538 1029208 95139
1154 95139 -37953 389425 386069 1002183 459073 672741 1036431 680078 730608 238573
1144B38573p22185R1695J046890k22290K195J20244j12991k58885o09315Q17141
1134C91072m26005L83764n60045N85253p53491L84007N21070l43863L18690J09497
1124F09949n21835l49951N56330J49269L9503m83689P41802m27442n9254k12468
1114D2214k83323K81035P44645J38660j291226Q75154j69180K01865q7244n67511
1104a14911L76237K16605J33261J43911o60328m19479M14970P47732N4321m18212
1094D74107K79485o03345L62607l26472J7941k63391j4966L98323N45108k83230
1084E86167l07826o05658Q73371j402297Q95563L03576J22616k36209O01125o55417
1074A75011P13282q54597J26663j23775M7592q54772M24574J98765J47042M41320
$$ plain form
1144 238573 -483612 -391917 654973 432683 434878 555122 442131 183246 -426069 391072
1134 391072 -34933 348831 -211214 374039 -379452 4555 525625 181762 500452 609949
1124 609949 88114 -261837 294493 443762 483265 -424 741378 313936 254682 42214
1114 42214 -241109 39926 784571 923231 -367995 507159 337979 539844 452600 -114911
1104 -114911 261326 477931 611192 755103 94775 -324704 90266 837998 892319 474107
1094 474107 753592 150247 512854 186382 204323 -59068 -74034 324289 869397 586167
1084 586167 278341 -327317 546054 -856243 39320 342896 465512 229303 830428 175011
1074 175011 888293 33696 160359 36584 84176 -770596 -346022 -147257 -215 441105
1064D41105j08359p89833J128318j03323j97512M00615l65170k85612o8077P1364
1054A23516J14989L92425n01749N95124p21196M69635q35353J029756k23209k07340
1044B36598k93710L56983K38582k70276o39269J16944M12980J72476J55753o38701
1034a51640q7723J083411p75906L20637k04889K09183k07236m07544Q35628n63687
1024E0234L6006J080558j337373J73921L5295Q5354k81165M62508p7147J76919
1014D05110k55691N17411j68560k54751k27071P5315Q429J04967r2551J19881
1004B32489l74032r7747K03869K64914K62298J00243k21715m97372P2415j54596
994b09234N94062K12649m1617M38782p33490J21014m52353L51033J59221l86909
$$ plain form
1064 441105 332746 -457087 671231 567908 370396 771011 405841 120229 52152 123516
1054 123516 238505 630930 129181 724305 3109 472744 -362609 667147 443938 236598
1044 236598 -57112 299871 538453 268177 -371092 -254148 158832 331308 487061 -151640
1034 -151640 -239363 844048 68142 388779 183890 393073 185837 -221707 613921 50234
1024 50234 86240 1166798 -170575 3346 38641 123995 -157170 305338 228191 405110
1014 405110 149419 666830 498270 243519 16448 91763 100192 205159 112608 232489
1004 232489 -141543 -239290 -35421 229493 491791 592034 370319 -127053 -54638 -209234
994 -209234 384828 597477 555860 994642 261152 382166 -70187 280846 440067 53158
984E3158M86308m4250n32709n2636M36553q33114N78157L70843k08845K7142J58245
973D38852O15140o23432M25191l17774j25183k87502j49150l56868k78962Q53087
963A93399K50448m23674l35097j33089O29974k77307J084663j205808P11853j52332
953C43030n24385L2483N35511o37903j5029P75971l64473N81706j554037J280402
943D53276J92776p62779J83138k76415P38411k26239L54549k90763J39949p92115
933b86212P02696M57360j832823P36472R30344k11809n64721K91094K26838L46244
923G95483r54310K98970L48970m53138L80212j7227k89028L14276j208595J283504
913D99117j56876M28770m84691Q39774j124624J2520l24806K35751k42175Q36176
$$ plain form
984 53158 539466 495216 -37493 -90129 346424 -486690 91467 462310 253465 280607 438852
973 438852 1053992 430560 855751 537977 412794 125292 -23858 -380726 -659688 193399
963 193399 443847 20173 -314924 -448013 181961 -95346 989317 -216491 495362 343030
953 343030 -181355 -148872 386639 -251264 -266293 509678 145205 726911 -827126 453276
943 453276 646052 -116727 66411 -210004 528407 302168 656717 365954 505903 -286212
933 -286212 416484 873844 -958979 -222507 707837 496028 -68693 222401 449239 795483
923 795483 -158827 140143 489113 35975 416187 398960 109932 424208 -784387 499117
913 499117 342241 771011 286320 1126094 1470 13990 -310816 -75065 -317240 518936
903E18936j52278q24101Q27626j7387J13016J86953j87271l25623J44114J6532
893C00517k35040N35376q75633O07626L52410n88556j85484K95781n34724M69555
883A41828j8385j29773L39778p54667K45767j93770j08256O38844k99316m39393
873e77343J161399l40490K68442o11810P92391J90049q36418m45903P76313m68563
863i1933L80598l19552k35405j37962O15166K87944j391272J011016j37671N36030
853E16959q6959q06109N57663k57925l35927R9598L13852m23529L86980Q0199
843D4802M09386k40718q20180J080009p05141j65253O24503K07105l31865K03142
833C05790K36943k80448J93783j121848K85348Q23438r21289M36635J21345L3754
$$ plain form
903 518936 366658 -457443 370183 352796 465812 652765 465494 139871 283985 300517
893 300517 65477 600853 -274780 332846 685256 96700 -88784 206997 -327727 141828
883 141828 123443 -6330 333448 -421219 -175452 -369222 -477478 161366 -137950 -577343
873 -577343 584056 243566 512008 -99802 692589 882638 46220 -399683 376630 -91933
863 -91933 288665 -30887 -266292 -404254 210912 498856 -892416 118600 -19071 516959
853 516959 430000 -376109 181554 -76371 -412298 -312700 1152 -422377 -35397 44802
843 44802 454188 213470 -606710 473299 -231842 -397095 227408 434513 102648 305790
833 305790 542733 262285 456068 -665780 -380432 443006 -478283 -41648 79697 113451
823A13451O9903m31536k54222J38416N57235q3965K50670m03836K42720m66853
813b68017J97257J5727n0990L45848r3910O28460o98975K93281j58427m71225
803b60971L58889K45045k42687r3351n41824P09153o37072j99055O05372m34556
793d91057J137370j12026n21959P31573j040615M50953k95234M32497k89421L56185
783C58266p80437M95163O69505p03306N47167M01626j346436K22063J11501L54516
773C29628j71313j42875j070216Q01974J80722l90546N21902Q9724j38192J23701
763A34509O2616j262619N87650N1712L20463K97953j40214P07788m25490l65736
753c1368n29729Q73979j89844l78627M53153k92540n1803M21150l19491N55852
$$ plain form
823 113451 183354 -248182 -502404 -363988 193247 109282 359952 -43884 198836 -268017
813 -268017 -70760 -55033 -106023 239825 145915 774375 75400 368681 210254 -260971
803 -260971 97918 342963 100276 6925 -534899 174254 -462818 -661873 -56501 -491057
793 -491057 646313 534287 12328 743901 -296714 154239 -140995 291502 2081 358266
783 358266 -422171 72992 742497 39191 586358 987984 -358452 -136389 -24888 329628
773 329628 158315 15440 -1054776 -252802 -72080 -462626 59276 149000 10808 134509
763 134509 197125 -1065494 -477844 -426132 -105669 192284 52070 759858 334368 -31368
753 -31368 -561097 312882 123038 -255589 197564 -94976 -146779 274371 -45120 510732
743E10732Q6293r02683L27947m88116O85254l86323K08512K2842K66466J79137
733E10061n24809m65651N20059K65626K07689j32860q25887M50763l409l30921
723c29339J12965j78203k43061Q62633o56607L82429j76608M53754K93140l18056
713B03047k89487j71803J051563p46147K30173l30962J00275R753l84478P39881
703D11815n48914L44893M16908r16455k48630K96876n88544P23311K15976k80654
693a73418K00241K17434l86466M92590n49001O2512K47920K47392j084586J115355
683C89973r24117M48796J22968l04476L40891l42947K41254J187020j002139l03381
673a46158N49807r59494n0832R64580K07929o97319j24594K18282o66136Q51070
$$ plain form
743 510732 597025 -305658 22289 -465827 219427 -166896 41616 64458 330924 510061
733 510061 -14748 -480399 39660 305286 512975 380115 -445772 4991 1582 -329339
723 -329339 -216374 -394577 -637638 224995 -431612 -49183 -225791 227963 521103 203047
713 203047 -86440 -258243 793320 47173 277346 -53616 46659 56412 -328066 411815
703 411815 -137099 207794 624702 -291753 -540383 -243507 -832051 -108740 107236 -173418
693 -173418 26823 244257 -142209 350381 -198620 -136108 111812 359204 -725382 389973
683 389973 -534144 -85348 37620 -266856 74035 -268912 -27658 1159362 157223 -146158
673 -146158 403649 -555845 -606677 357903 565832 -131487 -256081 -37799 -703935 147135
663A47135n09244j30370R70680l86544p01123P45863L28615l71133l12280Q42718
653F24317n53060n06676L04483M98095k45062L69284p53317L17960R2954l72711
643b23733k38859P20155m86316l67003N99281O73783j197751J841276j103728
634B17105M48421p79604N21679r60299J6572R54764j13653K44n79614P5013L34446
623A35074O5583j80639o6632P43320r29061L0288j69798N68882K82868m20524
613E9361l11621O95102l1952n00109l72402R13289j014311o2750L6855o6276J093336
602D38522o40116l8000q3882L80347j82214J7881p4022l75367J207648j236060
592e85263O87470K60463l60259l33451P22713J88673l99490n71751O64697l31563
$$ plain form
663 147135 -362109 -492479 478201 91657 -609466 136397 465012 93879 -218401 624317
653 624317 71257 -435419 -130936 367159 122097 491381 -261936 56024 148978 -223733
643 -223733 -462592 257563 -228753 -595756 3525 677308 -520443 1320833 217105
634 217105 665526 -114078 407601 -552698 -536126 418638 304985 305229 -274385 -199372 135074
623 135074 200657 20018 -46614 696706 -232355 -202067 -371865 197017 479885 59361
613 59361 -252260 442842 410890 -89219 -461621 451668 -562643 -625393 -588538 -654814 438522
602 438522 -201594 -239594 -323476 56871 -125343 -107462 -181484 -556851 650797 -585263
592 -585263 102207 362670 2411 -331040 391673 580346 180856 -390895 273802 -57761
582e7761k72611J99974O84601n93509l13324N36285K58274j99513m04019j67234
572c28837K85419j75347O66284p34906J067209j183337Q24535j150788J154586
563D24818j69391k74505K34685j06580n62256K93399P24869m04881k66616n83730
553f90188R53469m78545O31350k43052p0137M86397r26278O51918k60175j86325
543a31566O8023j43254M24571o04689Q9998P85193k79700Q7408l52088O70977
533F14873k45612q93730Q92636k30103j44729P98083j226193O91870M73107j045685
523c15483J21077L49080J75623j18044o44979j86922J070343q72065P2228J52926
513a96216L4500L3778L47681j8747k484l92536p52370N93077M00557k76248k39833
$$ plain form
582 -57761 -330372 -130398 554203 -39306 -352630 183655 441929 242416 -161603 -328837
572 -328837 -43418 -218765 447519 -287387 779822 -403515 421020 -729768 424818
563 424818 255427 -19078 215607 109027 -453229 -159830 565039 160158 -106458 -690188
553 -690188 263281 -215264 416086 173034 102897 589294 -336984 314934 54759 -131566
543 -131566 -63543 -206797 217774 -386915 -296917 488276 208576 295984 -56104 614873
533 614873 369261 -524469 368167 138064 -6665 791418 -434775 257095 730202 -315483
523 -315483 -194406 154674 330297 212253 -432726 -619648 450695 -421370 -349142 -196216
513 -196216 -161716 -127938 219743 200996 198512 -194024 -946394 -353317 47240 -229008 -468841
502d68841M16660J90333m27893Q3590K83679j73780L85073J61254m58825r5945
492a04695l50329O18370l68664N57925k66314l50523k94831O19689K3675p53814
482f69511M89860L55402L73879j14761j257205P87512M98918j09379P3143O5363
472D93221r85389O09200j43379k35131K55032P26844j128133R3890J002522j300323
462f11646j02559Q27361m50395J02985R7932O44612k49140J68107r74257J118114
452E71114l96836k1607r01745J121979k94730m40285O3838P75642l08149l11004
442a41783L65698q38544P98536L99550m23739r6842j4548j68189P77096p34064
432g6829J76443l62733L6431j00326P22936j645445J209256N28263j04303n46454
$$ plain form
502 -468841 -52181 138152 -289741 -206151 77528 -96252 288821 450075 -8750 -104695
492 -104695 -455024 163346 -205318 352607 86293 -264230 -559061 60628 84303 -669511
482 -669511 -179651 175751 549630 434869 -822336 -34824 464094 354715 427858 493221
472 493221 -492168 117032 -26347 -261478 -6446 720398 -407735 -313845 688677 -611646
462 -611646 -714205 113156 -337239 -234254 -136322 508290 259150 427257 -547000 571114
452 571114 174278 152671 -749074 372905 78175 -362110 -298272 477370 169221 -141783
442 -141783 223915 -614629 183907 583457 159718 62876 48328 -119861 657235 -76829
432 -76829 99614 -263119 -226688 -327014 395922 -1249523 -40267 487996 383693 -162761
422a62761O87061j572618J092771L0284l29689Q09759p81634K29655r62643K52054
412g07761L48367M22849J2689j00775J6761k75905r2172L80153k462n25281N16704
401f833m754m86499N78986j42276p68044J270261r8031k67422L72148o16776k07045
390c76285O26831n01589J68506m23902K07672J030676r63740P81271o17266K53779
380A85953j85458K16580n22498j28826O56924m95605K81969N5886m53898J037141
370F48168j056416j02898J319963j151304K2487O6785M23004j82086Q2952l91494
360c20839K58113K48682M38418q93958L32561K96075p00254K09585J17298m72478
350d86797O72622j52052K241k4511m98472Q73364p36363l31993O65243L40327
$$ plain form
422 -162761 524300 -1048318 44453 74737 -254952 554807 -226827 2828 -959815 -707761
412 -707761 -359394 63455 76144 -24631 -7870 -283775 -375947 4206 1744 -523537 -6833
401 -6833 -11587 -498086 80900 -61376 -829420 440841 342810 75388 447536 -169240 -376285
390 -376285 250546 -251043 -82537 -506439 -298767 731909 -231831 549440 -67826 185953
380 185953 495 217075 -305423 -434249 222675 -272930 9039 64925 -388973 648168
370 648168 -408248 -511146 808817 -342487 -320000 -253215 169789 -12297 70655 -320839
360 -320839 -62726 185956 624374 -269584 62977 359052 -341202 -131617 -14319 -486797
350 -486797 185825 33773 36014 11503 -486969 386395 -349968 -681961 -16718 323609
340C23609n83169k26103M69560m2658J33204L69022q25069P60766N50091q22264
330A06989o22489Q32384O530n86061k47725Q88598n40223k62917J50467K62546
320a1901K78150n49648J45765j21080o05391M34309M51436q95051J242180j043338
310f74569P63573k5344k9437O3715n83465j04638L26860O27867m54916J56858
300F6504k54428o86251L2140J118637r20679R33628l63760k53181k782j9177K36423
289a12926L14634Q0701r245L55035q51592j6804K61672j59411k37374M0199r5084
278d30195J54270r63256M64963P04721n48146J89058L93153k53555p09521J786207
268G87699o87548l65653k35588k86362M59587K92204k69583N46037k77552M8182
$$ plain form
340 323609 -259560 -485663 -16103 -58761 74443 443465 -381604 379162 929253 106989
330 106989 -515500 316884 323414 -262647 -510372 378226 -161997 -424914 -274447 -11901
320 -11901 266249 -283399 -137634 -258714 -864105 -429796 21640 -873411 368769 -674569
310 -674569 89004 63660 34223 97938 -485527 -590165 -263305 364562 -90354 66504
300 66504 -187924 -874175 -842035 276602 -644077 289551 -74209 -327390 -330172 -349349 -112926
289 -112926 201708 282409 273164 628199 -223393 -240197 21475 -137936 -375310 -335111 -430195
278 -430195 -275925 -1239181 -774218 -69497 -617643 -428585 -35432 -288987 -998508 787699
268 787699 100151 -265502 -501090 -787452 -327865 -35661 -305244 240793 -36759 11423
258A1423n48615m54800L05412R66764n09516O4084L35039q11128Q19789p39071
248e60619P15476j83808n5409J42307l34297M29446r8241L08222n26248p0957
$$ plain form
258 11423 -537192 -991992 -686580 280184 -229332 -165248 169791 -641337 178452 -560619
248 -560619 154857 -28951 -84360 57947 -276350 153096 54855 363077 -163171 -234128
$$ [...]
##END NTUPLES=NMR SPECTRUM
##END=
