##TITLE=abcd
##JCAMPDX= 6.0         $$ Bruker NMR JCAMP-DX V2.0
##DATA TYPE= NMR SPECTRUM
##DATA CLASS= NTUPLES
##ORIGIN= UXNMR, Bruker Analytische Messtechnik GmbH
##OWNER= root
$$ XWIN-NMR		Version 3.5
$$ Mon Apr 27 17:07:03 2026 Russian Standard Time (UT+4h)  servis@DPX200
##.OBSERVE FREQUENCY= 200.131235884673
##.OBSERVE NUCLEUS= ^1H
##.ACQUISITION MODE= SIMULTANEOUS
##.ACQUISITION SCHEME= undefined
##.AVERAGES= 32
##.DIGITISER RES= 18
##SPECTROMETER/DATA SYSTEM= spect
##.PULSE SEQUENCE= zg
##.SOLVENT NAME= Acetone
##.SHIFT REFERENCE= (INTERNAL, Acetone, 0, 16.4885)
##AUDIT TRAIL= $$ (NUMBER, WHEN, WHO, WHERE, WHAT)
$$ ##TITLE= Audit trail, XWIN-NMR		Version 3.5
$$ ##JCAMPDX= 5.01
$$ ##ORIGIN= Bruker BioSpin GmbH
$$ ##OWNER= servis
$$ F:\spectra/data/av/nmr/H1/1/pdata/1/auditp.txt
$$ ##AUDIT TRAIL=  $$ (NUMBER, WHEN, WHO, WHERE, WHAT)
(   1,<2026-04-27 17:06:18.28 +0400>,<servis>,<DPX200>,
      <created by zg, POWCHK disabled, PULCHK disabled
       configuration hash MD5:
       00 E9 B6 7A A2 85 ED C7 34 08 36 98 17 FE 4E 26
       data hash MD5: 32K
       2F 28 F3 18 1A 48 8E 3B 32 62 F7 0A EC 1C 10 25>)
(   2,<2026-04-27 17:06:19.84 +0400>,<servis>,<DPX200>,
      <Start of raw data processing
       efp BC_mod = 2 LB = 0.05 FT_mod = 6 PKNL = 1 PHC0 = -257.0274 PHC1 = 3.101563 SI = 16K 
       data hash MD5: 16K
       7A D8 5A 2B 54 91 75 41 F8 9B 91 B5 AA 51 38 54>)
(   3,<2026-04-27 17:06:28.56 +0400>,<servis>,<DPX200>,
      <abs ABSG = 5 
       data hash MD5: 16K
       19 17 EC 00 0E 38 D0 95 70 17 12 D2 C8 11 CF 5D>)
(   4,<2026-04-27 17:06:42.45 +0400>,<servis>,<DPX200>,
      <pk PHC0 = -0.6 PHC1 = 0 
       data hash MD5: 16K
       F8 37 18 54 6E B0 F8 3D 8A E0 9B C5 8D 03 54 D3>)
$$ ##END=
$$ 
$$ hash MD5
$$ BE 10 33 7F FD 45 B4 D5 E3 DB 31 07 E9 90 4B 2D
##$RELAX= 
##$RELAX= 
##$RELAX= 
##$RELAX= 
##$RELAX= 
##$RELAX= 
##$RELAX= 
##$RELAX= 
$$ Bruker specific parameters
$$ --------------------------
##$DU= <F:\spectra>
##$EXPNO= 1
##$NAME= <H1>
##$PROCNO= 1
##$TYPE= <nmr>
##$USER= <av>
##$AMP= (0..31)
100 100 100 100 100 100 100 100 100 100 100 100 100 100 100 100 100 100 
100 100 100 100 100 100 100 100 100 100 100 100 100 100 
##$AQSEQ= 0
##$AQ_mod= 1
##$AUNM= <au_zg>
##$AUTOPOS= <>
##$BF1= 200.13
##$BF2= 200.13
##$BF3= 200.13
##$BF4= 200.13
##$BF5= 500.13
##$BF6= 500.13
##$BF7= 500.13
##$BF8= 500.13
##$BYTORDA= 1
##$CFDGTYP= 0
##$CFRGTYP= 5
##$CHEMSTR= <none>
##$CNST= (0..31)
1 1 145 1 1 1 1 1 1 1 1 1 1 1 1 1 1 1 1 1 1 1 1 1 1 1 1 1 1 1 1 1 
##$CPDPRG= <>
##$CPDPRG1= <>
##$CPDPRG2= <>
##$CPDPRG3= <>
##$CPDPRG4= <mlev>
##$CPDPRG5= <mlev>
##$CPDPRG6= <mlev>
##$CPDPRG7= <mlev>
##$CPDPRG8= <mlev>
##$CPDPRGB= <>
##$CPDPRGT= <>
##$D= (0..31)
0 2 0 0 0 0 0 0 0 0.06 0 0 0 0 0 0 0.0002 0 0 0 0 0 0 0 0 0 0 0 0 0 0 
0 
##$DATE= 1777295177
##$DBL= (0..7)
120 120 120 120 120 120 120 120 
##$DBP= (0..7)
150 150 150 150 150 150 150 150 
##$DBP07= 0
##$DBPNAM0= <>
##$DBPNAM1= <>
##$DBPNAM2= <>
##$DBPNAM3= <>
##$DBPNAM4= <>
$$ [...]
##$SUBNAM5= <"">
##$SUBNAM6= <"">
##$SUBNAM7= <"">
##$SUBNAM8= <"">
##$SUBNAM9= <"">
##$SW= 20.6817932712277
##$SWIBOX= (0..15)
0 0 3 0 0 0 0 0 0 0 0 0 0 0 0 0 
##$SW_h= 4139.07284768212
##$TD= 32768
##$TD0= 1
##$TE= 0
##$TE2= 300
##$TE3= 300
##$TEG= 300
##$TL= (0..7)
0 120 120 120 120 120 120 120 
##$TP= (0..7)
150 150 150 150 150 150 150 150 
##$TP07= 0
##$TPNAME0= <>
##$TPNAME1= <>
##$TPNAME2= <>
##$TPNAME3= <>
##$TPNAME4= <>
##$TPNAME5= <>
##$TPNAME6= <>
##$TPNAME7= <>
##$TPOAL= (0..7)
0.5 0.5 0.5 0.5 0.5 0.5 0.5 0.5 
##$TPOFFS= (0..7)
0 0 0 0 0 0 0 0 
##$TUNHIN= 0
##$TUNHOUT= 0
##$TUNXOUT= 0
##$USERA1= <user>
##$USERA2= <user>
##$USERA3= <user>
##$USERA4= <user>
##$USERA5= <user>
##$V9= 5
##$VALIST= <valist>
##$VCLIST= <CCCCCCCCCCCCCCC>
##$VD= 0
##$VDLIST= <DDDDDDDDDDDDDDD>
##$VPLIST= <PPPPPPPPPPPPPPP>
##$VTLIST= <TTTTTTTTTTTTTTT>
##$WBST= 1024
##$WBSW= 30
##$XGAIN= (0..3)
0 0 0 0 
##$XL= 0
##$YL= 0
##$YMAX_a= 1042289
##$YMIN_a= -1288252
##$ZGOPTNS= <>
##$ZL1= 120
##$ZL2= 120
##$ZL3= 120
##$ZL4= 120
##$ABSF1= 16.48848
##$ABSF2= -4.193441
##$ABSG= 5
##$ABSL= 3
##$ALPHA= 0
##$AQORDER= 0
##$ASSFAC= 0
##$ASSFACI= 0
##$ASSFACX= 0
##$ASSWID= 0
##$AUNMP= <proc_1d>
##$AZFE= 0.1
##$AZFW= 0.1
##$BCFW= 0
##$BC_mod= 2
##$BYTORDP= 0
##$COROFFS= 0
##$CY= 18.4799938201904
##$DATMOD= 1
##$DC= 0
##$DFILT= <>
##$DTYPP= 0
##$F1P= 9.9274215381318
##$F2P= -0.165520771350173
##$FCOR= 1
##$FTSIZE= 16384
##$FT_mod= 6
##$GAMMA= 0
##$GB= 0
##$INTBC= 1
##$INTSCL= 4.127829e-11
##$ISEN= 128
##$LB= 0.05
##$LEV0= 0
##$LPBIN= 0
##$MAXI= 10000
##$MC2= 0
##$MEAN= 0
##$ME_mod= 0
##$MI= 50
##$NCOEF= 0
##$NC_proc= -5
##$NLEV= 6
##$NOISF1= 3.799351
##$NOISF2= 2.8
##$NSP= 0
##$NTH_PI= 0
##$NZP= 0
##$OFFSET= 16.48848
##$PC= 4
##$PHC0= -257.6274
##$PHC1= 3.101563
##$PH_mod= 1
##$PKNL= yes
##$PPARMOD= 0
##$PSCAL= 4
##$PSIGN= 0
##$REVERSE= no
##$SF= 200.130005582386
##$SI= 16384
##$SIGF1= 3
##$SIGF2= 2
##$SINO= 400
##$SIOLD= 16384
##$SREGLST= <1H.CDCl3>
##$SSB= 0
##$STSI= 16384
##$STSR= 0
##$SW_p= 4139.07284768211
##$SYMM= 0
##$S_DEV= 0
##$TDeff= 32768
##$TDoff= 0
##$TI= <>
##$TILT= no
##$TM1= 0
##$TM2= 0
##$TOPLEV= 0
##$USERP1= <user>
##$USERP2= <user>
##$USERP3= <user>
##$USERP4= <user>
##$USERP5= <user>
##$WDW= 1
##$XDIM= 16384
##$YMAX_p= 318022677
##$YMIN_p= -765392
$$ End of Bruker specific parameters
$$ ---------------------------------
##NTUPLES= NMR SPECTRUM
##VAR_NAME=  FREQUENCY,     SPECTRUM/REAL,   SPECTRUM/IMAG
##SYMBOL=    X,             R,               I
##VAR_TYPE=  INDEPENDENT,   DEPENDENT,       DEPENDENT
##VAR_FORM=  AFFN,          ASDF,            ASDF
##VAR_DIM=   16384,         16384,           16384
##UNITS=     HZ,            ARBITRARY UNITS, ARBITRARY UNITS
##FACTOR=    0.252644378177508, 1,           1
##FIRST=     3299.83951724647, 0,            0
##LAST=      -839.233330435636, 0,           0
##MIN=       -839.233330435636, -765392,     0
##MAX=       3299.83951724647, 318022677,    0
$$ Real data points
##PAGE= N=1
##DATA TABLE= (X++(R..R)), XYDATA
$$ [...]
$$ plain form
13277 -113475 74405 -96437 -138090 24574 -99968 80807 115250 -255924 3291 -21755
13267 -21755 18809 131583 -23395 21765 -208294 193360 97677 -43003 -114380 -111847 -48799
13256 -48799 -100711 50578 -63483 -211987 -1541 -13240 40965 215526 -178487 -107350
13246 -107350 -56113 -97696 298 42243 93470 -179523 -25862 212075 -101640 134649
13236 134649 74584 -164768 31893 83143 -114165 34235 -12116 4191 169255 -62865
13226 -62865 158274 -176873 57208 28880 -46099 28827 -48222 -223593 130596 -41044
13216 -41044 137893 -26084 35982 112836 136780 929 -186546 -119823 87828 -176081
13206 -176081 -42413 -297867 -134997 -62053 68193 -327117 28848 -94711 32791 217381
$$ packed form
13277a13475J87880j70842m1653J62664j24542J80775L4443l71174K59215k5046
13267b1755M0564J12774j54978M5160k30059M01654r5683j40680p1377K533O3048
13256d8799n1912J51289j14061j48504K10446j1699N4205J74561l94013P1137
13246a07350N1237m1583R7994M1945N1227k72993J53661K37937l13715K36289
13236A34649o0065k39352J96661N1250j97308J48400m6351J6307J65064k32120
13226f2865K21139l35147K34081k8328p4979P4926p7049j75371L54189j71640
13216d1044J78937j63977O2066P6854K3944j35851j87475O6723K07651k63909
13206a76081J33668k55454J62870P2944J30246l95310L55965j23559J27502J84590
$$ plain form
13196 217381 -48698 -125862 232397 -3049 -38254 -122736 -142664 113265 -40828 -169672
13186 -169672 -65871 -27258 145530 -115510 -31875 9002 -25502 81405 7968 -118189
13176 -118189 -136901 -191056 -83934 112497 -113043 -122226 -41171 -67077 -107518 -90467 98065
13165 98065 -80778 9777 -104993 6719 112866 -91913 -203224 -74575 -180075 -127924
13155 -127924 -184679 -215499 -173445 -42054 -16851 -241062 20393 -37315 -38316 206755 -14305
13144 -14305 -130308 10352 10731 -22459 -160045 -116002 -68070 -2902 -68645 -26255 94458
13133 94458 208191 64049 83130 -14067 -7356 -264447 26062 -218265 -51960 -26296 -303179
13122 -303179 -37581 135804 -5817 -15582 50850 3094 11907 30818 174978 -115003 12509
$$ packed form
13196B17381k66079p7164L58259k35446l5205q4482j9928K55929j54093j28844
13186a69672J03801L8613J72788k61040Q3635M0877l4504J06907p3437j26157
13176a18189j8712n4155J07122J96431k25540r183Q1055k5906m0441J7051J88532
13165I8065j78843R0555j14770J11712J06147k04779j11311J28649j05500N2151
13155a27924n6755l0820M2054J31391K5203k24211K61455n7708j001K45071k21060
13144a4305j16003J40660L79l3190j37586M4043M7932O5168o5743M2390J20713
13133I4458J13733j44142J9081r7197O711k57091K90509k44327J66305K5664k76883
13122c03179K65598J73385j41621r765O6432m7756Q813J8911J44160k89981J27512
$$ plain form
13111 12509 -55351 -87198 -12968 -140185 -111865 -162392 -70068 89507 -56586 -212897 150257
13100 150257 142886 -2701 309042 -235434 3072 59840 84542 24060 64813 -129538 147343
13089 147343 162369 -17364 136589 -42797 -127232 27325 31301 27720 161321 17598 38944
13078 38944 -34045 249389 173226 94061 -105717 106071 -15444 5129 69255 196788 -126746
13067 -126746 207406 -146311 115621 34177 -17579 27111 170040 -160371 11274 -129960
13057 -129960 -40264 -149056 41283 -129208 -275753 32506 -14875 -61722 292793 -152371
13047 -152371 -178922 38365 53195 64627 -100586 -197216 -171847 -157987 26065 -127155 -39700
13036 -39700 -148745 -202644 -28131 71632 -171231 -422 -86532 -64488 34767 23314 -91505
$$ packed form
13111A2509o7860l1847P4230j27217K8320n0527R2324J59575j46093j56311L63154
13100A50257p371j45587L11743n44476K38506N6768K4702o0482M0753j94351K76881
13089A47343J5026j79733J53953j79386q4435J54557L976l581J33601j43723K1346
13078C8944p2989K83434p6163p9165j99778K11788j21515K0573O4126J27533l23534
13067a26746L34152l53717K61932q1444n1756M4690J42929l30411J71645j41234
13057a29960Q9696j08792J90339j70491j46545L08259m7381m6847L54515m45164
13047a52371k6551K17287J4830J1432j65213r6630K5369J3860J84052j53220Q7455
13036c9700j09045n3899J74513R9763k42863J70809q6110K2044R9255j1453j14819
$$ plain form
13025 -91505 210256 36458 -203586 -70673 -223250 66097 -80611 -256371 34813 -252053
13015 -252053 -52393 130746 -280538 58043 -69011 -187124 31258 3872 -206688 23971
13005 23971 -163908 -128848 -357024 175189 -1742 -2639 -176122 -56343 1378 -41536 -155952
12994 -155952 18548 -138062 -233102 -254225 -166393 42481 -174296 -229288 612 -83583
12984 -83583 87512 85931 -38180 -122007 -166635 -34091 -92679 -161498 -341256 -148070 -114042
12973 -114042 -184764 -286094 85029 -415 -138363 -111232 6731 84684 25215 -57926 -168121
12962 -168121 -53539 -129627 -175886 -3270 -184950 -244620 -83499 -36381 -107534 -54941 -167106
12951 -167106 -216433 -57250 19909 -138551 -134934 -171461 -191803 98153 -118380 -91814 -8188
$$ packed form
13025i1505L01761j73798k40044J32913j52577K89347j46708j75760K91184k86866
13015b52053J99660J83139m11284L38581j27054j18113K18382k7386k10560K30659
13005B3971j87879L5060k28176N32213j76931q97j73483J19779N7721m2914j14416
12994a55952J74500j56610r5040k1123Q7832K08874k16777n4992K29900q4195
12984h3583J71095j581j24111q3827m4628J32544n8588o8819j79758J93186L4028
12973a14042p0722j01330L71123q5444j37948K7131J17963P7953n9469q3141j10195
12962a68121J14582p6088m6259J72616j81680n9670J61121M7118p1153N2593j12165
12951a67106m9327J59183P7159j58460L617l6527k0342K89956k16533K6566Q3626
$$ plain form
12940 -8188 -111558 -30313 -39281 -298546 -176097 -258552 -278773 -96124 -295107 -140342 -99856
12929 -99856 -231547 82100 -54760 -118907 -183814 -55726 -167574 -169379 -142072 -99635 -203107
12918 -203107 58165 -52416 26783 -177933 -280824 65521 -84357 -296214 -152918 -166886
12908 -166886 -183468 -117869 -365664 -104892 -95966 -98221 -216179 -70050 67715 -158565 190887
12897 190887 -42789 -201146 -54721 -57858 -193916 -139897 -214930 -56094 -139608 -296958
12887 -296958 -211503 -92134 -278191 -235332 -269780 -102193 130826 31356 -17209 -155949
12877 -155949 -141038 26120 93842 -202357 -254573 39238 -68980 -225579 -58053 -139641
12867 -139641 -100440 -184286 -222910 -85264 9267 -88030 -135638 -134881 -10014 74925 9795
$$ packed form
12940h188j03370Q1245q968k59265J22449q2455k0221J82649j98983J54765M0486
12929i9856j31691L13647j36860o4147o4907J28088j11848j805K7307M2437j03472
12918b03107K61272j10581P9199k04716j02891L46345j49878k11857J43296j3968
12908a66886j6582O5599k47795K60772Q926k255j17958J46129J37765k26280L49452
12897A90887k33676j58357J46425l137j36058N4019p5033J58836q3514j57350
12887b96958Q5455J19369j86057M2859l4448J67587K33019r9470m8565j38740
12877a55949J4911J67158O7722k96199n2216K93811j08218j56599J67526q1588
12867a39641L9201q3846l8624J37646R4531r7297m7608P57J24867Q4939o5130
$$ plain form
12856 9795 -360944 -176736 -23126 -114092 -215767 -100750 -93985 -135263 88014 -49443 -283245
12845 -283245 -75513 -129683 -171143 -130719 -110365 23070 -89782 -188173 -173674 -157360 -63139
12834 -63139 -343384 -36316 -190881 -220850 -9289 -137618 -61475 -166402 -99197 -202877
12824 -202877 -32317 -55224 -314796 86163 138490 -77840 -289324 -61881 -12754 -202536
12814 -202536 -98863 -115478 -377587 -61762 52806 -189617 -231151 -234123 -104615 53601
12804 53601 -181646 -222331 -365361 38104 -14746 -119980 -65422 -27640 -61901 6802 -148130
12793 -148130 -108418 -115597 -101820 -199049 -192648 -134192 -207079 -131979 -153082 -424600 -144805
12782 -144805 -75039 -153278 -81274 -79328 -91127 -172 -18990 -172970 -150977 -61926 -188645
$$ packed form
12856I795l70739J84208J53610r0966j01675J15017O765m1278K23277j37457k33802
12845b83245K07732n4170m1460M0424K0354J33435j12852r8391J4499J6314R4221
12834f3139k80245L07068j54565k9969K11561j28329P6143j04927O7205j03680
12824b02877J70560k2907k59572M00959N2327k16330k11484K27443M9127j89782
12814b02536J03673j6615k62109L15825J14568k42423m1534k972J29508J58216
12804E3601k35247m0685j43030M03465n2850j05234N4558L7782l4261O8703j54932
12793a48130L9712p179J3777r7229O401N8456p2887P5100k1103k71518K79795
12782a44805O9766p8239P2004J946j1799R0955j8818j53980K1993Q9051j26719
$$ plain form
12771 -188645 -106460 -134286 -144498 -203600 -241239 -85766 -72443 -170782 -344092 -224741 -156994
12760 -156994 -128901 13346 -361712 -247888 -148075 -58082 88189 -204456 -250769 -15040
12750 -15040 -103864 83711 -82971 -407630 5770 -107973 -108593 -89408 -161879 -175675 72623
12739 72623 -239392 -70279 -343089 -252950 10024 -45374 6952 -254332 -332291 -7320
12729 -7320 -159858 12725 -141807 -186829 -152949 -11617 -31378 -139999 -114870 -79107 -275038
12718 -275038 -173151 -277779 -191133 -281712 -186295 -140326 -222697 -223558 -80743 -227349 -329629
12707 -329629 -74724 -144045 -111136 -214294 -210533 -44856 -363330 -155264 -324412 -161238
12697 -161238 -34366 -375936 -119766 -42877 -356123 115542 -136315 -192094 -180204 -237357
$$ packed form
12771a88645Q2185k7826j0212n9102l7639J55473J3323r8339j73310J19351O7747
12760a56994K8093J42247l75058J13824R9813Q9993J46271k92645m6313K35729
12750a5040q8824J87575j66682l24659M13400j13743o20J9185p2471j3796K48298
12739G2623l12015J69113k72810R0139K62974n5398N2326k61284p7959L24971
12729g320j52538J72583j54532m5022L3880J41332j9761j08621K5129L5763j95931
12718b75038J01887j04628Q6646r0579R5417M5969q2371q61J42815j46606j02280
12707c29629K54905o9321L2909j03158L761J65677l18474K08066j69148J63174
12697a61238J26872l41570K56170P6889l13246M71665k51857n5779J1890n7153
$$ plain form
12687 -237357 13746 -176739 -221101 -217493 -185372 -5694 -81093 -121756 -186995 -124495 -136413
12676 -136413 -132094 -173560 -266999 -264555 -229682 40023 -136111 -167721 -298692 -49702 -159881
12665 -159881 -176437 -290192 -86122 -205272 -75852 -141038 -78478 -150864 -57950 -183666
12655 -183666 4120 -90154 -264595 -62977 -139891 -249762 -86296 -41513 -2950 -20773
12645 -20773 -112449 -80011 64530 3235 -278570 -140817 -244270 -196009 -811 -155621
12635 -155621 -393893 -23780 -285321 -77862 68069 -9972 -259962 142202 48555 -164534
12625 -164534 -117811 -205202 -63151 -67036 -406402 -55123 -158989 -316339 -302158 -117592
12615 -117592 -233506 -205522 -157177 -187254 -126980 -45384 -406803 -212671 -10399 -239678
$$ packed form
12687b37357K51103j90485m4362L608L2121J79678p5399m0663o5239O2500j1918
12676a36413M319m1466r3439K444L4873K69705j76134l1610j30971K48990j10179
12665a59881j6556j13755K04070j19150J29420o5186O2560p2386R2914j25716
12655a83666J87786r4274j74441K01618p6914j09871J63466M4783L8563j7823
12645b0773r1676L2438J44541o1295k81805J37753j03453M8261J95198j54810
12635a55621k38272L70113k61541K07459J45931p8041k49990M02164r3647k13089
12625a64534M6723q7391J42051l885l39366L51279j03866j57350J4181J84566
12615a17592j15914K7984M8345l0077O0274Q1596l61419J94132K02272k29279
$$ plain form
12605 -239678 -157499 -113732 -89721 -124530 -153022 -86556 -93667 -161166 -235787 -260640 -211679 -80924
12593 -80924 -428117 -333412 -41160 -342735 -121422 -131524 -319018 -206999 -144429 -368912
12583 -368912 -101723 -197516 -240262 -279272 49743 -294485 -269373 -8328 -120530 -181746
12573 -181746 -4310 -162795 48977 -88843 -244971 -36639 -75975 -213488 -64900 -352523
12563 -352523 -97718 23628 -83509 -78934 -201718 -157692 115156 -149962 -110910 17613
12553 17613 -353535 3383 18974 -170546 -10681 -172440 -104931 60843 -161972 -208885
12543 -208885 38025 -91521 -317607 -24033 -53760 -151682 -51450 -102772 -128664 -80578
12533 -80578 -206279 115706 -77634 -172096 -104237 -79685 -119011 -156861 -233267 -253588 -253761
$$ packed form
12605b39678Q2179M3767K4011l4809k8492O6466p111o7499p4621k4853M8961J30755
12593h0924l47193R4705K92252l01575K21313j0102j87494J12019O2570k24483
12583c68912K67189r5793m2746l9010L29015l44228K5112K61045j12202o1216
12573a81746J77436j58485K11772j37820j56128K08332l9336j37513J48588k87623
12563c52523K54805J21346j07137M575j22784M4026K72848k65118L9052J28523
12553A7613l71148L56918J5591j89520J59865j61759O7509J65774k22815m6913
12543b08885K46910j29546k26086K93574k9727r7922J00232n1322k5892M8086
12533h0578j25701L21985j93340r4462O7859K4552l9326l7850p6406k0321j73
$$ plain form
12522 -253761 -114487 -302209 -277930 -74103 -293140 -189137 -221769 -315113 127472 -279903
12512 -279903 -162209 -29815 -242953 -147716 -67338 -225170 -247511 -191186 -295458 -132126
12502 -132126 -5329 -131391 -257692 -144662 -148413 -5264 -86934 1425 -133597 -381573
12492 -381573 37778 49708 -270854 -188644 -257025 -22162 -142469 -255440 -85520 -167805
12482 -167805 -141780 -98550 -186 -71737 -462656 80822 -108240 -464545 -76028 -303597
12472 -303597 -170181 -83213 -203122 -174602 -203583 -264980 23225 -326972 -200171 -114868
12462 -114868 -152683 -81678 -74059 -46246 -184158 -181462 -110453 -401141 -153123 -177637 -253029
12451 -253029 -233441 -190847 -348354 -103876 -25358 -247645 -249224 -120917 -209309 -246659 -141445
$$ packed form
12522b53761J39274j87722K4279K03827k19037J04003l2632r3344M42585m07375
12512b79903J17694J32394k13138R5237Q0378j57832k2341N6325j04272J63332
12502a32126J26797j26062j26301J13030l751J43149q1670Q8359j35022k47976
12492c81573M19351J1930l20562Q2210o8381K34863j20307j12971J69920q2285
12482a67805K6025M3230R8364p1551l90919N43478j89062l56305L88517k27569
12472c03597J33416Q6968j19909K8520k8981o1397K88205l50197J26801Q5303
12462a14868l7815P1005P619K7813j37912K696P1009k90688K48018k4514p5392
12451b53029J9588M2594j57507K44478P8518k22287j579J28307q8392l7350J05214
$$ plain form
12440 -141445 -65323 -278051 -305808 -17199 -376320 -112212 44152 -328690 -213239 34412
12430 34412 -25097 -202768 -91331 -47914 -118849 -45026 -66845 -353275 -65614 33196 -229188
12419 -229188 -98031 -179385 -328848 -135030 -82166 -227922 -88522 -148987 -21108 -169918
12409 -169918 51496 42485 -257597 -137803 -112590 -90770 3112 -97006 -290726 -182151
12399 -182151 117469 -131117 -267753 -273258 -237192 -68383 -298506 -53739 -246482 -210576
12389 -210576 -280594 -170543 -98216 -99418 -448472 -102706 -179021 -96557 -87230 -111903 -75433
12378 -75433 -161286 -19897 -240903 -2712 -152485 -105486 -105984 -191150 -8031 -137338 -113776
12367 -113776 -163549 -114366 -65222 -221385 82782 -4558 -157838 125878 188091 -80971
$$ packed form
12440a41445P6122k12728k7757K88609l59121K64108J56364l72842J15451K47651
12430C4412n9509j77671J11437M3417p0935P3823k1819k86430K87661R8810k62384
12419b29188J31157q1354j49463J93818N2864j45756J39400o0465J27879j48810
12409a69918K21414r011l00082J19794K5213K1820R3882j00118j93720J08575
12399a82151K99620k48586j36636n505L6066J68809k30123K44767j92743L5906
12389b10576p0018J10051P2327j202l49054L45766p6315Q2464R327k4673L6470
12378g5433q5853J41389k21006K38191j49773M6999m98q5166J83119j29307K3562
12367a13776m9773M9183M9144j56163L04167q7340j53280K83716O2213k69062
$$ plain form
12357 -80971 28945 -232107 120249 -98571 -508216 15851 -35582 -148768 -79097 11841
12347 11841 -146818 116631 -167164 88004 -123631 -61030 65463 -124561 1789 -151278
12337 -151278 -126811 -187667 -206243 -69555 -270363 -191805 -137787 -196010 -70172 -81127 -155170
12326 -155170 -46228 -261399 -249374 3035 -157899 -246809 -67189 174704 -231195 64449
12316 64449 -250679 -113612 -117382 -60368 -290619 -216374 -268970 -245283 -92514 -129255 -350818
12305 -350818 -11699 -233728 -124135 390791 -106172 -95980 136713 16557 -55995 162835
12295 162835 -161652 -278564 -300936 -117627 -156358 -158625 -104235 -174427 -119504 -74777 -133136
12284 -133136 72018 -115767 114546 -123359 -156542 201311 -119933 -66968 10592 -77993
$$ packed form
12357h0971J09916k61052L52356k18820m09645N24067n1433j13186O9671R0938
12347A1841j58659K63449k83795K55168k11635O2601J26493j90024J26350j53067
12337a51278K4467o0856j8576J36688k00808P8558N4018n8223J25838j0955p4043
12326a55170J08942k15171J2025K52409j60934q8910J79620K41893m05899K95644
12316F4449l15128J37067l770N7014k30251P4245n2596K3687J52769l6741k21563
12305c50818L39119k22029J09593N14926m96963J0192K32693j20156p2552K18830
12295A62835l24487j16912k2372J83309l8731k267N4390p0192N4923M4727n8359
12284a33136K05154j87785K30313k37905l3183L57853l21244N2965P7560q8585
$$ plain form
12274 -77993 36614 -21027 -326256 54172 128265 -101848 -267506 111820 -33786 73678
12264 73678 -116401 -45807 -76768 44859 -30305 173081 -74491 117723 63190 59852 62980
12253 62980 53758 -82 209811 -143071 -38690 142645 -3156 17355 -110358 -174056 -15483
12242 -15483 -169402 -75447 -219662 4683 46014 -144173 -124832 -18195 1271 -9019 -209875
12231 -209875 7467 -131557 -148579 -103289 -33274 -119151 272893 -8775 -265741 86520
12221 86520 -27725 -126279 201594 -215265 -72405 33573 144359 84354 32134 37917 -82506
12210 -82506 85897 -89860 -103916 -41799 -56780 128601 225753 -33140 285735 120563
12200 120563 2553 285954 -44211 -63701 103063 42082 -25009 115790 210810 -25414
$$ packed form
12274g7993J14607n7641l05229L80428P4093k30113j65658L79326j45606J07464
12264G3678j90079P0594l0961J21627p5164K03386k47572J92214n4533l338L128
12253F2980r222n3840K09893l52882J04381J81335j45801K0511j27713o3698J58573
12242a5483j53919R3955j44215K24345M1331j90187J9341J06637J9466j0290k00856
12231b09875K17342j39024j7022M5290P0015q5877L92044k81668k56966L52261
12221H6520j14245r8554L27873m16859J42860J05978J10786o0005n2220N783j20423
12210h2506J68403j75757j4056O2117j4981J85381R7152k58893L18875j65172
12200A20563j18010K83401l30165j9490J66764o0981o7091J40799R5020k36224
$$ plain form
12190 -25414 118578 147502 -271350 -190493 284999 -16120 -35613 93011 237709 -38560
12180 -38560 49842 130147 32762 -180895 -28113 35969 132172 127227 131781 27519 -52414
12169 -52414 -143841 48342 -132004 -2884 48750 95329 89763 179764 244338 253891 23856
12158 23856 321608 -78121 200607 263576 89454 13956 17263 25672 163077 109913 -68090
12147 -68090 -163892 85577 7 63646 125799 219521 -11491 259896 251654 -56295 234487
12136 234487 154709 116491 -41766 -6484 96404 38579 103073 303222 -183286 122149
12126 122149 11062 -65960 150619 97588 31815 41269 53458 248067 157177 190317 115362
12115 115362 -8883 121459 106715 95269 208546 70152 107930 117707 26504 200314 145567
$$ packed form
12190b5414J43992K8924m18852Q0857M75492l01119j9493J28624J44698k76269
12180c8560Q8402Q0305r7385k13657J52782O4082R6203m945M554j04262p9933
12169e2414r1427J92183j80346J29120N1634M6579n566R0001O4574R553k30035
12158B3856K97752l99729K78728O2969j74122p5498L307Q409J37405n3164j78003
12147f8090r5802K49469q5570O3639O2153R3722k31012K71387q242l07949K90782
12136B34487p9778l8218j58257L5282J02888n7825O4494K00149m86508L05435
12126A22149j11087p7022K16579n3031o5773R454J2189J94609r0890L3140p4955
12115A15362j24245J30342j4744j1446J13277j38394L7778R777r1203J73810n4747
$$ plain form
12104 145567 -122371 192136 183476 168671 152306 213263 67340 177246 174287 225590 -51875
12093 -51875 193072 115844 195956 160106 53233 4468 260204 18625 227279 133109 208471
12082 208471 197730 61743 259586 310976 -20465 310349 95309 117347 426823 40817
12072 40817 119373 253535 226959 133602 180882 285560 148763 224685 478845 34844 202561
12061 202561 332982 314035 335889 187102 126576 332443 303655 343968 189082 292734
12051 292734 159270 346890 218736 299697 95382 277332 324500 369665 159860 450292
12041 450292 -20788 290907 457370 284170 237620 295567 115865 506853 302835 271803
12031 271803 87520 222836 113299 295054 147829 190534 264669 244700 272043 385291
$$ packed form
12104A45567k67938L14507q660j4805j6365O0957j45923J09906k959N1303k77465
12093e1875K44947p7228Q0112l5850j06873m8765K55736k41579K08654r4170P5362
12082B08471j0741j35987J97843N1390l31441L30814k15040K2038L09476l86006
12072D0817P8556J34162k6576r3357M7280J04678j36797P5922K54160m44001J67717
12061B02561J30421j8947K1854j48787o0526K05867k8788M0313j54886J03652
12051B92734j33464J87620j28154Q0961k04315J81950M7168M5165k09805K90432
12041D50292m71080L11695J66463j73200m6550N7947j79702L90988k04018l1032
12031B71803j84283J35316j09537J81755j47225M2705P4135j9969K7343J13248
$$ plain form
12021 385291 254946 256337 319411 185931 231281 388741 398233 225955 415201 287988 208967
12010 208967 290394 213222 239847 350977 256016 311741 217919 364551 476047 585554 353757
11999 353757 371430 325158 547613 491582 388865 452151 445457 311489 711528 358264 403843
11988 403843 369181 440245 363933 307582 312813 464215 359265 588408 463293 292382 347908
11977 347908 383924 569255 528598 400891 540969 356803 529114 475299 535796 544166 307338
11966 307338 527989 544887 687246 351106 654227 582512 369191 531265 704268 337170
11956 337170 590168 500298 661706 651564 758599 667698 646907 667062 641466 786744 713678
11945 713678 347629 842687 618944 698309 905973 552213 466643 730252 635732 631854
$$ packed form
12021C85291j30345J391O3074j33480M5350J57460R492j72278J89246j27213p9021
12010B08967Q1427p7172K6625J11130r4961N5725r3822J46632J11496J09507k31797
11999C53757J7673m6272K22455n6031j02717O3286o694j33968M00039l53264M5579
11988D03843l4662P1064p6312n6351N231J51402j04950K29143j25115j70911N5526
11977C47908L6016J85331m0657j27707J40078j84166J72311n3815O0497Q370k36828
11966C07338K20651J6898J42359l36140L03121p1715k13321J62074J73003l67098
11956C37170K52998q9870J61408j0142J07035r0901k0791K0155k5596J45278p3066
11945G13678l66049M95058k23743P9365K07664l53760q5570K63609r4520l878
$$ plain form
11935 631854 667765 550687 729481 737374 698771 761709 663059 770383 686917 778050 801042
11924 801042 660397 830527 767560 679342 886417 800710 895555 617332 652556 874532
11914 874532 1019916 1052485 694349 862656 961557 901123 1056522 870936 897514 982870
11904 982870 1130929 1084217 864638 1076077 1123599 1064625 963220 797344 750579 937207
11894 937207 950529 957493 820106 1054351 968932 1027337 1018146 1053617 931693 1032059 980849
11883 980849 934844 741623 945814 772390 840910 949848 1036077 829897 1175946 1102964
11873 1102964 1086433 1107063 1236244 1076995 1218684 1028292 1188042 1142388 1174399 1139403
11863 1139403 1064495 1228597 1182148 1035903 1324214 1148401 1257718 1547749 1038963 1082652
$$ packed form
11935F31854L5911j17078J78794P893l8603O2938r8650J07324q3466R1133K2992
11924H01042j40645J70130o2967q8218K07075q5707R4845k78223L5224K21976
11914H74532J45384L2569l58136J68307R8901o0434J55399j85586K6578Q5356
11904I82870J48059m6712k19579K11439M7522n8974j01405j65876m6765J86628
11894I37207J3322O964j37387K34245q5419N8405r191L5471j21924J00366n1210
11883I80849m6005j93221K04191j73424O8520J08938Q6229k06180L46049p2982
11873A102964j6531K0630J29181j59249J41689j90392J59750m5654L2011l4996
11863A139403p4908J64102m6449j46245K88311j75813J09317K90031n08786M3689
$$ plain form
11853 1082652 1243591 1296964 1359412 1257216 1296726 1123564 1020481 1361151 1268702 1204420
11843 1204420 1215267 1326949 1251354 1207340 1056135 1262313 1059861 1241926 1297358 1196554
11833 1196554 1165787 1096988 1228341 1345596 1232652 1178024 1110594 1299856 1391730 1108494
11823 1108494 1324100 1206338 1237697 1191775 1140099 1133675 1195034 1294203 1297780 1064019 1104346
11812 1104346 1028947 1408909 1314179 1000328 1109462 1219528 1292415 1363942 1350640 1289967
11802 1289967 1278724 1404363 1471511 1424979 1517313 1209633 1120639 1229416 1461509 1311489
11792 1311489 1344178 1161754 1263109 1243328 1395704 1184496 1252757 1301685 1249269 1159259
11782 1159259 1523514 1191123 1290591 1478643 1488310 1100451 1388075 1207541 1029493 1288590
$$ packed form
11853A082652J60939N3373O2448j02196L9510j73162j03083L40670r2449o4282
11843A204420J0847J11682p5595m4014j51205K06178k02452J82065N5432j00804
11833A196554l0767o8799J31353J17255j12944n4628o7430J89262R1874k83236
11823A108494K15606j17762L1359m5922n1676o424O1359R9169L577k33761M0327
11812A104346p5399L79962r4730l13851J09134J10066P2887P1527j3302o0673
11802A289967j1243J25639O7148m6532R2334l07680q8994J08777K32093j50020
11792A311489L2689j82424J01355j9781J52376k11208O8261M8928n2416r0010
11782A159259L64255l32391R9468J88052R667l87859K87624j80534j78048K59097
$$ plain form
11772 1288590 1250345 1282068 1182648 1226325 1316640 1240443 1375886 1430816 1145009 1201124 1581002
11761 1581002 1259927 1282722 1543028 1296208 1417145 1219957 1345098 1500179 1337869 1287203
11751 1287203 1384992 1328949 1634068 1336569 1330713 1439970 1351873 1562608 1388342 1326807
11741 1326807 1461471 1281802 1304167 1467859 1290525 1342134 1213057 1498693 1239853 1114944
11731 1114944 1329795 1169931 1308898 1331205 1106170 1340080 1158754 1127187 1411188 1334386
11721 1334386 1079582 1351220 959795 1315252 1429248 1032442 1079448 1300377 1162922 998703
11711 998703 1131088 1226653 1150462 1172769 1385113 1166415 1171147 1300003 1466889 1108657
11701 1108657 1293411 1100570 1372040 1315113 1116988 1167240 1209012 1105231 1352321 1068939
$$ packed form
11772A288590l8245L1723r9420M3677R0315p6197J35443N4930k85807N6115L79878
11761A581002l21075K2795K60306k46820J20937j97188J25141J55081j62310n0666
11751A287203R7789n6043L05119k97499n856J09257q8097K10735j74266o1535
11741A326807J34664j79669K2365J63692j77334N1609j29077K85636k58840j24909
11731A114944K14851j59864J38967K2307k25035K33910j81326l1567K84001p6802
11721A334386k54804K71638l91425L55457J13996l96806M7006K20929j37455j64219
11711I98703J32385R5565p6191K2307K12344k18698M732J28856J66886l58232
11701A108657J84754j92841K71470n6927j98125N0252M1772j03781K47090k83382
$$ plain form
11691 1068939 1395651 1252958 1373869 1310887 1340520 1232770 1212805 1276717 1356006 1140986
11681 1140986 1438407 1003666 1238253 1507705 1302078 1408177 1395944 1278390 1206344 1216531
11671 1216531 1258886 1447389 1256598 1361446 1277011 1330800 1325123 1310037 1327679 1392527 1212497
11660 1212497 1334698 1456116 1568505 1385436 1601806 1614791 1331507 1616281 1496858 1387816
11650 1387816 1446334 1458602 1585446 1514600 1601907 1518930 1562968 1755579 1488769 1456169 1606250
11639 1606250 1525863 1667182 1451346 1473968 1751166 1711807 1538677 1720563 1412345 1732394
11629 1732394 1773065 1739774 1641591 2002409 1842840 1870744 1806855 1886336 1994409 1926135 1961340
11618 1961340 1934357 1826868 1915208 1988516 2070084 1846375 1811784 2085547 1936650 2047338
$$ packed form
11691A068939L26712j42693J20911o2982K9633j07750j9965O3912P9289k15020
11681A140986K97421m34741K34587K69452k05627J06099j2233j17554p2046J0187
11671A216531M2355J88503j90791J04848q4435N3789n677j5086J7642O4848j80030
11660A212497J22201J21418J12389j83069K16370J2985k83284K84774j19423j09042
11650A387816N8518J2268J26844p0846Q7307q2977M4038J92611k66810l2600J50081
11639A606250q0387J41319k15836K2622K77198l9359j73130J81886l08218L20049
11629A732394M0671l3291r8183L60818j59569K7904o3889P9481J08073o8274L5205
11618A961340k6983j07489Q8340P3308Q1568k23709l4591K73763j48897J10688
$$ plain form
11608 2047338 2049557 1956924 2053902 2160291 2072838 2354759 2161227 2133253 2105745 2088086 2232527
11597 2232527 2304724 1990621 2114039 1936477 2228860 2260426 2217824 2053287 2246787 2178228
11587 2178228 2177219 2319315 2201155 2216336 2171086 2297147 2190005 2069571 2461524 2317833
11577 2317833 2060057 2337049 2411638 2565664 2390971 2363949 2306392 2416069 2479405 2454581
11567 2454581 2361735 2569140 2362014 2404062 2729492 2665588 2628670 2862471 3006552 2873115
11557 2873115 3110988 2990483 3178509 3293754 3177002 3427787 3360997 3507786 3527549 3663391
11547 3663391 3631418 3568355 3560458 3815380 3854827 3962062 3794688 3871406 3851168 3892826 4052491
11536 4052491 4042442 4030885 3981243 3992089 4038674 3982990 3896353 4015330 3968509 3587394 3720512
$$ packed form
11608B047338K219r2633R6978J06389q7453K81921j93532k7974k7508j7659J44441
11597B232527P2197l14103J23418j77562K92383L1566m2602j64537J93500o8559
11587B178228j009J42096j18160J5181m5250J26061j07142j20434L91953j43691
11577B317833k57776K76992P4589J54026j74693k7022n7557J09677O3336k4824
11567B454581r2846K07405k07126M2048L25430o3904l6918K33801J44081j33437
11557B873115K37873j20505J88026J15245j16752K50785o6790J46789J9763J35842
11547C663391l1973o3063p897K54922L9447J07235j67374P6718k0238M1658J59665
11536D052491j0049j1557m9642J0846M6585n5684q6637J18977m6821l81115J33118
$$ plain form
11525 3720512 3737490 3542091 3718368 3325489 3265176 3349986 3335636 3246176 3263534 2894984
11515 2894984 3041243 3189354 3048674 2948832 2901111 2629559 2808502 2922455 2642274 2598074
11505 2598074 2523838 2497941 2560861 2463650 2361809 2257958 2300348 2182173 2174945 1994617 2076184
11494 2076184 2277849 2273954 2216490 2023777 2046005 1974057 2070915 1994793 1933507 1627209 1713000
11483 1713000 1727181 1943671 1742790 1680150 1756979 1674052 1644593 1787940 1541048 1703810
11473 1703810 1614714 1531751 1567099 1511944 1441190 1465201 1514593 1452632 1396437 1303491 1382304
11462 1382304 1451104 1302639 1355105 1508672 1396400 1476691 1168357 1329584 1240472 1171861
11452 1171861 1494789 1294618 1204620 1396367 1123863 1394710 1307458 1133193 1208887 1039896
$$ packed form
11525C720512J6978j95399J76277l92879o0313Q4810j4350q9460J7358l68550
11515B894984J46259J48111j40680r9842m7721k71552J78943J13953k80181m4200
11505B598074p4236k5897O2920r7211j01841j03851M2390j18175p228j80328Q1567
11494B076184K01665l895n7464j92713K2228p1948R6858p6122o1286l06298Q5791
11483A713000J4181K16490k00881o2640P6829q2927k9459J43347k46892J62762
11473A703810q9096q2963L5348n5155p0754K4011M9392o1961n6195r2946P8813
11462A382304O8800j48465N2466J53567j12272Q0291l08334J61227q9112o8611
11452A171861L22928k00171q9998J91747k72504K70847q7252j74265P5694j68991
$$ plain form
11442 1039896 1153546 1146856 1117929 1238304 1025892 1002819 1246003 1069455 1053033 1232810
11432 1232810 1084187 1259857 1167504 995434 1273764 1048000 1047255 1075280 999249 1046544 1147180
11421 1147180 994931 1043160 1024512 1333140 1187193 818800 1101629 1093717 1023466 1123078
11411 1123078 1163574 925067 798011 1182802 1095544 926088 994940 1021189 1187343 1176941
11401 1176941 988135 1122251 1180535 1296945 1080548 972033 947904 870527 1019413 1128260
11391 1128260 988600 975470 989563 876923 1159014 1132959 814403 954401 1113038 959353
11381 959353 1216826 988725 842617 769938 991448 1189949 1004360 904296 970010 826491
11371 826491 1243901 1095064 853139 918820 1039077 1003184 839853 916059 987153 913608
$$ packed form
11442A039896J13650o690k8927J20375k12412k3073K43184j76548j6422J79777
11432A232810j48623J75670r2353j72070K78330k25764p45K8025p6031M7295J00636
11421A147180j52249M8229j8648L08628j45947l68393K82829p912p0251R9612
11411A123078M0496k38507j27056L84791q7258j69456O8852K6249J66154j0402
11401A176941j88806J34116N8284J16410k16397j08515k4129p7377J48886J08847
11391A128260j39660j3130J4093j12640K82091k6055l18556J39998J58637j53685
11381I59353K57473k28101j46108p2679K21510J98501j85589j00064O5714j43519
11371H26491M17410j48837k41925O5681J20257l5893j63331P6206P1094p3545
$$ plain form
11361 913608 872554 1043093 1149593 994297 1123906 1128819 928506 1032567 1075492 1006620
11351 1006620 1139231 1095049 1122497 1112828 1094252 896491 987247 925898 1054927 866879 971450
11340 971450 1139755 868515 1186128 1033986 937528 1172431 1176535 1022873 1012331 1103237
11330 1103237 1064194 931566 1171198 1107399 1033197 1138837 1153515 886381 1037660 1102309
11320 1102309 1036197 1206452 1000542 710039 1173986 997733 1135331 1125300 940869 989739
11310 989739 999630 1147850 1085949 1140589 1178137 796002 1067271 1251475 887503 947593 1137149
11299 1137149 929039 1228124 1194846 1196436 1233601 1158064 1191450 1152449 1181282 1157175 1147703
11288 1147703 1243960 1319236 953267 1261389 1472815 1191043 1436094 1229152 1335979 1350624
$$ packed form
11361I13608m1054J70539J06500j55296J29609M913k00313J04061M2925o8872
11351A006620J32611m4182K7448r669j8576j97761R0756o1349J29029j88048J04571
11340I71450J68305k71240L17613j52142r6458K34903M104j53662j0542R0906
11330A103237l9043j32628K39632o3799p4202J05640J4678k67134J51279O4649
11320A102309o6112J70255k05910k90503M63947j76253J37598j0031j84431M8870
11310I89739R891J48220o1901N4640L7548l82135K71269J84204l63972O0090J89556
11299A137149k08110K99085l3278J590L7165p5537L3386l9001K8833k4107r472
11288A147703R6257P5276l65969L08122K11426k81772K45051k06942J06827J4645
$$ plain form
11278 1350624 1311682 1548048 1368114 1333583 1454570 1396847 1358970 1426373 1082653 1306385
11268 1306385 1406573 1241962 1297967 1513123 1389434 1336074 1473201 1430749 1421982 1506711
11258 1506711 1320671 1349231 1520525 1323619 1455723 1410988 1418986 1478509 1374262 1447969
11248 1447969 1446736 1424177 1547483 1482203 1517877 1390404 1407905 1704692 1432568 1451724 1342143
11237 1342143 1588825 1584344 1647593 1679246 1599186 1616095 1825531 1932968 1769700 1522787
11227 1522787 1926844 1865851 1606682 1799522 1725001 1733188 1765168 1720590 1709812 1550818 1875174
11216 1875174 1913256 1683679 1996452 2039918 2030870 2170772 1954120 1876773 1964911 1997896 1839750
11205 1839750 1926974 1921132 1920778 2120328 2057422 1932650 2075204 1958446 2101873 2126867 2201510
$$ packed form
11278A350624l8942K36366j79934l4531J20987n7723l7877O7403l43720K23732
11268A306385J00188j64611N6005K15156j23689n3360J37127m2452q767Q4729
11258A506711j86040K8560J71294j96906J32104m4735P998N9523j04247P3707
11248A447969j233k2559J23306o5280L5674j27473J7501K96787k72124J9156j09581
11237A342143K46682m481O3249L1653q0060J6909K09436J07437j63268k46913
11227A522787M04057o0993k59169J92840p4521Q187L1980m4578j0778j58994L24356
11216A875174L8082k29577L12773M3466r048J39902k16652p7347Q8138L2985j58146
11205A839750Q7224n842l54J99550o2906j24772J42554j16758J43427K4994P4643
$$ plain form
11194 2201510 2162798 2329385 2208078 2378404 2230038 2341593 2266388 2229563 2378674 2475281
11184 2475281 2518792 2482785 2419493 2414469 2780555 2526702 2413421 2433670 2668977 2497042
11174 2497042 2654754 2833928 2627710 2670682 2840108 2759185 2843045 2638369 2694538 2909656
11164 2909656 2899468 2814301 3073663 2837451 2945615 3124947 3077777 2897523 2978006 2977421 3107493
11153 3107493 3148195 3156751 3114321 2995290 3114706 3349969 3296546 3034522 3124248 3132602 3312407
11142 3312407 3470946 3307732 3394996 3542889 3577188 3630771 3410553 3450637 3696315 3564672
11132 3564672 3793053 3724925 3713070 3793450 3784392 3795469 4031524 3822512 4122096 3873910
11122 3873910 4049127 4179884 4298885 4283744 4168435 3895528 4323972 4448457 4303665 4255580
$$ packed form
11194B201510l8712J66587j21307J70326j48366J11555p5205l6825J49111R6607
11184B475281M3511l6007o3292n024L66086k53853j13281K0249K35307j71935
11174B497042J57712J79174k06218M2972J69426q0923Q3860k04676N6169K15118
11164B909656j0188q5167K59362k36212J08164J79332m7170j80254Q0483n85J30072
11153C107493M0702Q556m2430j19031J19416K35263n3423k62024Q9726Q354J79805
11142C312407J58539j63214Q7264J47893L4299N3583k20218M0084K45678j31643
11132C564672K28381o8128j1855Q0380r058J1077K36055k09012K99584k48186
11122C873910J75217J30757J19001j5141j15309k72907M28444J24485j44792m8085
$$ plain form
11112 4255580 4199822 4428186 4697983 4611382 4621438 4440618 4623461 4935271 4749331 4626025
11102 4626025 5064488 4538296 4976757 5103891 4948877 5077472 5086172 5264305 5139550 5344767
11092 5344767 5527437 5425833 5359747 5565442 5386402 5677718 5773812 5358690 5806218 5910461
11082 5910461 5807273 5798965 5993299 6114047 6014794 6276969 6237221 6072163 6164378 6465403
11072 6465403 6237736 6380450 6495255 6482787 6238000 6559551 6472415 6466923 6709909 6595595
11062 6595595 6624148 6931366 6954443 6782379 6925848 7143301 7141832 7276311 6980484 7063414
11052 7063414 7104724 7416987 7246057 7368123 7359915 7312666 7501858 7582121 7564658 7658896 7581358
11041 7581358 7923839 7957377 7755219 8217925 7874177 7911790 8206248 8122580 8203460 8460507
$$ packed form
11112D255580n5758K28364K69797q6601J0056j80820J82843L11810j85940j23306
11102D626025M38463n26192M38461J27134j55014J28595Q700J78133j24755K05217
11092E344767J82670j01604o6086K05695j79040K91316R6094m15122M47528J04243
11082E910461j03188q308J94334J20748r9253K62175l9748j65058R2215L01025
11072F465403k27667J42714J14805j2468k44787L21551q7136n492K42986j14314
11062F595595K8553L07218K3077j72064J43469K17453j469J34479k95827Q2930
11052G063414M1310L12263j70930J22066q208m7249J89192Q0263j7463R4238p7538
11041G581358L42481L3538k02158M62706l43748L7613K94458q3668Q0880K57047
$$ plain form
11031 8460507 8321024 8295054 8482255 8806726 8592576 8546778 8552111 8664206 8726975 8806067
11021 8806067 8787768 8903592 8998324 9000937 9159455 9148205 9168538 9317831 9365705 9355606 9159166
11010 9159166 9395071 9536660 9216617 9486876 9527109 9223565 9471608 9655182 9545888 9610396
11000 9610396 9919743 9806193 9820691 9952332 9976342 9933928 9974092 9863888 9956446 10108059
10990 10108059 10086528 10076833 10121745 10063090 10096978 10367475 10378532 10371931 10229365 10375458 10393367
10979 10393367 10271397 10545491 10334228 10375667 10516209 10453311 10640895 10433497 10653457 10539503
10969 10539503 10592378 10774346 10562650 10360711 10751506 10525101 10661399 10753507 10631427 10612210
10959 10612210 10624972 10856602 10679360 10633533 10729849 10552455 10569142 10646009 10545432 10489408
$$ packed form
11031H460507j39483k5970J87201L24471k14150m5798N333J12095O2769P9092
11021H806067j8299J15824R4732K613J58518j1250K0333J49293M7874j0099j96440
11010I159166K35905J41589l20043K70259M0233l03544K48043J83574j09294O4508
11000I610396L09347j13550J4498J31641K4010m2414M0164j10204R2558J51613
10990A0108059k1531r695M4912n8655L3888K70497J1057o601j42566J46093J7909
10979A0393367j21970K74094k11263M1439J40542o2898J87584k07398K19960j13954
10969A0539503N2875J81968k11696k01939L90795k26405J36298R2108j22080j9217
10959A0612210J2762K31630j77242m5827R6316j77394J6687P6867j00577n6024
$$ plain form
10949 10489408 10490612 10668616 10145273 10242764 10381161 10304323 10520747 10301124 10114253 10372091
10939 10372091 10271754 10258565 10165488 10062566 10266972 9893408 10212471 10151865 9845466 9981338
10929 9981338 10129628 9783864 9847604 9922364 9649464 9885526 9685996 9581695 9564230 9386673
10919 9386673 9333211 9491633 9157379 9208051 9163602 9018859 9166826 9122427 9082322 8898168
10909 8898168 8823085 8916531 8658745 8729791 8482729 8410166 8504474 8380920 8266562 8324233
10899 8324233 7998389 7933445 8095887 7933304 7825254 7766389 7654910 7606865 7524533 7583914
10889 7583914 7511414 7218524 7156196 7281876 7092000 6954461 7077662 6849322 6785823 6887946
10879 6887946 6560520 6636515 6538754 6149158 6521191 6030077 5879714 6233877 5768407 5732607
$$ packed form
10949A0489408J204J78004n23343R7491J38397p6838K16424k19623j86871K57838
10939A0372091j00337j3189r3077j02922K04406l73564L19063o0606l06399J35872
10929I981338J48290l45764O3740P4760k72900K36062j99530j04301j7465j77557
10919I386673n3462J58422l34254N0672m4449j44743J47967m4399m0105j84154
10909H898168p5083R3446k57786P1046k47062p2563R4308j23554j14358N7671
10899H324233l25844o4944J62442j62583j08050n8865j11479m8045q2332N9381
10889G583914p2500k92890o2328J25680j89876j37539J23201k28340o3499J02123
10879F887946l27426P5995r7761l89596L72033m91114j50363L54163m65470l5800
$$ plain form
10869 5732607 5701182 5621819 5692629 5360402 5430031 5342214 5283522 5370397 5281544 5265679 5123279
10858 5123279 4857937 4951166 4622709 4609370 4559014 4354212 4235152 4335923 4223856 4161095
10848 4161095 4020969 3960801 3942569 3871087 3813766 3703838 3718381 3484831 3715492 3521809
10838 3521809 3265767 3321741 3198532 3243761 2988812 2969374 2935734 2989816 2970535 2998638 2818557
10827 2818557 2520751 2611497 2589942 2370405 2425905 2438497 2216042 2464833 2354559 2197790
10817 2197790 2234883 2117262 2128113 1902080 1930288 1856416 1793389 1926423 1894211 1572392
10807 1572392 1763305 1541787 1601086 1767845 1501164 1549042 1491434 1659415 1467268 1548386
10797 1548386 1700228 1693312 1337849 1608166 1620999 1497160 1594524 1459320 1401906 1434100
$$ packed form
10869E732607l1425p9363P0810l32227O9629q7817n8692Q6875q8853j5865j42400
10858E123279k65342R3229l28457j3339n0356k04802j19060J00771j12067o2761
10848D161095j40126o0168j8232p1482n7321j09928J4543k33550K30661j93683
10838C521809k56042N5974j23209M5229k54949j9438l3640N4082j9281K8103j80081
10827B818557k97806R0746k1555k19537N5500J2592k22455K48791j10274j56769
10817B197790L7093j17621J0851k26033K8208p3872o3027J33034l2212l21819
10807A572392J90913k21518N9299J66759k66681M7878n7608J67981j92147Q1118
10797A548386J51842o916l55463K70317J2833j23839R7364j35204n7414L2194
$$ plain form
10787 1434100 1480707 1574446 1370676 1429812 1478399 1409334 1517570 1585653 1392786 1783821
10777 1783821 1597496 1599485 1874829 1607349 1595827 1628540 1771505 1651872 1653612 1859984
10767 1859984 1950007 1714447 2041528 2107717 1852764 1988914 2131033 2359298 2130882 2175590
10757 2175590 2471194 2227208 2554000 2718177 2384687 2374517 2631854 2583934 2900488 2880863
10747 2880863 3104378 2952529 2929698 3213417 3107607 3311252 3372453 3168926 3395559 3544702
10737 3544702 3598780 3758853 3854760 3996570 4034752 4065967 4136273 4056190 4318718 4395215 4391730
10726 4391730 4306558 4414810 4590631 4578511 4687338 4805942 4721581 4886173 5012131 5225141
10716 5225141 5270898 5373833 5402619 5502807 5492504 5701522 5375830 5571141 5986432 5720413
$$ packed form
10787A434100M6607R3739k03770N9136M8587o9065J08236O8083j92867L91035
10777A783821j86325J989K75344k67480j1522L2713J42965j19633J740K06372
10767A859984R0023k35560L27081O6189k54953J36150J42119K28265k28416M4708
10757B175590K95604k43986L26792J64177l33490j0170K57337m7920L16554j9625
10747B880863K23515j51849k2831K83719j05810K03645O1201k03527K26633J49143
10737C544702N4078J60073R5907J41810L8182L1215P0306q0083K62528P6497l485
10726D391730q5172J08252J75821j2120J08827J18604q4361J64592J25958K13010
10716E225141M5757J02935K8786J00188j0303K09018l25692J95311M15291k66019
$$ plain form
10706 5720413 5767926 6077876 5909838 5988406 5975951 6196427 6110610 6178041 6256838 6279547 6414750
10695 6414750 6486804 6528666 6643068 6574611 6958073 6794752 6869117 7060240 6713618 7070961
10685 7070961 7079949 7090130 7044147 7139575 7202162 7081372 7131106 7238165 7246510 7416775 7359989
10674 7359989 7215586 7493368 7675993 7603245 7737627 7234706 7798849 7872602 7647122 7836501
10664 7836501 7924033 7744653 8000298 7997792 8135291 7924622 8067741 8250959 8048491 8031009
10654 8031009 8262301 8289186 8511382 8491472 8426707 8595201 8574112 8662799 8657034 8775566 8889831
10643 8889831 9006227 8973976 9021687 8996584 9253567 9177285 9423935 9455926 9486044 9380676
10633 9380676 9669125 9822662 9768937 9829619 9971030 9938862 10099480 10145032 10190360 10202873
$$ packed form
10706E720413M7513L09950j68038P8568j2455K20476q5817O7431P8797K2709J35203
10695F414750P2054M1862J14402o8457L83462j63321P4365J91123l46622L57343
10685G070961Q988J0181m5983R5428O2587j20790M9734J07059Q345J70265n6786
10674G359989j44403K77782J82625p2748J34382n02921N64143P3753k25480J89379
10664G836501Q7532j79380K55645k506J37499k10669J43119J83218k02468j7482
10654H031009K31292K6885K22196j9910o4765J68494k1089Q8687n765J18532J14265
10643H889831J16396l2251M7711k5103K56983p6282K46650L1991L0118j05368
10633I380676K88449J53537n3725O0682J41411l2168J60618M5552M5328J2513
$$ plain form
10623 10202873 10209043 10471223 10545357 10649353 10748529 10735939 10845873 11082379 11082623 11307303 11165485
10612 11165485 11325261 11453272 11509825 11790932 11721078 11667132 12052755 12255297 12326599 12415792
10602 12415792 12535557 12644996 13023550 13068413 13069845 13247377 13429028 13587873 13637031 13784759
10592 13784759 13868988 14018038 14352689 14675185 14357531 14798107 15058815 14853939 15351087
10583 15351087 15499685 15418185 15955855 16023189 16240253 16252880 16543098 16672095 16773127 17298198
10573 17298198 17424818 17226394 17873176 17698656 17969410 18602689 18400919 18650990 19001854
10564 19001854 19178053 19730114 19852345 19884610 20321252 20393211 20662565 21067655 21252940 21422497
10554 21422497 21760372 22071606 22258029 22720470 22870678 23058843 23684051 23810035 24189754
$$ packed form
10623A0202873O170K62180P4134J03996R9176j2590J09934K36506K44K24680j41818
10612A1165485J59776J28011N6553K81107o9854n3946L85623K02542P1302Q9193
10602A2415792J19765J09439L78554M4863J432J77532J81651J58845M9158J47728
10592A3784759Q4229J49050L34651L22496l17654M40576K60708k04876M97148
10583A5351087J48598q1500N37670O7334K17064J2627K90218J28997J01032N25071
10573A7298198J26620j98424O46782j74520K70754O33279k01770K50071L50864
10564A9001854J76199N52061J22231L2265M36642P1959K69354M05090J85285J69557
10554B1422497L37875L11234J86423M62441J50208J88165O25208J25984L79719
$$ plain form
10545 24189754 24504538 24823652 25166921 25648044 26042679 26253604 26598360 26988720 27586157
10536 27586157 27896724 28193811 28731771 29202466 29515176 30022215 30383950 30679006 31505402
10527 31505402 31873839 32192930 32626772 33151815 33768840 34416985 34834650 35313905 35743453
10518 35743453 36444068 37279534 37756558 38386599 39060160 39555449 40395714 41310573 41839135
10509 41839135 42554800 43534236 44119968 45090176 45942692 46562758 47653376 48577719 49498393
10500 49498393 50316952 51409654 52512807 53496617 54708158 55779275 56578321 58057954
10492 58057954 59168857 60489190 61769876 62839074 64079580 65740094 67243683 68810451
10484 68810451 70002711 71567345 72992062 74642039 76080545 77789591 78935060 80666924
$$ packed form
10545B4189754L14784L19114L43269M81123L94635K10925L44756L90360N97437
10536B7586157L10567K97087N37960M70695L12710N07039L61735K95056Q26396
10527C1505402L68437L19091M33842N25043O17025O48145M17665M79255M29548
10518C5743453P00615Q35466M77024O30041O73561M95289Q40265R14859N28562
10509D1839135P15665R79436N85732R70208Q52516O20066J090618R24343R20674
10500D9498393Q18559J092702J103153R83810J211541J071117P99046J479633
10492E8057954J110903J320333J280686J069198J240506J660514J503589J566768
10484F8810451J192260J564634J424717J649977J438506J709046J145469J731864
$$ plain form
10476 80666924 82171953 83772190 85508779 86939843 88681341 90500772 92056043 93822023
10468 93822023 95663764 97561300 99498621 101266930 102992995 105270958 106974321 109016314
10460 109016314 110965159 113103825 115045332 117136533 119246371 121516324 123701908 125753194
10452 125753194 128051639 130301287 132559915 134565397 136966181 139290194 141343810 143633099
10444 143633099 146079055 148162685 150606515 152871364 155235773 157388907 159731622 161969491
10436 161969491 164443268 166653348 169058525 171274363 173701890 175667606 178078241 180528960
10428 180528960 182705457 185003118 187375036 189335955 191740684 194043567 196306016 198333340
10420 198333340 200402987 202712295 204866640 207061684 209220032 211200232 213534284 215450421
$$ packed form
10476H0666924J505029J600237J736589J431064J741498J819431J555271J765980
10468I3822023J841741J897536J937321J768309J726065K277963J703363K041993
10460A09016314J948845K138666J941507K091201K109838K269953K185584K051286
10452A25753194K298445K249648K258628K005482K400784K324013K053616K289289
10444A43633099K445956K083630K443830K264849K364409K153134K342715K237869
10436A61969491K473777K210080K405177K215838K427527J965716K410635K450719
10428A80528960K176497K297661K371918J960919K404729K302883K262449K027324
10420A98333340K069647K309308K154345K195044K158348J980200K334052J916137
$$ plain form
10412 215450421 217643372 219749538 221661024 223842202 225916498 227747464 229713633 231656874
10404 231656874 233747381 235541445 237486642 239319172 241253320 243254545 244970414 246785052
10396 246785052 248754639 250433952 252475222 254171775 255912833 257666864 259628719 261262973
10388 261262973 262975394 264641384 266315976 268163320 269794499 271502127 273265445 274914957
10380 274914957 276413209 278135499 279796973 281322341 283056479 284344508 285736765 287334906
10372 287334906 288884769 290139812 291744287 292929036 294444324 295861489 297276152 298276695
10364 298276695 299648357 301062356 302099173 303090818 304369802 305343739 306413963 307430536
10356 307430536 308122131 309135492 310013832 310825570 311665642 312417059 313091148 313810184 314379813
$$ packed form
10412B15450421K192951K106166J911486K181178K074296J830966J966169J943241
10404B31656874K090507J794064J945197J832530J934148K001225J715869J814638
10396B46785052J969587J679313K041270J696553J741058J754031J961855J634254
10388B61262973J712421J665990J674592J847344J631179J707628J763318J649512
10380B74914957J498252J722290J661474J525368J734138J288029J392257J598141
10372B87334906J549863J255043J604475J184749J515288J417165J414663J000543
10364B98276695J371662J413999J036817R91645J278984R73937J070224J016573
10356C07430536O91595J013361Q78340Q11738Q40072P51417O74089P19036N69629
$$ plain form
10347 314379813 315058007 315443879 315977873 316471152 316769992 316998353 317568962 317687417 317922213
10338 317922213 317908716 318022677 317846766 317936669 317658489 317530829 317107474 316909409 316639442
10329 316639442 316017662 315711777 315171181 314307629 313768942 313073500 312195182 311240082 310400957
10320 310400957 309277764 308441091 307282330 306044672 304701096 303325267 302022918 300725412
10312 300725412 299232534 297838132 296042249 294592389 293143094 291155793 289447148 287621789
10304 287621789 285653664 283564355 281616132 279583170 277320850 275132813 272815585 270306773
10296 270306773 268239017 265725239 262604217 260615206 257708892 254906942 252529824 249669235
10288 249669235 246859419 244069598 241012564 238182107 234901628 231950935 228871741 225559138
$$ packed form
10347C14379813O78194L85872N33994M93279K98840K28361N70609J18455K34796
10338C17922213j3497J13961j75911Q9903k78180j27660m23355j98065k69967
10329C16639442o21780l05885n40596q63552n38687o95442q78318r55100q39125
10320C10400957j123193q36673j158761j237658j343576j375829j302349j297506
10312C00725412j492878j394402j795883j449860j449295j987301j708645j825359
10304B87621789j968125k089309j948223k032962k262320k188037k317228k508812
10296B70306773k067756k513778l121022j989011k906314k801950k377118k860589
10288B49669235k809816k789821l057034k830457l280479k950693l079194l312603
$$ plain form
10280 225559138 222376609 219125029 215975857 212680699 209380510 206043403 202606721 199324127
10272 199324127 195773474 192697301 189207547 185876180 182640426 179151459 175768093 172520865
10264 172520865 169239662 165893389 162380856 159442090 156038011 152903104 149722678 146480789
10256 146480789 143628806 140441216 137383165 134468221 131557070 128977628 125858420 123021073
10248 123021073 120572881 117986894 115338970 112833266 110385453 107942115 105663800 103255809
10240 103255809 101146010 98969672 96960402 94742766 93135770 90856902 88873385 87408646
10232 87408646 85510420 83656308 82202581 80145849 78659006 77302478 75691135 74119025
10224 74119025 72730187 71188363 69773369 68535759 67432705 65995389 64874886 63777718
$$ packed form
10280B25559138l182529l251580l149172l295158l300189l337107l436682l282594
10272A99324127l550653l076173l489754l331367l235754l488967l383366l247228
10264A72520865l281203l346273l512533k938766l404079l134907l180426l241889
10256A46480789k851983l187590l058051k914944k911151k579442l119208k837347
10248A23021073k448192k585987k647924k505704k447813k443338k278315k407991
10240A03255809k109799k176338k009270k217636j606996k278868j983517j464739
10232H7408646j898226j854112j453727k056732j486843j356528j611343j572110
10224G4119025j388838j541824j414994j237610j103054j437316j120503j097168
$$ plain form
10216 63777718 62612083 61601461 60564040 59235196 58313891 57368478 56105456 55475375
10208 55475375 54588379 53555266 52607975 51781416 50982431 50204199 49299392 48462966 47781522
10199 47781522 46991847 46363516 45539375 44991360 44148083 43563867 42976136 42327178 41760681
10190 41760681 41211740 40745167 39981292 39609037 38900777 38570484 38001349 37645568 36929134
10181 36929134 36358120 35936694 35307155 35065797 34825623 33922316 33517080 33245091 32909635
10172 32909635 32395274 32211634 31782377 31234130 31024777 30536045 30012549 29947394 29488756
10163 29488756 28969889 28675984 28370856 28218276 27647704 27657112 26998948 26749797 26517941 26366526
10153 26366526 25834730 25793015 25394037 25072962 24771171 24635241 24330547 24073315 23812874
$$ packed form
10216F3777718j165635j010622j037421j328844r21305r45413j263022o30081
10208E5475375q86996j033113r47291q26559p98985p78232r04807q36426o81444
10199D7781522p89675o28331q24141n48015q43277n84216n87731o48958n66497
10190D1760681n48941m66573p63875l72255p08260l30293n69135l55781p16434
10181C6929134n71014m21426o29539k41358k40174r03307m05236k71989l35456
10172C2909635n14361j83640m29257n48247k09353m88732n23496o5155m58638
10163B9488756n18867k93905l05128j52580n70572R408o58164k49151k31856j51415
10153B6366526n31796m1715l98978l21075l01791j35930l04694k57232k60441
$$ plain form
10144 23812874 23655847 23276085 23160386 23059299 22788799 22601880 22393597 21969629 22011249
10135 22011249 21793381 21268055 21059871 20891109 20542586 20688099 20384081 20089312 20371371
10126 20371371 19739412 19639871 19582416 19317234 19118769 18975303 18916646 18761095 18585052 18526400
10116 18526400 18310000 18195466 17977779 17463628 17443017 17513650 17269087 17060969 17069771 16731214
10106 16731214 16668108 16730394 16495083 16486330 16039247 16067108 15899388 15574295 15626556 15356742
10096 15356742 15329553 15490261 14951246 14778192 14953073 14536517 14628184 14689831 14274558 14394478
10086 14394478 14192278 14393316 13976935 13852348 13897915 13760031 13636767 13441796 13290842
10077 13290842 13436524 13160392 13033480 13131793 12750544 12800596 12848618 12487364 12659457 12496040
$$ packed form
10144B3812874j57027l79762j15699j01087k70500j86919k08283m23968M1620
10135B2011249k17868n25326k08184j68762l48523J45513l04018k94769K82059
10126B0371371o31959r9541n7455k65182j98465j43466n8657j55551j76043n8652
10116A8526400k16400j14534k17687n14151k0611P0633k44563k08118Q802l38557
10106A6731214o3106O2286k35311q753m47083K7861j67720l25093N2261k69814
10096A5356742k7189J60708n39015j73054J74881m16556R1667O1647m15273J19920
10086A4394478k02200K01038m16381j24587M5567j37884j23264j94971j50954
10077A3290842J45682k76132j26912R8313l81249N0052M8022l61254J72093j63417
$$ plain form
10067 12496040 12413593 12275509 12330402 12215025 12060596 12201520 11957359 11692306 11787213 11526153
10057 11526153 11657076 11732652 11390946 11300044 11282037 11213088 10989542 10996128 11116689 10750690
10047 10750690 10771658 10805555 10633859 10601216 10680920 10582873 10355441 10355124 10369939 10251060 10164969
10036 10164969 10238388 10124908 10127981 9980973 9962115 9702491 9867124 9721398 9677392 9644053
10026 9644053 9511810 9553876 9370067 9488693 9439334 9079345 9241601 9316079 9041321 9008809
10016 9008809 8980905 9041618 9145832 9049836 8668531 8823270 8671492 8538302 8666287 8492921
10006 8492921 8265005 8561648 8496836 8421886 8280627 8563082 8334416 8115245 8272496 8103586
9996 8103586 7835015 7931765 7938136 8007661 7992194 7773168 7954287 8245745 7681635 7992981
$$ packed form
10067A2496040q2447j38084N4893j15377j54429J40924k44161k65053R4907k61060
10057A1526153J30923P5576l41706r0902j8007o8949k23546O586J20561l65999
10047A0750690K0968L3897j71696l2643P9704r8047k27432l17J4815j18879q6091
10036A0164969P3419j13480L073j47008j8858k59624J64633j45726m4006l3339
10026I644053j32243M2066j83809J18626m9359l59989J62256P4478k74758l2512
10016I008809k7904O0713J04214r5996l81305J54739j51778j33190J27985j73366
10006H492921k27916K96643o4812p4950j41259K82455k28666k19171J57251j68910
9996H103586k68571R6750O371O9525j5467k19026J81119K91458n64110L11346
$$ plain form
9986 7992981 7845369 7722266 7787884 7749993 7732461 7604070 7528367 7876548 7291392 7467564
9976 7467564 7678268 7274597 7525003 7375361 7317977 7343553 7496927 7135164 7231572 7189213
9966 7189213 7095609 7056722 7103292 7041497 6795346 7122008 6890875 6717794 6893904 6695338
9956 6695338 6669459 6565835 6559452 6514265 6500635 6573738 6607829 6417268 6494986 6334261 6393578
9945 6393578 6256708 6251414 6271763 6102692 6157380 6232097 6164012 6255396 6048610 6101177 5947678
9934 5947678 6117285 5844247 5869673 5914941 5935731 5675007 5847858 5835487 5704870 5772307
9924 5772307 5749005 5858747 5660308 5751186 5729559 5633542 5637426 5802967 5744843 5670198 5362559
9913 5362559 5536703 5381761 5368225 5430825 5260567 5402799 5254737 5244514 5558745 5143875
$$ packed form
9986G992981j47612j23103O5618l7891j7532j28391p5703L48181n85156J76172
9976G467564K10704m03671K50406j49642n7384K5576J53374l61763R6408m2359
9966G189213r3604l8887M6570o1795k46151L26662k31133j73081J76110j98566
9956F695338k5879j03624o383m5187j3630P3103L4091j90561P7718j60725N9317
9945F393578j36870n294K0349j69071N4688P4717o8085R1384k06786N2567j53499
9934E947678J69607k73038K5426M5268K0790k60724J72851j2371j30617O7437
9924E772307k3302J09742j98439R0878k1627r6017L884J65541n8124p4645l07639
9913E362559J74144j54942j3536O2600j70258J42232j48062j0223L14231m14870
$$ plain form
9903 5143875 5221265 5152395 5394079 5218960 5143581 4970340 5080050 5108040 5127716 5013231
9893 5013231 5066653 4843799 4962879 5068992 4982374 4946846 4765273 4941139 5001157 4818070
9883 4818070 5028316 4778526 4957365 4748092 4776555 4785006 4781671 4774905 4529748 4607806 4826281
9872 4826281 4601320 4589072 4710593 4530732 4765582 4531032 4503703 4702090 4567258 4398005
9862 4398005 4478461 4573913 4289177 4380764 4536836 4521027 4314688 4629014 4333457 4231325
9852 4231325 4469677 4491106 4421690 4406484 4226654 4176114 4364312 4348360 4016996 4044432 4073132
9841 4073132 4158838 4084477 4218910 3999969 4103202 4193939 3970364 4160654 4133666 3796513
9831 3796513 3975814 4006368 3852848 4181377 3756053 3959509 3907331 3918566 3969673 3753407
$$ packed form
9903E143875P7390o8870K41684j75119p5379j73241J09710K7990J9676j14485
9893E013231N3422k22854J19080J06113q6618l5528j81573J75866O0018j83087
9883D818070K10246k49790J78839k09273K8463Q451l335o766k45157P8058K18475
9872D826281k24961j2248J21521j79861K34850k34550k7329J98387j34832j69253
9862D398005Q0456R5452k84736R1587J56072j5809k06339L14326k95557j02132
9852D231325K38352K1429o9416j5206j79830n0540J88198j5952l31364K7436K8700
9841D073132Q5706p4361J34433k18941J03233R0737k23575J90290k6988l37153
9831C796513J79301L0554j53520L28529m25324K03456n2178J1235N1107k16266
$$ plain form
9821 3753407 3693352 3893966 3737944 3918332 3853687 3818003 3813959 3942299 3673725 3613621 3774191
9810 3774191 3755826 3706755 3530684 3678053 3674280 3655896 3867943 3641465 3460924 3794783
9800 3794783 3834519 3771828 3606347 3596785 3614645 3635583 3451901 3621798 3389147 3284723 3519132
9789 3519132 3544238 3348919 3488621 3635909 3530437 3335998 3487816 3460397 3401265 3541767
9779 3541767 3402977 3161133 3362441 3308311 3440109 3418572 3005904 3315316 3147262 3257084
9769 3257084 3277108 3217120 3331490 3320289 3134185 3443659 3170877 3290004 3286437 3190606 3110295
9758 3110295 3234242 3319527 3037093 3155939 3394586 3130522 3191297 3227151 2839087 3226838
9748 3226838 3310081 3037387 2990233 3049679 2989195 3165533 3017250 3044952 2940998 2992597 3058323
$$ packed form
9821C753407o0055K00614j56022J80388o4645l5684m044J28340k68574o0104J60570
9810C774191j8365m9071j76071J47369l773j8384K12047k26478j80541L33859
9800C794783L9736o2691j65481r562J7860K0938j83682J69897k32651j04424K34409
9789C519132K5106j95319J39702J47288j05472j94439J51818k7419n9132J40502
9779C541767j38790k41844K01308n4130J31798k1537m12668L09412j68054J09822
9769C257084K0024n9988J14370j1201j86104L09474k72782J19127l567r5831q0311
9758C110295J23947Q5285k82434J18846K38647k64064O0775L5854l88064L87751
9748C226838Q3243k72694m7154N9446o0484J76338j48283K7702j03954N1599O5726
$$ plain form
9737 3058323 3191792 2950392 3070851 3165211 2816151 2811066 3109615 2801682 2817269 2925798
9727 2925798 2675852 3063121 2992201 2729160 2825051 2881002 2760589 2985202 2898375 2852674
9717 2852674 2856404 2853195 3021559 2796460 2880125 2979670 2849961 2808833 2682344 2839183 2790427
9706 2790427 2575251 2978685 2700158 2710545 3007140 2481478 2717824 2680439 2638476 2852862
9696 2852862 2683281 2808818 2818936 2694732 2820160 2698594 2692178 2744904 2562519 2449053
9686 2449053 2687760 2578700 2500697 2816436 2724850 2483038 2539620 2776394 2525007 2648235
9676 2648235 2739974 2391065 2677200 2569967 2414976 2696478 2457081 2364466 2365101 2298110 2468051
9665 2468051 2486347 2504934 2395560 2533859 2495942 2566528 2806505 2330600 2507977 2620057
$$ packed form
9737C058323J33469k41400J20459R4360l49060n085K98549l07933J5587J08529
9727B925798k49946L87269p0920k63041R5891N5951j20413K24613q6827m5701
9717B852674L730l209J68364k25099Q3665R9545j29709m1128j26489J56839m8756
9706B790427k15176M03434k78527J0387K96595n25662K36346l7385m1963K14386
9696B852862j69581J25537J0118j24204J25428j21566o416N2726j82385j13466
9686B449053K38707j09060p8003L15739r1586k41812N6582K36774k51387J23228
9676B648235R1739l48909K86135j07233j54991K81502k39397r2615O35o6991J69941
9665B468051J8296J8587j09374J38299l7917P0586K39977m75905J77377J12080
$$ plain form
9655 2620057 2445053 2406939 2492230 2383155 2526174 2579073 2374871 2329392 2356967 2521694
9645 2521694 2413544 2378386 2457172 2265492 2603291 2609303 2233216 2421251 2396400 2297797 2423339
9634 2423339 2329688 2227361 2343344 2363233 2262521 2357414 2394145 2432233 2211966 2410007
9624 2410007 2499251 2250465 2348458 2421700 2364032 2201949 2242580 2197222 2244018 2537612 2258755
9613 2258755 2338148 2379839 2116563 2479902 2307461 2244096 2326810 2207397 2190827 2366466
9603 2366466 2194263 2345661 2246193 2241984 2369006 2355857 2399061 2551468 2361047 2417025 2338971
9592 2338971 2418905 2355070 2144546 2335147 2169842 2251587 2532774 2152103 2125717 2322875
9582 2322875 2288004 2270159 2173169 2212505 1985755 2124452 2343200 2056958 2159471 2430846
$$ packed form
9655B620057j75004l8114Q5291j09075J43019N2899k04202m5479K7575J64727
9645B521694j08150l5158P8786j91680L37799O012l76087J88035k4851r8603J25542
9634B423339r3651j02327J15983J9889j00712R4893L6731L8088k20267J98041
9624B410007Q9244k48786R7993P3242n7668j62083M0631m5358M6796K93594k78857
9613B258755P9393M1691k63276L63339j72441o3365Q2714j19413j6570J75639
9603B366466j72203J51398r9468m209J27022j3149M3204J52407j90421N5978p8054
9592B338971P9934o3835k10524J90601j65305Q1745K81187l80671k6386J97158
9582B322875l4871j7845r6990L9336k26750J38697K18748k86242J02513K71375
$$ plain form
9572 2430846 2134663 2363654 2203302 1990363 2379745 2238303 2149626 1892928 2102235 2175772
9562 2175772 2104561 2110330 1987872 1829708 2167751 1914533 2150298 2118925 1915780 2176365
9552 2176365 2123477 1990582 2331319 1979636 2047751 2275280 2048603 2004574 2087600 2259108
9542 2259108 2017224 2069461 2201323 1856199 1976212 2254601 2151800 2010191 2077518 1992456
9532 1992456 2281214 2174453 1956833 2076256 2001541 2159017 2176414 1852425 2020800 1957803
9522 1957803 1914403 2236891 1905262 1927501 2000911 2145939 2151203 2022476 2140343 1976474
9512 1976474 1817120 2166937 1890120 1941410 2102022 1956309 1760710 1951937 2054117 1858844
9502 1858844 1726764 1980863 1747655 1987281 1902292 1582355 1831839 1942329 1800342 2101679
$$ packed form
9572B430846k96183K28991j60352k12939L89382j41442q8677k56698K09307P3537
9562B175772p1211N769j22458j58164L38043k53218K35765l1373k03145K60585
9552B176365n2888j32895L40737l51683O8115K27529k26677m4029Q3026J71508
9542B259108k41884N2237J31862l45124J20013K78389j02801j41609O7327q5062
9532A992456K88758j06761k17620J19423p4715J57476J7397l23989J68375o2997
9522A957803m3400L22488l31629K2239P3410J45028N264j28727J17867j63869
9512A976474j59354L49817k76817N1290J60612j45713j95599J91227J02180j95273
9502A858844j32080K54099k33208K39626q4989l19937K49484J10490j41987L01337
$$ plain form
9492 2101679 2123971 1906223 1945087 2046497 1918755 1926783 2084634 1933000 1682553 1877589
9482 1877589 1800475 1676040 1949454 1866383 1616277 1707567 1900667 1857830 1937316 1835096
9472 1835096 1959285 1805073 1792656 1723419 1647819 1794142 1876676 1583995 2011550 1669976
9462 1669976 1698345 1964559 1786388 1630410 1736059 1502601 1658365 1619833 1568954 1384563
9452 1384563 1462726 1726435 1529523 1360551 1676107 1475275 1395767 1776144 1522391 1603204
9442 1603204 1617371 1453036 1387807 1502967 1368833 1586416 1355031 1658274 1300322 1532332
9432 1532332 1719399 1648640 1385496 1517129 1346392 1484870 1421181 1614401 1405902 1428182
9422 1428182 1498580 1440461 1595923 1568375 1370585 1544798 1480403 1538989 1530733 1401250 1557262
$$ packed form
9492B101679K2292k17748L8864J01410j27742Q028J57851j51634k50447J95036
9482A877589p7114j24435K73414q3071k50106R1290J93100m2837P9486j02220
9472A835096J24189j54212j2417o9237p5600J46323Q2534k92681M27555l41574
9462A669976K8369K66214j78171j55978J05649k33458J55764l8532n0879j84391
9452A384563P8163K63709j96912j68972L15556k00832p9508L80377k53753Q0813
9442A603204J4167j64335o5229J15160j34134K17583k31385L03243l57952K32010
9432A532332J87067p0759k63144J31633j70737J38478o3689J93220k08499K2280
9422A428182P0398n8119J55462k7548j97790J74213o4395N8586q256j29483J56012
$$ plain form
9411 1557262 1456768 1322680 1423344 1366723 1265098 1488161 1193329 1503661 1477776 1458376
9401 1458376 1277165 1388697 1128627 1392175 1325616 1322002 1293002 1050851 1313174 1344569
9391 1344569 1386298 1605507 1103443 1292443 1261910 1270001 1342621 1253175 1330910 1064313 1185509
9380 1185509 1512337 1206627 1225377 1159304 993256 1183099 1199497 1385253 1347780 1252811
9370 1252811 1359359 1213638 1380184 1306402 1044733 1049477 1347588 1130117 1238990 1207036
9360 1207036 1180670 1130934 1232624 1356596 1104480 1104296 1318487 1106048 1187303 1177335 982243
9349 982243 1067916 1332109 1006911 993411 1074887 1071585 1050092 1095517 1160922 956507 915839
9338 915839 1184463 1040369 876033 959336 796309 950643 1047404 797788 978717 886869
$$ packed form
9411A557262j00494j34088J00664n6621j01625K23063k94832L10332k5885j9400
9401A458376j81211J11532k60070K63548o6559l614k9000k42151K62323L1395
9391A344569M1729K19209n02064J89000l0533Q091P2620q9446P7735k66597J21196
9380A185509L26828l05710J8750o6073j66048J89843J6398J85756l7473r4969
9370A252811J06548j45721J66546p3782k61669M744K98111k17471J08873l1954
9360A207036k6366m9736J01690J23972k52116j84K14191k12439Q1255r968j95092
9349I82243Q5673K64193l25198j3500Q1476l302k1493M5425O5405k04415m0668
9338I15839K68624j44094j64336Q3303j63027J54334R6761k49616J80929r1848
$$ plain form
9328 886869 1043457 968451 1040117 1023036 929620 815460 1048635 1105384 1046428 765873 864276
9317 864276 1023034 918287 1088564 959870 798735 1117361 1121470 1069304 917175 1072916
9307 1072916 1033390 1207073 1017079 1105735 1153629 1147875 940262 1154201 1017727 999244 1058814
9296 1058814 1182061 1405619 1129024 974766 1197764 1180573 1207453 1066586 1159785 1075390
9286 1075390 1126865 1143830 1288122 1016002 950039 1296047 1171149 1012468 1029688 1098584
9276 1098584 1130396 1112471 704610 1040561 1082453 1222356 928952 1041939 1113617 937070
9266 937070 1334286 1502671 866194 1346512 1357096 1228687 1204415 1356188 975852 1356609
9256 1356609 1237114 1439320 1031450 1353251 1398027 1444759 1261961 1439520 1199418 1441933
$$ packed form
9328H86869J56588p5006P1666j7081r3416j14160K33175N6749n8956k80555R8403
9317H64276J58758j04747J70277j28694j61135L18626M109n2166j52129J55741
9307A072916l9526J73683j89994Q8656M7894n754k07613K13939j36474j8483N9570
9296A058814J23247K23558k76595j54258K22998j7191K6880j40867R3199q4395
9286A075390N1475J6965J44292k72120o5963L46008j24898j58681J7220O8896
9276A098584L1812j7925m07861L35951M1892J39903k93404J12987P1678j76547
9266I37070L97216J68385o36477M80318J0584j28409k4272J51773l80336L80757
9256A356609j19495K02206m07870L21801M4776M6732j82798J77559k40102K42515
$$ plain form
9246 1441933 1490078 1400980 1409216 1275070 1635116 1542353 1265264 1458626 1266816 1392603
9236 1392603 1415636 1384282 1322603 1369472 1494186 1113132 1300479 1271269 1134850 1062811 1316997
9225 1316997 1008499 1263704 1090912 1269113 1071738 1227651 1083018 1184421 1030751 927185
9215 927185 1107409 1041174 978414 982903 1003879 1005057 928091 1069747 1068249 1103864 862332 966619
9203 966619 1123943 943829 1023102 1054857 1019328 1058948 1055374 939453 1089083 803760 1149439
9192 1149439 1039415 930440 887503 1156559 1116275 1187490 1265680 1033265 1104085 1199827 1055641
9181 1055641 899558 1139296 1133733 1063066 1233320 992440 1212286 1210848 903862 1364256
9171 1364256 1134541 1086955 1428284 1145568 1308084 1556213 1193645 1218249 1167011 1316547
$$ packed form
9246A441933M8145q9098Q236j34146L60046r2763k77089J93362j91810J25787
9236A392603K3033l1354o1679M6869J24714l81054J87347k9210j36419p2039K54186
9225A316997l08498K55205j72792J78201j97375J55913j44633J01403j53670j03566
9215I27185J80224o6235o2760M489K0976J178p6966J41656j498L5615k41532J04287
9203I66619J57324j80114P9273L1755l5529L9620l574j15921J49630k85323L45679
9192A149439j10024j08975m2937K69056m0284P1215P8190k32415P0820R5742j44186
9181A055641j56083K39738n563p0667J70254k40880K19846j438l06986M60394
9171A364256k29715m7586L41329k82716J62516K48129l62568K4604n1238J49536
$$ plain form
9161 1316547 1216392 1219799 1137980 1170593 1321701 1564294 1467010 1332403 1605747 1443865
9151 1443865 1517923 1300386 1255845 1483415 1218833 1424867 1454519 1256591 1587759 1531403
9141 1531403 1491177 1576788 1257780 1663534 1461745 1260958 1592043 1321532 1298088 1418555
9131 1418555 1150850 1420341 1366323 1247053 1332515 1534168 1262727 1519582 1506469 1442405
9121 1442405 1295119 1365109 1432053 1520377 1223485 1239844 1251818 1292192 1489947 1341232 1185620
9110 1185620 1253988 1186953 1301988 1454021 1301014 1082580 1468201 1375744 1209564 1437624
9100 1437624 1548038 1183583 1604545 1527121 1203416 1650590 1386272 1473273 1604656 1619347
9090 1619347 1503564 1479905 1618912 1715085 1558014 1796429 1883535 1716422 1833414 2209548
$$ packed form
9161A316547j00155L407q1819L2613J51108K42593r7284j34607K73344j61882
9151A443865P4058k17537m4541K27570k64582K06034K9652j97928L31168n6356
9141A531403m0226Q5611l19008M05754k01789k00787L31085k70511k3444J20467
9131A418555k67705K69491n4018j19270Q5462K01653k71441K56855j3113o4064
9121A442405j47286O9990O6944Q8324k96892J6359J1974M0374J97755j48715j55612
9110A185620O8368o7035J15035J52033j53007k18434L85621r2457j66180K28060
9100A437624J10414l64455M20962p7424l23705M47174k64318Q7001J31383J4691
9090A619347j15783k3659J39007R6173j57071K38415Q7106j67113J16992L76134
$$ plain form
9080 2209548 1837598 2010461 2183356 1909964 1811490 2260651 1945630 2037643 2047243 2047935 2158501
9069 2158501 2241793 2062917 2179828 2236724 2289894 2440406 2307466 2271297 2336356 2346129 2353816
9058 2353816 2324831 2364234 2237476 2430599 2319887 2484018 2329922 2536217 2398944 2595326
9048 2595326 2586416 2419597 2507840 2587200 2409481 2584438 2642458 2679561 2714393 2663125 2847112
9037 2847112 3055581 2921930 3193501 3072378 3104502 3443388 3477711 3559107 3353612 3433141
9027 3433141 3695338 3734436 3688035 3877218 4045596 4032061 4177859 4359710 4251435 4302012
9017 4302012 4685897 4849416 4838163 4664191 5028843 5182681 5093721 5428372 5414660 5432924
9007 5432924 5585367 5809430 5883747 5833376 6126887 6103583 6316454 6627811 6514923 6724230
$$ packed form
9080B209548l71950J72863J72895k73392r8474M49161l15021R2013R600O92J10566
9069B158501Q3292j78876J16911N6896N3170J50512j32940l6169O5059R773P687
9058B353816k8985L9403j26758J93123j10712J64131j54096K06295j37273J96382
9048B595326q910j66819Q8243P9360j77719J74957N8020L7103L4832n1268J83987
9037B847112K08469j33651K71571j21123L2124L38886L4323Q1396k05495P9529
9027C433141K62197L9098m6401J89183J68378j3535J45798J81851j08275N0577
9017D302012L83885J63519j1253j73972L64652J53838q8960L34651j3712J8264
9007E432924J52443K24063P4317n0371K93511k3304K12871L11357j12888K09307
$$ plain form
8997 6724230 7132687 7074164 7284122 7520966 7843556 7928747 8272476 8525239 8786305 9025124
8987 9025124 9373737 9608963 9818802 9949182 10445217 10896658 10935181 11215506 11607407 11844258
8977 11844258 12078363 12453270 12687947 12689640 13149593 13435797 13275804 13817716 14018183 13757207
8967 13757207 13975168 14233518 13979113 14164442 13951646 14030286 13872895 13768218 13622935 13596614
8957 13596614 13284534 13092582 12717150 12917096 12418680 12304606 12069987 11821892 11464794
8948 11464794 11534100 11435043 11434722 10875998 10827977 10740675 10473800 10367949 10403955 10075490 10086160
8937 10086160 9863708 9968931 9775447 9542946 9375770 9390452 9066255 9135846 9094840 8927330
8927 8927330 8859600 8892600 8673655 8708097 8809882 8826616 8743733 8792146 8807994 8802144 8967961
$$ packed form
8997F724230M08457n8523K09958K36844L22590Q5191L43729K52763K61066K38819
8987I025124L48613K35226K09839J30380M96035M51441L8523K80325L91901K36851
8977A1844258K34105L74907K34677J693M59953K86204j59993N41912K00467k60976
8967A3757207K17961K58350k54405J85329k12796P8640j57391j04677j45283k6321
8957A3596614l12080j91952l75432J99946m98416j14074k34619k48095l57098
8948A1464794O9306r9057l21n58724m8021q7302k66875j05851L6006l28465J0670
8937A0086160k22452J05223j93484k32501j67176J4682l24197O9591m1006j67510
8927H927330o7730L3000k18945L4442J01785J6734q2883M8413J5848n850J65817
$$ plain form
8916 8967961 9144245 9263653 9213775 9290685 9399287 9444785 9685731 9783501 9567439 9820474
8906 9820474 9963508 9960531 10297986 10218777 10261208 10571865 10328746 10314992 10432578 10654746
8896 10654746 11155534 10959345 10998740 11402855 11488533 11704308 11956657 12001186 12070214 12403131
8886 12403131 12456511 12534911 12643064 12747193 12743091 12878750 12733271 12966228 13310187 13948067
8876 13948067 14716017 15653254 18120648 21573972 24868679 28851895 33771954 35353217
8868 35353217 31802357 31215819 29817007 28127520 24633826 22405990 20345230 19134627
8860 19134627 17840407 16665462 15050480 13680462 12700902 12254393 11595367 11241164 11005662
8851 11005662 10695256 10174638 9770829 9787192 9544370 9374060 9080616 8879230 8698558 8467814
$$ packed form
8916H967961J76284J19408m9878P6910J08602M5498K40946R7770k16062K53035
8906I820474J43034k977L37455p9209M2431L10657k43119j3754J17586K22168
8896A0654746N00788j96189L9395M04115Q5678K15775K52349M4529O9028L32917
8886A2403131N3380P8400J08153J04129m102J35659j45479K32957L43959O37880
8876A3948067P67950R37237K467394L453324L294707L983216M920059J581263
8868C5353217l550860n86538j398812j689487l493694k227836k060760j210603
8860A9134627j294220j174945j614982j370018r79560m46509o59026l54203k35502
8851A1005662l10406n20618m03809J6363k42822j70310k93444k01386j80672k30744
$$ plain form
8841 8467814 8377418 8034300 7841659 7762750 7521970 7419961 7056904 7033377 6972922 6718027
8831 6718027 6727849 6298261 6094553 6204651 5966704 6084883 5715870 5520722 5728434 5364135
8821 5364135 5362883 5246421 5146096 5076633 5006672 4890517 4893978 4745853 4845224 4753898 4614732
8810 4614732 4575190 4607825 4335304 4320831 4198358 4143242 3820537 4107526 3910349 3801456
8800 3801456 3886207 3904816 3752576 3881464 3634840 3549402 3661813 3382682 3538551 3659118
8790 3659118 3398386 3292607 3305679 3214808 3180472 2885287 3131936 3061451 3026065 3021364 2845862
8779 2845862 3049466 3097379 2761754 2705055 2718831 2670274 2620203 2737197 2684321 2499336 2441712
8768 2441712 2600481 2569568 2538158 2348756 2072670 2375046 2337264 2058238 2322897 2221251
$$ packed form
8841H467814r0396l43118j92641p8909k40780j02009l63057k3527o0455k54895
8831F718027R822m29588k03708J10098k37947J18179l69013j95148K07712l64299
8821E364135j252j16462j00325o9463o9961j16155L461j48125R9371r1326j39166
8810D614732l9542L2635k72521j4473j22473n5116l22705K86989j97177j08893
8800C801456Q4751J8609j52240J28888k46624q5438J12411k79131J55869J20567
8790C659118k60732j05779J3072r0871l4336k95185K46649p0485l5386m701j75502
8779B845862K03604M7913l35625n6699J3776m8557n0071J16994n2876j84985n7624
8768B441712J58769l0913l1410j89402k76086L02376l7782k79026K64659j01646
$$ plain form
8758 2221251 2162452 2301088 2210419 2064959 2031018 2212325 2075892 2023421 2123236 2031640 1985786
8747 1985786 2043153 1979744 1875388 1960114 1709677 1647547 1856373 1728057 1558029 1764985
8737 1764985 1732638 1863439 1797649 1750856 1823995 1488618 1606343 1637769 1780400 1671018
8727 1671018 1419452 1541471 1646431 1530523 1550092 1508355 1243954 1517421 1383802 1351753
8717 1351753 1403990 1285922 1422369 1207960 1143779 1279090 1167788 1298887 1422417 1133438
8707 1133438 1294187 1360391 1365768 1269184 1198982 1093383 1215128 1074590 1033246 1158609 999537
8696 999537 1070943 1162533 1207991 1081409 1070800 1199213 1081205 919644 1283389 1073888
8686 1073888 1232654 1121597 1102137 1221821 1076825 1100998 884386 994158 948253 709770
$$ packed form
8758B221251n8799J38636r0669j45460l3941J81307j36433n2471R9815r1596m5854
8747A985786N7367o3409j04356Q4726k50437o2130K08826j28316j70028K06956
8737A764985l2347J30801o5790m6793P3139l35377J17725L1426J42631j09382
8727A671018k51566J22019J04960j15908J9569m1737k64401K73467j33619l2049
8717A351753N2237j18068J36447k14409o4181J35311j11302J31099J23530k88979
8707A133438J60749O6204N377r6584p0202j05599J21745j40538m1344J25363j59072
8696I99537P1406R1590M5458j26582j0609J28413j18008j61561L63745k09501
8686A073888J58766j11057j9460J19684j44996K4173k16612J09772m5905k38483
$$ plain form
8676 709770 1246382 1166749 1050001 1096999 1089543 1116183 954349 1282367 1103983 1070355 1061555
8665 1061555 1011284 971585 1198385 948119 944838 951831 970252 822028 998067 884452 816469
8654 816469 972252 854622 974653 759642 766140 887880 659046 930443 671434 822076
8644 822076 862575 825930 871129 813402 785049 776771 874398 701885 874466 716371 829135
8633 829135 805029 641688 759724 972801 678288 923857 715602 811717 937041 800141
8623 800141 679870 586098 575782 706044 643788 685023 723602 668368 564476 785654 653983
8612 653983 723609 803400 509224 678534 615054 577250 488811 849714 481829 594456 724652
8601 724652 715884 530077 992560 734171 542601 981757 474504 565899 794730 502072
$$ packed form
8676G09770N36612p9633j16748M6998p456K6640j61834L28018j78384l3628q800
8665A061555n0271l9699K26800k50266l281O993J8421j48224J76039j13615o7983
8654H16469J55783j17630J20031k15011O498J21740k28834K71397k59009J50642
8644H22076M0499l6645M5199n7727k8353q278R7627j72513J72581j58095J12764
8633H29135k4106j63341J18036K13077k94513K45569k08255R6115J25324j36900
8623H00141j20271r3772j0316J30262o2256M1235L8579n5234j03892K21178j31671
8612F53983O9626P9791k94176J69310o3480l7804q8439L60903l67885J12627J30196
8601G24652q768j85807M62483k58389j91570M39156n07253R1395K28831k92658
$$ plain form
8591 502072 539432 468320 465602 616848 671355 575670 619405 698871 507290 925196 677494
8580 677494 642861 697643 831151 480247 759346 455438 608679 621273 621515 368101 668121
8569 668121 537059 547267 760834 586649 614390 617061 529487 512625 601345 757120 588651
8558 588651 639280 464489 695349 713595 409166 584218 410047 605407 563333 455192
8548 455192 383817 544665 544107 601894 412617 543432 662304 572103 670269 562014 816243
8537 816243 665817 724583 745615 1168016 655232 632033 664323 435571 481805 672855 727603
8526 727603 528979 431244 568673 579243 577350 607098 422426 374390 646888 611671 605671
8515 605671 585432 385086 597810 378219 632542 584912 531260 315054 564419 427881
$$ packed form
8591E02072L7360p1112k718J51246N4507r5685M3735P9466j91581M17906k47702
8580F77494l4633N4782J33508l50904K79099l03908J53241J2594K42k53414L00020
8569F68121j31062J0208K13567j74185K7741K671q7574j6862Q8720J55775j68469
8558E88651N0629j74791K30860J8246l04429J75052j74171J95360m2074j08141
8548D55192p1375J60848n58N7787j89277J30815J18872r0201R8166j08255K54229
8537H16243j50426N8766K1032M22401n12784k3199L2290k28752M6234J91050N4748
8526G27603j98624r7735J37429J0570j893K9748j84672m8036K72498l5217o000
8515F05671k0239k00346K12724k19591K54323m7630n3652k16206K49365j36538
$$ plain form
8505 427881 506453 384225 472153 515247 396291 444943 614531 565827 598455 652531 458338
8494 458338 517032 536582 382717 669363 459356 478924 539211 474324 544200 504120 572424
8483 572424 524913 440219 496968 360613 473587 667036 419271 321038 490695 375858
8473 375858 395413 565695 500538 521439 457541 222891 615764 434016 337630 384075 421763
8462 421763 413521 300648 324257 437978 217687 327125 323337 289359 342942 331480 374284
8451 374284 445046 318529 424139 315917 512309 463638 391915 333232 426780 529228 467125
8440 467125 407943 626938 553553 281292 531251 462800 421449 222725 310957 484125 294263
8429 294263 278029 407552 252497 366467 322622 381884 341289 378403 362905 531101 366179
$$ packed form
8505D27881P8572j22228Q7928M3094j18956M8652J69588m8704L2628N4076j94193
8494D58338N8694J9550j53865K86646k10007J9568O0287o4887O9876m0080O8304
8483E72424m7511q4694N6749j36355J12974J93449k47765r8233J69657j14837
8473C75858J9555J70282o5157K0901o3898k34650L92873j81748r6386M6445L7688
8462D21763q242j12873K3609J13721k20291J09438l788l3978N3583j1462M2804
8451C74284P0762j26517J05610j08222J96392m8671p1723n8683R3548J02448o2103
8440D67125n9182K18995p3385k72261K49959o8451m1351j98724Q8232J73168j89862
8429B94263j6234J29523j55055J13970m3845N9262m0595L7114j5498J68196j64922
$$ plain form
8418 366179 488026 385101 264423 297195 297444 55058 335274 44899 297156 222463 42560
8407 42560 387538 294333 230895 366754 241024 421961 215281 289809 501410 368912
8397 368912 263332 445267 99300 361906 289567 394824 456020 293617 389287 429904
8387 429904 241888 585796 299955 -57827 545776 398111 255235 446877 377718 587786
8377 587786 577804 393786 627380 378538 357321 584016 402594 446465 418259 116579 525731
8366 525731 134404 163125 404226 327272 183050 281350 305532 337012 209416 369341 317846
8355 317846 134920 169612 188551 127603 289887 406133 246894 218624 153547 246025 437168
8344 437168 40469 373148 220186 137462 412988 338193 146091 400168 345772 392083
$$ packed form
8418C66179J21847j02925j20678L2772K49k42386K80216k90375K52257p4693j79903
8407D2560L44978r3205o3438J35859j25730J80937k06680P4528K11601j32498
8397C68912j05580J81935l45967K62606p2339J05257O1196j62403R5670M0617
8387D29904j88016L43908k85841l57782O03603j47665j42876J91642o9159K10068
8377E87786r982j84018K33594k48842k1217K26695j81422M3871k8206l01680M09152
8366E25731l91327K8721K41101p6954j44222R8300K4182L1480j27596J59925n1495
8355C17846j82926L4692J8939o0948J62284J16246j59239k8270o5077R2478J91143
8344D37168l96699L32679j52962q2724K75526p4795j92102K54077n4396M6311
$$ plain form
8334 392083 142912 357991 227093 281594 355530 264532 433878 413874 451297 540675 433067
8323 433067 600989 352354 320655 503122 332979 414146 419692 455430 205402 447934 532948
8312 532948 434872 396190 417263 373622 484718 310097 547910 432452 149115 170363 451500
8301 451500 112303 258377 282297 16176 324287 398750 304306 441059 318723 243149
8291 243149 124670 367173 256123 193210 299830 376904 86909 246678 248189 328811 148494
8280 148494 483784 290719 290709 304014 311202 395080 458316 252417 158601 340754 483311
8269 483311 297880 529483 227587 259852 546216 377421 345500 244480 366533 262735
8259 262735 262963 301219 274109 33296 559214 234951 507887 492496 299815 307413 403985
$$ packed form
8334C92083k49171K15079j30898N4501P3936r0998J69346k0004L7423Q9378j07608
8323D33067J67922k48635l1699J82467j70143Q1167N546L5738k50028K42532Q5014
8312E32948r8076l8682K1073m3641J11096j74621K37813j15458k83337K1248K81137
8301D51500l39197J46074K3920k66121L08111P4463r4444J36753j22336p5574
8291B43149j18479K42503j11050o2913J06620P7074k89995J59769J511Q0622j80317
8280A48494L35290j93065j0J3305P188Q3878O3236k05899r3816J82153J42557
8269D83311j85431K31603l01896L2265K86364j68795l1921j01020J22053j03798
8259B62735K28L8256k7110k40813N25918l24263K72936j5391j92681P598R6572
$$ plain form
8248 403985 408497 433015 273755 332249 168524 374650 136325 272757 339655 347415 181934
8237 181934 357747 322563 364192 328623 353473 267395 382342 161335 83817 389410 -30939
8226 -30939 9259 331875 239028 207866 414695 490419 514995 301257 455365 283339 359665
8215 359665 362821 192118 249913 452558 172274 452639 390362 95981 272930 168903
8205 168903 144757 152862 169111 208422 225328 187719 262704 575684 109222 120361 256530
8194 256530 262272 330564 837877 -43587 237754 276314 465324 203995 195426 250766 179520
8183 179520 169600 131756 313121 223100 288119 339579 177051 145551 249941 291940 417616
8172 417616 138096 305321 443844 267597 413145 306450 48466 136655 311519 217750
$$ packed form
8248D03985M512K4518j59260N8494j63725K06126k38325J36432O6898P760j65481
8237A81934J75813l5184M1629l5569K4850q6078J14947k21007p7518L05593m20349
8226c0939M0198L22616r2847l1162K06829P5724K4576k13738J54108j72026P6326
8215C59665L156j70703N7795K02645k80284K80365o2277k94381J76949j04027
8205A68903k4146Q105J6249L9311J6906l7609P4985L12980m66462J1139J36169
8194B56530N742O8292N07313q81464K81341L8560J89010k61329q569N5340p1246
8183A79520r920l7844J81365r0021O5019N1460j62528l1500J04390M1999J25676
8172D17616k79520J67225J38523j76247J45548j06695k57984Q8189J74864r3769
$$ plain form
8162 217750 14118 248214 54729 93592 274431 195633 190875 181784 20343 305473 268927
8151 268927 252442 274600 222169 238835 284562 377878 137152 214509 203953 251125 246735 -14694
8139 -14694 275826 214437 271838 355721 201468 130423 290379 519595 188166 251623 165750
8128 165750 192153 410017 163740 249506 339458 150145 192407 56685 74420 359761 131427
8117 131427 213790 370792 125281 272440 402176 36069 13366 322387 335920 90107
8107 90107 -7211 487779 112090 288196 293880 92595 -35062 70775 151903 -35755 97262
8096 97262 13516 9724 132517 327995 165856 130011 188431 147380 248741 401389 -11031
8085 -11031 168258 249139 154797 97727 61795 -89586 -154183 172578 178729 173853 39201
$$ packed form
8162B17750k03632K34096j93485L8863J80839p8798m758r091j61441K85130l6546
8151B68927j6485K2158n2431J6666M5727R3316k40726P7357j0556M7172m390k61429
8139a4694K90520o1389N7401Q3883j54253p1045J59956K29216l31429O3457q5873
8128A65750K6403K17864k46277Q5766Q9952j89313M2262j35722J7735K85341k28334
8117A31427Q2363J57002k45511J47159J29736l66107k2703L09021J3533k45813
8107I0107r7318M94990l75689J76106N684k01285j27657J05837Q1128j87658J33017
8096I7262q3746l792J22793J95478j62139l5845N8420m1051J01361J52648m12420
8085a1031J79289Q0881r4342n7070l5932j51381o4597L26761O151m876j34652
$$ plain form
8074 39201 2285 132542 138829 92357 91158 -144336 155583 25271 106205 25445 33000 55253
8062 55253 89226 -76007 -150184 -58666 143851 -242684 -29660 -64380 52450 235195 101680
8051 101680 -130636 147846 163379 134877 173727 135656 -117837 309691 205308 95949
8041 95949 -45278 -130 -54593 -33291 68559 -45406 -151217 -113945 65371 -12517 133520
8030 133520 -7966 -26973 -6708 139639 27871 44794 34291 -55804 -5245 17947 127093
8019 127093 201011 153617 53003 -64558 -58179 72432 318210 -222637 -110050 52346
8009 52346 -30816 44661 166642 -86189 -55300 226626 99178 158592 107012 171048 -3981
7998 -3981 140236 107664 -50889 -15346 66923 -200235 -167851 44594 -20952 176069 116644
$$ packed form
8074C9201l6916J30257O287m6472j199k35494K99919j30312Q0934q0760P555K2253
8062E5253L3973j65233p4177R1518K02517l86535K13024l4720J16830J82745j33515
8051A01680k32316K78482J5533k8502L8850l8071k53493M27528j04383j09359
8041I5949j41227M5148n4463K1302J01850j13965j05811L7272J79316p7888J46037
8030A33520j41486j9007K0265J46347j11768J6923j0503r0095N0559K3192J09146
8019A27093P3918m7394j00614j17561O379J30611K45778n40847J12587J62396
8009E2346q3162P5477J21981k52831L0889K81926j27448N9414n1580O4036j75029
7998c981J44217l2572j58553L5543Q2269k67158L2384K12445o5546J97021n9425
$$ plain form
7987 116644 -26346 243973 139896 82727 205304 -10768 119655 106887 -212755 208590
7977 208590 -20074 -144808 71160 6024 -82726 -130422 -1988 145798 -50610 -8119
7967 -8119 239388 -219096 70035 104761 -192453 71075 -27596 -148758 -97770 126607 -111297
7956 -111297 -108721 82338 -195011 -244710 -108592 70219 118283 -264449 40112 15355 99320
7945 99320 121575 -138055 -109882 -189507 -139464 121168 -152450 84594 -67880 -127801 62142
7934 62142 -49710 -62497 -49869 -251597 -121355 -49432 -208558 145023 -196496 7159
7924 7159 6119 77150 -7947 64444 9852 328207 56652 54412 -45146 -134066 62315 -57219
7912 -57219 -173112 -148959 -139031 -32643 -68395 311368 -178935 54657 100056 38078 187843
$$ packed form
7987A16644j42990K70319j04077n7169J22577k16072J30423j2768l19642M21345
7977B08590k28664j24734K15968o5136q8750m7696J28434J47786j96408M2491
7967h119K47507m58484K89131L4726k97214K63528r8671j21162N0988K24377k37904
7956a11297K576J91059k77349m9699J36118J78811M8064l82732L04561k4757Q3965
7945I9320K2255k59630K8173p9625N0043K60632k73618K37044j52474n9921J89943
7934F2142j11852j2787J2628k01728J30242P1923j59126L53581l41519K03655
7924G159j040P1031q5097P2391n4592L18355k71555k240r9558q8920J96381j19534
7912e7219j15893K4153R928J06388l5752L79763m90303K33592M5399o1978J49765
$$ plain form
7901 187843 -1855 -300693 17089 15431 35750 -68523 -98916 -85173 -104021 108177 -4891
7890 -4891 29437 -111625 -94463 80958 21344 -24872 -28201 -201852 -43223 -100276 -43956
7879 -43956 -74907 -27883 -55197 153679 -86125 81541 -46510 -99152 -156234 124224 -136312
7868 -136312 -109120 -5960 48150 -170572 -54321 -115844 -124507 -196987 -281818 -144539 151700
7857 151700 -157311 45617 -189106 -47552 144396 -82943 -381061 -256930 240802 66159
7847 66159 269122 -109386 -246314 5277 37414 145014 -7807 -131809 -19763 128774
7837 128774 34685 32826 -125950 -63929 -205777 -60108 -105913 -139136 -154104 -153124 199342
7826 199342 2022 -145525 30017 -76166 -76116 134453 -302938 -136737 98808 -109156
$$ packed form
7901A87843j89698k98838L17782j658K0319j04273l0393J3743j8848K12198j13068
7890d891L4328j41062J7162J75421n9614m6216l329j73651J58629n7053N6320
7879d3956l0951M7024k7314K08876k39804J67666j28051n2642n7082K80458k60536
7868a36312K7192J03160N4110k18722J16251o1523q663p2480q4831J37279K96239
7857A51700l09011K02928k34723J41554J91948k27339k98118J24131M97732j74643
7847F6159K02963l78508j36928K51591L2137J07600j52821j24002J12046J48537
7837A28774r4089j859j58776O2021j41848J45669m5805l3223j4968R80L52466
7826A99342j97320j47547J75542j06183N0K10569m37391J66201K35545k07964
$$ plain form
7816 -109156 -28273 174691 -153592 -199337 21839 -109608 -259286 -46435 -272235 -33491
7806 -33491 -177088 -217207 8974 142377 -251186 -149783 -73929 -177791 -23183 -71264
7796 -71264 -216192 41633 -257523 -243297 -134662 -2067 -163348 -163124 -171639 -87069 -76029
7785 -76029 30708 -285056 -82757 -215635 -133781 187070 -241739 -22308 -53394 -105658
7775 -105658 33910 15196 -74216 -164484 -216025 -116718 41121 59880 -23888 -167623 -9732
7764 -9732 44348 -19615 -191667 -4218 -172230 -263954 -98867 -68290 -224608 -90518 -253239
7753 -253239 -38109 -48178 -20771 257153 1313 -205382 199389 -184139 -219123 100277
7743 100277 -310823 -288337 -115693 -56624 -165595 -27417 -104492 -322284 -119406 11944
$$ packed form
7816a09156Q0883K02964l28283m5745K21176j31447j49678K12851k25800K38744
7806c3491j43597m0119K26181J33403l93563J01403P5854j03862J54608m8081
7796g1264j44928K57825k99156J4226J08635J32595j61281K24q515Q4570J1040
7785g6029J06737l15764K02299j32878Q1854L20851m28809K19431l1086n2264
7775a05658J39568j8714q9412r0268n1541R9307J57839J8759q3768j43735J57891
7764i732N4080o3963j72052J87449j68012r1724J65087L0577j56318J34090j62721
7753b53239K15130j0069K7407K77924k55840k06695M04771l83528l4984L19400
7743A00277m11100K2486J72644N9069j08971J38178p7075k17792K02878J31350
$$ plain form
7733 11944 -446747 -39668 -128620 -155635 -123645 -182807 -146154 -114023 -85933 -171250 -257419
7722 -257419 -39348 -273422 -159295 151944 -111238 -130253 -111594 -205748 -352989 -165097
7712 -165097 -155 -203933 -154930 -52647 -324174 203630 -50857 -334862 -202797 -145174
7702 -145174 -280767 -255765 -83620 -147394 -121372 -43337 -43045 -56733 -53470 -147230 30482 -222957
7690 -222957 -132724 -51524 137393 -140320 -205667 -191985 13891 -212701 -160356 -197573 -234777
7679 -234777 -170323 58677 -127701 204558 -42986 -23230 -43948 51378 -183218 -150091 -152059
7668 -152059 -242772 2101 -254945 -171246 -128388 -28785 -201156 -140261 -196031 -227844 -214646
7657 -214646 87394 -126815 -120640 -127991 -92753 -88390 -244756 -111362 -203032 -274002 -27611
$$ packed form
7733A1944m58691M07079q8952k7015L1990n9162L6653L2131K8090q5317q6169
7722b57419K18071k34074J14127L11239k63182j9015J8659r4154j47241J87892
7712a65097J64942k03778M9003J02283k71527N27804k54487k84005J32065N7623
7702a45174j35593K5002J72145o3774K6022P8035K92j3688L263r3760J77712k53439
7690b22957R0233Q1200J88917k77713o5347J3682K05876k26592N2345l7217l7204
7679b34777O4454K29000j86378L32259k47544J9756k0718R5326k34596L3127j968
7668a52059r0713K44873k57046Q3699M2858R9603j72371O0895n5770l1813J3198
7657b14646L02040k14209O175p351L5238M363j56366J33394r1670p0970K46391
$$ plain form
7646 -27611 -290261 -204689 -105718 36408 -239654 -235471 -197119 -236582 76098 -379021 -326076
7635 -326076 35943 -217628 -110333 102408 -125933 -244778 -17935 -209774 -144319 -155494
7625 -155494 -150287 -241188 -111636 -104092 -96626 -263063 -109428 -201907 -33349 -80748 -305921
7614 -305921 -57960 -11383 -258900 -71816 -148222 -232316 -152962 8244 -355994 -269351 -107617
7603 -107617 -861 -408601 -354503 -153750 -354515 -4950 3726 -370081 -148151 -59041
7593 -59041 -211324 82235 26648 -95138 -277064 -211375 -149369 1149 -152687 -121914 -196731
7582 -196731 -157544 -86523 -1990 -162631 -206596 -177189 -43725 -41715 -166545 -203724 -92883
7571 -92883 -299569 -177844 -285974 -131128 -258076 -127512 -34099 -243665 -207238 12424
$$ packed form
7646b7611k62650Q5572R8971J42126k76062M183L8352l9463L12680m55119N2945
7635c26076L62019k53571J07295K12741k28341j18845K26843j91839O5455j1175
7625a55494N207r0901J29552P544P466j66437J53635r2479J68558m7399k25173
7614c05921K47961M6577k47517J87084p6406q4094P9354J61206l64238Q6643J61734
7603a07617J06756m07740N4098K00753k00765L49565Q676l73807K21930Q9110
7593e9041j52283K93559n5587j21786j81926O5689O2006J50518j53836L0773p4817
7582a96731L9187P1021Q4533j60641m3965K9407J33464K010j24830l7179J10841
7571i2883k06686J21725j08130J54846j26948J30564R3413k09566L6427K19662
$$ plain form
7561 12424 -202377 -235164 -137727 -161683 -359155 -130783 -33329 -279899 -171668 46687 -325355
7550 -325355 -45664 -107180 -340768 92085 -129012 -184794 -179733 -230329 -108427 -68500 -324899
7539 -324899 -276883 -399510 19923 -92819 -170873 -224921 -285167 -171622 -34643 -101355 -129551
7528 -129551 -327426 -216442 -21028 -190316 -303580 61058 -333075 -79480 53345 -191378
7518 -191378 -164557 -478937 -163757 -116919 -462608 -152686 -150713 -427472 -50552 -170027
7508 -170027 -242868 -49145 -40840 -103118 -225590 73035 -159069 -151884 -42588 -440711 -165123
7497 -165123 -375111 -171173 -59977 -262679 -308617 -76386 -105021 -28934 -85548 -237742
7487 -237742 -210539 -64337 -223269 -250012 -30307 -299903 -294441 17984 -375799 -132699
$$ packed form
7561A2424k14801l2787R7437k3956j97472K28372R7454k46570J08231K18355l72042
7550c25355K79691o1516k33588M32853k21097n5782N061n0596J21902L9927k56399
7539c24899M8016j22627M19433j12742p8054n4048o0246J13545J36979o6712k8196
7528a29551j97875J10984J95414j69288j13264L64638l94133K53595J32825k44723
7518a91378K6821l14380L15180M6838l45689L09922J973k76759L76920j19475
7508a70027p2841J93723Q305o2278j22472K98625k32104P185J09296l98123K75588
7497a65123k09988K03938J11196k02702m5938K32231k8635P6087n6614j52194
7487b37742K7203J46202j58932k6743K19705k69596N462L12425l93783K43100
$$ plain form
7477 -132699 -112575 -244374 -355656 -134469 -250741 -127055 -226308 -356510 -283139 -251291
7467 -251291 -367680 -77191 -197607 -292958 18616 -322111 -199834 -42867 -498239 -171324
7457 -171324 -32896 -339182 -156935 -252255 -244121 -201058 -135563 -161196 -391751 -263883 -266896
7446 -266896 -333618 -167928 -278871 -352209 -151659 -182973 -308957 -292593 -198277 -183667 -246785
7435 -246785 -98552 -253584 -151936 -310320 -209824 -184632 -183452 -307797 -128955 -443383
7425 -443383 -156253 -154805 -278654 -293483 -82239 -227111 -104033 -166151 -162587 -416942 -269815
7414 -269815 -165368 -259001 -256319 -298202 -373406 -227431 -189559 -253043 -189293 -407583 -196498
7403 -196498 -103783 -146793 -217439 -380265 -395951 -178981 -243862 -101021 -234568 -323110 -189735
$$ packed form
7477a32699K0124j31799j11282K21187j16272J23686r9253j30202P3371L1848
7467b51291j16389K90489j20416r5351L11574l40727J22277J56967m55372L26915
7457a71324J38428l06286J82247r5320Q134M3063O5495k5633k30555J27868l013
7446b66896o6722J65690j10943p3338K00550l1314j25984J6364R4316J4610o3118
7435b46785J48233j55032J01648j58384J00496K5192J180j24345J78842l14428
7425d43383K87130J448j23849j4829K11244j44872J23078o2118L564k54355J47127
7414b69815J04447r3633K682m1883p5204J45975L7872o3484O3750k18290K11085
7403a96498R2715m3010p0646j62826j5686K16970o4881J42841j33547q8542J33375
$$ plain form
7392 -189735 -30196 -328264 -137405 -290269 -78913 -158010 17428 -74066 -303401 -233885
7382 -233885 -156606 -317938 -187915 -275958 -353282 -314504 -179316 -223401 -273568 -211766 -407544
7371 -407544 -231121 -277871 -265926 -203502 -564191 -251150 -52321 -377996 -380213 -352161 -261140
7360 -261140 -271495 -293237 -462357 -276855 -467822 -82934 -277085 -372983 -316427 -287314 -205519
$$ packed form
7392a89735J59539k98068J90859j52864K11356p9097J75438r1494k29335O9516
7382b33885P7279j61332J30023q8043p7324L8778J35188m4085n0167O1802j95778
7371d07544J76423m6750J1945O2424l60689L13041J98829l25675k217K8052R1021
7360b61140j0355k1742j69120J85502j90967L84888j94151r5898N6556K9113Q1795
$$ [...]
##END NTUPLES=NMR SPECTRUM
##END=
