##TITLE=abcd
##JCAMPDX= 6.0         $$ Bruker NMR JCAMP-DX V2.0
##DATA TYPE= NMR SPECTRUM
##DATA CLASS= NTUPLES
##ORIGIN= UXNMR, Bruker Analytische Messtechnik GmbH
##OWNER= root
$$ XWIN-NMR		Version 3.5
$$ Fri Aug 29 19:01:44 2025 Russian Standard Time (UT+4h)  servis@DPX200
##.OBSERVE FREQUENCY= 200.131235884673
##.OBSERVE NUCLEUS= ^1H
##.ACQUISITION MODE= SIMULTANEOUS
##.ACQUISITION SCHEME= undefined
##.AVERAGES= 32
##.DIGITISER RES= 18
##SPECTROMETER/DATA SYSTEM= spect
##.PULSE SEQUENCE= zg
##.SOLVENT NAME= CDCl3
##.SHIFT REFERENCE= (INTERNAL, CDCl3, 0, 16.4885)
##AUDIT TRAIL= $$ (NUMBER, WHEN, WHO, WHERE, WHAT)
$$ ##TITLE= Audit trail, XWIN-NMR		Version 3.5
$$ ##JCAMPDX= 5.01
$$ ##ORIGIN= Bruker BioSpin GmbH
$$ ##OWNER= servis
$$ F:\spectra/data/av/nmr/H1/1/pdata/1/auditp.txt
$$ ##AUDIT TRAIL=  $$ (NUMBER, WHEN, WHO, WHERE, WHAT)
(   1,<2025-08-29 19:00:27.96 +0400>,<servis>,<DPX200>,
      <created by zg, POWCHK disabled, PULCHK disabled
       configuration hash MD5:
       00 E9 B6 7A A2 85 ED C7 34 08 36 98 17 FE 4E 26
       data hash MD5: 32K
       E8 E8 F6 B2 13 68 24 26 57 65 94 5C 3F EA D1 9D>)
(   2,<2025-08-29 19:01:08.59 +0400>,<servis>,<DPX200>,
      <Start of raw data processing
       efp BC_mod = 2 LB = 0.05 FT_mod = 6 PKNL = 1 PHC0 = -262.0114 PHC1 = -12.69845 SI = 16K 
       data hash MD5: 16K
       C3 EB 07 B8 AF F2 3C 2F 1D 03 79 50 68 A6 E9 55>)
(   3,<2025-08-29 19:01:16.54 +0400>,<servis>,<DPX200>,
      <abs ABSG = 5 
       data hash MD5: 16K
       25 8E A0 A2 75 CC 72 34 9B 85 B1 63 91 24 91 0D>)
(   4,<2025-08-29 19:01:26.82 +0400>,<servis>,<DPX200>,
      <pk PHC0 = 0.2 PHC1 = 0 
       data hash MD5: 16K
       34 E7 70 A3 FA 82 85 F4 65 79 FD D4 5A 9C 64 15>)
$$ ##END=
$$ 
$$ hash MD5
$$ 5F D7 FA 2C 06 4B D7 A4 0E 7C EA 8A FB 7F 97 3A
##$RELAX= 
##$RELAX= 
##$RELAX= 
##$RELAX= 
##$RELAX= 
##$RELAX= 
##$RELAX= 
##$RELAX= 
$$ Bruker specific parameters
$$ --------------------------
##$DU= <F:\spectra>
##$EXPNO= 1
##$NAME= <H1>
##$PROCNO= 1
##$TYPE= <nmr>
##$USER= <av>
##$AMP= (0..31)
100 100 100 100 100 100 100 100 100 100 100 100 100 100 100 100 100 100 
100 100 100 100 100 100 100 100 100 100 100 100 100 100 
##$AQSEQ= 0
##$AQ_mod= 1
##$AUNM= <au_zg>
##$AUTOPOS= <>
##$BF1= 200.13
##$BF2= 200.13
##$BF3= 200.13
##$BF4= 200.13
##$BF5= 500.13
##$BF6= 500.13
##$BF7= 500.13
##$BF8= 500.13
##$BYTORDA= 1
##$CFDGTYP= 0
##$CFRGTYP= 5
##$CHEMSTR= <none>
##$CNST= (0..31)
1 1 145 1 1 1 1 1 1 1 1 1 1 1 1 1 1 1 1 1 1 1 1 1 1 1 1 1 1 1 1 1 
##$CPDPRG= <>
##$CPDPRG1= <>
##$CPDPRG2= <>
##$CPDPRG3= <>
##$CPDPRG4= <mlev>
##$CPDPRG5= <mlev>
##$CPDPRG6= <mlev>
##$CPDPRG7= <mlev>
##$CPDPRG8= <mlev>
##$CPDPRGB= <>
##$CPDPRGT= <>
##$D= (0..31)
0 2 0 0 0 0 0 0 0 0.06 0 0 0 0 0 0 0.0002 0 0 0 0 0 0 0 0 0 0 0 0 0 0 
0 
##$DATE= 1756479627
##$DBL= (0..7)
120 120 120 120 120 120 120 120 
##$DBP= (0..7)
150 150 150 150 150 150 150 150 
##$DBP07= 0
##$DBPNAM0= <>
##$DBPNAM1= <>
##$DBPNAM2= <>
##$DBPNAM3= <>
##$DBPNAM4= <>
##$DBPNAM5= <>
$$ [...]
##$SUBNAM5= <"">
##$SUBNAM6= <"">
##$SUBNAM7= <"">
##$SUBNAM8= <"">
##$SUBNAM9= <"">
##$SW= 20.6817932712277
##$SWIBOX= (0..15)
0 0 3 0 0 0 0 0 0 0 0 0 0 0 0 0 
##$SW_h= 4139.07284768212
##$TD= 32768
##$TD0= 1
##$TE= 0
##$TE2= 300
##$TE3= 300
##$TEG= 300
##$TL= (0..7)
0 120 120 120 120 120 120 120 
##$TP= (0..7)
150 150 150 150 150 150 150 150 
##$TP07= 0
##$TPNAME0= <>
##$TPNAME1= <>
##$TPNAME2= <>
##$TPNAME3= <>
##$TPNAME4= <>
##$TPNAME5= <>
##$TPNAME6= <>
##$TPNAME7= <>
##$TPOAL= (0..7)
0.5 0.5 0.5 0.5 0.5 0.5 0.5 0.5 
##$TPOFFS= (0..7)
0 0 0 0 0 0 0 0 
##$TUNHIN= 0
##$TUNHOUT= 0
##$TUNXOUT= 0
##$USERA1= <user>
##$USERA2= <user>
##$USERA3= <user>
##$USERA4= <user>
##$USERA5= <user>
##$V9= 5
##$VALIST= <valist>
##$VCLIST= <CCCCCCCCCCCCCCC>
##$VD= 0
##$VDLIST= <DDDDDDDDDDDDDDD>
##$VPLIST= <PPPPPPPPPPPPPPP>
##$VTLIST= <TTTTTTTTTTTTTTT>
##$WBST= 1024
##$WBSW= 30
##$XGAIN= (0..3)
0 0 0 0 
##$XL= 0
##$YL= 0
##$YMAX_a= 526737
##$YMIN_a= -451150
##$ZGOPTNS= <>
##$ZL1= 120
##$ZL2= 120
##$ZL3= 120
##$ZL4= 120
##$ABSF1= 16.48848
##$ABSF2= -4.193441
##$ABSG= 5
##$ABSL= 3
##$ALPHA= 0
##$AQORDER= 0
##$ASSFAC= 0
##$ASSFACI= 0
##$ASSFACX= 0
##$ASSWID= 0
##$AUNMP= <proc_1d>
##$AZFE= 0.1
##$AZFW= 0.1
##$BCFW= 0
##$BC_mod= 2
##$BYTORDP= 0
##$COROFFS= 0
##$CY= 18.4799938201904
##$DATMOD= 1
##$DC= 0
##$DFILT= <>
##$DTYPP= 0
##$F1P= 9.9274215381318
##$F2P= -0.165520771350173
##$FCOR= 1
##$FTSIZE= 16384
##$FT_mod= 6
##$GAMMA= 0
##$GB= 0
##$INTBC= 1
##$INTSCL= 4.127829e-11
##$ISEN= 128
##$LB= 0.05
##$LEV0= 0
##$LPBIN= 0
##$MAXI= 10000
##$MC2= 0
##$MEAN= 0
##$ME_mod= 0
##$MI= 50
##$NCOEF= 0
##$NC_proc= -6
##$NLEV= 6
##$NOISF1= 3.799351
##$NOISF2= 2.8
##$NSP= 0
##$NTH_PI= 0
##$NZP= 0
##$OFFSET= 16.48848
##$PC= 4
##$PHC0= -261.8114
##$PHC1= -12.69845
##$PH_mod= 1
##$PKNL= yes
##$PPARMOD= 0
##$PSCAL= 4
##$PSIGN= 0
##$REVERSE= no
##$SF= 200.130005582386
##$SI= 16384
##$SIGF1= 3
##$SIGF2= 2
##$SINO= 400
##$SIOLD= 16384
##$SREGLST= <1H.CDCl3>
##$SSB= 0
##$STSI= 16384
##$STSR= 0
##$SW_p= 4139.07284768211
##$SYMM= 0
##$S_DEV= 0
##$TDeff= 32768
##$TDoff= 0
##$TI= <>
##$TILT= no
##$TM1= 0
##$TM2= 0
##$TOPLEV= 0
##$USERP1= <user>
##$USERP2= <user>
##$USERP3= <user>
##$USERP4= <user>
##$USERP5= <user>
##$WDW= 1
##$XDIM= 16384
##$YMAX_p= 535539802
##$YMIN_p= -4031848
$$ End of Bruker specific parameters
$$ ---------------------------------
##NTUPLES= NMR SPECTRUM
##VAR_NAME=  FREQUENCY,     SPECTRUM/REAL,   SPECTRUM/IMAG
##SYMBOL=    X,             R,               I
##VAR_TYPE=  INDEPENDENT,   DEPENDENT,       DEPENDENT
##VAR_FORM=  AFFN,          ASDF,            ASDF
##VAR_DIM=   16384,         16384,           16384
##UNITS=     HZ,            ARBITRARY UNITS, ARBITRARY UNITS
##FACTOR=    0.252644378177508, 1,           1
##FIRST=     3299.83951724647, 0,            0
##LAST=      -839.233330435636, 0,           0
##MIN=       -839.233330435636, -4031848,    0
##MAX=       3299.83951724647, 535539802,    0
$$ Real data points
##PAGE= N=1
##DATA TABLE= (X++(R..R)), XYDATA
$$ [...]
6397C77496p3561k26331L25188k5549k92242M3483J50898q4356P7590K2372j04479
6386A90509P9032l3392N5801Q6002k01429J4127J14469j00831l7619j6354k3059
6375A27256l4647K57076j93001K26682r7254Q0829j8741k6509R8551r9600O0868
6364C81510j64410P8287j14609L04392k56760k3065o2253N6700l833J74003n5238
6353C14724P2393P5083O6281m62870K34870j6143J0568p8286J20194j10666O4690
6342B90838q9679Q638R6435l469m9946J2248o1740R2431o2189q0218J18307j10104
6330A61552K72422p0180r4222M524m3551m8726K14584r185q5043o0973q9729J30532
6318B82005L2340Q1377R0511j8790j50617L1195j21191R7691j46426K80458k91953
$$ plain form
6397 377496 303935 77604 402792 377243 85001 128484 279382 195026 272616 294988 190509
6386 190509 269541 236149 291950 377952 176523 190650 305119 204288 166669 150315 127256
6375 127256 92609 349685 156684 383366 286112 366941 348200 321691 420242 320642 381510
6364 381510 217100 295387 180778 485170 228410 205345 143092 199792 195959 369962 314724
6353 314724 387117 462200 528481 65611 300481 284338 294906 216620 336814 226148 290838
6342 290838 201159 209797 306232 302763 252817 265065 203325 295756 233567 153349 271656 161552
6330 161552 433974 363794 269572 274096 230545 181819 396403 387218 302175 241202 151473 282005
6318 282005 314345 395722 486233 467443 316826 348021 226830 324521 178095 458553 166600
6307A66600K9577J16493q6834K6724J20048l5963k332k3912M1077J27540j05806
6296C73212j90708J87575M3889Q4511j81658l01216J69065O2293P8795m7448M7795
6285C26105J45105j44725n6696L4448j01117K34163J07728k20652K40412j87151
6275C77620l235p1604j0628J79630J45497l09394R838J28499j87558j974J63608
6264D20299n5088j97059J96855l5195N6845K19260r8608J32761k42381q7874K14167
6253E23982q5401j01410K22333j1127q5280k18416K28044l2290r3753r0051Q9999
6242C46630N0339o2358L980L09643j43217j79725P3400J12209o6481J50055j63925
6231D30550j7662K6291J30494q6451N7879j81952O0523j92194K93986j12420j3777
$$ plain form
6307 166600 196177 312670 225836 252560 372608 336645 334313 310401 351478 479018 373212
6296 373212 182504 370079 413968 498479 316821 15605 184670 246963 325758 278310 326105
6285 326105 471210 326485 269789 304237 203120 437283 545011 324359 564771 377620
6275 377620 374385 302781 292153 471783 617280 307886 317724 446223 258665 256691 420299
6264 420299 365211 168152 365007 329812 386657 605917 507309 640070 397689 309815 523982
6253 523982 438581 337171 559504 548377 463097 244681 472725 440435 346682 256631 346630
6242 346630 396969 334611 338591 648234 505017 325292 398692 510901 444420 594475 430550
6231 430550 412888 439179 569673 483222 541101 359149 419672 227478 521464 409044 395267
6220C95267P5743J23211k4371j02542n5983r911K18667l67536K28380P8175p1462
6209D87638n3682P2090j48827J46211k7407J24415j26864L5300n1318N0303j22255
6198C85604J65862r1967K83865l07489J69824j36435K32302q9419p3131r649M0537
6187E69904o7265J11548m1167P8471q467j14748q8941Q9855m0687J62721n1510
6176E99714k6736R5783j20097O5666P0674j04193N6125j76032L34565k71703N6585
6165E80351n9518M7308K54877l40433J07590o3319L9222Q3847j13310J90115K5503
6154G52233j96357k7472O2703k6542J2338j2694P1143K9983l4148o9534J74017
6143G35670j13830M3793j41382K52390N5096l79871K02650m2207K11013J5055
$$ plain form
6220 395267 471010 594221 569850 467308 411325 401414 620081 252545 480925 559100 487638
6209 487638 433956 506046 357219 503430 476023 600438 473574 508874 457556 507859 385604
6198 385604 551466 459499 743364 435875 605699 469264 701566 612147 539016 529367 569904
6187 569904 502639 614187 573020 651491 643024 528276 439335 529190 488503 651224 599714
6176 599714 572978 668761 548664 614330 685004 580811 636936 460904 795469 523766 580351
6165 580351 520833 568141 823018 482585 590175 526856 566078 649925 536615 726730 752233
6154 752233 555876 528404 591107 564565 576903 564209 635352 665335 631187 561653 735670
6143 735670 621840 665633 524251 776641 831737 451866 654516 612309 823322 838377
6133H38377j65651m6892N7643J69039j22943j09207K7533p8059Q4621j17262L0853
6122E68052J97452l04573J89733J01625L7014p7046j9914J44786k87351K18521
6112G68299r8215K89101k75267R2326m4218J17195n4378o6132K75732k69545O1695
6101G96593N4868k4538K27703j8985k2475k50277K03759o0390j04001O4693j99184
6090F67766R8989k6548M7653J2255O8788j21119J93775j24086P2489k29982K08293
6079H68273l2927J50349k54012K89267j46159j83412J01681J4182J81765j09674
6069H79333o5672N88j12967o8186K31964r1855n5974K96063j76101o5367M1335
6058H13161M3086L3123L9502j08968r8656j3126K45395k43616K04445K3688M057
$$ plain form
6133 838377 672726 625834 683477 852516 729573 620366 647899 569840 654461 537199 568052
6122 568052 765504 460931 650664 752289 789303 712257 692343 837129 549778 768299
6112 768299 670084 959185 683918 776244 732026 849221 794843 728711 1004443 734898 796593
6101 796593 851461 826923 1054626 1035641 1013166 762889 966648 906258 802257 866950 667766
6090 667766 766755 740207 787860 800115 868903 747784 941559 817473 889962 659980 868273
6079 868273 835346 985695 731683 1020950 874791 691379 793060 807242 989007 879333
6069 879333 813661 814249 701282 633096 865060 773205 717231 1013294 837193 771826 813161
6058 813161 856247 889370 928872 819904 721248 708122 953517 709901 914346 938034 942091
6047I42091o3776l7951L7810J33154R8082j78316K3608L9298q4664l1711K06510
6036A084135j24987j49277J43119P6694j21646Q8168o4881L2137O4670j57698
6026H70434l2710L1400J75301j17225n732N880J5913R5621M5946k00908J35205
6015A019125Q7471l0960q8632N197o3968n9186O415J54895J83118j81746j59008
6004H72721J25450M0354n8507N8007J4853K8845j50391K28337k39043o8317J13300
5993I65609J69548r3368M1232k5275Q1819j84107K43480q8836j14733M0936r6063
5982I40242J26402L2630j12730J01040R4677k66840J70308J36464n0481N016j34808
5971A041920N6553n0100l3177l8887J19237P9483j5563j99199L15499n9053j10443
$$ plain form
6047 942091 878315 840364 878174 1011328 1109410 931094 954702 994000 909336 877625 1084135
6036 1084135 959148 809871 952990 1029684 908038 996206 931325 963462 1028132 870434
6026 870434 837724 869124 1044425 927200 921468 927348 943261 1038882 1084828 883920 1019125
6015 1019125 1106596 1075636 987004 992201 928233 869047 875462 1030357 1213475 1031729 872721
6004 872721 998171 1038525 980018 1038025 1052878 1081723 931332 1159669 920626 852309 965609
5993 965609 1135157 1041789 1083021 1057746 1139565 955458 1198938 1110102 995369 1036305 940242
5982 940242 1066644 1099274 986544 1087584 1182261 915421 1085729 1222193 1171712 1176728 1041920
5971 1041920 1098473 1048373 1015196 976309 1095546 1175029 1159466 960267 1275766 1216713 1106270
5960A106270K3577K1279l0090J16689m383Q6629J7763k41857P196P9728K00887
5949A383688j16047J27389k28419J3330j11657J93449j44863J45735j48990J32921
5939A246536Q7137L5358r2763l6214O6689m6471j72196K65863p1504J47453k93438
5928A136450J43064p5941P3361R1519J27938j92645j4299Q9158l2672k04363m5657
5917A095913L92131r0765k31840J79943n2286N4848L0467n0216j2464j80047K16834
5906A352518K1P7455J56353l40651J90047J47875r2459j63831k2391K03423n6168
5895A452192K2218m7480p9552Q3617O4762j49391J05471O0597q5817J80611l8365
5884A568863j83583J21168j38911J77653k2717j8739J21771p392j61284J7432
$$ plain form
5960 1106270 1129847 1151126 1121036 1237725 1233342 1319971 1337734 1095877 1103073 1182801 1383688
5949 1383688 1267641 1395030 1166611 1179941 1068284 1261733 1116870 1262605 1113615 1246536
5939 1246536 1333673 1369031 1276268 1240054 1306743 1260272 1088076 1353939 1282435 1429888 1136450
5928 1136450 1279514 1203573 1276934 1368453 1496391 1303746 1289447 1378605 1345933 1141570 1095913
5917 1095913 1488044 1397279 1165439 1345382 1293096 1347944 1378411 1328195 1315731 1135684 1352518
5906 1352518 1352539 1429994 1586347 1245696 1435743 1583618 1491159 1327328 1304937 1508360 1452192
5895 1452192 1474410 1426930 1347378 1430995 1495757 1346366 1451837 1512434 1426617 1607228 1568863
5884 1568863 1385280 1506448 1367537 1545190 1522473 1503734 1625505 1618113 1456829 1474261
5874A474261J63750j63915K66746k15899j2554J64286p2757j00024J97515l76964
5864A324445K86069R9889j16816J21363j07255J03987K1739k02760j15705L47939
5854A762895j9583r3984l6969M9506j80865K86026j46732n7420N6931K734j4556
5843A607983O9588R437N9732o9626R7616K5178J42153L5990k17075j31153J019
5832A630842K20739o1693m5514J89227O9515j76430j08363Q1980j02428J59254
5822A857129n2001J80280j70472R3805Q3310m035k81607L8164J17308O9381l5603
5811A895659O7115k78719L08803q3380J6945m2837P0827N7008j96871Q41R717
5800A825108o0785P8554N7757J0333n4679K18806j17034L1129r5089J89554k63617
$$ plain form
5874 1474261 1638011 1474096 1740842 1524943 1512389 1676675 1603918 1503894 1701409 1324445
5864 1324445 1610514 1710403 1593587 1714950 1607695 1711682 1733421 1530661 1414956 1762895
5854 1762895 1743312 1649328 1612359 1661865 1481000 1767026 1620294 1562874 1619805 1622539 1607983
5843 1607983 1677571 1687008 1746740 1677114 1774730 1799908 1942061 1978051 1760976 1629823 1630842
5832 1630842 1851581 1789888 1744374 1933601 2003116 1826686 1718323 1800303 1697875 1857129
5822 1857129 1805128 1985408 1814936 1908741 1992051 1988016 1706409 1744573 1861881 1931262 1895659
5811 1895659 1962774 1684055 1992858 1909478 1926423 1883586 1954413 2011421 1814550 1815391 1825108
5800 1825108 1764323 1842877 1900634 1910967 1856288 2075094 1958060 1989189 1894100 2083654 1820037
5789A820037J52090N1283J42597j32669j4532R1484j73263j00975L21281k59704
5779A897629J81853j47662J67285m2042J16435N2026l61787P8146J81633j09152
5769B014364J72565m8018j91221J46371M3812n9341J26182k55157K9797O8550
5759B047904O8979L1829R651j74573L32773j25986J08362l67242L85592k2820
5749B294469L9018j68855Q0234J199k49188M14086r8925j04816l2766L9341N0579
5738B264376J36460r1844j54437p8841L33278r8553r7931J22337n642J15620j35168
5727B309655m5275K40644K4021p0956k21830J06085p6957J41357j2495j80228
5717B214021r560J64822N8616l6701j68485K93544j04248j23364J98166O5468
$$ plain form
5789 1820037 1972127 2023410 2166007 2033338 2018806 2110290 1937027 1836052 2157333 1897629
5779 1897629 2079482 1931820 2099105 2057063 2173498 2225524 1863737 1941883 2123516 2014364
5769 2014364 2186929 2138911 1947690 2094061 2137873 2078532 2204714 1949557 1979354 2047904
5759 2047904 2116883 2148712 2158363 1983790 2316563 2190577 2298939 1931697 2317289 2294469
5749 2294469 2333487 2164632 2244866 2246065 1996877 2410963 2312038 2207222 2174456 2213797 2264376
5738 2264376 2400836 2308992 2154555 2075714 2408992 2310439 2212508 2334845 2329203 2444823 2309655
5727 2309655 2264380 2505024 2529045 2458089 2236259 2342344 2265387 2406744 2394249 2214021
5717 2214021 2204461 2369283 2427899 2391198 2222713 2516257 2412009 2288645 2486811 2552279
5707B552279j67878n805J47821J3234R9871j06380J39432k75651J56914L5428
5697B589265k8259K12118j85205p8451J01407J3103K1362r9880r267j8454n027
5686B512712k6785K78921j72608N6470J4609j05435K96927j98270L139M0344K7749
5675B727773R9483K5714o9889J19403k65327K00520l5660m6645J39719j43138
5665B751953q8718J81505m5534N5454M581L2960r5000n3905J52004p634J32415
5654C020081l28374J33733K54269J2384r654j74942R5346J08020n0839j27603
5644B932421J02594J43185q351k9694q5786j20995J15169K28905k34357L4087
5634C077178J70009r9023j0888J0736j7909N1349P171q042o1003L8123R7757k24898
$$ plain form
5707 2552279 2384401 2378596 2526417 2539651 2639522 2533142 2672574 2396923 2553837 2589265
5697 2589265 2561006 2773124 2587919 2509468 2610875 2623978 2645340 2545460 2536193 2517739 2512712
5686 2512712 2485927 2764848 2592240 2648710 2663319 2557884 2854811 2656541 2659680 2700024 2727773
5675 2727773 2827256 2852970 2783081 2902484 2637157 2837677 2802017 2755372 2895091 2751953
5665 2751953 2663235 2844740 2799206 2854660 2859241 2892201 2797201 2743296 2895300 2887666 3020081
5654 3020081 2691707 2825440 3079709 3092093 3082439 2907497 3002843 3110863 3060024 2932421
5644 2932421 3035015 3178200 3169849 3140155 3054369 2933374 3048543 3277448 3043091 3077178
5634 3077178 3247187 3148164 3137276 3148012 3130103 3181452 3188623 3180581 3119578 3157701 3255458 3030560
5622C030560J68305J11150k61868J13538K5922K436K1529j67947L28974j24816
5612C247783M0489l3882M9504n7175Q3210l2066m6573o2536J8137P1166j1395
5601C266662k03959J37604P7430P0808p4067j15548R1486j66140L56487k39551
5591C201212J15146j75301J36141m8067r6921L8363M5697l753l2959J14462j21850
5580C172170J83866p9534K50572j52094j05036P4693j07925O7035J5479K9028
5570C348254Q289j95299N21155k98389J00064J16684j88508l2066Q6861J4784
5560C481829j19747j10419P6500K37041o2716j14148k1509Q187o5225j5143J04143
5549C398793L8330n2702K71535k86267p8260L32770j81885K34323l5926o4058
$$ plain form
5622 3030560 3198865 3310015 3048147 3161685 3187607 3190043 3211572 3043625 3372599 3247783
5612 3247783 3288272 3254390 3303894 3246719 3329929 3297863 3251290 3188754 3206891 3278057 3266662
5601 3266662 3062703 3200307 3277737 3348545 3274478 3158930 3250416 3084276 3440763 3201212
5591 3201212 3316358 3141057 3277198 3229131 3132210 3170573 3216270 3212517 3179558 3294020 3172170
5580 3172170 3356036 3276502 3527074 3374980 3269944 3344637 3236712 3303747 3319226 3348254
5570 3348254 3356543 3161244 3682399 3384010 3484074 3600758 3412250 3380184 3467045 3481829
5560 3481829 3362082 3251663 3328163 3565204 3502488 3388340 3366831 3375018 3309793 3294650 3398793
5549 3398793 3437123 3384421 3655956 3369689 3291429 3624199 3442314 3676637 3640711 3576653
5539C576653p5835L4993j03743K62192k41953p9625Q5202k14554J46816N4230
5529C444376J35432j78982J18506O0446l9298Q7358j84892J85367n9317L2285
5519C601281k18226J78670j6192K34198k45888N4152J78274l08216K00786l45622
5509C313217L07869j9965J37696j64818J9273L6208J30221k11101J3954J62178
5499C724732k219j40669J43134j5496N5388O0259j35998J1060O5097m6633m1174
5488C677481J05594j19211R3043j73529J56070P8809n5022k4901K08846j52572
5478C794608M7926j10835l3014K23652r9224P3608k87382J22601M5546n997O3506
5467C834995j01651J11422l3242R3164J25282k06619k6628P5769J46559l02710
$$ plain form
5539 3576653 3500818 3535811 3432068 3694260 3452307 3372682 3457884 3243330 3390146 3444376
5529 3444376 3579808 3400826 3519332 3579778 3540480 3627838 3442946 3628313 3568996 3601281
5519 3601281 3383055 3561725 3545533 3779731 3533843 3587995 3766269 3458053 3658839 3313217
5509 3313217 3621086 3601121 3738817 3573999 3593272 3629480 3759701 3548600 3562554 3724732
5499 3724732 3722513 3581844 3724978 3709482 3764870 3825129 3689131 3700191 3765288 3718655 3677481
5488 3677481 3783075 3663864 3756907 3583378 3739448 3818257 3763235 3738334 3947180 3794608
5478 3794608 3842534 3731699 3698685 3922337 3823113 3896721 3609339 3731940 3777486 3771489 3834995
5467 3834995 3733344 3844766 3811524 3904688 4029970 3823351 3796723 3872492 4019051 3716341
5457C716341J65029l505O7432K4691n6157j6951M5959J13768j66670Q6993R4470
5446D071400j89947N3746P7927q4813J5417o661j25267O5778K09499j82994K35173
5435D139258m1406j04222r3491N9304K56422j43717j34460k4089J82011j73847
5425C921763M1978j0922j29638J94792j55837J56790j8368o7189j77727K49133
5415D004775P2361j15874j54947K06374J56916j63503J91245k66790N1827j40816
5405C841568O4576M4223L7791P0837Q6736k39538P3600r703n9696j90035L97592
5394D117951j89563K7697Q7191R399J39367j67185j50961J25484j15057K24294
5384D108617N0607l54581M2020J6543K78451j17753j56284J78212j72258K77087
$$ plain form
5457 3716341 3881370 3877865 3945297 3969988 3913831 3896880 3942839 4056607 3889937 3976930 4071400
5446 4071400 3881453 3935199 4013126 3928313 3943730 3937069 3811802 3877580 4087079 3904085 4139258
5435 4139258 4097852 3993630 3900139 3959443 4215865 4072148 3937688 3913599 4095610 3921763
5425 3921763 3963741 3952819 3823181 4017973 3862136 4018926 4000558 3933369 3755642 4004775
5415 4004775 4077136 3961262 3806315 4012689 4169605 4006102 4197347 3930557 3982384 3841568
5405 3841568 3906144 3950367 3988158 4058995 4145731 3906193 3979793 3970090 3910394 3720359 4117951
5394 4117951 3928388 3956085 4043276 4052675 4192042 4024857 3873896 3999380 3884323 4108617
5384 4108617 4159224 3804643 3846663 3863206 4141657 4023904 3867620 4045832 3873574 4150661
5374D150661j65173O9926j2041p7511k7257n1954J55150r9650P8939j19111k4767
5363C877212R8531j31706R1850K0050j96794J90435N2293j48763J41502k07862
5353C786748K3510p5526J29916K27976n6777j61840Q4262j787r9389K44316k70805
5342C830604J54013M5511l5385M0393r7566J16361j14033r316N2085l2280j55229
5331C795158J77271Q6321j2586j45915O3422O4053q9629p7961L4101K4932m0508
5320C878659K00023j63867l4742J58413J0792j15694J53971k12382J71495m3250
5310D003418r0078R2175L5516j19236M0086Q8732k75771L55987n5182j53171J49069
5299D071545q5953o7805P6373n7122J98447k45776q6122K19299P5867j30723j13177
$$ plain form
5374 4150661 3985488 4055414 4043373 3965862 3938605 3886651 4041801 3942151 4021090 3901979 3877212
5363 3877212 3975743 3844037 3935887 3955937 3759143 3949578 4001871 3853108 3994610 3786748
5353 3786748 3810258 3734732 3864648 4092624 4035847 3874007 3958269 3956482 3857093 4101409 3830604
5342 3830604 3984617 4030128 3994743 4035136 3937570 4053931 3939898 3930582 3982667 3950387 3795158
5331 3795158 3972429 4058750 4046164 3900249 3963671 4027724 3938095 3860134 3894235 3919167 3878659
5320 3878659 4078682 3914815 3880073 4038486 4049278 3933584 4087555 3875173 4046668 4003418
5310 4003418 3913340 4005515 4041031 3921795 3961881 4050613 3774842 4130829 4075647 3922476 4071545
5299 4071545 3985592 3917787 3994160 3937038 4135485 3889709 3803587 4022886 4098753 3968030 3854853
5288C854853J01049M8824J9687J75945q8206o453j866j08463J9638q6542J0229
5277C938695P0106r3776J90753j2765r4071Q5836j09182K09634q6546j98237K25892
5266D126339m3342o9763J31538Q462j21699P6409j28480R4267J44247P1180j28598
5255D160560J7377L0460j32919K12507m8658j09219r116J24617r6062M4615n298
5244D188864L41748l25044j81202J90657l6230m9291N062r9135K13302k2871j9006
5233D206854o5738r1912K60002L8035j47627O8311k5422L9609k6985J07073k35948
5222D126252K02349P674J22454n7576l9451J01376j14686l4224K33824j80818
5212D367174j6886Q0009j25164k5369K6498L13592k49729J62299k2952N8086k40293
$$ plain form
5288 3854853 3955902 4004726 4024413 4200358 4112152 4105699 4103833 3995370 4015008 3928466 3938695
5277 3938695 4008801 3915025 4105778 4093013 3998942 4084778 3975596 4185230 4098684 3900447 4126339
5266 4126339 4082997 4013234 4144772 4153234 4031535 4107944 3979464 4073731 4217978 4289158 4160560
5255 4160560 4177937 4208397 4075478 4287985 4239327 4130108 4120992 4245609 4149547 4194162 4188864
5244 4188864 4530612 4205568 4024366 4215023 4178793 4129502 4134564 4035429 4248731 4225860 4206854
5233 4206854 4141116 4049204 4309206 4347241 4199614 4267925 4242503 4282112 4255127 4362200 4126252
5222 4126252 4328601 4336275 4458729 4401153 4361702 4463078 4348392 4314168 4547992 4367174
5212 4367174 4350288 4430297 4305133 4279764 4306262 4619854 4370125 4532424 4509472 4567558 4327265
5201D327265L5189J91053J63588j62265J521k3148n6237N9834Q3193j28388k9242
5190D462363M8920K457m3378K08395k55962J87207k3427l4593J68352j64659J07140
5179D662815K0665j40195M7073l2606J43002J07160m86m796k5181m7728l4152
5168D695571R4212L7440J16198n5813k34858M50189k39554O5185p6547N9203J37001
5157E048227j26475j47356O4066l6512P4958J65737j00371m230l0185K6799J17999
5146E052657o0538J04889j90973J23828O5646r7593J30216j44884P1571J55516
5136E210335k0319o5328m8305P5065j45271K62822j36547Q4144j26844J59633
5126E249385P4671O5113J20365j22356J28874k1120N8934J4138R5218P3251J38897
$$ plain form
5201 4327265 4362454 4553507 4717095 4554830 4556351 4533203 4476966 4536800 4619993 4491605 4462363
5190 4462363 4511283 4513740 4470362 4678757 4422795 4610002 4586575 4551982 4720334 4555675 4662815
5179 4662815 4683480 4543285 4590358 4557752 4700754 4807914 4807428 4802632 4777451 4729723 4695571
5168 4695571 4789783 4827223 4943421 4887608 4652750 5102939 4863385 4928570 4852023 4911226 5048227
5157 5048227 4921752 4774396 4838462 4801950 4876908 5042645 4942274 4938044 4907859 4934658 5052657
5146 5052657 4992119 5097008 4906035 5029863 5095509 4997916 5128132 4983248 5054819 5210335
5136 5210335 5190016 5124688 5076383 5151448 5006177 5268999 5132452 5216596 5089752 5249385
5126 5249385 5324056 5389169 5509534 5387178 5516052 5494932 5553866 5568004 5663222 5736473 5875370
5115E875370J70250o3602N1651L60746L1027J16711j28528K07359K9183J28559
5105F778726J34071M03681K00722J79956n3980J01228L22054L62622k7714K95462
5095H696828L93155K11587K53441L89728K07247J41148M54676J91925L07510J97705
5085A1444950l7270L85361k6292L55862K6344j5818L02958l28898J40226k9115
5075A2218308J75182q5387J04390r7430k0024j12651J32290l798p5150l6113J8138
5064A2217755P3472N3600r5378j3405k32032P5989j99644k53994j97804j60305
5054A1268254l33364r8788k68702j2980l31660l61148k26194n06170j09548j53819
5044H865881k63207l31414p8763m07991j69467q1441k00939k27362j74904r4595
$$ plain form
5115 5875370 6045620 5982018 6033669 6394415 6425442 6542153 6413625 6620984 6650167 6778726
5105 6778726 6912797 7316478 7517200 7697156 7643176 7744404 8066458 8429080 8401366 8696828
5095 8696828 9089983 9301570 9555011 9944739 10151986 10293134 10747810 10939735 11247245 11444950
5085 11444950 11407680 11793041 11766749 12122611 12148955 12133137 12436095 12107197 12247423 12218308
5075 12218308 12393490 12308103 12412493 12315063 12295039 12182388 12314678 12310880 12235730 12199617 12217755
5064 12217755 12291227 12344827 12249449 12236044 12004012 12080001 11880357 11626363 11428559 11268254
5054 11268254 10934890 10836102 10567400 10554420 10222760 9861612 9635418 9129248 9019700 8865881
5044 8865881 8602674 8271260 8192497 7784506 7615039 7533598 7332659 7105297 6930393 6835798
5034F835798j82140k52623j68283k40620l9787j7598r0249k30641j79751j65061
5024E269045k2119M6062j31044j74571j33467K5417q8994j70588L15761m23474
5014D512028J51153l8909l34575J52838j15768L03691l14332k9872j87465J39171
5004D237960q2485m0291j80944K24237j39585n9488J11277n0777q1700P1575p2943
4993C936836l9642N0546l13317J63539J7180M4743l3256Q3870j41980P0875n4859
4982C784535P9721k67606M5682J17044K43392l87512O023R8124o9646L41942l42091
4971C649608J08157m7281q1721Q4278l06302K93998k46963J25161j5276K36726
4961C800385l06199P2644n289O620J28119n7964o9114J20052j9807j20358J57879
$$ plain form
5034 6835798 6653658 6401035 6232752 5992132 5952345 5934747 5844498 5613857 5434106 5269045
5024 5269045 5246926 5292988 5161944 4987373 4853906 4879323 4790329 4619741 4935502 4512028
5014 4512028 4663181 4624272 4289697 4442535 4326767 4630458 4316126 4286254 4098789 4237960
5004 4237960 4155475 4115184 3934240 4158477 4018892 3959404 4070681 4019904 3938204 4009779 3936836
4993 3936836 3897194 3947740 3634423 3797962 3815142 3859885 3826629 3910499 3768519 3839394 3784535
4982 3784535 3864256 3596650 3642332 3759376 4002768 3615256 3621279 3719403 3649757 3991699 3649608
4971 3649608 3757765 3710484 3628763 3713041 3406739 3700737 3453774 3578935 3563659 3800385
4961 3800385 3494186 3566830 3561541 3568161 3696280 3638316 3569202 3689254 3669447 3549089 3706968
4950C706968o1439m4318l9436L4051J75831l1306j51875M8623K07453k18606k13218
4939C412728m069M6171K8894n7694N7474k0442O9838m1723J31120p6751k9059
4928C516487N5420j04266J23577j71819K09226l48232J54064R6719J64748j31729
4918C564195L0866j44841J33340p6814J76683j37126J56965n7161j58445J32140
4908C619802J427k2541l1833j03239P6324O4057J4793J13928q8945J66108j21052
4897C688829J46411j56801J10726N9964j63789K24422K6579J19571q4555J94874
4887D166231J45819J7076J61085O875O4600J74953r423K80488J4556K96807J45961
4876E465028J16455J03420K55985O9911O4344j03251J10635K28736j17990J84031
$$ plain form
4950 3706968 3645529 3601211 3561775 3595826 3771657 3740351 3588476 3637099 3844552 3625946 3412728
4939 3412728 3408659 3454830 3483724 3426030 3483504 3463062 3532900 3491177 3622297 3545546 3516487
4928 3516487 3571907 3467641 3591218 3419399 3628625 3280393 3434457 3531176 3695924 3564195
4918 3564195 3595061 3450220 3583560 3506746 3683429 3546303 3703268 3646107 3487662 3619802
4908 3619802 3621229 3598688 3566855 3463616 3539940 3603997 3618790 3732718 3643773 3809881 3688829
4897 3688829 3835240 3678439 3789165 3849129 3685340 3909762 3936341 4055912 3971357 4166231
4887 4166231 4312050 4329126 4490211 4497086 4561686 4736639 4727216 5007704 5022260 5319067 5465028
4876 5465028 5581483 5684903 5940888 6010799 6075143 5971892 6082527 6311263 6193273 6377304
4866F377304M9035J52845L2960K08244J33993K29365n865L60151K00260M8028
4856G786320K00058J83726n5085K73384K03743K20799K91769N55562R5912J55952
4846I912140L19299p9515O8712m99955k98463l12321j16812k46125R6032j00546
4836H742446j87637p3546P8170j58437P1365j35648J44286k4518j08912q5046
4826H262523O2578l31063L92085Q3057K45164K52172P0439K38412J39596J9407
4816I434370Q3255o37346m30566l69972j06403l72531j63178r5680k08577P9157
4806G212529r9617N0767k67325R9311j76961q053P6545J86222R8438r4470J37045
4795G214431n9206K81102J73312J81136K07840N3704J99294K05166o8712j6488
$$ plain form
4866 6377304 6426339 6579184 6612144 6820388 6954381 7183746 7177881 7538032 7738292 7786320
4856 7786320 7986378 8170104 8115019 8388403 8592146 8812945 9104714 9660276 9756188 9912140
4846 9912140 10231439 10151924 10220636 9720681 9422218 9109897 8993085 8746960 8842992 8742446
4836 8742446 8554809 8481263 8559433 8400996 8472361 8336713 8480999 8456481 8347569 8262523
4826 8262523 8325101 7994038 8386123 8469180 8714344 8966516 9036955 9275367 9414963 9434370
4816 9434370 9517625 8880279 8449713 8079741 7973338 7600807 7437629 7341949 7133372 7212529
4806 7212529 7112912 7163679 6896354 6995665 6818704 6810651 6887196 7073418 7171856 7077386 7214431
4795 7214431 7155225 7436327 7609639 7790775 7998615 8052319 8251613 8456779 8388067 8371579
4785H371579n9987R548M1415k3639j18100L39271L9325J39370J05346R1149J56430
4774I091707m0796M92431j73244M62699K67185R7844K27442m6168L37008L35196
4764A1051304O4530K70626J15764L36970M26184J40003K61541N33873J53036J84570
4754A3538401N15283L34060J50525L03782J23117L28026M02421L21612M93849
4745A6511076K02453N12884K00492L13593N0189L30912K63218L05556J10899K19899
4735A9021171L29485J15051K66511N16392K24396N35609K72759M77852M70769
4726B2229995L43700L44261N51740L71841L92033L53577P01148N01827N34349
4717B6324471O72122N67367M79198L26121J49686l231J12096k81303r0885J20578
$$ plain form
4785 8371579 8311592 8321140 8362555 8338916 8220816 8560087 8599412 8738782 8844128 8935277 9091707
4774 9091707 9050911 9543342 9370098 9832797 10099982 10197826 10425268 10379100 10716108 11051304
4764 11051304 11115834 11386460 11502224 11839194 12265378 12405381 12666922 13200795 13353831 13538401
4754 13538401 14053684 14387744 14538269 14842051 14965168 15293194 15695615 16017227 16511076
4745 16511076 16713529 17226413 17426905 17740498 17790687 18121599 18384817 18690373 18801272 19021171
4735 19021171 19350656 19465707 19732218 20248610 20473006 21008615 21281374 21759226 22229995
4726 22229995 22573695 22917956 23469696 23841537 24233570 24587147 25288295 25790122 26324471
4717 26324471 26996593 27563960 28043158 28369279 28518965 28515734 28627830 28346527 28255642 28376220
4707B8376220k03871J12798r4318j43946K15533j37412N1639J6726k61853J64191
4697B8095707k87433L42178n09029j28246j05469K13285n4147J66040K16322j40385
4687B7808823Q4549o0449k4871m00184j94754l87416m09183l21019j45264j78054
4677B5772178k47585k82245J77257j49389K86842l11205K03879l3765r2764j17584
4667B5205619J08685j10634j90235J14493j65742J1515k21567j95611j71769j13187
4657B4271567k52892l99345k79774n24958l78715m86647p26156j75762l28202
4648B0719116n63321l55019n56200n62472k61662m94664m67421k72810p66192
4639A6419355j96532m91659p02271m27199l47249k83180o73685k78553n03947
$$ plain form
4707 28376220 28172349 28285147 28190829 28046883 28262416 28125004 28176643 28193369 27931516 28095707
4697 28095707 27808274 28150452 27641423 27513177 27407708 27620993 27566846 27732886 27949208 27808823
4687 27808823 27893372 27832923 27808052 27407868 27213114 26825698 26416515 26095496 25950232 25772178
4677 25772178 25524593 25242348 25419605 25270216 25557058 25245853 25449732 25415967 25323203 25205619
4667 25205619 25314304 25203670 25013435 25127928 24962186 24973701 24752134 24556523 24384754 24271567
4657 24271567 24018675 23619330 23339556 22814598 22435883 21949236 21223080 21047318 20719116
4648 20719116 20155795 19800776 19244576 18682104 18420442 17925778 17458357 17185547 16419355
4639 16419355 16222823 15731164 15028893 14601694 14254445 13971265 13297580 13019027 12515080
4630A2515080l72815k30001n89475k54301m24515m00071r3132k32914m48092j47123
4620I322641k48148k34393j56819o6301k23507l45620l12308J25040k50280k78833
4610G331472l0635j72155m5664j68244l44746n34j88160J50463j55687j87105
4600F189005j58608k7208k73148J95641k79946K7698j99382J49934l86651j11625
4590E125710n3659j83526j10946K00786l36709K5852j2108k76878r1596J53004
4580D439930l11896Q9746k11506j41155J67365J2439k83234J76058k82744K20117
4570C875120k29471J06871k37667k1378j77440k0457O3085L552j35245J37731
4560C364701o3206j42243P134j70939J22437m0633M159j94119K4457N927p4485
$$ plain form
4630 12515080 12142265 11912264 11322789 11068488 10643973 10243902 10150770 9917856 9469764 9322641
4620 9322641 9074493 8840100 8683281 8616980 8393473 8047853 7735545 7860585 7610305 7331472
4610 7331472 7300837 7128682 7083018 6914774 6570028 6569494 6381334 6531797 6376110 6189005
4600 6189005 6030397 6003189 5730041 5925682 5645736 5673434 5474052 5623986 5237335 5125710
4590 5125710 5072051 4888525 4777579 4978365 4641656 4667508 4655400 4378522 4286926 4439930
4580 4439930 4128034 4217780 4006274 3865119 4032484 4044923 3761689 3937747 3655003 3875120
4570 3875120 3645649 3752520 3514853 3493475 3316035 3295578 3358663 3362215 3226970 3364701
4560 3364701 3301495 3159252 3166386 2995447 3117884 3077251 3081410 2887291 2911748 2917675 2843190
4549B843190P226P962k7634q4615j61651q3296L25961j79628J61214l36569J30852
4538B603012n5636o6595j8343J42628j30777r7138L7074J51927j31390j60618
4528B274144J27348m0143J6181r4097o3441m4358k9156J75553j05676j53366M7762
4517B110751j86424J74545p6250J9302J40242J1765j75433J39562q1219J74044
4507B250885l16416M9517j117m6779L7944K8882r1208j13820K73737q4204q0388
4496A907033P617n1071K16997q5167K82116l04918N9442L8728l04071J65353N5668
4485A987727j70553m4281J71697k85978L27048m3265j40645j9086J67593l7059
4475A913198o7398K905j2799K0122O445j6877J0724J31750j48018K6552K0488
$$ plain form
4549 2843190 2850416 2858378 2830744 2746129 2584478 2501182 2827143 2647515 2808729 2472160 2603012
4538 2603012 2547376 2480781 2462438 2605066 2474289 2377151 2414225 2566152 2434762 2274144
4528 2274144 2401492 2361349 2377530 2283433 2219992 2175634 2146478 2322031 2216355 2062989 2110751
4517 2110751 1924327 2098872 2022622 2041924 2182166 2193931 2018498 2158060 2076841 2250885
4507 2250885 1934469 1983986 1982869 1936090 1974034 2002916 1911708 1797888 2071625 1987421 1907033
4496 1907033 1914650 1863579 2080576 1995409 2277525 1972607 2032049 2070777 1766706 1932059 1987727
4485 1987727 1817174 1772893 1944590 1658612 1985660 1942395 1801750 1782664 1950257 1913198
4475 1913198 1845800 1848705 1835906 1856028 1862473 1845596 1856320 1988070 1840052 1866604 1887092
4464A887092j0106J84903l3257m5406j71642J14465k4661Q4742j15797n308M4053
4453A909078j31961R6127J9019m141j0866j20537j2138P7573k6K1359n0484q5321
4441A707682P0032J92199k91495K257j2294R2931J46353k87402j03309J38389
4431A655343J38859O5290j14683m1360m72j27977K30385l6850o0584l3115j16766
4420A558070J4406P0301j29075R9654r9579o6646J30893R690J03300k44217J75611
4409A622408j8838k33168Q0549n8329J52087j22233K26928j42163M7044j8565
4399A535720P8463k12993J88655j06138j12014K02943K3814r7513k12784J97205
4389A485358n5852K2311o8010M8548J74350j26394l1704j7041p151N1421j96979
$$ plain form
4464 1887092 1876986 2061889 2028632 1983226 1811584 1926049 1901388 1986130 1870333 1865025 1909078
4453 1909078 1777117 1873244 1892263 1888122 1877256 1756719 1744581 1822154 1822128 1843487 1793003 1707682
4441 1707682 1777714 1969913 1678418 1680675 1668381 1761312 1907665 1620263 1516954 1655343
4431 1655343 1794202 1859492 1744809 1703449 1702977 1575000 1805385 1768535 1707951 1674836 1558070
4420 1558070 1572476 1642777 1513702 1613356 1513777 1447131 1578024 1587714 1691014 1446797 1622408
4409 1622408 1603570 1370402 1450951 1392622 1544709 1422476 1649404 1507241 1554285 1535720
4399 1535720 1614183 1401190 1589845 1483707 1371693 1574636 1598450 1500937 1288153 1485358
4389 1485358 1429506 1451817 1383807 1432355 1606705 1480311 1448607 1431566 1424415 1475836 1278857
4378A278857R2156J65907l7323O6866j85918J67580j95257N0384J78039j65060
4368A416231P027J0131J18967j15973q9189K51192k3075l7772j87233J44174p8036
4357A416444J87672j18202K041q5970K357K1186m1182J11173L4469J25165p5263
4346A579890J04051k73833K52917j25433m2548L5714m0524j9147R0809j5280j5436
4335A531180J36623k6072q3849R8825R5860j36129o4968K08440k4638O4463l7237
4324A762498R3611r1745J18800j39110k0264J88965k53778J31964J59683R1056
4314B041680j12933K4047k28046Q0530J31830P3061j29075m8960J66380k77295
4304A721219K91347j08141j49005K41876j76103J75058j45210J37611J76158j29579
$$ plain form
4378 1278857 1371013 1536920 1499597 1566463 1380545 1548125 1352868 1403252 1581291 1416231
4368 1416231 1423258 1433389 1552356 1436383 1347194 1598386 1575311 1537539 1350306 1494480 1416444
4357 1416444 1604116 1485914 1487955 1401985 1404342 1425528 1384346 1495519 1529988 1655153 1579890
4346 1579890 1683941 1410108 1663025 1537592 1495044 1530758 1490234 1471087 1561896 1546616 1531180
4335 1531180 1667803 1641731 1557882 1656707 1752567 1616438 1551470 1759910 1735272 1799735 1762498
4324 1762498 1856109 1764364 1883164 1744054 1723790 1912755 1658977 1790941 1950624 2041680
4314 2041680 1928747 1952794 1724748 1805278 1937108 2010169 1881094 1832134 1998514 1721219
4304 1721219 2012566 1904425 1755420 1997296 1821193 1996251 1851041 1988652 2164810 2035231
4294B035231P520j1998K31231P7647M0513k88277J12295J38996j36873J38496
4284B344781K04096r5161J50708j49092J33856J90620q8704K7058o1085K12017
4274B869094j86968k4945K29786P1300J69414j85217p2097J29920n329J74428
4264C169386k38749J36078Q5061J17218J4056m7485R8242m3983M26195m58895
4254C257124L06551Q9626J05562P3343J56998J63481L1172L74616j5936K49415
4244D791952j23533K96300K55988J92841O6343L23599J97069J6827J66540J45981
4234F329907k0955N36884J85273J62042Q0439M58888K70897M09674J72814M74155
4224I060018K68826M40906M46661M38819O03699L65052N82470N84033P28439R05424
$$ plain form
4294 2035231 2042751 2030753 2261984 2339631 2380144 2091867 2204162 2343158 2206285 2344781
4284 2344781 2548877 2453716 2604424 2455332 2589188 2779808 2691104 2718162 2657077 2869094
4274 2869094 2682126 2657181 2886967 2958267 3127681 2942464 2870367 3000287 2994958 3169386
4264 3169386 2930637 3066715 3151776 3268994 3283050 3235565 3333807 3289824 3716019 3257124
4254 3257124 3563675 3653301 3758863 3832206 3989204 4152685 4183857 4558473 4542537 4791952
4244 4791952 4668419 4964719 5220707 5413548 5479891 5803490 6000559 6017386 6183926 6329907
4234 6329907 6308952 6845836 7031109 7193151 7273590 7732478 8003375 8413049 8585863 9060018
4224 9060018 9328844 9769750 10216411 10655230 11258929 11623981 12206451 12790484 13518923 14424347
4214A4424347N95266P61633J144765R55866P47740Q03020O82511R15930N23029
4205B1554107P74688O62444N76515R63722P62992O37828Q74072J071608O34761
4196B8512737J107606R57329R74564J235978Q13532J220009J099342J097916Q69241
4187C7888254J001311R48977P07717O60396M51683J07915L76645q3267K00815
4178D2260446j12044J2354m40361r3544m82453k05036k04684l24371n78820k52052
4168C9579435m10368m25964o02237l27470q86625n66921n76875j156411p94235
4159C3832329j007214j072496j185553r32388j289822r59545j508098j020979
4151B4856234j015667j098416j138780p64643q98395q27208j041040p05392p18382
$$ plain form
4214 14424347 15019613 15781246 16926011 17881877 18629617 19432637 20115148 21031078 21554107
4205 21554107 22328795 22991239 23567754 24531476 25294468 25932296 26806368 27877976 28512737
4196 28512737 29620343 30577672 31552236 32788214 33601746 34821755 35921097 37019013 37888254
4187 37888254 38889565 39838542 40546259 41206655 41658338 41766253 42142898 42059631 42260446
4178 42260446 42148402 42160756 41720395 41626851 41144398 40939362 40734678 40410307 39831487 39579435
4168 39579435 39169067 38743103 38140866 37813396 36926771 36359850 35782975 34626564 33832329
4159 33832329 32825115 31752619 30567066 29634678 28344856 27385311 25877213 24856234
4151 24856234 23840567 22742151 21603371 20838728 19940333 19113125 18072085 17366693 16648311
4142A6648311o54104m85409o70797l96540p59984l16431n98120m53096l11967
4133A2001863n09287j69099m70482m36330j84612k17576k90278l90948l51010
4124H982241j09039j57716n4443m99164j08700j23375l40959J60660l59094j45115
4114G245296L8855j70723j31995j51373k39536m4886k06236O1380k16586j28583
4104F055613J309k38425R951o2528k73576J46647k24739O0989N726r6048J8189
4093E403108p9208n6088k2660k4237n1157j2626M4587j96709K7459m5653P6802
4082E063618j04440J40970j8598j67876J743j15172k9998P3457Q1437j21340k3
4071D803778M3074l5889r4017j11566L46579l02699n2060K37418l05883K7772
$$ plain form
4142 16648311 15994207 15508798 14838001 14441461 13681477 13365046 12766926 12313830 12001863
4133 12001863 11492576 11323477 10852995 10416665 10232053 10014477 9724199 9333251 8982241
4124 8982241 8873202 8715486 8661043 8161879 8053179 7929804 7588845 7749505 7390411 7245296
4114 7245296 7284151 7113428 6981433 6830060 6590524 6545638 6339402 6400782 6184196 6055613
4104 6055613 6056922 5818497 5828448 5765920 5492344 5638991 5414252 5475241 5480967 5384919 5403108
4093 5403108 5323900 5267812 5245152 5220915 5169758 5157132 5201719 5005010 5032469 4986816 5063618
4082 5063618 4959178 5100148 5081550 4913674 4915417 4800245 4770247 4843704 4925141 4803801 4803778
4071 4803778 4846852 4810963 4716946 4605380 4951959 4649260 4597200 4834618 4528735 4556507
4061D556507M1229k42604J53315N0024j43378J79338m7368j05710n253J70605
4051D606705N780r3535K02874k04613p8207L1282J86582j3496j22010J44338O4031
4040D729731N6327j71160j646k0861J12384R1762J5567j27355J92969J12376p5390
4029D914704J30585l3350K85691j17676J177K28078l716K0842K44496p6472K12128
4018E806487K84553p7742J45298J47678L16464O3121J77583L2148j32149L14594
4008G078035r777K82992J00446N3787M0277L26408k788K64465J05993K42746J82033
3997H664617J75901j3883J64641M73503J25295J13413O6940K11672J11827K71467
3987A0365393K15057J02580K22779K80212K98843K50023K40719J35502K29337
$$ plain form
4061 4556507 4597736 4355132 4508447 4558471 4415093 4594431 4547063 4441353 4436100 4606705
4051 4606705 4612485 4518950 4721824 4517211 4439004 4470286 4656868 4643372 4521362 4665700 4729731
4040 4729731 4786058 4614898 4613252 4592391 4704775 4796537 4812104 4684749 4877718 4990094 4914704
4029 4914704 5045289 5011939 5297630 5179954 5181131 5409209 5405493 5426335 5670831 5594359 5806487
4018 5806487 6091040 6013298 6158596 6306274 6622738 6685859 6863442 6895590 6763441 7078035
4008 7078035 7068258 7351250 7451696 7505483 7545760 7872168 7869380 8133845 8239838 8482584 8664617
3997 8664617 8840518 8826635 8991276 9464779 9590074 9703487 9770427 9982099 10093926 10365393
3987 10365393 10580450 10683030 10905809 11186021 11484864 11734887 11975606 12111108 12340445
3978A2340445K07429N59128K00179K35543L07647M87044L74166N57769L12239
3969A5581589M63197M41989M61926O81851M37994N57164N42722O99281M27362
3960B0295075M29994N03761L44437O58704L37678K75238K43839M48357L08561
3951B3845644K93082j84766L51844K49799M98053J39569Q3477K23536N81233O6191
3941B6147662M38268J49494N84693N64643O09813P31781O40653P57224P59865
3932C1384096O40235P35169O05490Q09714M52848L28751L65220L64844K58287
3923C5944654J29569p7117K90505l28549k04307n0607k20045k43306k49499l70962
3913C4620336k02593l05624j48912p9633j4398j51694k04643K52571J27839j01082
$$ plain form
3978 12340445 12547874 13107002 13307181 13542724 13850371 14337415 14711581 15269350 15581589
3969 15581589 16044786 16486775 16948701 17630552 18068546 18625710 19168432 19867713 20295075
3960 20295075 20725069 21228830 21573267 22231971 22569649 22844887 23088726 23537083 23845644
3951 23845644 24138726 23953960 24305804 24555603 25053656 25193225 25276702 25500238 26081471 26147662
3941 26147662 26585930 26735424 27320117 27884760 28494573 29226354 29867007 30624231 31384096
3932 31384096 32024331 32759500 33364990 34174704 34627552 34956303 35321523 35686367 35944654
3923 35944654 36074223 35997106 36287611 35959062 35754755 35704148 35484103 35240797 34991298 34620336
3913 34620336 34417743 34112119 33963207 33883574 33869176 33717482 33512839 33765410 33893249 33792167
3903C3792167K62542L22072K12297K03411J45051N78307n7990K52095M24442k02095
3893C5932299j0641R0716k06050k31206n7927m09107r7811l07180n38332l53668
3883C3811093j19206m93765k58111n83207k53589j32841m70883k55303m28979
3874C0815209j02671j3270l85112K2755q7963q9656K24762M944L8315J78076J80345
3863C0785734L11219P2567N7823K64830K16172M05925J99610K63909M05786K12845
3853C3196420M02647J72655L26569L29431K06657J81621P04140J22093L89940
3844C6032173L07112N05441M24091L06812M31450N59850M76985K25968O24568
3835C9894450N79702O75321M01796N63980N62709Q01877L36596P82400N69666
$$ plain form
3903 33792167 34054709 34376781 34589078 34792489 34937540 35515847 35457857 35709952 36134394 35932299
3893 35932299 35921658 36012374 35806324 35575118 35517191 35108084 35010273 34703093 34164761 33811093
3883 33811093 33691887 33198122 32940011 32356804 32103215 31970374 31499491 31244188 30815209
3874 30815209 30712538 30699268 30314156 30336911 30248948 30159292 30384054 30388998 30427313 30605389 30785734
3863 30785734 31096953 31169520 31227343 31492173 31708345 32114270 32313880 32577789 32983575 33196420
3853 33196420 33599067 33771722 34098291 34427722 34634379 34816000 35520140 35642233 36032173
3844 36032173 36339285 36844726 37268817 37575629 38007079 38566929 39043914 39269882 39894450
3835 39894450 40474152 41149473 41551269 42115249 42677958 43479835 43816431 44598831 45168497
3826D5168497P01736N85234L81342O40427O80899L90949P20158M39603O86678
3817E0395523O94159M15993M28111N78880N42903K95723N40121N28483M31570
3808E4851466L15582O16576O2122K87688L78419L08167J28145J76343L54570q1720
3798E7397358K63007J13742o2970J96517k14879M3520k56476J18040J7818R9826
3788E7715503k65743k48456J72526k75802l16726J14830j88365j65888m36657
3779E6105222j20300r8610j14233q1246L6569K02791J03097J0902M28596K60325
3769E6733113J31689p1555M4657j39823k36442q217m6597P5631L4361o3311P8374
3758E6531880n7960j66599r8778L4497l56309m03358l72002k93323o10238l01742
$$ plain form
3826 45168497 45870233 46455467 46836809 47477236 48158135 48549084 49269242 49708845 50395523
3817 50395523 51089682 51505675 51933786 52512666 53055569 53351292 53891413 54419896 54851466
3808 54851466 55167048 55783624 55845746 56133434 56511853 56820020 56948165 57124508 57479078 57397358
3798 57397358 57660365 57774107 57711137 57907654 57692775 57736295 57479819 57597859 57615677 57715503
3788 57715503 57449760 57201304 57373830 57098028 56781302 56896132 56707767 56541879 56105222
3779 56105222 55984922 55886312 55772079 55690833 55727402 55930193 56033290 56044192 56472788 56733113
3769 56733113 56864802 56793247 56837904 56698081 56461639 56453422 56406825 56482456 56516817 56453506 56531880
3758 56531880 56473920 56307321 56208543 56243040 55886731 55483373 55111371 54818048 54207810 53906068
3748E3906068p01441m87768m50882o08776q75834q39974q33528r21149j064263
3739D7122453j084790o62940r21594q26370n33620n65575o95029o29800o85126
3730D0517609l12166o14013m21605m58748k22907l82023n18697j56739n29456
3721C6901255k97271m20733k63941l91826k41563k69860k48472l94576j20059
3712C4252954l10233k1115j85882m63666j00199l09147j88529k01977k88658m65446
3702C1718102l31122k88533j53027m29571m54373m57010l85773n17731m02238
3693B8298724l53963m76663n07310l91297n22445l71993m70512o18321m20363
3684B4165857m54654n78042l61007l76663l76241l93329n60772j74626k74608
$$ plain form
3748 53906068 53204627 52716859 52265977 51657201 50781367 49941393 49107865 48186716 47122453
3739 47122453 46037663 45374723 44453129 43626759 43093139 42527564 41832535 41202735 40517609
3730 40517609 40205443 39591430 39169825 38711077 38488170 38106147 37587450 37430711 36901255
3721 36901255 36603984 36183251 35919310 35527484 35285921 35016061 34767589 34373013 34252954
3712 34252954 33942721 33921606 33735724 33272058 33171859 32862712 32674183 32472206 32183548 31718102
3702 31718102 31386980 31098447 30945420 30515849 30061476 29604466 29218693 28700962 28298724
3693 28298724 27944761 27468098 26960788 26569491 26047046 25675053 25204541 24586220 24165857
3684 24165857 23711203 23133161 22772154 22395491 22019250 21625921 21065149 20890523 20615915
3675B0615915j08997l95400m36241N3284k85041k79853j68302q7545k02445k24773
3665A8480602k13478o3331k19095m13495j64408k80472k50102l19161m69483n4947
3655A6032630k42227l28542j39432k34295k69849q5275j14365k68309j19783j12065
3645A4118488j69631n6995j94490q4399n0774N667j69419J69189k42471P9101
3635A3404266k19549j67564j02848P2956J5961l67503o845j65976k00420k11298
3625A2051180J55391l75888O4533l04638J9978j94155q0500k70362K85080k15595
3615A1135024J2262Q1251J9371j32010o7059l4178j15024j4162R7090N5517J23796
3604A1161878k15499j30371O5050J22238n9495n0907N3908J77730j94741O635
$$ plain form
3675 20615915 20506918 20111518 19675277 19728561 19443520 19163667 18995365 18907820 18705375 18480602
3665 18480602 18267124 18203793 17984698 17571203 17406795 17126323 16876221 16557060 16087577 16032630
3655 16032630 15790403 15461861 15322429 15088134 14818285 14733010 14618645 14350336 14230553 14118488
3645 14118488 13948857 13891862 13697372 13612973 13562199 13567866 13398447 13567636 13325165 13404266
3635 13404266 13184717 13017153 12914305 12987261 13003222 12635719 12628874 12462898 12262478 12051180
3625 12051180 12206571 11830683 11895216 11590578 11610556 11416401 11335901 11065539 11350619 11135024
3615 11135024 11147286 11228537 11247908 11115898 11048839 11014661 10899637 10885475 10982565 11038082 11161878
3604 11161878 10946379 10816008 10881058 11003296 10943801 10892894 10946802 11124532 10929791 10936426
3594A0936426N2011r5403p855k6248p5411K84220j69728J03004N1367K14967r5719
3583A1171631M2166j8646J6208J81856k10652J66250k83235L57055k30820L95712
3573A1587525j66272K4228J20970L15976j37600K07819M4181K24439j73920K31490
3563A2278836P6770m536K45834R0799K25424Q5719N9112Q2263L7436L13569R0364
3552A3581590L7628K23152J3059O7341k379Q5701J69915K01000K12905K41455
3542A4831367k56164M49342J99666J39011K92884K16816L87170Q1756L40974L26112
3532A7008934K95030M63090J88148L80306K18122O10446L57885O78617J6017O91669
3522B0908264M74655L05994O87875L36772N58170N76941O80684N98907N55070
$$ plain form
3594 10936426 10988437 10893034 10885179 10858931 10783520 11067740 10898012 11001016 11052383 11267350 11171631
3583 11171631 11213797 11195151 11211359 11393215 11182563 11348813 11065578 11422633 11191813 11587525
3573 11587525 11421253 11445481 11566451 11882427 11744827 11952646 11996827 12221266 12047346 12278836
3563 12278836 12355606 12351070 12596904 12687703 12913127 12998846 13057958 13140221 13177657 13491226 13581590
3552 13581590 13619218 13842370 13855429 13922770 13920391 14006092 14176007 14377007 14589912 14831367
3542 14831367 14575203 15024545 15224211 15363222 15656106 15872922 16260092 16341848 16682822 17008934
3532 17008934 17303964 17767054 17955202 18335508 18553630 19164076 19521961 20200578 20216595 20908264
3522 20908264 21382919 21688913 22376788 22713560 23271730 23848671 24529355 25128262 25683332
3513B5683332O52892Q25922Q05142R65244J114026R85666J121240J256898J460008
3504C4870370J207066J815553J703733K166627K316972K539265K406028K671525
3496E1697139L186567L227259L807761M184619M431883M995184N978744O872553
3488H8381709P941987R407950J0093518J1878572J3045520J4739959J6843703
3481A72332918J9905867K4876891L3516013M4412610N6869745N6673402M2418024
3474D51005470L7489114L1294551J5750667j8153750n7570061n8754146m6671495
3467C54390350l7662427l0532570k5827055k2656061k1037871j9381358j6576076
3460A80716932j4359884j1715627j0069791q344056p623293o977661n998076n516385
$$ plain form
3513 25683332 26336224 27162146 27967288 28932532 30046558 31032224 32153464 33410362 34870370
3504 34870370 36077436 37892989 39596722 41763349 44080321 46619586 49025614 51697139
3496 51697139 54883706 58110965 61918726 66103345 70535228 75530412 81509156 88381709
3488 88381709 96323696 105731646 115825164 127703736 140749256 155489215 172332918
3481 172332918 192238785 217115676 250631689 295044299 351914044 408587446 451005470
3474 451005470 488494584 519789135 535539802 517386052 459815991 401061845 354390350
3467 354390350 316727923 286195353 260368298 237712237 216674366 197293008 180716932
3460 180716932 166357048 154641421 144571630 136227574 128604281 121626620 115628544 110112159
3452A10112159m915382l951398l791841l408797k664721k454618k733573j960681
3444H4231148k027623j996773j834906j996079j812760j831804j973520j555933
3436F9201750j436444j398094j061469j248926q95787j108584o82857j072223
3428F0297366o81616p88229o50276p69665o34810n34076r08448o69818o65277
3419E3995151q59544j033381n74015p00048n47002p84174l91506p71141m90983
3410D7843357o65003n50550n71921p06421n36690p03719p60918o01122l77674
3401D2369339o72957o72722p73960m20113o27076n54399n53942q51223k60573
3392C6982374q12950n82928m13967o40799m74326n76888n75886m35791k77917
$$ plain form
3452 110112159 105196777 101245379 97453538 94044741 91380020 88925402 86191829 84231148
3444 84231148 82203525 80206752 78371846 76375767 74563007 72731203 70757683 69201750
3436 69201750 67765306 66367212 65305743 64056817 63161030 62052446 61369589 60297366
3428 60297366 59615750 58827521 58177245 57407580 56772770 56238694 55330246 54660428 53995151
3419 53995151 53135607 52102226 51528211 50828163 50281161 49496987 49105481 48334340 47843357
3410 47843357 47178354 46627804 46055883 45349462 44812772 44109053 43348135 42747013 42369339
3401 42369339 41696382 41023660 40249700 39829587 39202511 38648112 38094170 37242947 36982374
3392 36982374 36169424 35586496 35172529 34531730 34057404 33480516 32904630 32468839 32190922
3383C2190922p37776l79869n44216k12545m22985k26795n07984m57388k46469
3374B8454895l32739k94967m90418j82176k01813l01355k78557m44064j52309
3365B5776497l31168l01290l18199k23527k49041j98428l26753j83928j70784
3356B3473379j15350l42258j63958j23498j80644l10998M3073j71461R5335l18655
3346B1884965l0693o968k32296l7594k72011j23279j04407p1906j7372K9005l93319
3335B0624125L8245j46102j35469j00769L51486k73606J21514l19593P3951N2562
3325B0286344j90066n8733k87070j08919j00231j77241k27386J06497j15032k84004
3315A8844159j46343L7148k30934j69559j13917k70426R4162k26524j62454j36624
$$ plain form
3383 32190922 31453146 31073277 30529061 30316516 29893531 29666736 29158752 28701364 28454895
3374 28454895 28122156 27827189 27336771 27154595 26952782 26651427 26372870 25928806 25776497
3365 25776497 25445329 25144039 24825840 24602313 24353272 24154844 23828091 23644163 23473379
3356 23473379 23358029 23015771 22851813 22728315 22547671 22236673 22279746 22108285 22203620 21884965
3346 21884965 21854272 21847304 21615008 21577414 21305403 21182124 21077717 21005811 20988439 21017444 20624125
3335 20624125 20662370 20516268 20380799 20280030 20631516 20357910 20479424 20159831 20233782 20286344
3325 20286344 20096278 20037545 19750475 19641556 19541325 19364084 19136698 19243195 19128163 18844159
3315 18844159 18697816 18734964 18504030 18334471 18220554 17950128 18044290 17817766 17655312 17518688
3305A7518688k61077l73331R1783l81614r2562J3151k03242l07411o353l62887
3295A5635145j40713p4569l15007l25134O7920l20476k09382j13249k33225j44884
3285A3826426k01724m05319p5210j65985j88286j99274J06003k20339m27139j37310
3275A1911843j80641q8479n0931k64886L847k50493k53593r7936j72657r6971
3265A0459103j49144m6177K3557o3742k04723Q2136j68342K0157k13885j87233
3255I551707k10473J943O9094j03256K3398p6573N1694k38976o2466L6028o5408
3244H976712j92649o3861J1239K28687j98337j09840J21530O2957j82211J899
3234H656126M1197J18811j75335L10728j44983J78326j32272J69195L03303J1232
$$ plain form
3305 17518688 17257611 16884280 16976063 16594449 16501887 16515038 16311796 16004385 15998032 15635145
3295 15635145 15494432 15419863 15104856 14779722 14847642 14527166 14317784 14204535 13971310 13826426
3285 13826426 13624702 13219383 13144173 12978188 12789902 12590628 12696631 12476292 12049153 11911843
3275 11911843 11731202 11642723 11591792 11326906 11330753 11080260 10826667 10728731 10556074 10459103
3265 10459103 10309959 10263782 10287339 10223597 10018874 10101010 9932668 9952825 9738940 9551707
3255 9551707 9341234 9343177 9412271 9309015 9332413 9255840 9307534 9068558 9006092 9042120 8976712
3244 8976712 8784063 8720202 8731441 8960128 8761791 8651951 8773481 8836438 8654227 8656126
3234 8656126 8697323 8816134 8640799 8951527 8806544 8984870 8852598 9021793 9325096 9336328
3224I336328Q5003J14267m9656J09105j04218J9889R2629k87983P1542o0207J65509
3213I492208p765N9756J08744J61046n5917K13815J34920J02009O36945m913N38092
3202A1378940O3921K98547M58083N3748J02872K39171l0877j74858k1722j05347
3192A2262478l4305N3825n7707K91861J45452K30418J66028K01925J20108J41162
3182A3521245N9206Q9149k78563r4258J37669m0832j13041K33642j07198K22257
3172A3629276K7513O3726J92782O5281L04506L4352J02769p3311J95685K4379
3162A4566958J71910J43329K94805J29279J96393J01095J77416L55802L98239
3153A6535226K81437K12112J19305K68317M16732L78417M75301N38211L14957
$$ plain form
3224 9336328 9421331 9535598 9485942 9595047 9490829 9510718 9603347 9315364 9386906 9326699 9492208
3213 9492208 9484443 9544199 9652943 9813989 9758072 9971887 10106807 10208816 10845761 10840848 11378940
3202 11378940 11442861 11741408 12199491 12253239 12356111 12595282 12564405 12389547 12367825 12262478
3192 12262478 12228173 12281998 12224291 12516152 12661604 12892022 13058050 13259975 13380083 13521245
3182 13521245 13580451 13669600 13391037 13296779 13434448 13393616 13280575 13514217 13407019 13629276
3172 13629276 13656789 13720515 13913297 13978578 14283084 14317436 14420205 14346894 14542579 14566958
3162 14566958 14738868 14882197 15177002 15306281 15502674 15603769 15781185 16136987 16535226
3153 16535226 16816663 17028775 17148080 17416397 17833129 18211546 18686847 19225058 19540015
3144A9540015O06217L60703L35247M01555O34171M24610M06342K66467L81778
3135B3357105L81001K57900M08450K60046L97606L96823K94569N66585J99809
3126B6519894O21318M36767M25164N00850N21329P14497N49457M60678R86137
3117C1736091N83690O14144P52990L69059P21482O04721O76524O59674L23865
3108C7042240L66424K14489L54034M29103J43958K89141j00026L63216K2423J62478
3098C9287480J11994J82008L3008k58489L67002K97958K414K71601J15188K74184
3088D0684348N7527M39444K61598M67956L10186L05664Q8424M84452K33642J01191
3078D3434432M67486j22717K15629j04415J79934Q313k01949j62188j38890l51879
$$ plain form
3144 19540015 20146232 20506935 20842182 21243737 21877908 22302518 22708860 22975327 23357105
3135 23357105 23738106 23996006 24404456 24664502 25062108 25458931 25753500 26320085 26519894
3126 26519894 27141212 27577979 28003143 28503993 29025322 29739819 30289276 30749954 31736091
3117 31736091 32319781 32933925 33686915 34055974 34777456 35382177 36058701 36718375 37042240
3108 37042240 37408664 37623153 37977187 38406290 38550248 38839389 38739363 39102579 39125002 39287480
3098 39287480 39399474 39581482 39614490 39356001 39723003 40020961 40023375 40294976 40410164 40684348
3088 40684348 40741875 41181319 41442917 41910873 42221059 42526723 42615147 43099599 43333241 43434432
3078 43434432 43901918 43779201 43994830 43890415 44070349 44078662 43876713 43714525 43575635 43223756
3068D3223756l08040m51041l18120m56041p8239o80052k08170k69646m20956j50757
3058C9882694q4378k17439j10950k31666k75422j28360P6570k95542k94597q3090
3048C8237820l75697k12758k4245j59302k44390j4987l22813k81751l12964l17650
3038C5971263l93822k95530n97379m66434l85480m98715l58727m68971m49382
3029C2056823j96117o12665l93446n72721K994m17651k96750l27254r3386n01668
3019B8648159k40150l69623j94288k81615l57688k87008k25208l91031l64939
3010B5936609m46814m54341l61383m64809k52491l81504k64407n19686k81183
3001B2509991m38197k16251l45985m39583j25247n44922k61900k14132k98593
$$ plain form
3068 43223756 42915716 42464675 42146555 41690514 41612275 40932223 40724053 40454407 40033451 39882694
3058 39882694 39798316 39580877 39469927 39238261 38962839 38834479 38911049 38615507 38320910 38237820
3048 38237820 37862123 37649365 37625120 37465818 37221428 37206441 36883628 36601877 36288913 35971263
3038 35971263 35577441 35281911 34684532 34218098 33832618 33333903 32975176 32506205 32056823
3029 32056823 31860706 31248041 30854595 30281874 30284868 29867217 29570467 29243213 29149827 28648159
3019 28648159 28408009 28038386 27844098 27562483 27204795 26917787 26692579 26301548 25936609
3010 25936609 25489795 25035454 24674071 24209262 23956771 23575267 23310860 22791174 22509991
3001 22509991 22071794 21855543 21509558 21069975 20944728 20399806 20137906 19923774 19625181
2992A9625181j49097j52557l27502j62855r3941l24663k54608k19103J06814l15739
2982A7731930J6984k50646q0421j93613j68622m2195j76111j62500J12718j77826
2972A6609698Q738l68360J29040j17366j04460j52215N7876M6968j13902J92138
2962A6188155k29884J76231k97658J86649K33669j88684J00777J52677l0177J70543
2952A6462298J80921j07859J75471J74721J57862J30946p2716J54002K50357J60363
2942A7666366J20553K35237J77826K25301K99064N2143N29708J95078J45574L67183
2932B0014033L31163L18407L17624K92679M25547L23228K76393N90266K10179
2923B3099519L45470N27858O21154L36718L22411M66676O50186L80150N08361
$$ plain form
2992 19625181 19476084 19323527 18996025 18833170 18739229 18414566 18159958 17940855 18047669 17731930
2982 17731930 17748914 17498268 17417847 17224234 17055612 17013417 16837306 16674806 16787524 16609698
2972 16609698 16618436 16250076 16379116 16261750 16157290 16005075 16062951 16109919 15996017 16188155
2962 16188155 15958271 16134502 15836844 16023493 16257162 16068478 16169255 16321932 16291755 16462298
2952 16462298 16643219 16535360 16710831 16885552 17043414 17174360 17101644 17255646 17506003 17666366
2942 17666366 17786919 18022156 18199982 18425283 18724347 18776490 19306198 19501276 19646850 20014033
2932 20014033 20345196 20663603 20981227 21273906 21699453 22022681 22299074 22889340 23099519
2923 23099519 23444989 23972847 24594001 24930719 25253130 25719806 26369992 26750142 27258503
2914B7258503N58694O02943L69921O15727N62450O62365N99292M17972M72494
2905C2120361P35413O63180Q50004N61150Q81665N82565O48696N97542P26410
2896C8366986Q34761N75775O11348O62957P82064Q10685P91731O04643P96717
2887D4837667P64680N06455P33186P35854P11609O90165P74245L31181P19451
2878E0804493P47541O60192O79269Q87706M15559N63846O31205P23834O25347
2869E6738992Q44705K97675Q24763O08903O37557O93779N90084P23801M94922
2860F2455181O67303P29489Q39251K80461N91423Q33620L79078N89355O52770
2851F8017931K41335P49306N90559P30754N69972M47652O87726P06907M71560
$$ plain form
2914 27258503 27817197 28420140 28790061 29405788 29968238 30630603 31229895 31647867 32120361
2905 32120361 32855774 33518954 34368958 34930108 35811773 36394338 37043034 37640576 38366986
2896 38366986 39201747 39777522 40388870 41051827 41833891 42644576 43436307 44040950 44837667
2887 44837667 45602347 46108802 46841988 47577842 48289451 48979616 49753861 50085042 50804493
2878 50804493 51552034 52212226 52891495 53779201 54194760 54758606 55389811 56113645 56738992
2869 56738992 57583697 57881372 58706135 59315038 59952595 60646374 61236458 61960259 62455181
2860 62455181 63122484 63851973 64691224 64971685 65563108 66396728 66775806 67365161 68017931
2851 68017931 68259266 69008572 69599131 70329885 70899857 71347509 72035235 72742142 73213702
2842G3213702O18603N26568O90686M26221L65499O00435L53093N93364M04233
2833G7792404N27484O01000K34530K59057O59268K37525K02091O3349M49220P3459
2823H1099387r2117L25301L13672K27713m1935o2766J09343L93480j27088R5411
2813H2240401m7834o1347K8868o7211j19828j35589o9514j30665k92926k45373
2803H1098982l32861l78526j93833l42164m58093o92493r2417m90054o36166n53381
2793G6928994n97971n68260p69154n05923o10965m08619r10760o14210n69814
2784G1373318n52619o35202o13696l92526n65763o67088n68115m08260n80809
2775F6389240o84751n83549m73435o27127n69312n48160m74608q19140j44751
$$ plain form
2842 73213702 73832305 74358873 75049559 75475780 75841279 76441714 76794807 77388171 77792404
2833 77792404 78319888 78920888 79155418 79414475 80073743 80311268 80513359 80576708 81025928 81099387
2823 81099387 81007270 81332571 81646243 81873956 81832021 81769255 81878598 82272078 82144990 82240401
2813 82240401 82192567 82131220 82160088 82092877 81973049 81837460 81767946 81637281 81344355 81098982
2803 81098982 80766121 80387595 80193762 79851598 79393505 78701012 78608595 78118541 77482375 76928994
2793 76928994 76331023 75762763 74993609 74487686 73876721 73468102 72557342 71943132 71373318
2784 71373318 70820699 70185497 69571801 69179275 68613512 67946424 67378309 66970049 66389240
2775 66389240 65704489 65120940 64647505 64020378 63451066 62902906 62428298 61609158 61464407
2766F1464407r43294m07798p57066o99595q13011m98347q22832o50568p64230
2757E5107666q33585o88920n77640q11803m74801r51395n68257j129991l85285
2748D8685989q83071q01278o92976p19278p04618q29704p32430p88790o55322
2739D1878522p31292p19524o80769q41142o49513p14755o30482p49045o99393
2730C5462607n25555o42250n63879n60653n97568p57033l71975p37400n73744
2721C0132550p47498l52830o13577o32066n39700n02831n35575n34171n81290
2712B5093012n34146m03758n33294m91054n99301k93066o90914k42421o29607
2703B0675451k80204m84593k47235n08673l16575m32409l99551m39040l43906
$$ plain form
2766 61464407 60521113 60113315 59356249 58656654 57843643 57345296 56522464 55871896 55107666
2757 55107666 54274081 53585161 53007521 52195718 51720917 50769522 50201265 49071274 48685989
2748 48685989 47802918 47001640 46308664 45589386 44884768 44055064 43322634 42533844 41878522
2739 41878522 41147230 40427706 39746937 38905795 38256282 37541527 36911045 36162000 35462607
2730 35462607 34937052 34294802 33730923 33170270 32572702 31815669 31443694 30706294 30132550
2721 30132550 29385052 29032222 28418645 27786579 27246879 26744048 26208473 25674302 25093012
2712 25093012 24558866 24155108 23621814 23130760 22531459 22238393 21547479 21305058 20675451
2703 20675451 20395247 19910654 19663419 19154746 18838171 18405762 18006211 17567171 17223265
2694A7223265k64436k70924m45645l88184j91871l59903k30217l60899j70205
2685A4540981r9143o13514p6334k81209k45431k25639l21524k43927l46900J21616
2675A2208976j55206k18964k48010p2746k77774r5570j68990l83067M3368j12242
2665A0519775n6941m05981J4138j65321M0742k40907k20636R2648k54464r314
2655I313739j40135n7426j41854q8528k04166J56472k65641J38005k05379k32641
2645H272446J27543j0167j97769J81836m15041J89854K8571j45505K44163j89242
2635H086689l346J12821N8151q9806J03095J78418j88929J8700j41399q0926n9527
2624G993941k17290j98863Q7505k36223J50108j82496k51461j88830J71484R7667
$$ plain form
2694 17223265 16958829 16687905 16242260 15854076 15662205 15302302 15072085 14711186 14540981
2685 14540981 14441838 13828324 13751990 13470781 13225350 12999711 12678187 12434260 12087360 12208976
2675 12208976 12053770 11834806 11586796 11514050 11236276 11140706 10971716 10588649 10632017 10519775
2665 10519775 10462834 10056853 10070991 9905670 9946412 9705505 9484869 9577517 9323053 9313739
2655 9313739 9173604 9116178 8974324 8885796 8681630 8838102 8572461 8710466 8505087 8272446
2645 8272446 8399989 8389822 8192053 8373889 7958848 8148702 8177273 8031768 8275931 8086689
2635 8086689 8083343 8196164 8254315 8164509 8267604 8446022 8257093 8275793 8134394 8053468 7993941
2624 7993941 7776651 7577788 7665293 7429070 7579178 7396682 7145221 6956391 7127875 7225542
2614G225542j02351J6590j87436j04758J76898j42342O6901J58886m1341M4417
2604G111006J87076k39799J80539Q6107l83788R8663N2045o6458r759n2631Q9599
2593G052600k33396K9009J09746j6307N3378n1059r0499M1628K84132m6233l9098
2582G093901L6579K16458J85680P7877K57118J52375K00752o3821L04678J30508
2572H592105L6172j46756n6515j08835J59886j17274L23226J40824N2276K83360
2562I158469P1821M29245J14824M47164L05931N33220M10370K49156K11241O5611
2552A1997052k81475l10265l28862r290j62022J52609M7707j18417J56721k1778
2542A1121980j09035J78465r1919Q8766K94923K80273R2578M30661K90197N33201
$$ plain form
2614 7225542 7123191 7139781 6952345 6847587 7024485 6882143 6949044 7107930 7066589 7111006
2604 7111006 7298082 7058283 7238822 7324929 6941141 7039804 7091849 7025391 7015632 6963001 7052600
2593 7052600 6819204 6848213 6957959 6941652 6995030 6943971 6853472 6895100 7179232 7132999 7093901
2582 7093901 7130480 7346938 7532618 7610495 7867613 8019988 8220740 8156919 8461597 8592105
2572 8592105 8628277 8481521 8425006 8316171 8476057 8358783 8682009 8822833 8875109 9158469
2562 9158469 9230290 9659535 9774359 10221523 10527454 11060674 11471044 11720200 11931441 11997052
2552 11997052 11715577 11405312 11076450 11067160 10905138 11057747 11105454 10987037 11143758 11121980
2542 11121980 11012945 11191410 11099491 11188257 11483180 11763453 11856031 12286692 12576889 13110090
2532A3110090L14774N45802R47564Q25808M58270M52454K10402J95725m68344
2523A6592545q88515o88872l05354n41300j63753m22468o2160j79157k94655J00871
2513A3147182J31666q7962K09493o9574K18190N1362K76926K01338J07791M57329
2503A4643741M14147L68866K67075O14174K85831J66434J55717n435m07244k93742
2493A6209564n5034J6446k75085O0560p7651K65388Q5268J27952J03895K37481
2483A6698784J74386M63347K96256L18470O56000k02528K7549M9584k64485j21293
2473A8096070J4737J8808j30438j24256J13946L65669j2798P2043J89506M24920
2463A9028207K24510L93195N33237N90585L15544N92289J92869J182516K90805
$$ plain form
2532 13110090 13424864 13970666 14918230 15744038 16202308 16654762 16865164 17060889 16592545
2523 16592545 15704030 15015158 14709804 14168504 14004751 13582283 13520123 13340966 13046311 13147182
2513 13147182 13278848 13190886 13400379 13330805 13548995 13600357 13877283 14078621 14186412 14643741
2503 14643741 15057888 15426754 15693829 16308003 16593834 16760268 16915985 16910550 16503306 16209564
2493 16209564 16154530 16170976 15895891 15956451 15878800 16144188 16229456 16357408 16461303 16698784
2483 16698784 16873170 17336517 17632773 17951243 18607243 18404715 18432264 18481848 18217363 18096070
2473 18096070 18110807 18129615 17999177 17874921 17988867 18354536 18341738 18413781 18603287 19028207
2463 19028207 19252717 19645912 20179149 20769734 21085278 21677567 21870436 23052952 23343757
2454B3343757P93723M06193P08704M03338L75416L49916l86896m00242m29037
2445B5164872l92520l9084k20152K23053j00723K4205J19430Q1487J03628J76459
2435B5140655J87550M83568M59191K98750N67360K75436L63062K58194M25239
2426B8459005K28607J89022L99826K56298Q7119K31063j90879q551j91562J17293
2416B9577241k76834N5189j29720J77407j9819p0164L48906K99432J79584K70178
2406C0411400L78489L52728N25792M38858N57597M15453M49199P27171O04488
2397C4861175M54901J092580O12414J044033J185932J180184J413281J393948
2389D3238448J428171J296854J423498J459243J087715P24258M89901J86338l04796
$$ plain form
2454 23343757 24137480 24543673 25252377 25655715 26031131 26381047 25994151 25593909 25164872
2445 25164872 24772352 24733268 24513116 24736169 24635446 24659651 24779081 24860568 24964196 25140655
2435 25140655 25328205 25811773 26270964 26569714 27137074 27412510 27775572 28033766 28459005
2426 28459005 28687612 28876634 29276460 29532758 29619877 29850940 29660061 29651510 29459948 29577241
2416 29577241 29300407 29355596 29225876 29403283 29383464 29313300 29662206 29961638 30141222 30411400
2406 30411400 30789889 31142617 31668409 32107267 32664864 33080317 33529516 34256687 34861175
2397 34861175 35316076 36408656 37021070 38065103 39251035 40431219 41844500 43238448
2389 43238448 44666619 45963473 47386971 48846214 49933929 50658187 51148088 51334426 51029630
2380E1029630q16422j108526j358058j415169j564023j321103j467968j102043
2372D0876318j297006j004091j046454r22100j012788r21179n34712r28666n60701
2363C2648621o20483p25631m71503m85401n34166m16639l02415o34473m58935
2354B7998975l98745n96488j79539n80276p614m85241k77165k72193q4508r0705
2344B5026501l16856k09789m13637m2004l4636j52470k01885j60831K1206j39674
2334B3375925l77894L0089Q784k41541K907k73622k11388j56412j44000k5374
2324B1987474l33795j53221m41069q2625j60455k59697k31103l81147j09439o00778
2314A9234145N479l85422m40081j8835m31185k09714l65870l16005k06444m33559
$$ plain form
2380 51029630 50213208 49104682 47746624 46331455 44767432 43446329 41978361 40876318
2372 40876318 39579312 38575221 37528767 36606667 35593879 34672700 34137988 33209322 32648621
2363 32648621 32028138 31302507 30831004 30345603 29811437 29394798 29092383 28457910 27998975
2354 27998975 27600230 27003742 26824203 26243927 26236313 25751072 25473907 25201714 25117206 25026501
2344 25026501 24709645 24499856 24086219 24044215 24009579 23857109 23655224 23494393 23515599 23375925
2334 23375925 22998031 23028120 23036904 22795363 22798270 22524648 22313260 22156848 22012848 21987474
2324 21987474 21653679 21500458 21059389 20976764 20816309 20556612 20325509 19944362 19834923 19234145
2314 19234145 19239624 18854202 18414121 18395286 17964101 17754387 17388517 17072512 16866068 16432509
2304A6432509n44671j14813j48072l71342j2118m01142j44336l59904l3238k71503
2294A4031370j57398k52807j67459N188q703k53975j66990j36043k11852L6008
2284A2717339j37512j16462k63238l0095J5383q2718m51795R0856k29334p6971
2274A1435453k76285q4016j35920j75281j11181l10177l4652j24012l47494p7714
2264I758721K6921k03631n4943n45949j92657j95979R806o9159k13193j61714
2254H158223j97588j16000k47313J16402m18831n7492k71014J0494m8094k85228
2244F643559K15226l01628o6998l105k91479K894n1796N7266k19288j76655k28101
2233E579895L0404l1941N2116k02186j29985J1890K5701k10783O1961k51957L2595
$$ plain form
2304 16432509 15887838 15773025 15624953 15253611 15241493 14840351 14696015 14336111 14302873 14031370
2294 14031370 13873972 13621165 13453706 13458894 13450191 13196216 13029226 12893183 12681331 12717339
2284 12717339 12579827 12463365 12200127 12170032 12185415 12102697 11650902 11741758 11512424 11435453
2274 11435453 11159168 11075152 10939232 10763951 10652770 10342593 10307941 10183929 9836435 9758721
2264 9758721 9785642 9582011 9527068 8981119 8788462 8592483 8602289 8533130 8319937 8158223
2254 8158223 7960635 7844635 7597322 7713724 7294893 7237401 6966387 6976881 6928787 6643559
2244 6643559 6858785 6557157 6490159 6487054 6195575 6198469 6146673 6203939 5984651 5807996 5579895
2233 5579895 5610299 5578358 5630474 5428288 5298303 5310193 5335894 5125111 5187072 4935115 4967710
2222D967710k08195J83508j83399j65465P5879l5783L3720k67608J07625j60846
2212D347146J64033J1226j96759Q777n7675j33618j72527O8822j20659m3396o8768
2201C806602j75785J50967j22574Q4917l2092p905o7843p0403L8366j44325M2458
2190C502383J6723p1527J36973j00213J1886J1112O2201q850j30285K49941j46279
2179C534065j25164J63952r5922M2830r7129M1051K7809j97126l5493q8378P6155
2168C246650J35740j44179L9738J0777k9257j64020K16622j26157j32684J97192
2158C250422J11832j5518R280P9822q4309J31003o3967O8596p5202k8640N6179
2147C439498l9790O2040j72005J51741j42506j01381J08190J71461o4633K0684
$$ plain form
2222 4967710 4759515 4943023 4759624 4594159 4670038 4634255 4667975 4400367 4507992 4347146
2212 4347146 4511179 4522405 4325646 4334423 4276748 4143130 3970603 4039425 3918766 3875370 3806602
2201 3806602 3630817 3781784 3659210 3744127 3712035 3704130 3636287 3565884 3604250 3459925 3502383
2190 3502383 3519106 3447579 3584552 3484339 3496225 3507337 3569538 3560688 3430403 3680344 3534065
2179 3534065 3408901 3572853 3476931 3519761 3422632 3463683 3491492 3294366 3258873 3170495 3246650
2168 3246650 3382390 3238211 3277949 3288726 3259469 3095449 3312071 3185914 3053230 3250422
2158 3250422 3362254 3346736 3356016 3435838 3351529 3482532 3418565 3487161 3411959 3383319 3439498
2147 3439498 3399708 3461748 3289743 3441484 3298978 3197597 3305787 3477248 3412615 3433299
2137C433299o0979J27165L9949P1107j14415J7125K44593l09264M0831J84379
2127C673790K79792j30324o1718K15856p678J45944K2402k00709L60438p5973
2117D221820K876L99971k21578P5975O2502R721J33379J91417O5674R7966j40679
2106D899044J35127J3430N2904j36606K28320K62161j70157J98344Q3022R3395
2096E658984J90152k1451N0678M45031k6231K92845J46703o6J05747L57478q2711
2085G117159j58665J52316l9139k96026j05754l31912m2221q4062l15920K79679
2075F175455p3489R6774P9275k98916J62239L35370o7801J1571P7793j54357L17897
2064F661811p5546p7243l5124Q8122j08727r7075k69111j65135l0073j67801k1759
$$ plain form
2137 3433299 3372320 3499485 3539434 3610541 3496126 3513251 3757844 3448580 3489411 3673790
2127 3673790 3953582 3823258 3761540 3977396 3969718 4115662 4138064 3937355 4297793 4221820
2117 4221820 4224696 4624667 4403089 4479064 4541566 4551287 4684666 4876083 4941757 5039723 4899044
2106 4899044 5034171 5047601 5100505 4963899 5192219 5454380 5284223 5482567 5565589 5658984
2096 5658984 5849136 5827685 5878363 6323394 6297163 6590008 6736711 6736645 6842392 7199870 7117159
2085 7117159 6958494 7110810 7071671 6775645 6669891 6337979 6295758 6211696 5895776 6175455
2075 6175455 6101966 6198740 6278015 5979099 6141338 6476708 6408907 6420478 6498271 6343914 6661811
2064 6661811 6586265 6509022 6473898 6562020 6453293 6356218 6087107 5921972 5891899 5724098 5702339
2053E702339k66890l1348j66370k20213j23335N1569O0012k22312l4831k52314
2043D496307K4395o3947N551j52606j21820m2715k50957j51674j78746K21440
2033C785228l35444k03894J4487j28245m5783j22351J14856j85639l01655P1735
2023B663295j56801J06792k29183Q273N0478p6984J7989j97918K0151q7258j07269
2012B011565j46194Q7821j43693J59657q9860k37216J4047m0107N5583j27529
2002A544074j06398J5958K0326k0855r6966Q5730p1138K7194k39743J01575J73394
1991A433151p8621j90408r8560m6664m7029J65494J39812K6895p1184l14741K6983
1980I45128J69830r9691n4304n1496N1692k24935J31603k3943M2844N4199J35362
$$ plain form
2053 5702339 5435449 5404101 5237731 5017518 4894183 4945752 5005764 4783452 4748621 4496307
2043 4496307 4520702 4456755 4462306 4309700 4187880 4145165 3894208 3742534 3563788 3785228
2033 3785228 3449784 3245890 3260377 3132132 3086349 2963998 3078854 2893215 2591560 2663295
2023 2663295 2506494 2613286 2384103 2392376 2442854 2365870 2383859 2185941 2206092 2118834 2011565
2012 2011565 1865371 1953192 1809499 1969156 1879296 1642080 1656127 1616020 1671603 1544074
2002 1544074 1437676 1453634 1473960 1453105 1356139 1441869 1370731 1397925 1158182 1259757 1433151
1991 1433151 1354530 1164122 1065562 1018898 971869 1137363 1277175 1304070 1232886 918145 945128
1980 945128 1114958 1015267 960963 909467 961159 736224 867827 843884 886728 940927 1076289
1969A076289l46238j3128J99885k20012J68697q0885P3415j21810P473j24766
1959F18920k661J74333l39330N4929q2808J46250J88738j78687k6597j43773L57006
1948G66320k33165j1276M6040l7146j64455J81931j37156J4529Q5336O5913k56187
1937C20684J74932M9361m8140n9302n9977J22028L5354k72846J99243m2561j43389
1926B75387o0617K29264l38173L34331M4433j46376j52369K7685L71967j20503
1916D65029j22948o4093L737R8933j99082Q7656p0078N93J31544j45134N4510
1905B40667J25585m3340j39691n0736J54864n8804n8180O8034K2704Q865j33489
1894A36479J31262p4441j42277K28719n8720M595R4853j14124K0111j22907m0214
$$ plain form
1969 1076289 730051 716923 916808 696796 865493 784608 858023 736213 743686 618920
1959 618920 616259 790592 451262 506191 423383 569633 758371 579684 553087 409314 766320
1948 766320 533155 521879 567919 530773 366318 548249 411093 425622 510958 576871 320684
1937 320684 495616 544977 496837 437535 377558 499586 534940 262094 461337 418776 275387
1926 275387 214770 444034 105861 440192 484625 338249 185880 213565 585532 465029
1916 465029 342081 277988 281725 380658 181576 269232 199154 199747 331291 186157 240667
1905 240667 366252 322912 183221 132485 287349 228545 170365 238399 261103 269968 136479
1894 136479 267741 193300 51023 279742 221022 225617 320470 206346 226457 103550 63336
1883F3336J10659q4465J27930M6919j40465R4983q7823j11154J34823R1829J95955
1872D42527l46119p8590k7770J74419O2408r9170j15463P0438K8185L4190k95316
1861a50261L66969k08900K95451j72472L8994J2920j35860n0113q7523J08698
1851A7903P5700k36166K08156K49973M2295m16425O0342J04617j28779M0797J10675
1840A29088K7911M2137l15122J68872r6876o460J1117J10941L7589k15500P2153
1829c4150O4226m2931j713N8829N1034J54506j87996k9559n574L6931j96083L08268
1817A75788r9664N5166k40509K4351k1497J28428J5811l0337r5663K21379j33221
1806C2N9639l8888p1761J37822j03683J17101M2291j45155o7388o0037J30557
$$ plain form
1883 63336 173995 89530 217460 264379 123914 218897 131074 19920 154743 246572 442527
1872 442527 96408 17818 -9952 164467 226875 127705 12242 82680 110865 145055 -150261
1861 -150261 216708 7808 303259 130787 169781 182701 46841 -3272 -90795 17903
1851 17903 93603 -142563 65593 315566 357861 -58564 1778 106395 -22384 18413 129088
1840 129088 156999 199136 -115986 52886 -43990 -50450 -39333 71608 109197 -106303 -34150
1829 -34150 30076 -12855 -14568 44261 95295 249801 61805 32246 26672 63603 -132480 175788
1817 175788 76124 131290 -109219 -84868 -106365 22063 37874 7537 -88126 133253 32
1806 32 59671 20783 -50978 86844 -16839 100262 142553 -2602 -69990 -130027 530
1795E30j4322J55385j83559N5682k6037J36007j15619J1872m2053p5651J34002
1784C6237q1453J13448k00373L7545J56755j18103J02203q5383J53733j48936
1774c4327j36166R0687R378J13140p8085N3838J6593j69027J76320o0100K70312
1763B52563l13744K1905n9866j9209J94166j15794j29104J22536p0763O5996N447
1752d5867j89048J70887p9776L6392J08693j3764O9003k09919J66667j27750J99112
1741H4630k09726r5146L32895r9667L9954j09936N8376K0510k17124O4599Q4857
1730d5778j37504J4015M7276j7172Q3112k4107j81616J48339K9036k3038R0879
1719a6558j44308R0119o7257K1907J2058J1305J4786K927q6995q1929K80154j06950
$$ plain form
1795 530 -13792 141593 -41966 13716 -12321 123686 8067 19939 -22114 -97765 36237
1784 36237 -45216 68232 -132141 -94596 62159 -55944 46259 -39124 114609 -34327
1774 -34327 -170493 -79806 -70428 42712 -35373 18465 35058 -133969 42351 -17749 252563
1763 252563 -61181 -39276 -99142 -118351 75815 -39979 -169083 -46547 -117310 -51314 -45867
1752 -45867 -234915 -64028 -143804 -107412 1281 -12483 56520 -153399 13268 -114482 84630
1741 84630 -125096 -220242 112653 12986 52940 -56996 1380 21890 -195234 -130635 -45778
1730 -45778 -183282 -169267 -121991 -139163 -56051 -80158 -261774 -113435 -84399 -107437 -16558
1719 -16558 -160866 -70747 -138004 -116097 -104039 -92734 -77948 -75021 -162016 -243945 36209 -70741
1707g0741j61564J84496j22573J2092J11572k4630N0476j40328N9890N4122j33217
1696a80405l281J58409j64661O9200P7828J4672j88067M8517O1154N200j18653
1685b20087J51752M3181R5554j07667m6564n5376J24012k14028j297J07115R9156
1674b4249p2332k29736L46215p3031p7138M0203M1613L4410j45992L7103K7281
1663i5653J21543k16704K222J19569N567j05920p2098J58269o8634N0257M0784
1652f0798M7914O2836k2873k13520l6705J62738j14006K4462m544Q6617k8779
1641i6658j17874m1154O0251L2695O5687P4314m5394J00491L5833j01577j83415
1630b16801L9903N5695J22424Q9684j80397m8910J70630q3789O506J04743j24169
$$ plain form
1707 -70741 -232305 -47809 -170382 -158290 -46718 -71348 -20872 -161200 -101310 -47188 -180405
1696 -180405 -183686 -25277 -189938 -120738 -42910 -28238 -216305 -167788 -106634 -101434 -220087
1685 -220087 -68335 -25154 70400 -37267 -83831 -139207 -15195 -229223 -230520 -123405 -24249
1674 -24249 -96581 -326317 19898 -53133 -130271 -90068 -48455 -14045 -160037 -122934 -95653
1663 -95653 25890 -190814 -188592 -69023 -63456 -169376 -241474 -83205 -151839 -101582 -60798
1652 -60798 -12884 49952 27079 -186441 -223146 -60408 -174414 -149952 -154496 -67879 -96658
1641 -96658 -214532 -255686 -195435 -162740 -97053 -22739 -68133 32358 68191 -33386 -216801
1630 -216801 -176898 -121203 1221 90905 -89492 -138402 32228 -51561 -45055 59688 -64481
1619f4481p4053N0967m9902m6006J76352k12045K9964j96582L26853J2498N07
1608d5928K6413P6712j76977J14694J42855j70726m6051m4279q3982J79030j25716
1597a53955m0875J90098k70664Q1104K06124j57539N4590K2544J76656j69384
1587f1301O3965l9430M2543j70669Q803O1475j88660L75637j18181J151p8023
1576a02690j87778K42457N2456j00854K6219P977m9470q0769J84253j24110J17194
1565a5115j8469R4531L59o5753q7393l7100J52219o9189r3711K26624j47694Q9383
1553B8692p011l0851J6266L9894j71797L4671R928J61799j9089k3204j31754m326
1541i6782N7699Q549Q1149k62885K42338M817K6199j52228j49350K22285J83761
$$ plain form
1619 -64481 -138534 -87567 -137469 -183475 -7123 -219168 -189204 -385786 -58933 -46435 -45928
1608 -45928 -19515 57197 -119780 -5086 137769 -32957 -79008 -123287 -207269 -28239 -153955
1597 -153955 -194830 -4732 -275396 -194292 11832 -145707 -91117 -68573 108083 -61301
1587 -61301 2664 -36766 5777 -164892 -156089 -94614 -283274 92363 -25818 -24667 -102690
1576 -102690 -290468 -48011 4445 -96409 -70190 -62213 -111683 -192452 -8199 -132309 -15115
1565 -15115 -33584 60947 61306 -4447 -91840 -128940 23279 -45910 -139621 87003 -60691 28692
1553 28692 21681 -9170 7096 46990 -124807 -90136 -80208 81591 62502 39298 -92456 -96782
1541 -96782 -39083 -30534 50615 -212270 30068 34885 61084 -91144 -240494 -18209 165552
1530A65552j75438j53402L00843j41335N9396k77492K82224l0537j6285p8768
1520f5242J02978k38663J72048K47736j79548J00693n5419L5609j07507l8162
1510b5477M8691O750j76102K46510P0709j01339n5904Q1679n895k3335O2023j48137
1498a9827J86905r3476J588J20113J02127l97262J22727Q8555J64952j27653j679
1487A47070p1038J26974n8416j45618J09685J33531q0227K20422j77206p3970
1477A31207J99805o3330J73244l1437N6796j70693K62228p9031P2470j19359p097
1466D24803L02455J74064j39948j02271M22739P5423J8746J03869J26401L15290
1456A721571o2584K62543p11L83766L00268L83844K51503P45741K59719K08933
$$ plain form
1530 165552 -9886 -163288 137555 -3780 55616 -221876 60348 29811 13526 -65242
1520 -65242 37736 -200927 -28879 218857 39309 140002 84583 120192 12685 -25477
1510 -25477 23214 29964 -146138 100372 171081 69742 13838 95517 89622 66287 128310 -19827
1498 -19827 167078 73602 75190 195303 297430 -99832 22895 111450 276402 148749 147070
1487 147070 76032 203006 144590 -1028 108657 242188 161961 382383 205177 131207
1477 131207 331012 267682 440926 409489 466285 295592 557820 478789 551259 431900 424803
1466 424803 727258 901322 761374 659103 1081842 1157265 1176011 1279880 1406281 1721571
1456 1721571 1658987 1921530 1920819 2304585 2604853 2988697 3240200 3985941 4245660 4454593
1446D454593K51374O712j66770l08288n52619j08902m02094l43808k56195k18303
1436B355700j61544j34876k08979R2026k43191J36853j05133k41563L6828K0903
1426A547024j18950M1386j01088j19185K53370k41162J46492J54598r0749R2779
1416A564515J5172K25328m6279J74673J65911K26488P4152J45335M3358L95654
1406B984307K13323M99644N12865M8334O05953M74114N85440N09164P43612R18114
1396H094870J048028J492576K016818K471630J822533J493174J487588O94200
1388B0621417J61989j690892k556939k186637j971381j270818j256742q52166
1380H997831q61385q14495q14516n61823n08332l72183n46006j69730m77427k61872
$$ plain form
1446 4454593 4705967 4712679 4545909 4237621 3685002 3576100 3174006 2830198 2574003 2355700
1436 2355700 2194156 2059280 1850301 1942327 1699136 1835989 1730856 1489293 1526121 1547024
1426 1547024 1428074 1469460 1368372 1249187 1502557 1261395 1407887 1562485 1471736 1564515
1416 1564515 1579687 1805015 1758736 1933409 2099320 2325808 2399960 2545295 2588653 2984307
1406 2984307 3197630 3697274 4210139 4258473 4864426 5338540 5923980 6433144 7176756 8094870
1396 8094870 9142898 10635474 12652292 15123922 16946455 18439629 19927217 20621417
1388 20621417 20783406 19092514 16535575 14348938 12377557 11106739 9849997 8997831
1380 8997831 8136446 7321951 6507435 5945612 5437280 5065097 4519091 4349361 3871934 3610062
1370C610062o20639M7707l81194l1358j93740j50767m684k90440o3935k55229
1360A665783J6695m359j6932l0723l31959L735j59693N0852r0964N5639j82343
1349I75731J37534k56307k2739o3287Q479j15094R786K5106J40100k36273Q4608
1338F87644j77409J38666q8341j18790p1812K50838j10480n9557l1606P5832j20199
1327C74786p1439j5496N9756m3167J17278m7938L0251j75695K18001j43382L6266
1316C39221m2165K0385J0016J1425k37601J15599l8058O8442k1543N568O8551
1305B99840k51494r1K03876j1837j95906K27507q5340M6894p8906j51829J23783
1294A26497j3622P3849j46042Q4462r1111O2741M1493N9484J27k59440L17309
$$ plain form
1370 3610062 2989423 3037130 2655936 2624578 2430838 2280071 2275387 1984947 1921012 1665783
1360 1665783 1682478 1678119 1661187 1630464 1298505 1302240 1142547 1193399 1102435 1158074 975731
1349 975731 1113265 856958 834219 770932 779411 664317 674103 699209 839309 603036 687644
1338 687644 510235 648901 560560 441770 369958 620796 510316 450759 419153 494985 374786
1327 374786 303347 287851 347607 304440 421718 373780 404031 228336 446337 302955 339221
1316 339221 297056 317441 327457 338882 101281 216880 178822 247264 225721 231289 299840
1305 299840 48346 48255 252131 240294 44388 271895 186555 233449 154543 2714 126497
1294 126497 112875 186724 40682 125144 34033 96774 138267 197751 197878 -61562 255747
1283B55747j66952K046N9885N4609k25776K7622j34830L7925K36200j45236o7095
1272f5855J2194K23549j19393k6602o126J1710p3194J74709n4509j62803o7090
1261a53410Q0238J38016p4402l4879o9602J25453L8299q414R7723k14627L17597
1250B41992j83744n0894J9224P0113k27104m968J01914j508k04524o1329L55893
1239E5065k51019J20212P676N9550k20615k8501R1496Q4158k3904K78969m74722
1228c01635J79824j039Q3305J26825j94082J81785q4806m0315k1993p153J3849
1217f5435o4498N6068j25042N9278K29226j38917M475j65342J90858p0094q6164
1206a75587J52834m0338k0882j33842K36030j48594O8870o8303K65765j94664
$$ plain form
1283 255747 88795 90841 150726 205335 -20441 7181 -127649 -89724 146476 1240 -65855
1272 -65855 -53661 169888 50495 23893 17767 29477 -43717 130992 76483 -86320 -153410
1261 -153410 -73172 64844 -9558 -44437 -114039 11414 49713 41299 139022 -75605 241992
1250 241992 58248 7354 26578 96691 -130413 -135381 -33467 -34975 -239499 -300828 55065
1239 55065 -195954 -75742 -68066 -8516 -229131 -257632 -166136 -81978 -105882 173087 -301635
1228 -301635 -121811 -122850 -39545 87280 -106802 74983 -9823 -50138 -72131 -79284 -65435
1217 -65435 -129933 -73865 -198907 -139629 89597 -49320 -44845 -210187 -19329 -89423 -175587
1206 -175587 -22753 -63091 -83973 -217815 18215 -130379 -61509 -129812 135953 -58711
1196e8711j57993J15783J35466j30173j00154N2906J30886j96666K0366P484P0517
1185a10289N7630j52219P4715J50534l01710p6499K31422l8247o9514J48080k08925
1174b95022K12138j55474Q4531n1456J37750r7813P7746j62765Q2527K07105k66673
1163b27406J35728L7883N9374o9216R1106j09990J5031K18643J0914r4925K2356
1152H9498l4990K8079o6237n0026l3689J8692k2075K28366k64391K671O5404R9529
1140F0831j35323l585k07362J06165J59892l3303j70930Q5131o9733K0203J62435
1129b5579Q885p8107n2724J31289j48322Q5586J0912K9973j04603J3817M8916
1118g9957L119j93834M9140J507n414J7056J37278j59365J47764J01519p4507
$$ plain form
1196 -58711 -216704 -100921 34545 -95628 -195782 -142876 -11990 -208656 -188290 -180806 -110289
1185 -110289 -52659 -204878 -130163 20371 -281339 -357838 -126416 -164663 -234177 -86097 -295022
1174 -295022 -82884 -238358 -153827 -205283 -67533 -165346 -87600 -250365 -167838 39267 -227406
1163 -227406 -91678 -53795 5579 -63637 27469 -82521 -67490 151153 162067 67142 89498
1152 89498 54508 82587 16350 -33676 -67365 -48673 -70748 157618 -106773 -104102 -38698 60831
1140 60831 -74492 -78077 -285439 -179274 -19382 -52685 -223615 -138484 -208217 -188014 -25579
1129 -25579 -16694 -94801 -147525 -16236 -164558 -78972 -68060 -38087 -142690 -128873 -79957
1118 -79957 -76838 -270672 -221532 -220025 -225439 -208383 -71105 -230470 -82706 18813 -55694
1107e5694k06741K08570l5774q0337q8841J12847J64368j80345k3911J7425K06348
1096C7915k0318k28679J46876j73171J22529O4128k51478J08820K8293q4550J05860
1085a43775L3645n9512P0892L4348j1620j96429K29498k1696p1687j59849J65478
1074a30707n9107n6699J11247j52331K34335N8336r3356n8371O5281K2280N710
1063e3382j9669p4792Q4731n6337N6841m6622M316N8377M5227j25231n7544j65263
1051c49348L49456k9812j40928p7948K147K65575l4916o7800q8806L1764O0221
1040h0395m132O3160r1014l618L3307o9584J9880j7243j55749P7763R3436N0286
1028h3903j00299J48963j32493j1401O9604l923K3463n8108j28177Q6551P3473
$$ plain form
1107 -55694 -262435 -53865 -89639 -169976 -258817 -145970 18398 -161947 -185858 -168433 37915
1096 37915 17597 -211082 -64206 -237377 -114848 -50720 -302198 -193378 -165085 -249635 -143775
1085 -143775 -110130 -169642 -98750 -64402 -76022 -272451 -42953 -64649 -136336 -296185 -130707
1074 -130707 -189814 -246513 -135266 -287597 -53262 5074 -88282 -146653 -81372 -59092 -53382
1063 -53382 -73051 -147843 -63112 -119449 -62608 -109230 -104914 -46537 -1310 -126541 -184085 -349348
1051 -349348 108 -29704 -170632 -248580 -246433 19142 -15774 -83574 -172380 -140616 -80395
1040 -80395 -84527 -21367 -112381 -115999 -82692 -152276 -132396 -149639 -305388 -227625 -134189 -83903
1028 -83903 -184202 -35239 -167732 -179133 -109529 -113452 -89989 -148097 -276274 -189723 -116250
1017a16250o744M1184J43843q8114l9140M6524J3191J472l6818p7148j4238K00006
1005F7768j08827k02110J28467L2932j51142J22390k23022K02493j71024R2513
995b09562j75209K16825J65547Q4857j85193j79190J03117k7358j9993L3989K14420
984B2250j81420J56200j85651M7766k6323O3140M0917p0282j35401K58775J8858
973H829j79906M9904n0386K0743J35437o5647J34772r7260M0448j13494j57550
962b74110L45001j30096j07106L00365k24773P0114j91145J20437K8552j43981
952b06742L57724k02830J29733p1180J1309k75170J55754j42369J20009N8991
942f4771p8026M9856n320J43103j29847K0245M1483k6616k08823K253J83353p7115
$$ plain form
1017 -116250 -122994 -81810 62033 -26081 -65221 -18697 -5506 -4034 -40852 -118000 -132238 67768
1005 67768 -41059 -243169 -114702 -81770 -232912 -110522 -333544 -131051 -302075 -209562
995 -209562 -384771 -167946 -2399 82458 -102735 -281925 -178808 -206166 -226159 -192170 22250
984 22250 -159170 -2970 -188621 -140855 -167178 -104038 -63121 -133403 -268804 -10029 8829
973 8829 -171077 -121173 -171559 -150816 -15379 -81026 53746 -43514 -3066 -116560 -274110
962 -274110 70891 -59205 -166311 134054 -90719 -20605 -211750 -91313 -62761 -206742
952 -206742 150982 -51848 77885 6705 18014 -257156 -101402 -243771 -123762 -64771
942 -64771 -142797 -92941 -98261 44842 -85005 -64760 -23277 -49893 -258716 -256463 -73110 -150225
930a50225M9409l6419r0939K6672N7768K4859m5458P6883j13661J86509l70737
919c85339L06179k2099k3154K05316j84385k386N0818o1421L9778j67731N219
908b39205J84599m3564J43718p0818P5783j27200R2074j62035J20344j29060J69471
897A4107j32669n8710k0225J73076O9697l4355p9985j11775J54785j08352j24141
886b58547k5764J32252p2698J8143P6158j9041O6594j2138J240M8535j37681J5934
874a67013K607J47866j75326O4990j2260r9947K38523m6134j98632J31896N1926
863f1504J18608j30911K1531m8642j54997Q9421N1814o7916J38409j28216N0093
852a22310K1285J27035o6686P124n0024r7946J30859j67774K05124o9993Q2434
$$ plain form
930 -150225 -100816 -137235 -228174 -201502 -143734 -118875 -164333 -87450 -201111 -14602 -385339
919 -385339 -79160 -101259 -124413 80903 -103482 -105868 -55050 -116471 -76693 -244424 -239205
908 -239205 -54606 -98170 45548 -25270 50513 -76687 15387 -146648 -26304 -155364 14107
897 14107 -118562 -177272 -197497 -24421 45276 10921 -69064 -180839 -26054 -134406 -258547
886 -258547 -284311 -152059 -224757 -206614 -130456 -149497 -82903 -95041 -93801 -45266 -182947 -167013
874 -167013 -164406 -16540 -191866 -126876 -139136 -239083 -560 -46694 -245326 -113430 -61504
863 -61504 57104 -73807 -52276 -100918 -255915 -166494 -114680 -182596 -44187 -172403 -122310
852 -122310 -101025 26010 -40676 -33552 -83576 -181522 -50663 -218437 -13313 -83306 -872
841h72j5932J35841M4263j41491l8650k57360K13127J8355j3688J03454j51517
830a04470p1849Q683N3224K6763M0036Q4950r7289j61667K3347N5771J08615J71842
818A37956j48296n010o3983J40870k17210J20351o2684N9111O5605q7068M8134
807a2224m9010p9041R2250o3421K87815k27613p65j63678K40408j6192R028Q8417
795A05974j88525J77428r7202P0701j46970J30070k49210J10608K52595k11438
785d5969j92804J71172L0711o9801M530o316n8785O915n077M1614Q8798k24645
773b59657J89236j63844M5019J7355J35555o239J71374k60880J939K12958j36197
762e3381J3251L7780j22894J48856k58758J33354J39121r3218K51586k22801l7231
$$ plain form
841 -872 -16804 119037 163300 21809 -16841 -274201 -61074 -42719 -56407 47047 -104470
830 -104470 -176319 -167636 -114412 -87649 -47613 37337 -59952 -221619 -198272 -142501 -33886 137956
818 137956 -10340 -15350 -79333 61537 -155673 -35322 -98006 -38895 26710 -60358 -12224
807 -12224 -61234 -140275 -48025 -111446 176369 -51244 -52009 -215687 24721 8529 17557 105974
795 105974 -82551 94877 -2325 68376 -78594 51476 -197734 -87126 165469 -45969
785 -45969 -238773 -67601 -36890 -106691 -102161 -108477 -167262 -160347 -165424 -123810 -35012 -259657
773 -259657 -70421 -234265 -189246 -171891 -36336 -42575 128799 -132081 -130142 82816 -53381
762 -53381 -40130 -2350 -125244 23612 -235146 -101792 37329 -55889 195697 -27104 -64335
751f4335Q263j39066K75171j22758o4004J2935J00015p7983J55292k06017L54524
740B32037l44461m5600J59636J5025J19094j91053m8609R4604n7914k1758P634
729h1365J77457k05361j29653J10391P2428k9824j2193J28799M9448k28100J74402
718B6429r2400O0283J7029K4051p0201j18557K02916q8622N9199l24432L26659
707B2354M531Q482M1176O866l97790L10623l1048j4725L8031j5413p3914J18725
695A7898N299k19283K12331J784Q6870J1433O4272k51413Q6306J12532k65377
684a37348R6434N7135K3954M2828j62090J39577j94825J15086k7730J36900j05330
673a5409P6458j14387O4035K1883j49266K33177p4777k29447J28291j47271P8899
$$ plain form
751 -64335 -56072 -195138 80033 -42725 -106729 -93794 6221 -71762 83530 -122487 232037
740 232037 -112424 -158024 1612 16637 135731 -55322 -103931 -9327 -67241 -88999 -81365
729 -81365 96092 -109269 -238922 -128531 -56103 -85927 -98120 30679 80127 -147973 26429
718 26429 -65971 -5688 11341 35392 -34809 -153366 49550 -39072 20127 -304305 22354
707 22354 26885 35367 76543 83409 -314381 -3758 -34806 -49531 -11500 -26913 -100827 17898
695 17898 23197 -196086 16245 18029 104899 116332 180604 -70809 15497 128029 -137348
684 -137348 -40914 16221 40175 83003 -79087 60490 -134335 -19249 -46979 89921 -15409
673 -15409 61049 -53338 10697 32580 -116686 116491 41714 -187733 -59442 -206713 -127814
662a27814r9403N7364J79603O3385j9612O1620k31872J64542j40135j6585P341
651a01566L0452J38753l3934N4573p9518M2870l8303m8994R8928N485k05576Q0497
639e6333J35207j22334q2794J65881M1729k04687M3560L28567j02128j19930q8641
628f1903q2779L04002j57788J25072q9457j02052J16853q1649o9720L46481k77569
617c0509l6002J64672j45147P1222J44328m3276j54176J63626k42626K4604K14832
606A31548j46402J51157k52224Q5294M3889j41587K09597q7350L7052j35283J03051
595a258j45238j2626K14158k04805O8381J19846j6106q414J3576O0403k44564
584a56647J86543r4961O3438N3843K3523p4241N0021J20490j48686l7336J9526
$$ plain form
662 -127814 -227217 -169853 9750 73135 53523 115143 -116729 47813 -92322 -108907 -101566
651 -101566 -71114 67639 33705 88278 8760 51630 13327 -35667 63261 68746 -136830 -56333
639 -56333 78874 -43460 -126254 39627 81356 -123331 -79771 248796 146668 26738 -61903
628 -61903 -144682 159320 1532 126604 37147 -64905 51948 -29701 -99421 247060 -30509
617 -30509 -66511 98161 -46986 24236 168564 125288 -28888 134738 -107888 -83284 131548
606 131548 -14854 136303 -115921 -30627 13262 -128325 81272 -6078 30974 -104309 -1258
595 -1258 -146496 -159122 55036 -149769 -81388 38458 22352 13938 27514 87917 -156647
584 -156647 29896 -65065 -1627 52216 75739 1498 51519 172009 23323 -14013 5513
573E513q8066N0696P8152M1376o7865K4305k51847J93307k2031m005O4733j8951
561E317l0158q4631J53533J01901j94801J0829J16884J32015k24875j6863Q3245
550E2396k6586R7473k40601K93325r7183l4279r4877K5121J28208p5505j0229
$$ plain form
573 5513 -82553 -31857 46295 87671 19806 44111 -207736 -14429 -36460 -40465 24268 5317
561 5317 -24841 -109472 44061 145962 -48839 -38010 78874 210889 -13986 -30849 52396
550 52396 25810 123283 -117318 176007 78824 44545 -50332 -25211 102997 27492 17263
$$ [...]
##END NTUPLES=NMR SPECTRUM
##END=
