##TITLE=abcd
##JCAMPDX= 6.0         $$ Bruker NMR JCAMP-DX V2.0
##DATA TYPE= NMR SPECTRUM
##DATA CLASS= NTUPLES
##ORIGIN= UXNMR, Bruker Analytische Messtechnik GmbH
##OWNER= root
$$ XWIN-NMR		Version 3.5
$$ Thu Jul  2 19:28:22 2026 Russian Standard Time (UT+4h)  servis@DPX200
##.OBSERVE FREQUENCY= 200.131235884673
##.OBSERVE NUCLEUS= ^1H
##.ACQUISITION MODE= SIMULTANEOUS
##.ACQUISITION SCHEME= undefined
##.AVERAGES= 32
##.DIGITISER RES= 18
##SPECTROMETER/DATA SYSTEM= spect
##.PULSE SEQUENCE= zg
##.SOLVENT NAME= CDCl3
##.SHIFT REFERENCE= (INTERNAL, CDCl3, 0, 16.4885)
##AUDIT TRAIL= $$ (NUMBER, WHEN, WHO, WHERE, WHAT)
$$ ##TITLE= Audit trail, XWIN-NMR		Version 3.5
$$ ##JCAMPDX= 5.01
$$ ##ORIGIN= Bruker BioSpin GmbH
$$ ##OWNER= servis
$$ F:\spectra/data/av/nmr/H1/1/pdata/1/auditp.txt
$$ ##AUDIT TRAIL=  $$ (NUMBER, WHEN, WHO, WHERE, WHAT)
(   1,<2026-07-02 19:26:04.92 +0400>,<servis>,<DPX200>,
      <created by zg, POWCHK disabled, PULCHK disabled
       configuration hash MD5:
       00 E9 B6 7A A2 85 ED C7 34 08 36 98 17 FE 4E 26
       data hash MD5: 32K
       4F C6 85 AD 32 89 D5 58 13 F2 CE 0E 79 54 A1 4A>)
(   2,<2026-07-02 19:27:57.81 +0400>,<servis>,<DPX200>,
      <Start of raw data processing
       efp BC_mod = 2 LB = 0.05 FT_mod = 6 PKNL = 1 PHC0 = -415.99 PHC1 = 3.101563 SI = 16K 
       data hash MD5: 16K
       C3 3F 10 2A EE 1C 0F E1 6F 97 25 28 39 39 C4 C7>)
$$ ##END=
$$ 
$$ hash MD5
$$ D4 6E 8F 1F F5 C1 4D B2 B5 3D 79 79 0B AD 3F EC
##$RELAX= 
##$RELAX= 
##$RELAX= 
##$RELAX= 
##$RELAX= 
##$RELAX= 
##$RELAX= 
##$RELAX= 
$$ Bruker specific parameters
$$ --------------------------
##$DU= <F:\spectra>
##$EXPNO= 1
##$NAME= <H1>
##$PROCNO= 1
##$TYPE= <nmr>
##$USER= <av>
##$AMP= (0..31)
100 100 100 100 100 100 100 100 100 100 100 100 100 100 100 100 100 100 
100 100 100 100 100 100 100 100 100 100 100 100 100 100 
##$AQSEQ= 0
##$AQ_mod= 1
##$AUNM= <au_zg>
##$AUTOPOS= <>
##$BF1= 200.13
##$BF2= 200.13
##$BF3= 200.13
##$BF4= 200.13
##$BF5= 500.13
##$BF6= 500.13
##$BF7= 500.13
##$BF8= 500.13
##$BYTORDA= 1
##$CFDGTYP= 0
##$CFRGTYP= 5
##$CHEMSTR= <none>
##$CNST= (0..31)
1 1 145 1 1 1 1 1 1 1 1 1 1 1 1 1 1 1 1 1 1 1 1 1 1 1 1 1 1 1 1 1 
##$CPDPRG= <>
##$CPDPRG1= <>
##$CPDPRG2= <>
##$CPDPRG3= <>
##$CPDPRG4= <mlev>
##$CPDPRG5= <mlev>
##$CPDPRG6= <mlev>
##$CPDPRG7= <mlev>
##$CPDPRG8= <mlev>
##$CPDPRGB= <>
##$CPDPRGT= <>
##$D= (0..31)
0 2 0 0 0 0 0 0 0 0.06 0 0 0 0 0 0 0.0002 0 0 0 0 0 0 0 0 0 0 0 0 0 0 
0 
##$DATE= 1783005964
##$DBL= (0..7)
120 120 120 120 120 120 120 120 
##$DBP= (0..7)
150 150 150 150 150 150 150 150 
##$DBP07= 0
##$DBPNAM0= <>
##$DBPNAM1= <>
##$DBPNAM2= <>
##$DBPNAM3= <>
##$DBPNAM4= <>
##$DBPNAM5= <>
##$DBPNAM6= <>
##$DBPNAM7= <>
##$DBPOAL= (0..7)
0.5 0.5 0.5 0.5 0.5 0.5 0.5 0.5 
##$DBPOFFS= (0..7)
0 0 0 0 0 0 0 0 
##$DE= 6
##$DECBNUC= <off>
##$DECIM= 32
##$DECNUC= <off>
##$DECSTAT= 4
##$DIGMOD= 1
##$DIGTYP= 9
##$DL= (0..7)
0 120 120 120 120 120 120 120 
##$DP= (0..7)
150 150 150 150 150 150 150 150 
##$DP07= 0
##$DPNAME0= <>
$$ [...]
##$SUBNAM4= <"">
##$SUBNAM5= <"">
##$SUBNAM6= <"">
##$SUBNAM7= <"">
##$SUBNAM8= <"">
##$SUBNAM9= <"">
##$SW= 20.6817932712277
##$SWIBOX= (0..15)
0 0 3 0 0 0 0 0 0 0 0 0 0 0 0 0 
##$SW_h= 4139.07284768212
##$TD= 32768
##$TD0= 1
##$TE= 0
##$TE2= 300
##$TE3= 300
##$TEG= 300
##$TL= (0..7)
0 120 120 120 120 120 120 120 
##$TP= (0..7)
150 150 150 150 150 150 150 150 
##$TP07= 0
##$TPNAME0= <>
##$TPNAME1= <>
##$TPNAME2= <>
##$TPNAME3= <>
##$TPNAME4= <>
##$TPNAME5= <>
##$TPNAME6= <>
##$TPNAME7= <>
##$TPOAL= (0..7)
0.5 0.5 0.5 0.5 0.5 0.5 0.5 0.5 
##$TPOFFS= (0..7)
0 0 0 0 0 0 0 0 
##$TUNHIN= 0
##$TUNHOUT= 0
##$TUNXOUT= 0
##$USERA1= <user>
##$USERA2= <user>
##$USERA3= <user>
##$USERA4= <user>
##$USERA5= <user>
##$V9= 5
##$VALIST= <valist>
##$VCLIST= <CCCCCCCCCCCCCCC>
##$VD= 0
##$VDLIST= <DDDDDDDDDDDDDDD>
##$VPLIST= <PPPPPPPPPPPPPPP>
##$VTLIST= <TTTTTTTTTTTTTTT>
##$WBST= 1024
##$WBSW= 30
##$XGAIN= (0..3)
0 0 0 0 
##$XL= 0
##$YL= 0
##$YMAX_a= 232194
##$YMIN_a= -502951
##$ZGOPTNS= <>
##$ZL1= 120
##$ZL2= 120
##$ZL3= 120
##$ZL4= 120
##$ABSF1= 0
##$ABSF2= 0
##$ABSG= 0
##$ABSL= 0
##$ALPHA= 0
##$AQORDER= 0
##$ASSFAC= 0
##$ASSFACI= 0
##$ASSFACX= 0
##$ASSWID= 0
##$AUNMP= <proc_1d>
##$AZFE= 0.1
##$AZFW= 0.1
##$BCFW= 0
##$BC_mod= 2
##$BYTORDP= 0
##$COROFFS= 0
##$CY= 18.4799938201904
##$DATMOD= 1
##$DC= 0
##$DFILT= <>
##$DTYPP= 0
##$F1P= 9.9274215381318
##$F2P= -0.165520771350173
##$FCOR= 1
##$FTSIZE= 16384
##$FT_mod= 6
##$GAMMA= 0
##$GB= 0
##$INTBC= 1
##$INTSCL= 4.127829e-11
##$ISEN= 128
##$LB= 0.05
##$LEV0= 0
##$LPBIN= 0
##$MAXI= 10000
##$MC2= 0
##$MEAN= 0
##$ME_mod= 0
##$MI= 50
##$NCOEF= 0
##$NC_proc= -7
##$NLEV= 6
##$NOISF1= 3.799351
##$NOISF2= 2.8
##$NSP= 0
##$NTH_PI= 0
##$NZP= 0
##$OFFSET= 16.48848
##$PC= 4
##$PHC0= -415.99
##$PHC1= 3.101563
##$PH_mod= 1
##$PKNL= yes
##$PPARMOD= 0
##$PSCAL= 4
##$PSIGN= 0
##$REVERSE= no
##$SF= 200.130005582386
##$SI= 16384
##$SIGF1= 3
##$SIGF2= 2
##$SINO= 400
##$SIOLD= 16384
##$SREGLST= <1H.CDCl3>
##$SSB= 0
##$STSI= 16384
##$STSR= 0
##$SW_p= 4139.07284768211
##$SYMM= 0
##$S_DEV= 0
##$TDeff= 32768
##$TDoff= 0
##$TI= <>
##$TILT= no
##$TM1= 0
##$TM2= 0
##$TOPLEV= 0
##$USERP1= <user>
##$USERP2= <user>
##$USERP3= <user>
##$USERP4= <user>
##$USERP5= <user>
##$WDW= 1
##$XDIM= 16384
##$YMAX_p= 366114032
##$YMIN_p= -1945216
$$ End of Bruker specific parameters
$$ ---------------------------------
##NTUPLES= NMR SPECTRUM
##VAR_NAME=  FREQUENCY,     SPECTRUM/REAL,   SPECTRUM/IMAG
##SYMBOL=    X,             R,               I
##VAR_TYPE=  INDEPENDENT,   DEPENDENT,       DEPENDENT
##VAR_FORM=  AFFN,          ASDF,            ASDF
##VAR_DIM=   16384,         16384,           16384
##UNITS=     HZ,            ARBITRARY UNITS, ARBITRARY UNITS
##FACTOR=    0.252644378177508, 1,           1
##FIRST=     3299.83951724647, 0,            0
##LAST=      -839.233330435636, 0,           0
##MIN=       -839.233330435636, -1945216,    0
##MAX=       3299.83951724647, 366114032,    0
$$ Real data points
##PAGE= N=1
##DATA TABLE= (X++(R..R)), XYDATA
$$ [...]
6977D6360656j226416k42871n62839L97886N02260J359422J192768J186325P59638
6968D9726829M86717p6739j292473o61068j465245j257360j635487j481725j173201
6959D1170248m01188j7084p75402k29034N09900N18249O27248k07083L18394K96355
6949D1810603l01115j027284j339861j367874j210775j490039j268386q05349
6941C2999920j079937n17949o59295p63879o39762l90668o02988r6242j65064
6932B8084136m3724o21860r6424j58429K28069l25447O89046n24732L06599n9086
6922B7478148K97557k04186O8536l89182k07459l78855J93828m76216o0885n4642
6912B6266644k56795n74308J23221n09895n47430k599K96224j72452O8157Q4797
$$ plain form
6977 46360656 45134240 44891369 44328530 44726416 45228676 46588098 47780866 48967191 49726829
6968 49726829 50213546 50136807 48844334 48183266 46718021 45460661 43825174 42343449 41170248
6959 41170248 40769060 40751976 39976574 39747540 40257440 40775689 41402937 41195854 41514248 41810603
6949 41810603 41509488 40482204 39142343 37774469 36563694 35073655 33805269 32999920
6941 32999920 31919983 31402034 30742739 29978860 29339098 28948430 28345442 28249200 28084136
6932 28084136 28040412 27418552 27322128 27163699 27391768 27066321 27755367 27230635 27537234 27478148
6922 27478148 27775705 27571519 27640055 27250873 27043414 26664559 26858387 26382171 26321286 26266644
6912 26266644 26009849 25435541 25558762 25048867 24501437 24498838 24795062 24622610 24690767 24775564
6902B4775564O24318J64312R77189N20209R3666K37825K20842O1487k71349L80030
6892B7784093P66936Q60421N32134J002946M37420j07298l64814n25687j196908
6883B9189243n71725j72209j017374l15243o67783Q4777k00954r39030n46670
6874B4843032n11108k39910p90615J70440l33399Q7246m69719M07205P39141l027
6864B3899286o6294q16567L83033m86626N76633j19217L8699K81805N09324L99156
6854B4599232M61779R51466r8986j91167P37714j83361R01074J56446M50408o117
6844B7778488m72308J49051N21517P29133k91626l3936k63265l36782p44111j693195
6834B5342966o27874j279136r07423q35914o16820r52442R1558l74399L6781N27885
$$ plain form
6902 24775564 25399882 25564194 26541383 27061592 27155258 27393083 27613925 27675412 27404063 27784093
6892 27784093 28551029 29411450 29943584 30946530 31383950 31276652 30911838 30386151 29189243
6883 29189243 28617518 28445309 27427935 27112692 26444909 26529686 26328732 25389702 24843032
6874 24843032 24331924 24092014 23301399 23471839 23138440 23225686 22755967 23163172 23902313 23899286
6864 23899286 23832992 23016425 23399458 22912832 23489465 23370248 23408947 23690752 24200076 24599232
6854 24599232 25061011 26012477 25913491 25722324 26460038 26276677 27177751 27334197 27784605 27778488
6844 27778488 27306180 27455231 27976748 28705881 28414255 28380319 28117054 27780272 27036161 25342966
6834 25342966 24715092 23435956 22528533 21692619 21075799 20123357 20214915 19840516 19877297 20405182
6824B0405182J94588O83703L82846R22648N03814R54849N85597P09162N92576
6815B5934965R79831J462653K219713J840041J306108J199099J90590J55730o27037
6806C4661693j308555n69296j121891j596719j334861j988093j178631j711409
6798B3852238j066520j462586p48090j56127p09776K90194l32861M01288J007918
6789B1075678m65052K6892J35680P14868M47680M15338K71700J227266J052372
6780B4902422J630411J340876N86895M11091J7480m37443p04906j111885o64226
6771B5970715j771933r38204j398106j486947q49537j183788n75018p92083o89545
6762A6285554k20467l60897l03694o48029L483j40750K94817m17297l66312R4769
$$ plain form
6824 20405182 20599770 21283473 21666319 22588967 23092781 24047630 24633227 25342389 25934965
6815 25934965 26914796 28377449 30597162 32437203 33743311 34942410 35133000 35288730 34661693
6806 34661693 33353138 32783842 31661951 30065232 28730371 26742278 25563647 23852238
6798 23852238 22785718 21323132 20575042 20418915 19709139 19999333 19666472 20067760 21075678
6789 21075678 20610626 20637518 20773198 21488066 21935746 22351084 22622784 23850050 24902422
6780 24902422 26532833 27873709 28460604 28871695 28889175 28451732 27746826 26634941 25970715
6771 25970715 24198782 23260578 21862472 20375525 19525988 18342200 17767182 16975099 16285554
6762 16285554 16065087 15704190 15400496 14752467 14755950 14615200 14910017 14492720 14126408 14221177
6752A4221177j46343k6134n6989J58118j29336j40804j35912K53539L38872j00785
6742A4235403J48690L8502M99544N07903K1564K36745O2218m30568k86784k64885
6732A4768332o50180L61394n79103r2273N1783J81054n32911J67350K92139l35133
6722A3632452L68705j27640J12365k26654M85682l34387K11634J62920j56765
6713A4128312M48531K98974P52885J7783K14923N95492K72702O4776m418K28866
6703A7018826k9398N90891l4604J11914j69136K01095K12207k2329q0794L35833
6693A8134505j59367n0580P81731m65531K56895N00056j48120k06809L35754N9131
6683A9037665k01959N09933k62099o2834k2342N17280P01281l95829K70782M69851
$$ plain form
6752 14221177 14074834 14048700 13991711 14149829 14020493 13879689 13743777 13997316 14336188 14235403
6742 14235403 14384093 14422595 14922139 15430042 15451606 15688351 15750569 15320001 15033217 14768332
6732 14768332 14118152 14479546 13900443 13808170 13859953 14041007 13508096 13675446 13967585 13632452
6722 13632452 14001157 13873517 13985882 13759228 14244910 13910523 14122157 14285077 14128312
6713 14128312 14576843 14875817 15628702 15646485 15861408 16456900 16729602 16794378 16789960 17018826
6703 17018826 16989428 17580319 17545715 17657629 17488493 17689588 17901795 17879466 17798672 18134505
6693 18134505 17975138 17924558 18706289 18240758 18497653 18997709 18849589 18642780 18978534 19037665
6683 19037665 18835706 19345639 19083540 19020706 18998364 19515644 20216925 19821096 20091878 20561729
6673B0561729O92681l55424M20961k17906P81249m83403l65002J33812Q9778k47082
6663B1011393k19124L08058n12297K2788L72038L13806l54634O13795J51986Q6119
6653B1793928P2298m9973L00114m4058J031167K87529K30360P32621J19625N1353
6643B4524964N74542j30415n57320n5114n49095r92833j31819m47002m9552l69711
6633B1816645L85509J55586O34444R05243Q17210N79138R62606m16715l63435
6624B5476231j236805j149065o92229o21590r19095r61612k90348q93758K51279
6615A8963008k82667M82467N51174J09580k89786p2973M1934M0982p43827J05977
6605A8905869o36300J95417l76758J40119L1400J44839K40481K83095O10317Q34158
$$ plain form
6673 20561729 21254410 20898986 21319947 21102041 21883290 21399887 21034885 21168697 21258475 21011393
6663 21011393 20792269 21100327 20588030 20610818 20982856 21296662 20942028 21555823 21707809 21793928
6653 21793928 21866226 21816253 22116367 22072309 23103476 23391005 23621365 24353986 24473611 24524964
6643 24524964 25099506 24969091 24411771 24356657 23807562 22814729 22682910 22235908 22186356 21816645
6633 21816645 22202154 22357740 22992184 23897427 24714637 25293775 26256381 25839666 25476231
6624 25476231 24239426 23090361 22398132 21776542 20857447 19895835 19605487 18711729 18963008
6615 18963008 18680341 19162808 19713982 19823562 19533776 19460803 19502737 19543719 18799892 18905869
6605 18905869 18269569 18464986 18088228 18228347 18259747 18404586 18645067 18928162 19538479 20372637
6595B0372637R9803L22572O76198j13816n8794l5730j56637j1287n10418k38640
6585B0345888k74144l16136k46955O28256j07408O55812m95304J06641j45340
6576B0151310j337528k26350j150798L98278k19950m88191p03652N1951O17050
6567A7092120n33011N82275J92572J70593N19052l45298m27676P0287l58043m55225
6557A6507646n21848J91793j75476K41716o08842j36729J15176r7606Q44292N59344
6547A6919466K23312K09960K05805O68448m07579J85764P7911p39340K23624m27636
6537A7139735M02698k68781M94169q10955P5324O94642J81416J37900M80074j61519
6527A8364703K86376R3654m70959M40537q15899q59083m10210k01612m77475o55873
$$ plain form
6595 20372637 20472440 20795012 21471210 21357394 21298600 21262870 21106233 21094946 20584528 20345888
6585 20345888 20071744 19755608 19508653 20136909 20029501 20685313 20190009 20296650 20151310
6576 20151310 18813782 18587432 17436634 17834912 17614962 17126771 16423119 16475070 17092120
6567 17092120 16559109 17141384 17333956 17504549 18023601 17678303 17250627 17320914 16962871 16507646
6557 16507646 15985798 16177591 16002115 16243831 15634989 15498260 15613436 15515830 16360122 16919466
6547 16919466 17142778 17352738 17558543 18226991 17819412 18005176 18083087 17343747 17567371 17139735
6537 17139735 17542433 17273652 17767821 16956866 17032190 17726832 17908248 18046148 18526222 18364703
6527 18364703 18651079 18744733 18273774 18714311 17898412 17039329 16629119 16427507 15950032 15294159
6517A5294159k69565r07696k78394j89379K7975j63775j20648L29159j92333N3936
6507A3583439k11686K73656m07691m63634m1145l45626m10953k28170m21197J08488
6497A1435481q42825M24539j01052j47359l0101J49992k51746r5773K43652M63612
6487A1248420M02147K83283N09356J17006p1736J92390l62492m92706o13035j97236
6477A1015397m27835k74269l59380k4916k28215q8186k80429k72784L26489q6924
6467I298948l65823J25008J67196K94637n53900j46935M51227K13014m0651j01007
6457I341714L34753r1399J6866O49697j97662Q7228R8835J71252K278J99688k88844
6446A0324406L79670m93499j12639R0445J81622J9833n50450m724O47653J77018
$$ plain form
6517 15294159 15024594 14116898 13838504 13649125 13677100 13513325 13392677 13721836 13529503 13583439
6507 13583439 13371753 13645409 13237718 12774084 12732939 12387313 11976360 11748190 11326993 11435481
6497 11435481 10592656 11017195 10916143 10768784 10738683 10888675 10636929 10541156 10784808 11248420
6487 11248420 11650567 11933850 12443206 12560212 12488476 12680866 12318374 11825668 11212633 11015397
6477 11015397 10587562 10313293 9953913 9928997 9700782 9612596 9332167 9059383 9385872 9298948
6467 9298948 8933125 9058133 9225329 9519966 8966066 8819131 9270358 9483372 9442721 9341714
6457 9341714 9676467 9585068 9601934 10251631 10053969 10141197 10240032 10411284 10413562 10613250 10324406
6446 10324406 10704076 10210577 10097938 10188383 10370005 10389838 9839388 9834664 10482317 10659335
6436A0659335J79691P27547M36286K04550L06821O92607O54684r2810r2181m1787
6426A3634743J18194l067n12998k08151o3611l33162m78599M91459l8957j90681
6416A2415170L9202j01549M52436m18488K00817p59553Q94126o08974O29848O78318
6406A3421353k38752j28830J56580J2415J26186J45869J88165L87864m20967m88380
6396A3161503L56434j74547L01005M3359K92636R2798j75945K72581k75276L38379
6386A4232927l37484M2984k91350q3296O40651k24834K27562l29617k73719Q5827
6376A3689651N45812K49637L63036l82943K22268N6878J88644L12713p6287l60868
6366A4808541j10781K53259j74233L75239j52168k26664M43588J005595l04609
$$ plain form
6436 10659335 10839026 11566573 12002859 12207409 12514230 13206837 13861521 13768711 13676530 13634743
6426 13634743 13752937 13749870 13236872 13028721 12965110 12631948 12153349 12644808 12605851 12415170
6416 12415170 12454372 12352823 12805259 12386771 12587588 11828035 12722161 12113187 12743035 13421353
6406 13421353 13182601 13053771 13210351 13222766 13348952 13494821 13682986 14070850 13649883 13161503
6396 13161503 13517937 13343390 13644395 13687754 13980390 14073188 13897243 14169824 13894548 14232927
6386 14232927 13895443 13938427 13647077 13563781 14204432 13979598 14207160 13877543 13603824 13689651
6376 13689651 14235463 14485100 14848136 14465193 14687461 14744339 14932983 15245696 15169409 14808541
6366 14808541 14697760 14951019 14776786 15152025 14999857 14773193 15216781 16222376 15917767
6357A5917767J30667P68555K27226J50887M19356j93862K65261R6286M3669N12649
6347A8338461K65321O59415p1771k22238N46043L82141N41363J20411J101641
6338B1660787J178753O41691M63085k52726O23561M62777J35346R1110M65793
6329B5470177K92869N24540K15601R13549N61331L61808R54041N83391J006364
6320C0883671P48191R35139M32018M82434K03631J77503n31845r9012o45823r96531
6310C1589376p19834l66605o53555n08435k12623k26132l78362r6358M16185k00275
6300B8643382J8777K26991M57356P42018P52726M68234N91812R6645Q9166P1916
6290C2159023K3784N79628L67450L22139J04525J69976l44219l12429l04951m80045
$$ plain form
6357 15917767 16048434 16816989 17044215 17195102 17614458 17420596 17685857 17782143 17825812 18338461
6347 18338461 18603782 19263197 19191426 18969188 19515231 19897372 20438735 20559146 21660787
6338 21660787 22839540 23481231 23944316 23691590 24315151 24777928 24913274 25004384 25470177
6329 25470177 25763046 26287586 26503187 27416736 27978067 28339875 29293916 29877307 30883671
6320 30883671 31631862 32567001 32999019 33481453 33685084 33862587 33330742 33231730 32585907 31589376
6310 31589376 30869542 30502937 29849382 29340947 29128324 28902192 28523830 28427472 28843657 28643382
6300 28643382 28662159 28889150 29346506 30088524 30841250 31309484 31901296 31997941 32087107 32159023
6290 32159023 32182807 32762435 33129885 33452024 33556549 33726525 33382306 33069877 32764926 32284881
6280C2284881l03404j26654o09017q7269m62471L85046N32279k53960R38051p9084
6270C2218398K41399J84550O15342M92917j9033L00007l21969M44948p49703k59072
6260C3147784k47526o92267n3496m22515n86964o10556k9845k71268k40248k08759
6250B9784340N74153M26229L74773k36615N39196l66547P5958k33638O1669m83516
6240C0516002k18259J23956p3591q0142O25493L27343n2177j06575K95968j82277
6230C1175741o1971q0011m65583O58087l24958q730M65718N9569J71973l37002
6220C1252833P26766m37706m8798l42743K81091m7487Q1130l80235O7531j08200
6210C1044182j93928J41370j84431L36088l74869L0451M54613N45266m8148K14259
$$ plain form
6280 32284881 31981477 31854823 31245806 31158537 30696066 31081112 31613391 31359431 32297482 32218398
6270 32218398 32459797 32644347 33259689 33752606 33733573 34033580 33711611 34156559 33406856 33147784
6260 33147784 32900258 32207991 32154495 31731980 31145016 30534460 30504615 30233347 29993099 29784340
6250 29784340 30358493 30784722 31159495 30922880 31462076 31095529 31171487 30937849 30999518 30516002
6240 30516002 30297743 30421699 30348108 30267966 30893459 31220802 31168625 31062050 31358018 31175741
6230 31175741 31113770 31033759 30568176 31226263 30901305 30892575 31358293 31417862 31589835 31252833
6220 31252833 31979599 31541893 31493095 31150352 31431443 31383956 31465086 31084851 31152382 31044182
6210 31044182 30850254 30991624 30807193 31143281 30768412 30798863 31253476 31798742 31750594 31964853
6200C1964853M7391N15307k11317j56269q3618K54856k63430l27108o6982L89700
6190C2063383O71970J80849J059736J464123J470307J742469J466155J437154
6182D1556146J48437o7925r30566o05167j772919o63871j600155j363041r53019
6173C3747920j000609p38077m65737k49135m95878o18678q62669j48553j46632
6164B9021952j23339k59663R3972O52202J164600J851616J127741J499517J190821
6155C6219419J076836J504743J316143Q98009N79351j96847l23851j756647k018715
6146C7298441j860522k744289k103424j716806j390508j859577p23995o19191
6138B4280129l75083j75794m95544r1027n67883j71441K18076J24107l18988K09600
$$ plain form
6200 31964853 32012244 32527551 32316234 32159965 32076347 32331203 32067773 31740665 31673683 32063383
6190 32063383 32735353 32916202 33975938 35440061 36910368 38652837 40118992 41556146
6182 41556146 41704583 41636658 40706092 40100925 38328006 37664135 36063980 34700939 33747920
6173 33747920 32747311 32009234 31543497 31294362 30798484 30179806 29317137 29168584 29021952
6164 29021952 28898613 28638950 28732922 29385124 30549724 32401340 33529081 35028598 36219419
6155 36219419 37296255 38800998 40117141 41015150 41594501 41397654 41073803 39317156 37298441
6146 37298441 35437919 32693630 30590206 28873400 27482892 25623315 24899320 24280129
6138 24280129 23905046 23729252 23233708 23142681 22574798 22403357 22621433 22745540 22426552 22636152
6128B2636152L26775O43042M99028J321890J451653R73674M14486J62592l28793
6119B8100499o98014p46961j524889j130244j069920j243266l63980m03999k12028
6110B0707198n56099l72511j43757m77807M518o39215n04492j86989L39387l82725
6100A7787508j79921l76408K19131p6023J7625l54060l011L60097n03566N42075
6090A7433447N32820O2781O96884O15327N21917J205112R12364Q41606J091529
6081B3913787N29340M12487J97844J98014K6374K07311p09286j35218q06230q26571
6071B3007852k19650r48138k55870p03781k68099j10100j28142Q98406n92479
6062B0679999Q79926N08669P27290P82812K027609J006386J338517J545641J309859
$$ plain form
6128 22636152 22962927 23605969 24104997 25426887 26878540 27852214 28266700 28429292 28100499
6119 28100499 27402485 26655524 25130635 24000391 22930471 21687205 21323225 20919226 20707198
6110 20707198 20151099 19778588 19634831 19157024 19161542 18522327 18017835 17830846 18170233 17787508
6100 17787508 17607587 17231179 17450310 17374287 17391912 17037852 17034841 17394938 16891372 17433447
6090 17433447 17966267 18029048 18725932 19341259 19863176 21068288 21980652 22822258 23913787
6081 23913787 24443127 24855614 25053458 25251472 25277846 25485157 24775871 24640653 23834423 23007852
6071 23007852 22788202 21840064 21584194 20880413 20612314 20502214 20374072 21272478 20679999
6062 20679999 21559925 22068594 22795884 23578696 25606305 26612691 27951208 29496849 30806708
6053C0806708R32625Q76591J047268M62194L94973o7367m64483q66708o25073
6044C2496728j922485j300318j422812r55126q68124n87160l37314j19010N20332
6035B5504711N8191R65715R24783R68070J619938J623925J281836J210481Q52192
6026C5009842P57464L12006J74391o6958L08901l99594p48304l31743r68383j244862
6016C2802760j106858j901634n81703j492296p20915q6192l16390J83991J44756
6007B6925519O64952M72197O08322Q53127L15173R97004R07378O64217L24494
5998C2732383n26407K68057l49495l2470n56426j289309K1699j110434r67678
5989B8189920j537442q36492j258043j063340r40618n47698j6375J20008N5658
$$ plain form
6053 30806708 31739333 32615924 33663192 34125386 34520359 34452992 33988509 33121801 32496728
6044 32496728 30574243 29273925 27851113 26895987 26027863 25440703 25103389 24984379 25504711
6035 25504711 25562902 26528617 27453400 28421470 30041408 31665333 32947169 34157650 35009842
6026 35009842 35767306 36079312 36253703 36186745 36495646 36096052 35347748 35016005 34047622 32802760
6016 32802760 31695902 29794268 29212565 27720269 26999354 26913162 26596772 26780763 26925519
6007 26925519 27590471 28062668 28670990 29524117 29839290 30836294 31743672 32407889 32732383
5998 32732383 32205976 32474033 32124538 32092068 31535642 30246333 30268032 29157598 28189920
5989 28189920 26652478 25815986 24557943 23494603 22553985 22006287 21989912 22109920 22165578
5980B2165578j44640m9627l46762L463O11071m77328J17540K37301p12901L93991
5970B1797686k13940j17078n20221j01462n52903l68874j78572q36480p58144
5961A8150012q78241p41116p24293l95651l81576k82112m95203K24758l77166
5952A4099412o102l52412j36106o82954J12407j65329J86r57183J97446l28443
5942A1780922K88290l23063j21057k2425j467o28702p2902K00022l13066m88609
5932A0297943m76800J8709R0505n5508k5299p02027J26799O9999l69390j51413
5922H823518k2349n6233j00604j60363J22870J02366k43389j73981K0120j35942
5912H176013r7041r9473J27858l14042P7369J44597L60972m80114K62455m5519
$$ plain form
5980 22165578 22020938 21971311 21624549 21628012 22239083 21761755 21879295 22116596 21403695 21797686
5970 21797686 21583746 21466668 20946447 20844985 20292082 19923208 19744636 18908156 18150012
5961 18150012 17271771 16530655 15806362 15410711 15029135 14747023 14251820 14476578 14099412
5952 14099412 14093310 13740898 13604792 12921838 13034245 12868916 12869102 11911919 12109365 11780922
5942 11780922 12069212 11746149 11625092 11602667 11601200 10972498 10899596 11099618 10786552 10297943
5932 10297943 9821143 9839852 9930357 9874849 9849550 9147523 9274322 9344321 8974931 8823518
5922 8823518 8801169 8744936 8644332 8483969 8606839 8709205 8465816 8291835 8311955 8176013
5912 8176013 8078972 7979499 8107357 7793315 7870684 8015281 8376253 7896139 8158594 8113075
5902H113075m81056L96127p7411j9358L807O48614l32173j56383J92929k9402
5892H258769J88842m17204L89506p9425L80622o33919j11565J5769j74129J30148
5882G947414K02974m15462K18423k34393L23479M99656K22115l43758L9857J5811
5872H476116P01452k20467K89171m9611L51263l5278O4451k11288J12164K11925
5862I689898J27672K19544l58602k35294J91092N58233l73088m28937O58128m6811
5852A0001835k5920M14043k15349J43162K14210K40669K70991L23856k36756j12116
5842A1018625O9053M69758n8272k11588l7733M13729j15691j95810O78988J51312
5832A2182371N24195m6074K7577J12309L18051O57l46789N56790P9216K9003O04869
$$ plain form
5902 8113075 7632019 8028146 7950735 7931377 7935184 8583798 8251625 8095242 8288171 8258769
5892 8258769 8447611 8030407 8419913 8340488 8721110 8087191 7975626 7991395 7817266 7947414
5882 7947414 8150388 7734926 7953349 7718956 8042435 8542091 8764206 8420448 8460305 8476116
5872 8476116 9177568 8957101 9246272 9196661 9547924 9512646 9577097 9365809 9477973 9689898
5862 9689898 9817570 10037114 9678512 9443218 9634310 10192543 9819455 9390518 10048646 10001835
5852 10001835 9975915 10389958 10174609 10317771 10531981 10772650 11043641 11367497 11130741 11018625
5842 11018625 11087678 11557436 11499164 11287576 11249843 11663572 11547881 11352071 12031059 12182371
5832 12182371 12706566 12660492 12688069 12800378 13118429 13119086 12772297 13329087 13408303 13437306 14042175
5821A4042175J63577M0368J16932N49190K03790K81795j55845m8778K82897K9775
5811A5505876K50816k64996L59277M71212L61254P48611J22335R4179O14691M25765
5801A8689020Q43486R30699O12461Q66616J243680J102425P18089J076968J203428
5792B7286872J406005Q37917N02240J049228N6353M65064J68529J26080l08509
5783C1589779k89937L27623m45277J33700R0457N06985m24057J048048O43727
5774C3181048O38178P48496Q50055R84777J024508J140029J191252J281595J833807
5765D2873745J515340J624141J730574K106422J241131J464353J378839J87587
5757E4122132N26251K74474K7747r16256r7570k89279l78084R8673K16930J02435
$$ plain form
5821 14042175 14205752 14246120 14363052 14912242 15116032 15397827 15241982 15193204 15476101 15505876
5811 15505876 15756692 15491696 15850973 16322185 16683439 17432050 17554385 17648564 18263255 18689020
5801 18689020 19532506 20463205 21075666 21942282 23185962 24288387 25006476 26083444 27286872
5792 27286872 28692877 29530794 30033034 31082262 31138615 31603679 31772208 31898288 31589779
5783 31589779 31299842 31627465 31182188 31315888 31406345 31913330 31489273 32537321 33181048
5774 33181048 33819226 34567722 35417777 36402554 37427062 38567091 39758343 41039938 42873745
5765 42873745 44389085 46013226 47743800 49850222 51091353 52555706 53934545 54122132
5757 54122132 54648383 54922857 54950604 54034348 53936778 53647499 53269415 53368088 53585018 53687453
5747E3687453L10425J014977L29672L74598O76143J002835Q86082Q72453L08701
5738E9463339M72542N45280J167661P03274O23125J663428J102208J666004J444925
5729F8851786J562973J862834J352169K181437J288834K054041O51756J485453
5721H1291283J317235Q98743O73099L63064O29463O28445Q47539o3627O04524
5712H7189768J253406N41371J056185M75218J032879R19962Q62859J356611J213546
5703I5901805R93918J763256J631820K523359K528100K745183K990624L057566
5695A14135631L359156L129132K385132K550659J310778J397195O05566O0528
5687A28933777l39173k83497p68225o61029k94066m97900k30490L62472M02786
$$ plain form
5747 53687453 53997878 55012855 55342527 55717125 56393268 57396103 58282185 59154638 59463339
5738 59463339 59935881 60481161 61648822 62352096 62975221 64638649 65740857 67406861 68851786
5729 68851786 70414759 72277593 73629762 75811199 77100033 79154074 79805830 81291283
5721 81291283 82608518 83507261 84180360 84543424 85172887 85801332 86648871 86585244 87189768
5712 87189768 88443174 88984545 90040730 90515948 91548827 92468789 93331648 94688259 95901805
5703 95901805 96895723 98658979 100290799 102814158 105342258 108087441 111078065 114135631
5695 114135631 117494787 120623919 123009051 125559710 126870488 128267683 128873249 128933777
5687 128933777 128594604 128311107 127542882 126881853 126587787 126089887 125859397 126221869 126624655
5678A26624655N37742J085190N14192R72383L93162J179327J517881J222353J428917
5669A35475802J967451J237259J923572J620189K098706J384659J369689M46326
5661A47523653O55213M03869m76731p79846q19162j190527k397200k000917k056549
5652A38861803j966640k642916k077597k015277j354214j486628j488262o20103
5644A25210166p49688M06927K81016N38775P81899O48653Q18273O28843M68130
5635A29032994l07893j06872l21704j47571q48186j494087j439506j672120j566123
5626A21128932k389642k219154j760854k015634k006018j731003j087427j405867
5618A06513333j287528q76664r04803l981m79849n09284j1990m79589l81365n35405
$$ plain form
5678 126624655 127162397 128247587 128761779 129734162 130127324 131306651 132824532 134046885 135475802
5669 135475802 137443253 138680512 140604084 142224273 144322979 145707638 147077327 147523653
5661 147523653 148178866 148582735 148106004 147326158 146506996 145316469 142919269 140918352 138861803
5652 138861803 136895163 134252247 132174650 130159373 128805159 127318531 125830269 125210166
5644 125210166 124460478 124867405 125148421 125687196 126469095 127117748 127936021 128564864 129032994
5635 129032994 128725101 128618229 128296525 128148954 127300768 125806681 124367175 122695055 121128932
5626 121128932 118739290 116520136 114759282 112743648 110737630 109006627 107919200 106513333
5618 106513333 105225805 104349141 103444338 103440357 102960508 102451224 102439234 101959645 101578280 101042875
5608A01042875j008550n41994n41783p23185q05302n67665j072777l28373j238028
5599I4215218p55940r45574j211281m19551k88043r70807j778938j219185j128133
5590H5497766o87472j298374j106112q35624j119513j219145r87812o46205j051437
5581G6546072r32861o24289j172535p88889q21351j023737j266149j050232q55077
5572F8010952j203506n50601r54669j124622j012205o18025j206305j057366n18019
5563E9765634m81281j132501Q2396r25412m35251P4674L05637J44562m88135M36162
5553E7346485l58633l49069J79516q67108l91872j031111r62550r79812j156263
5544E1429583j001806q68366j001671o79586j75574p64188n33058o14787K46366
$$ plain form
5608 101042875 100034325 99492331 98950548 98227363 97422061 96854396 95781619 95453246 94215218
5599 94215218 93459278 92513704 91302423 90882872 90594829 89624022 87845084 86625899 85497766
5590 85497766 84810294 83511920 82405808 81570184 80450671 79231526 78243714 77597509 76546072
5581 76546072 75613211 74988922 73816387 73027498 72206147 71182410 69916261 68866029 68010952
5572 68010952 66807446 66256845 65302176 64177554 63165349 62547324 61341019 60283653 59765634
5563 59765634 59284353 58151852 58234248 57308836 56873585 56948259 57253896 57398458 56910323 57346485
5553 57346485 56987852 56638783 56818299 55951191 55559319 54528208 53565658 52585846 51429583
5544 51429583 50427777 49559411 48557740 47878154 47702580 46938392 46405334 45790547 46036913
5535D6036913o49272N2956J24213j12384J1503L47455Q56250M50649P20964Q27719
5525D8666966O05950J084027N93822L90199m475m52551k35853o01426j068318
5516D8978341j229761m15400j121054j114614j089256p64628o9414j133216o31036
5507D1409962q96169m57551j71651K68387n12086r4836O82638Q58798N83681J501599
5497D3172772J088468P21563J503087J773642J059823J249962M84144N15994L09214
5488E1878669l43935k33319r13745r95493o58505j023568j355610r80756q51984
5479D4521754q81984n32474n10410j16746K50991L94215j26857N10022O17134
5470D4125645L04073N1246J163139O85510N93662P16849J139877J218895L93099
$$ plain form
5535 46036913 45387641 45440597 45564810 45452426 45463929 45811384 46667634 47118283 47839247 48666966
5525 48666966 49272916 50356943 50950765 51340964 51336489 50883938 50648085 50046659 48978341
5516 48978341 47748580 47333180 46212126 45097512 44008256 43243628 43174214 42040998 41409962
5507 41409962 40513793 40056242 39884591 40152978 39640892 39546056 40228694 41087492 41671173 43172772
5497 43172772 44261240 44982803 46485890 48259532 49319355 50569317 51053461 51569455 51878669
5488 51878669 51534734 51301415 50387670 49392177 48733672 47710104 46354494 45373738 44521754
5479 44521754 43639770 43107296 42596886 42480140 42731131 43125346 42998489 43508511 44125645
5470 44125645 44429718 44480964 45644103 46329613 46923275 47640124 48780001 49998896 50391995
5461E0391995Q81781K14596l36256N84673r75011r43677m26647m8858p85646k40746
5451D8316204p78155r5544q88349M58701n26103n05720j05412j43808n57694q56321
5441D4317799l00321k14015l54495n75219k46452l07583M19736j70064n71958
5432D1997428K07219k23412k9000p53659k07097j3983k88384o24797k85842j71043
5422C9607430k94275L0216N2774M7242Q61724P96140M73745R91828O47860k17437
5412D2997247J43793j427717j044147o60636r75151j582372n69328p13974q55464
5403C5312251l07934n07559o05558j22695o40930l35246k45642o6846J01132k50227
5393C2330746l87040L77053j73782O51558l91528M36076O3746M64090K83068M18810
$$ plain form
5461 50391995 51273776 51488372 51152116 51736789 50761778 49818101 49391454 49342596 48556950 48316204
5451 48316204 47538049 47442505 46554156 47012857 46486754 45981034 45875622 45731814 45174120 44317799
5441 44317799 44017478 43803463 43448968 42873749 42627297 42319714 42739450 42569386 41997428
5432 41997428 42204647 41981235 41952235 41198576 40991479 40977496 40689112 40064315 39778473 39607430
5422 39607430 39313155 39343371 39396145 39443387 40305111 41101251 41574996 42566824 43214684 42997247
5412 42997247 43141040 41713323 40669176 40008540 39033389 37451017 36881689 36167715 35312251
5403 35312251 35004317 34496758 33891200 33768505 33127575 32792329 32546687 32479841 32580973 32330746
5393 32330746 31943706 32320759 32146977 32798535 32407007 32843083 32906829 33370919 33653987 34072797
5383C4072797J56036Q05827J06987J045686P9790M15681K33927Q07622k39570
5374C7484783j53660O34043j40449L68153k97043K59718J23748M67582n7242N06548
5364C9196181M44934J79670N73182M58781M20340J326000L26038Q10216J178457
5355D4913799J19190J022660N70869Q1287O77550j85313m07553k22773j36915
5346D6432801m62280r6157q89466j189534J34817l89002r95715K87162l20038
5337D2512588K5739m27546O2964l08789K51217l26022k84713l44666l61128m86985
5327D0312659o37675o74076p23077m67988r22059r47961p55952j058523m86074
5318C3639274l4485j038193n96117m95018p40099N003q24793j81797M5800k34767
$$ plain form
5383 34072797 34228833 35034660 35141647 36187333 36267123 36682804 36916731 37724353 37484783
5374 37484783 37331123 37965166 37824717 38192870 37895827 38155545 38279293 38746875 38689633 39196181
5364 39196181 39641115 39820785 40393967 40852748 41273088 42599088 42925126 43735342 44913799
5355 44913799 45032989 46055649 46626518 46707805 47385355 47200042 46792489 46569716 46432801
5346 46432801 45970521 45874364 44984898 43795364 43930181 43541179 42545464 42832626 42512588
5337 42512588 42538327 42110781 42173745 41864956 42116173 41790151 41505438 41160772 40799644 40312659
5327 40312659 39674984 39000908 38277831 37809843 36887784 35939823 35183871 34125348 33639274
5318 33639274 33604789 32566596 31970479 31475461 30735362 30740365 29915572 29733775 29779575 29544808
5308B9544808m95691k98030P2160j8042O81402n77601p8654j01643N23184n56104
5298B8695789n70286j23868J86514n32777n27879k85456m10452l57171m5116p52586
5288B5276712k47779q16256J15208n10640j001258K24894l12830O6563p92611
5279B2002003k36243l9603l42045j07670K7641L56628r5215o29403M6660O24854
5269B1607607j59873J4667J72150j12196k0586j05898n40008j42097n9717k29466
5259B0424583m60881n4244k75636l79601l0317l88451K42426m58795P8259r9960
5249A8597383k5929J49084O317l7272J58390K17777J17275m41432P74616J081
5239A9517290l49353P28646l48759o7004J40564K31084j4458k21939J33197K92523
$$ plain form
5308 29544808 29049117 28751087 28823247 28805205 29486607 28909006 28830352 28728709 29251893 28695789
5298 28695789 28125503 28001635 28188149 27655372 27127493 26842037 26431585 26074414 26029298 25276712
5288 25276712 25028933 24212677 24327885 23817245 22815987 23040881 22728051 22794614 22002003
5279 22002003 21765760 21726157 21384112 21276442 21304083 21660711 21565496 20936093 20982753 21607607
5269 21607607 21447734 21462401 21634551 21522355 21501769 21395871 20855863 20713766 20654049 20424583
5259 20424583 19963702 19909458 19633822 19254221 19223904 18835453 19077879 18619084 18697343 18597383
5249 18597383 18571454 18720538 18726855 18689583 18847973 19065750 19183025 18741593 19516209 19517290
5239 19517290 19167937 19896583 19547824 19480820 19621384 19852468 19838010 19616071 19749268 20041791
5229B0041791N71114j58632p1490O1355N05040K4999Q9691l08996P04227l76213
5219B1082886J11553P06688j18569j01755J3289j47301l66564M30155j84343J39541
5209B1565580J7436R16649p94762N27301O16934j07669j40439M21017J57667j09235
5199B3070479L10369m34508k2807l31203r3816m59401m18662J94499p02196o17174
5189B0495580o0675j15010r18004k60282k4540j66232l9533n50036K78137o21209
5179A8018196N704q92225K7211j4449J62634n42491k84624j10172m11745l19927
5169A5638112n72869p0104L8964m55090l52726m05481P1359j84963R8937P129
5159A3813268j64733m35722R9419j56228K30400k23272J08813k91251l85545p3348
$$ plain form
5229 20041791 20612905 20454273 20382783 20444138 20949178 20974177 21063868 20754872 21459099 21082886
5219 21082886 21194439 21901127 21782558 21680803 21694092 21546791 21180227 21610382 21426039 21565580
5209 21565580 21583016 22499665 21704903 22232204 22849138 22741469 22601030 23022047 23179714 23070479
5199 23070479 23380848 22946340 22923533 22592330 22498514 22039113 21620451 21814950 21112754 20495580
5189 20495580 20434905 20319895 19401891 19141609 19117069 18950837 18911304 18361268 18639405 18018196
5179 18018196 18023900 17131675 17158886 17144437 17307071 16764580 16479956 16369784 15958039 15638112
5169 15638112 15065243 14995139 15034103 14579013 14226287 13820806 13892165 13707202 13806139 13813268
5159 13813268 13648535 13212813 13312232 13156004 13386404 13163132 13271945 12980694 12595149 12521801
5149A2521801K07806J29484l2442j06804Q8132J56001l6108p8650n80754P13833
5139A2982299L1495p6592k72776O711O87656l77690N40799m41702M1787J95257
5129A3317244J45550J57343J78702l65198o7519L41908K53211m79175J8749M2685
5119A3543500m9884J50990N54474m18075o9516K62302j7989K95758m06238K76849
5109A4122171K50469O4603J6321l06238M66364K4260M92740J43935j4429L12221
5099A5572417n5556j45139L454N45163k68806l20101N81737K71026r393L80043
5089A6554845N9538J62738O52895K8511Q53138N24796M53152N32131N91663N46045
5079B0959452P66467J01027N25183j71274L85604P455M32547K80141K25894Q910
$$ plain form
5149 12521801 12729607 12859091 12826649 12719845 12807977 12963978 12927870 12849220 12268466 12982299
5139 12982299 13013794 12937202 12664426 12671137 13358793 12981103 13521902 13080200 13121987 13317244
5129 13317244 13462794 13620137 13798839 13433641 13366122 13708030 13961241 13482066 13500815 13543500
5119 13543500 13493616 13644606 14199080 13781005 13711489 13973791 13955802 14251560 13845322 14122171
5109 14122171 14372640 14437243 14453564 14147326 14613690 14637950 15130690 15274625 15260196 15572417
5099 15572417 15516861 15371722 15375176 15920339 15651533 15331432 15913169 16184195 16174802 16554845
5089 16554845 16614383 16777121 17430016 17458527 18311665 18836461 19289613 19821744 20413407 20959452
5079 20959452 21725919 21826946 22352129 22180855 22566459 22573914 23006461 23286602 23512496 23521406
5069B3521406K81215K65744L10927P0837L92967L99873M38330Q87604Q31593P37551
5059B8138047J241526J558061J894334K508268L334746L425700K920640K694645
5051D7715967N47144J99755o00778q45573q65440j235312j129075r27465m69538
5042D2389685o45169j71169L05347j57804k82222P78509N91506J032839K44902
5033D4086424O80265J109681J107558J035228J675383J139210J079518J008815
5025E2922082Q37775J263590J07799Q34348N18158P94793L39947j52740O27176
5016E8092928p33131J85637l96978N9416J70548L94813M6058K47265M48573J208212
5006E9723341J102994P40808J268177J052422J499269J373868J514037J298650
$$ plain form
5069 23521406 23802621 24068365 24379292 24450129 24843096 25242969 25681299 26568903 27400496 28138047
5059 28138047 29379573 30937634 32831968 35340236 38674982 42100682 45021322 47715967
5051 47715967 48263111 48462866 47862088 47016515 46151075 44915763 43786688 42859223 42389685
5042 42389685 41744516 41573347 41878694 41720890 41438668 42217177 42808683 43841522 44086424
5033 44086424 44766689 45876370 46983928 48019156 49694539 50833749 51913267 52922082
5025 52922082 53759857 55023447 55131246 55965594 56483752 57278545 57618492 57465752 58092928
5016 58092928 57359797 57545434 57148456 57207872 57378420 57773233 57819291 58066556 58515129 59723341
5006 59723341 60826335 61567143 62835320 63887742 65387011 66760879 68274916 69573566
4998F9573566J477820O81545P31546O78794O8374o40007q57239m75130j214803
4989G0024466p18575j064611o39825r76305j193826o8795q58575l6477k06732
4980F4260745P656M21608N79698M00348N23387M77716Q22811O12953P56649J021931
4970F9885502J95635M81805O26445n84148K01045r68425p33441j265638j157612
4961F6681168j705496j789692q22099j811172j350457j536725o59629j430569
4953E5575329q79702n56570l77243j97737M00625k43634J15919j38338M266o30703
4943E3072212K66966r43077k04109j6324o43836p23531o94571l12059q93085j608587
4933D7299999q49251j430685r38631j473234r71005j263820l02270j910776m45490
$$ plain form
4998 69573566 71051386 71732931 72464477 73143271 73211645 72571638 71714399 71239269 70024466
4989 70024466 69305891 68241280 67601455 66625150 65431324 65362529 64503954 64467477 64260745
4980 64260745 64268401 64690009 65269707 65670055 66193442 66671158 67493969 68106922 68863571 69885502
4970 69885502 70081137 70562942 71189387 70605239 70806284 69837859 69104418 67838780 66681168
4961 66681168 64975672 63185980 62363881 60552709 59202252 57665527 57005898 55575329
4953 55575329 54695627 54139057 53761814 53564077 53964702 53721068 53836987 53698649 53702915 53072212
4943 53072212 53339178 52396101 52191992 52175668 51531832 50808301 50113730 49801671 48908586 47299999
4933 47299999 46450748 45020063 44081432 42608198 41637193 40373373 40071103 38160327 37714837
4924C7714837o31154m47028r52183o71934n64601j6626l94976l51669k8354m48368
4914C3207944l23506l04547j01307N2104p10443o73412k03631j12576p08689j51710
4904B9970227l71291o19169n60835k38523m34844j91252l54152k03976K13797
4895B7209982j34872K9600k79892j92550J58631l75065k81767L13269r7235k33768
4885B6116333k5196O3786L19605N6232m84216j3701L27209m45254L42512Q8377
4875B6345687j92815J19812L57071o04926L53299K78300k04103K83216Q0799L73142
4865B7189482m3485L56012M18487K17643L81280M71908M15494K80352m4636M79902
4855C0122439L50216N30597N42355L87452L51747M20127O05279L19907N56564
$$ plain form
4924 37714837 37083683 36636655 35684472 35012538 34447937 34431311 34036335 33684666 33656312 33207944
4914 33207944 32884438 32579891 32478584 32530688 31820245 31146833 30943202 30830626 30121937 29970227
4904 29970227 29598936 28979767 28418932 28180409 27745565 27554313 27200161 26996185 27209982
4895 27209982 27075110 27104710 26824818 26632268 26790899 26415834 26134067 26447336 26350101 26116333
4885 26116333 26091137 26154923 26474528 26530760 26046544 26032843 26360052 25914798 26257310 26345687
4875 26345687 26152872 26272684 26629755 26024829 26378128 26656428 26452325 26735541 26816340 27189482
4865 27189482 27145997 27502009 27920496 28138139 28519419 28991327 29406821 29687173 29642537 30122439
4855 30122439 30472655 31003252 31545607 31933059 32284806 32704933 33310212 33630119 34186683
4846C4186683P03671N62973j75993O25217N37399M96404O46539L66036Q23452
4837C8772381L24045J083498P19429J099573M49304O37396Q46529P12149J440912
4828D6085216J216580L28666Q74028J539782R89141P67564O54789J059288J005260
4819E4520314O48653J326612J101450Q51693J684338J001393J559478J252493
4811F3946424J318308J100268P38126J720680J021157P81117J492698R84031J156584
4802G4259393J081220J144304J430958J040952Q79717J108769J139762N48253
4794H2633328J801521J346885K012644J307277K052559J703594J673486K150003
4786I6681297J347334J887082J201185J238260J309857J484232P02307O64681
$$ plain form
4846 34186683 34890354 35453327 35277334 35902551 36439950 36936354 37582893 37948929 38772381
4837 38772381 39096426 40179924 40899353 41998926 42448230 43085626 43932155 44644304 46085216
4828 46085216 47301796 47630462 48504490 50044272 51033413 51800977 52455766 53515054 54520314
4819 54520314 55168967 56495579 57597029 58448722 60133060 61134453 62693931 63946424
4811 63946424 65264732 66365000 67103126 68823806 69844963 70626080 72118778 73102809 74259393
4802 74259393 75340613 76484917 77915875 78956827 79836544 80945313 82085075 82633328
4794 82633328 84434849 85781734 87794378 89101655 91154214 92857808 94531294 96681297
4786 96681297 98028631 99915713 101116898 102355158 103665015 105149247 105851554 106516235
4778A06516235R10182P65536R42353J003193O95021J668899J932742J173580J477689
4769A17085430J069034J645556J464654R46626R19172R15985N14704P55308J101047
4760A26417516O44223P00249N23563J250399j90095J62849J05844m73248n09267
4751A28632033j190944m39303r88664o28427j258871j100561k35959p51058j463071
4742A20575175j445064j201143j562651k024348j681061j927453j313408j961491
4734A07458556j421676j436902p69940j968098j313887r24624j644787j494178
4726I6484464j202271j307002j762720j193063j057425j834289j723723j578746
4718H4825225j073747j281278j494923j130178j411525r74422j575971k078715
$$ plain form
4778 106516235 107426417 108191953 109134306 110137499 110832520 112501419 114434161 115607741 117085430
4769 117085430 118154464 119800020 121264674 122211300 123130472 124046457 124561161 125316469 126417516
4760 126417516 127061739 127761988 128285551 129535950 129345855 129508704 129614548 129141300 128632033
4751 128632033 127441089 127001786 126013122 125384695 124125824 123025263 122789304 122038246 120575175
4742 120575175 119130111 117928968 116366317 114341969 112660908 110733455 109420047 107458556
4734 107458556 106036880 104599978 103830038 101861940 100548053 99623429 97978642 96484464
4726 96484464 95282193 93975191 92212471 91019408 89961983 88127694 86403971 84825225
4718 84825225 83751478 82470200 80975277 79845099 78433574 77459152 75883181 73804466
4710G3804466q73402j079074j778466j443993q32092j459940r01263j488886n97549
4701F3349801j365247j632682j37310j786491q84906j098319p19636r50186r76885
4692E3798139j003210r59195m90087j446700k81877p21141j011204j202964j084526
4683D5597235j471773n88541r81668j539699r65024r79813j097119q63677r68702
4674C6141219k23320j033749j246191q22927n00465q05452q77222q16218o73819
4665B9141856m48185k29929r63798n48016o22479q66933k96032l27035j97505
4656B4641944j101827j26338l34358m68986l83703n79880j84044k40064r02460
4647B0320284k59332m44123k62739k23582r77318n72489n512m88252p73599n27938
$$ plain form
4710 73804466 72931064 71851990 70073524 68629531 67797439 66337499 65436236 63947350 63349801
4701 63349801 61984554 60351872 60214562 58428071 57543165 56444846 55725210 54775024 53798139
4692 53798139 52794929 51835734 51345647 49898947 49617070 48895929 47884725 46681761 45597235
4683 45597235 44125462 43536921 42555253 41015554 40050530 39070717 37973598 37109921 36141219
4674 36141219 35917899 34884150 33637959 32815032 32314567 31509115 30631893 29815675 29141856
4665 29141856 28693671 28463742 27499944 26951928 26329449 25462516 25166484 24839449 24641944
4656 24641944 23540117 23413779 23079421 22610435 22226732 21646852 21462808 21222744 20320284
4647 20320284 20060952 19616829 19354090 19130508 18153190 17580701 17575189 17086937 16313338 15785400
4637A5785400J17094n08847m68106j38055o38321m02261k8817n47599L18852o41945
4627A2847395M6584n17609K67319m94420r9661M56001k99782n77828M21799k97958
4617A1751840L0049m8873m4554l30058j60347r1476l40196K02027m86018j36052
4607A0346342k08312n23734J39205J25081n86935K6522M96284n09153J25608K72951
4597I703859N724R0626l94492j6283L00505p9113N1774k80041n09128L42922m65719
4586H750634j75855l07593j26576L24657l49126o1404m09461j99941k00066K73780
4576G519049k96989n18913M64898m10088J44448P6472k71490J98267m63831K8522
4566F470345j55428k43485L26376m21679M44527k1940l0221n98402J46059O48422
$$ plain form
4637 15785400 15902494 15393647 14925541 14787486 14149165 13746904 13718087 13170488 13489340 12847395
4627 12847395 12893979 12376370 12643689 12149269 12049608 12505609 12205827 11627999 12049798 11751840
4617 11751840 11781889 11733016 11688462 11358404 11198057 11106581 10766385 10968412 10482394 10346342
4607 10346342 10138030 9614296 9753501 9878582 9291647 9318169 9814453 9305300 9430908 9703859
4597 9703859 9709583 9800209 9405717 9389434 9689939 9610826 9662600 9382559 8873431 9216353 8750634
4586 8750634 8574779 8267186 8140610 8465267 8116141 8054737 7645276 7445335 7245269 7519049
4576 7519049 7222060 6703147 7168045 6757957 6902405 6978877 6707387 6905654 6441823 6470345
4566 6470345 6314917 6071432 6397808 5976129 6420656 6398716 6368495 5770093 5916152 6564574
4556F564574m76751l22491j21175K77113r0132J6008J68546m95857L63832j29943
4546E753724J53477j53742K59999K52465q92893n593J42763k77339L23866J95718
4536E752445q05530M34044j85302J63075J41477k0117m77102N05605l27925M4777
4526E225447J74733k76904j36001L55556m75996Q21404l18890j33763J51154J33712
4516E520452K78440K87799m82528J42219J20597R0305K2611j58503J67181J01218
4506F089791N59076l01314o10464M75887L38104k03734j32602k03621K25355J38729
4496F375207P1613k21251N5421N4722J67611L0538j2903m4544L52580N218l78474
4485F455738M48988J21172K52453k50661M0820O11512l06301J67759J66486J00950
$$ plain form
4556 6564574 6087823 5765332 5644157 5921270 5831138 5847146 6015692 5519835 5883667 5753724
4546 5753724 5907201 5753459 6013458 6265923 5373030 5367437 5510200 5232861 5556727 5752445
4536 5752445 4946915 5380959 5195657 5358732 5500209 5480092 5002990 5508595 5180670 5225447
4526 5225447 5400180 5123276 4987275 5342831 4866835 5688239 5369349 5235586 5386740 5520452
4516 5520452 5798892 6086691 5604163 5746382 5866979 5957284 5979895 5821392 5988573 6089791
4506 6089791 6648867 6347553 5737089 6212976 6551080 6347346 6214744 6011123 6236478 6375207
4496 6375207 6446820 6225569 6280990 6335712 6503323 6533861 6520958 6476414 6828994 6834212 6455738
4485 6455738 6904726 7025898 7278351 7027690 7068510 7680022 7373721 7541480 7707966 7808916
4475G808916L1848L83M3245r8706J50358K33834P6510J18086j20555N76829J82668
4464I003416j87907k2861O28183n73167J063419l95912M39891m2853k64628Q37787
4454A0485368j47913J82211K06759N00805Q5140m97155J029872L28334m1557R80640
4444A3112504L14199L14628N66282P91688J717914J407354K189543J452593J137312
4435B3004017N51739n73429m41087j075518m18586q25354o91385k40767q2847
4426A9206783m6481J82271J44986L30871N9539N69015O28063K56327Q38527K77761
4416B2447662N61018J474599Q91678J662581J920066K360744K928844K525314
4408C6772506K173128M95412P6305m36695r88319j155201m73656m12518M95637
$$ plain form
4475 7808916 7840764 7841147 7884392 7785686 7936044 8169878 8246388 8364474 8243919 8820748 9003416
4464 9003416 8815509 8792648 9420831 8847664 9911083 9515171 9955062 9912209 9647581 10485368
4454 10485368 10337455 10519666 10726425 11227230 11312370 10815215 11845087 12173421 12131864 13112504
4444 13112504 13426703 13741331 14307613 15099301 16817215 18224569 20414112 21866705 23004017
4435 23004017 23555756 22982327 22541240 21465722 21047136 20221782 19530397 19289630 19206783
4426 19206783 19160302 19342573 19487559 19818430 19877969 20446984 21075047 21331374 22169901 22447662
4416 22447662 23008680 24483279 25374957 27037538 28957604 31318348 34247192 36772506
4408 36772506 38945634 39441046 39517351 39080656 38092337 36937136 36463480 36050962 36546599
4399C6546599O24361P17336O90770Q84013J2853J431257L48182O53437J434424
4390D3343232J208980J378907K002734K198413K441638L164855M521209N075415
4382F5335383N737410O436007O977063R516103J1457666J7526443K3343332K7248566
4374A73577973K6213657K6065636K6760314K6126777K1663771J3121395L998902
4367C17528425k289175p161729r950846r219652q744107q582434q425583r279756
4359B53875143q862630r583982q010286o536638m246371l663517l135035j862001
4351B07974683J225271O931132J3627747J9341219J9677722K0475288K2294287
4344C11547349K3824647J9734525J0775490K32021p191056j1564902j4046150
$$ plain form
4399 36546599 37170960 37888296 38579066 39463079 39475932 40907189 41255371 41908808 43343232
4390 43343232 44552212 45931119 47933853 50132266 52573904 55738759 60259968 65335383
4382 65335383 71072793 77508800 84485863 94001966 105459632 122986075 146329407 173577973
4374 173577973 199791630 225857266 252617580 278744357 300408128 313529523 317528425
4367 317528425 315239250 308077521 298126675 288907023 280162916 271580482 263154899 253875143
4359 253875143 245012513 235428531 227418245 220881607 216635236 212971719 209836684 207974683
4351 207974683 209199954 216131086 229758833 249100052 268777774 289253062 311547349
4344 311547349 335371996 355106521 365882011 366114032 358922976 347358074 333311924
4337C33311924j1916362r680770q833567r190820j0758350j0644114j1412574
4330B60875367j1988405j0125469q232079p264405o845918o741457q179106r455599
4322A92042929r768331q144673m041633j313215J053732L65756k589710o489515
4314A61115340q436151j1169770j0817386r182895p474725n227921k430725q94542
4306A05481225k11509o41578m60004j92879m25007m06067J521585K983732L540197
4297A11189695M524411L408285K992147Q29415k770491n722883p598881q083152
4289I8768546p093383o783197o274833n171552n212153n034302l736760l968855
4281E5493511k887016k703046k069288j942722k31437p422J081307P86437J244920
$$ plain form
4337 333311924 321395562 311714792 302881225 293690405 282932055 272287941 260875367
4330 260875367 248886962 238761493 230529414 223265009 216419091 209677634 201498528 192042929
4322 192042929 182274598 174129925 170088292 168775077 169828809 170194565 167604855 161115340
4314 161115340 152679189 141509419 130692033 121509138 114034413 108806492 106375767 105481225
4306 105481225 105269716 104628138 104168134 103975255 103550248 103144181 104665766 107649498 111189695
4297 111189695 115714106 119122391 122114538 122943953 120173462 114450579 106851698 98768546
4289 98768546 91675163 84891966 78617133 73445581 68233428 63199126 59462366 55493511
4281 55493511 52606495 49903449 47834161 45891439 45660002 45652580 46733887 47520324 48765244
4272D8765244J276369J471991J632287M212169M446193M742698J830703m51473
4264F7926181k066384l688947l367095l252853l812931l626368l824767l156781
4256D1130055l630648k896546k870188k082955j830407j075864m15755m05427
4248B5922265n50333K58614r7222o5948M78880j3488j8096Q5207k21820o23882
4238B5154177j036921n60873p16216j212868q00012q39806j012932n36562n04225
4229A7933762l18368k67053m0401j92929n43767L00585l4844L22006L80413J016511
4219A8555915J14570N65485O52301J20953k33181K91341l43975m94080q50627
4210A8378702q73464n78911p10127j238559o52704j206768l47465k41885j242639
$$ plain form
4272 48765244 50041613 51513604 53145891 57358060 61804253 66546951 68377654 67926181
4264 67926181 65859797 62170850 58803755 55550902 51737971 48111603 44286836 41130055
4256 41130055 37499407 34602861 31732673 29649718 27819311 26743447 26327692 25922265
4248 25922265 25371932 25630546 25533324 25467376 25946256 25932768 25914672 25999879 25778059 25154177
4238 25154177 24117256 23556383 22840167 21627299 20827287 19987481 18974549 18437987 17933762
4229 17933762 17615394 17348341 17307940 17115011 16571244 16871829 16836985 17158991 17539404 18555915
4219 18555915 18670485 19235970 19888271 20009224 19776043 20067384 19723409 19229329 18378702
4210 18378702 17505238 16926327 16216200 14977641 14324937 13118169 12770704 12528819 11286180
4201A1286180Q855l00945l94945l85565m40229r2107m48052j24870r1896n05365
4191H511061R2779j79200j02935j04991k17212J09246m23443K46362l2435m12860
4181G486372j00496j08068m58127j6668O18869m24029J4596l53582O08852j68500
4171G099219M30344K90832L70634R14911O35652J144754J407863K309396L194732
4162A7798337N004134L851955K978201L80146j011247l081792k811247l350524
4154A9757963k779772k438491k285043j111973j562105n98160m01219o41398k68299
4145G671503P9852j5381J11101L16296M6795N69179J043829J535637J824052K717432
4135A5900295L537994M346601K944233J234669j108281k239680l369848k970805
$$ plain form
4201 11286180 11295035 10994090 10599145 10213580 9773351 9681244 9233192 9108322 9016426 8511061
4191 8511061 8603840 8424640 8321705 8216714 7999502 8108748 7685305 7931667 7899232 7486372
4181 7486372 7385876 7277808 6819681 6803013 7421882 6997853 7012449 6658867 7267719 7099219
4171 7099219 7529563 7820395 8191029 9105940 9741592 10886346 12294209 14603605 17798337
4162 17798337 22802471 26654426 29632627 30012773 29001526 25919734 23108487 19757963
4154 19757963 16978191 14539700 12254657 11142684 9580579 8982419 8581200 7939802 7671503
4145 7671503 7751355 7735974 7847075 8163371 8210166 8779345 9823174 11358811 13182863 15900295
4135 15900295 19438289 23784890 26729123 27963792 26855511 24615831 21245983 18275178
4127A8275178k997175k753549j832328j937395o87280q15825m85457j44381p74827
4118E846961M4135m10503l84897M0583K06426n01912l10637P8673j3077j14306
4108D481446o41191P2031k69169L09753j48288j96122r4600m0555R1743m22187
4098C142861L23545M07462k30772J63109L37253K99612O93187Q06928J17802M43530
4088F504517M60036l41134K03498o18843l33828p19271l50682o70487J15064n71162
4078C677708n26891N10566n73082K76067o906o80459J27424J87159k73831P21999
4068C439754r3331m43731J87573M94724O34171J28279J65772P9704K41671j70459
4058D664127p74324m63012p76362k691M0667k78942k15499L03093p13775K21445
$$ plain form
4127 18275178 15278003 12524454 10692126 8754731 8067451 7251626 6766169 6621788 5846961
4118 5846961 5891096 5480593 5095696 5136279 5342705 4840793 4530156 4608829 4595752 4481446
4108 4481446 3840255 3912286 3643117 3952870 3804582 3608460 3513860 3473305 3565048 3142861
4098 3142861 3466406 3873868 3643096 3806205 4143458 4443070 5136257 5943185 6060987 6504517
4088 6504517 6964553 6623419 6826917 6208074 5874246 5154975 4804293 4133806 4248870 3677708
4078 3677708 3150817 3661383 3088301 3364368 3357462 2677003 2804427 2991586 2717755 3439754
4068 3439754 3346423 2902692 3090265 3584989 4219160 4347439 4513211 4592915 4834586 4664127
4058 4664127 3889803 3426791 2650429 2647738 2688405 2409463 2193964 2497057 1783282 2004727
4048B004727P4052k50847O774O5497n81999N48546k39123p9100J16283M64707
4038B129517o09338l74118Q0112O45009j47150K5714m58267l40607N29373K6057
4028A506302Q7974j89084j31402M09291k03365J92182J32468j04976M81705J03397
4018B284492l43629N28772m16281K9843j29956k69515R1889q72176N52809l43178
4008A113070N8110J61006j45664q3609K1920L67936m1120J6018j88200Q45244
3998B124711o77527J95693l89442L81797N59190n26165k91007r7088L06830o1836
3988A525156j47241j02100k68786p131K57272n15187K965j74142J46407J49085
3978H66298m48010L27663j17869n2801K19632j99970K75669q5791k16223J08732
$$ plain form
4048 2004727 2078779 1827932 1834706 1900203 1318204 1866750 1627627 1548527 1664810 2129517
4038 2129517 1520179 1146061 1226173 1871182 1724032 1749746 1291479 950872 1480245 1506302
4028 1506302 1594276 1405192 1273790 1683081 1479716 1671898 1804366 1699390 2181095 2284492
4018 2284492 1940863 2469635 2053354 2083197 1953241 1683726 1775615 903439 1456248 1113070
4008 1113070 1171180 1332186 1186522 1102913 1124833 1492769 1451649 1467667 1279467 2124711
3998 2124711 1447184 1642877 1253435 1635232 2194422 1668257 1377250 1280162 1586992 1525156
3988 1525156 1377915 1275815 1007029 999898 1257170 741983 744948 570806 717213 866298
3978 866298 418288 745951 628082 575281 794913 594943 870612 784821 568598 677330
3968F77330n46264n7839L61407k00618j10364k3317j00860p9080k18921K77728
3958b0798j77319J88815m26986k59565K81805k31379M83345r3450N9868l97443
3948e93107j32232j54418L67810j29083j60052L42084o3149o79452N0655O49967
3938e00977o14638R22945r02842J82057J67636J6461j16459m5743J22868K42649
3928e26043l7301m07725R2491l68843j34877M89223j98803K31074o8210k07828
3918a136842J35606K05560j64754k91172K10554K85769l36961K43036P9987O05806
3908a63411m56906l86566J30656Q9990m98873L16674n70385J001410m39906j50808
3898a128125L37683j5770j35452l29110J67847K48275m01965J57740j96230R6817
$$ plain form
3968 677330 131066 73227 434634 234016 123652 100335 -525 -79605 -298526 -20798
3958 -20798 -198117 -9302 -436288 -695853 -414048 -645427 -162082 -255532 -195664 -593107
3948 -593107 -725339 -879757 -511947 -641030 -801082 -458998 -522147 -1201599 -1150944 -500977
3938 -500977 -1115615 -192670 -1095512 -913455 -745819 -729358 -845817 -891560 -768692 -526043
3928 -526043 -563344 -971069 -878578 -1247421 -1382298 -893075 -1091878 -860804 -929014 -1136842
3918 -1136842 -1001236 -795676 -960430 -1251602 -1041048 -755279 -1092240 -849204 -769217 -163411
3908 -163411 -620317 -1006883 -876227 -786237 -1285110 -968436 -1538821 -537411 -977317 -1128125
3898 -1128125 -790442 -806212 -941664 -1270774 -1102927 -854652 -1256617 -1098877 -1295107 -1198290
3888a198290L70649J85815j54113o31667K8218N02495O699o3606k73994P5667
3878a152127K6472j19689j17685P603L29801J04444o35530K26301r2166K42340
3868a180236K4409k2414O467K10667j88818k14197J43000J04249J36826k48890
3858a228937j19933N2869k14693K5229O1010M43155r4509j54972K92226l59618
3848a298173K04332m31420j78543K97598P2675j13281R0007J63656l85852J30590
3838a448411P3906N1355n1238K3920J57601J9253l46587J92662J3159k4751m5481
3827a384612k58381O76078m69484K86823l92177J42837P2552M5797j37820j96330
3817a614717L64549o2359k99696m7146K30153M7224L10630m07942K26635K90628
$$ plain form
3888 -1198290 -827641 -641826 -795939 -1427606 -1399388 -896893 -890194 -953800 -1227794 -1152127
3878 -1152127 -1125655 -1245344 -1363029 -1355426 -1025625 -921181 -1556711 -1330410 -1422576 -1180236
3868 -1180236 -1155827 -1178241 -1171774 -961107 -1149925 -1364122 -1221122 -1116873 -980047 -1228937
3858 -1228937 -1348870 -1296001 -1510694 -1485465 -1424455 -981300 -1075809 -1230781 -938555 -1298173
3848 -1298173 -1093841 -1525261 -1703804 -1406206 -1333531 -1446812 -1356805 -1193149 -1579001 -1448411
3838 -1448411 -1374505 -1323150 -1374388 -1350468 -1192867 -1173614 -1520201 -1327539 -1314380 -1339131 -1384612
3827 -1384612 -1642993 -966915 -1436399 -1149576 -1541753 -1398916 -1326364 -1280567 -1418387 -1614717
3817 -1614717 -1250168 -1312527 -1612223 -1659369 -1429216 -1381992 -1071362 -1479304 -1252669 -962041
3807i62041j18230k95664M9061k29016Q7471L50538J96864k04258J303m38959
3797a562931K9666N03781m01136o0815K5992k36366M83738j95075K23878k61616
3787a450884J53658k65285M78449K27422l70588M51755o08912L04195k88997K71150
3777a098037o9770k94748M05546o1074k53692N9066r8478j21902o331M67211L0724
3766a041485o7836j93170L0942k77266L36053p5884O2323R2802L32921k24301
3756a024901p3288j62920o84107O62214k16024N30284k09375k28998q3106K72032
3746a218189m51571L58739k4052L63589n44149J55681K71762k09582K6704M8250
3736a222818Q6219n15505M87363j72580p5138m7801k93614L83420K30796m23686
$$ plain form
3807 -962041 -1080271 -1375935 -1326874 -1555890 -1468419 -1117881 -921017 -1125275 -1123972 -1562931
3797 -1562931 -1533265 -1029484 -1430620 -1491435 -1465443 -1701809 -1218071 -1413146 -1189268 -1450884
3787 -1450884 -1297226 -1562511 -1084062 -856640 -1227228 -775473 -1384385 -1080190 -1369187 -1098037
3777 -1098037 -1167807 -1462555 -1057009 -1118083 -1371775 -1312709 -1411187 -1533089 -1539420 -1072209 -1041485
3766 -1041485 -1109321 -1302491 -1271549 -1548815 -1212762 -1288646 -1226323 -1133521 -800600 -1024901
3756 -1024901 -1098189 -1261109 -1945216 -1283002 -1499026 -968742 -1178117 -1407115 -1490221 -1218189
3746 -1218189 -1669760 -1311021 -1335073 -971484 -1515633 -1359952 -1088190 -1297772 -1271068 -1222818
3736 -1222818 -1136599 -1652104 -1164741 -1337321 -1412459 -1460260 -1753874 -1370454 -1139658 -1563344
3726a563344k87900K40806P40549l70465j36123j00336J52021J18535j6284l58046
3716a580587K84210q8385K78773j19539P2662k51126J13256J90862J14493M4463
3706i40918O3898k60498n641M54993j60735l30141M78554k30486K91397m68149
3696a107726N68516l56056O07416n20858M66064m19850M85740j11886k25198M88660
3686a25178m56057k16209k20864L79435k77851J09079O5871r9904k31147L38549
3676g34276j54853m5400J0708j59701L14033p2886M44120n76706L68634l4855
3666f41182k72292L2612m0414L8563l2101o9164L75835K9969k09031k42384K89256
3655g40333J15480j79728j26378K87899l4734j58960l9543n9696k45383J82748
$$ plain form
3726 -1563344 -1851244 -1610438 -869889 -1240354 -1376477 -1476813 -1324792 -1206257 -1222541 -1580587
3716 -1580587 -1296377 -1384762 -1105989 -1225528 -1152866 -1403992 -1290736 -1099874 -985381 -940918
3706 -940918 -877020 -1137518 -1143159 -688166 -848901 -1179042 -700488 -930974 -639577 -1107726
3696 -1107726 -539210 -895266 -287850 -808708 -342644 -762494 -276754 -388640 -613838 -125178
3686 -125178 -581235 -797444 -1018308 -638873 -916724 -807645 -741774 -841678 -1072825 -734276
3676 -734276 -889129 -934529 -923821 -1083522 -769489 -842375 -398255 -974961 -606327 -641182
3666 -641182 -913474 -880862 -921276 -882713 -914814 -983978 -608143 -578174 -787205 -1029589 -740333
3655 -740333 -624853 -804581 -930959 -643060 -677794 -836754 -876297 -935993 -1181376 -998628
3645i98628j28019J27266K4140j32486J09214j12596j45677k98952K50802K95179
3635a009757O4512j23605j43735j28513M34970l34506J4116l0131J16265M73765
3625f66619q46262P31755q1363m31217j72130P76480j11842j94103j59629j42313
3615a297243K83563M71809p11129j13633L71718k14225K14522J22989R9433l66154
3605a138350J10353J08424p4470J46657k13315k79093k48604M19732J25842P1392
3595i71432o3431k73147J82022l13250K08923J92672j94850J41092J8916k97191
3585a369676K43428K18812k55328P1637l43040J75655K21033l39575K76850K26795
3575h73409p82094O98438k61147J63827k5342l23089j50261j57553L2131K76845
$$ plain form
3645 -998628 -1126647 -999381 -975241 -1107727 -998513 -1111109 -1256786 -1555738 -1304936 -1009757
3635 -1009757 -945245 -1068850 -1212585 -1341098 -906128 -1240634 -1226518 -1256649 -1140384 -666619
3625 -666619 -1512881 -781126 -862489 -1293706 -1465836 -689356 -801198 -995301 -1154930 -1297243
3615 -1297243 -1013680 -541871 -1253000 -1366633 -994915 -1209140 -994618 -871629 -772196 -1138350
3605 -1138350 -1027997 -919573 -994043 -847386 -1060701 -1339794 -1588398 -1168666 -1042824 -971432
3595 -971432 -1034863 -1308010 -1125988 -1439238 -1230315 -1037643 -1232493 -1091401 -1072485 -1369676
3585 -1369676 -1126248 -907436 -1162764 -1091127 -1434167 -1258512 -1037479 -1377054 -1100204 -873409
3575 -873409 -1655503 -957065 -1218212 -1054385 -1079727 -1402816 -1553077 -1710630 -1678499 -1401654
3565a401654J09037L31621P9841n13618J5893J19695J56906O1856n82665M87018
3555a136070P5944O8150P5805j80014K15824M8171l46967n3184j9812M7086M14527
3544g90540R8409l67553o51373L00276K20324j31829J81281k74811M23795K2527
3534i69494m9410k62405M59638k73810j0816L91256m04899P91592k66279m23316
3524a017943L19772j01990j92389j70433q8830K30711J38088Q679P2169o65333
3514a467499J81150K43615P0270m25332L91286L63488n64888J48927J52847k38802
3504a144938J9636m3973M99435k16079p7952k93471K47827N01212p60387k40958
3494a509648M29843r6650R892K89237k42893L27143l63038L0426J3843O2620l87994
$$ plain form
3565 -1401654 -1292617 -960996 -881155 -1394773 -1378880 -1259185 -1102279 -1040423 -1623088 -1136070
3555 -1136070 -1060126 -991976 -916171 -1096185 -880361 -832190 -1179157 -1232341 -1252153 -1205067 -790540
3544 -790540 -692131 -1059684 -1711057 -1410781 -1190457 -1322286 -1141005 -1415816 -992021 -969494
3534 -969494 -1018904 -1281309 -821671 -1095481 -1106297 -715041 -1119940 -328348 -594627 -1017943
3524 -1017943 -698171 -800161 -992550 -1162983 -1251813 -1021102 -883014 -874335 -802166 -1467499
3514 -1467499 -1286349 -1042734 -972464 -1397796 -1006510 -643022 -1207910 -1058983 -906136 -1144938
3504 -1144938 -1125302 -1169275 -669840 -885919 -963871 -1257342 -1009515 -508303 -1268690 -1509648
3494 -1509648 -1079805 -1176455 -1166563 -877326 -1120219 -793076 -1156114 -1125688 -1111845 -1049225 -1437219
3483a437219M07573k23400L52304k76777j00814l210L15906l21647P7154J40283
3473a069847p453j66724M25206m26875N18977j45742j61066p8281J52202p0653
3463a030256K92859l28523M7887J85776l17285L35280l83313K88488J45638m99821
3453a263270J29051M37823l29222o1727k92070N38349O3279l67025M83087m06878
3443a068603L03237K34281k23576J3077l95420K75513J27180k07756L31735l98339
3433a008671J16154j26629K51481j21679K6141J23705l3615L55965k47785J14665
3423e50268j42366N1268k86594J64438N8874j3228k4257q3338j19128J19947L91774
3412d32878m43108K71642m90644N42230j71802P7512K43848o97833J33149K25189
$$ plain form
3483 -1437219 -1029646 -1253046 -900742 -1177519 -1278333 -1281543 -965637 -1287284 -1210130 -1069847
3473 -1069847 -1077300 -1244024 -818818 -1245693 -726716 -872458 -1033524 -1111805 -959603 -1030256
3463 -1030256 -737397 -1065920 -1018033 -832257 -1149542 -814262 -1197575 -909087 -763449 -1263270
3453 -1263270 -1134219 -696396 -1025618 -1087345 -1379415 -841066 -777787 -1144812 -661725 -1068603
3443 -1068603 -765366 -531085 -754661 -741584 -1137004 -861491 -734311 -942067 -610332 -1008671
3433 -1008671 -892517 -1019146 -767665 -889344 -863203 -739498 -773113 -417148 -664933 -550268
3423 -550268 -692634 -641366 -927960 -763522 -704648 -717876 -742133 -825471 -944599 -824652 -432878
3412 -432878 -875986 -604344 -1094988 -552758 -724560 -647048 -403200 -1101033 -967884 -742695
3402g42695J41007J78038r2023M4060j5435j64189K79792o6026J67358K19540
3392e0573j90162l38685J34490N593J03321L70227Q2728J37098j05323O16016
3382G64730N09197K69754N53183J40101j60499m74880M1334k76165p97491m24924
3372A44340J68717j10472Q1601j97334n71492J56401j61859k29183Q11479l05367
3362b13169J32747p8954K56908m17926M79330k92753k85754J32778P48249j72327
3352B89129l06598p7591J56699L22903m98869N94161m98026L77431l73202J46086
3342A32123L36526l06639N39175o8481O28036m02450N97835Q77042L27955m30743
3332B230379N75793p9515O29013M42266N00750R43648K377832M363164P537867
$$ plain form
3402 -742695 -601688 -423650 -515673 -471613 -487048 -651237 -371445 -437471 -270113 -50573
3392 -50573 -240735 -579420 -444930 -439337 -336016 34211 116939 254037 148714 764730
3382 764730 1273927 1543681 2096864 2236965 2076466 1601586 1642920 1366755 569264 144340
3372 144340 313057 202585 284186 86852 -484640 -328239 -490098 -719281 92198 -213169
3362 -213169 -80422 -159376 97532 -320394 158936 -133817 -419571 -286793 461456 289129
3352 289129 -17469 -95060 61639 384542 -114327 479834 -18192 359239 -13963 132123
3342 132123 468649 162010 701185 632704 1260740 858290 1456125 2333167 2661122 2230379
3332 2230379 2806172 2726657 3355670 3797936 4298686 5242334 7620166 11983330 19521197
3323A9521197J0017382P619081K845094k178713l924662n155076o233572n398576
3315A7112155m272862l928126k681790q73259j025744p13855N8389p61161l70326
3306B543421n93701l61241L8761l23882q35711K90983k290k04730n90091K87375
3296B48894j62435P069J16018l44468L02251l86168R1680L74869n15537K18566
3286d9261l38531L2995O9679n5972m4117k16792K38986J31683j90632K87072k81473
3275d16363j8504J07479j22282K23299k47429Q417J10201j437Q0176j10654l09842
3264f96939J10087j5050l44439L23583p424l0676L33806n47842J69993m1536j86205
3253i32642L32265L0913j96797q0469J00572l6369J63768j82631J58357J06955
$$ plain form
3323 19521197 29538579 37157660 40002754 37824041 33899379 28744303 22510731 17112155
3315 17112155 12839293 8911167 6229377 5356118 4330374 3616519 3674908 2913747 2543421
3306 2543421 1949720 1588479 1627240 1303358 467647 758630 756340 551610 -38481 248894
3296 248894 86459 93528 209546 -134922 167329 -218839 -127159 247710 -267827 -49261
3286 -49261 -387792 -354797 -285118 -341090 -385207 -601999 -363013 -231330 -421962 -134890 -416363
3275 -416363 -434867 -327388 -449670 -226371 -473800 -465383 -355182 -356619 -276443 -387097 -696939
3264 -696939 -586852 -601902 -946341 -622758 -630182 -660858 -327052 -874894 -704901 -746437 -932642
3253 -932642 -600377 -569464 -766261 -846730 -746158 -782527 -618759 -801390 -643033 -536078
3243e36078m97282K37420k14012j5390J56057k6089n0862K84747l35498K31878
3233g65109K9108j73343M85003q17773M05767L72356k95755J89577n72118Q7682
3223a054605K12773j50306M44398m00210N8397n79531N61642J7812o57365L77802
3213a169193j46712N1665P88007q41148M88580l5623j70695L0797J4665M3624
3203i46033J79959J71807k62515k54713O02387m87337k30708j12101K81962k7540
3193a084832j39155M11924m55396o8531J27972j63699L13551N3557j34814M93194
3183f46229k47890m04783Q9114J71622J15918l5434k7170J35421j47774n21J5457
3172i82269j26370K62418J34597l15939j21776J16648J10476j37563n5758M74464
$$ plain form
3243 -536078 -1033360 -795940 -1009952 -1025342 -869285 -895374 -946236 -661489 -996987 -765109
3233 -765109 -736001 -909344 -424341 -1242114 -836347 -463991 -759746 -570169 -1142287 -1054605
3223 -1054605 -841832 -992138 -547740 -947950 -889553 -1469084 -907442 -889630 -1546995 -1169193
3213 -1169193 -1315905 -1264240 -476233 -1317381 -828801 -864424 -1035119 -1004322 -989657 -946033
3203 -946033 -766074 -594267 -856782 -1111495 -509108 -996445 -1227153 -1339254 -1057292 -1084832
3193 -1084832 -1223987 -812063 -1267459 -1335990 -1208018 -1371717 -1058166 -1004609 -1139423 -646229
3183 -646229 -894119 -1298902 -1209788 -1038166 -922248 -957682 -984852 -849431 -997205 -997726 -982269
3172 -982269 -1108639 -846221 -711624 -1027563 -1149339 -1032691 -922215 -1059778 -1115536 -641072
3162f41072l9623k30902L4972J15397J82784m69203K73758K53577l28625k04481
3152a053418J87335k69671K33461j82352j14099L38234m8563l56282L52848K5644
3142h86863Q0187j17483k52686K2927M01421K0007j78630L7486j39836L23612
3132f89858j23675l9867l76763k0979L1355P4477J66847K59968l7092l02424l96580
3121a454591Q16200m76609j2705L58042o05270K63780J22489k442l49059L8807
3111a301358r7022O46639m24039j21134L46548k71560J2483P3526k44625j14852
3101a495394K41541L63679l97237O41612o01028J10038k35830L83767L52787n02120
3091a138185N5330K00533n22614J11902M64280q3869j33241n8569J51606J19354
$$ plain form
3162 -641072 -680695 -911597 -876625 -761228 -578444 -1047647 -773889 -520312 -848937 -1053418
3152 -1053418 -866083 -1135754 -902293 -1084645 -1198744 -860510 -909073 -1265355 -912507 -886863
3142 -886863 -806676 -924159 -1176845 -1153918 -752497 -732490 -911120 -873634 -1013470 -689858
3132 -689858 -813533 -853400 -1230163 -1251142 -1219787 -1145310 -978463 -718495 -755587 -1058011 -1454591
3121 -1454591 -638391 -1115000 -1127705 -769663 -1374933 -1111153 -988664 -991106 -1340165 -1301358
3111 -1301358 -1398380 -751741 -1175780 -1296914 -950366 -1221926 -1209443 -1135917 -1380542 -1495394
3101 -1495394 -1253853 -890174 -1287411 -645799 -1246827 -1136789 -1372619 -988852 -636065 -1138185
3091 -1138185 -1082855 -882322 -1404936 -1293034 -828754 -912623 -1045864 -1104433 -952827 -833473
3081h33473J6408k34983K26777k9380L1299l50678j83232Q9055L09192R4180j04292
3070i69127Q3899l37505K99831j1629J36404k08481J2311j35658J60682l51359
3060a320632P0831l73981P46778j35643J73358k51936J77008j10308L83477q596
3050f49644j94637k73690Q4518n6593J95692J34086j05913l62340K94181M01189
3040e33151l78484M28599o82179K36948j357K29940R447r6390k59934j21513J93752
3029i74322J79988l35578L74734J21558o99480P03848l67785O7374r3558j33293
3019a156514r5218M85178k10819k50171K92217l0995l60289N18489m45815L80516
3009h73421j0178k91504K30042Q8291k69693J00847L7437r55J26416l1769o1448
$$ plain form
3081 -833473 -817065 -1052048 -825271 -854651 -823352 -1174030 -1357262 -1268207 -959015 -864835 -969127
3070 -969127 -885228 -1222733 -922902 -934531 -798127 -1006608 -994297 -1129955 -969273 -1320632
3060 -1320632 -1249801 -1623782 -877004 -1012647 -839289 -1091225 -914217 -1024525 -641048 -649644
3050 -649644 -844281 -1117971 -1033453 -1090046 -894354 -760268 -866181 -1228521 -934340 -533151
3040 -533151 -911635 -483036 -1165215 -928267 -929624 -699684 -690237 -786627 -1046561 -1168074 -974322
3029 -974322 -794334 -1129912 -755178 -633620 -1333100 -629252 -997037 -929663 -1023221 -1156514
3019 -1156514 -1251732 -766554 -977373 -1227544 -935327 -966322 -1326611 -808122 -1253937 -873421
3009 -873421 -883599 -1175103 -945061 -856770 -1126463 -1025616 -988179 -989134 -862718 -894487 -955935
2998i55935k18220r2432K3616L38095k53642k16709L83784o819K61352j68984
2988i05894r1862j15101m98770O28186j56458l0498K45596k95741j40423K67277
2978a093688l425L60998j76577l30348K70635n91Q3088k77761m5860q7230M49548
2967h51211m47982K91652L35216l24316r8834o0702N31657l39740K65473k53687
2957i52474j14517O29323o51260N6497m21310O02425N4584j47087J54263l01348
2947a090904k0877M98957l84487J24170k78715j41623L79807j62286K51105p4085
2937h98938j37510L87069j20826k51673l6005J70943j00965J46596J52300l23327
2927a012336L27587l09596j85165J26247L21288k07284j80947J07648j6393p5958
$$ plain form
2998 -955935 -1174155 -1266587 -1242971 -904876 -1158518 -1375227 -991443 -998262 -736910 -905894
2988 -905894 -997756 -1112857 -1611627 -983441 -1139899 -1170397 -924801 -1220542 -1360965 -1093688
2978 -1093688 -1097113 -736115 -912692 -1243040 -972405 -972996 -889908 -1167669 -1213529 -1300759 -851211
2967 -851211 -1299193 -1007541 -672325 -996641 -1095475 -1156177 -624520 -964260 -698787 -952474
2957 -952474 -1066991 -437668 -1088928 -1032431 -1453741 -851316 -796732 -943819 -789556 -1090904
2947 -1090904 -1111781 -612824 -997311 -873141 -1151856 -1293479 -913672 -1075958 -824853 -898938
2937 -898938 -1036448 -649379 -770205 -1021878 -1057883 -886940 -987905 -841309 -689009 -1012336
2927 -1012336 -684749 -994345 -1179510 -1053263 -731975 -939259 -1120206 -1012558 -1028951 -1104909
2917a104909M57632J30087k53137k13401k49688N8228k59620N54996j32137N5666
2907i56283n4266k2030M90530m50423N4561k74313J59032L36604J07166o23119
2897a232541R2382n2004K34972J01342J10633o304j89058K26430l1563k4858n0661
2886h21230j34851K02141r64843P11400P1182K0650r6506l15986P687N8873J63207
2875a098276L94017o01618K22932J36199n14094N2922K90874J17026J82M73402
2865e26434k5179p87273M05655q2877K4730k63076L01322Q4624P1963k9424m92283
2854a318252j39455P20806k50624M73227l49380j46972P1311P6097J1688k31720
2844a083274L22841l99223O6757J34211k9380K48790l64340Q5189l9403k6138
$$ plain form
2917 -1104909 -647277 -517190 -770327 -983728 -1233416 -1175188 -1434808 -879812 -1011949 -956283
2907 -956283 -1010549 -1032579 -542049 -992472 -937911 -1212224 -1053192 -716588 -609422 -1232541
2897 -1232541 -1140159 -1192163 -957191 -855849 -745216 -751520 -940578 -714148 -745711 -770569 -821230
2886 -821230 -956081 -753940 -1718783 -1007383 -936201 -915551 -1012057 -1328043 -1320356 -1261483 -1098276
2875 -1098276 -704259 -1305877 -1082945 -946746 -1460840 -1407918 -1117044 -1000018 -999836 -526434
2865 -526434 -551613 -1338886 -933231 -1016108 -991378 -1254454 -953132 -868508 -796545 -825969 -1318252
2854 -1318252 -1457707 -736901 -987525 -514298 -863678 -1010650 -939339 -863242 -851554 -1083274
2844 -1083274 -760433 -1159656 -1092899 -958688 -988068 -739278 -1103618 -1018429 -1057832 -1083970
2834a083970P5709J40630k69538J61279J79399l89541N01096l3387K02621m56986
2824i72688O30380l94944k37924L36890m20527M06820l79971j25449j46389N5453
2814a248349K08189j30787r7465K09396J64874l66220M73616k07222j58636K20052
2804i32552O5252Q7731l85712L51738m9633K80081n03165l3357j69067l2399o528
2793a327611O25219n47721R7498j02777P9909o2130M18334K78500q95817N18300
2783i18296l67996J08604K74009M29395m67645k35166J22231K89460k05529m46729
2773a417662N52749j87982L8985L1507j5898M7141l1814k27134K52360K57094
2763g00654o32549K29304K50394k92492L31914j79840P6532j72085M04481m24759
$$ plain form
2834 -1083970 -1008261 -867631 -1137169 -975890 -796491 -1186032 -684936 -718323 -515702 -972688
2824 -972688 -342308 -737252 -975176 -638286 -1058813 -651993 -1031964 -1157413 -1303802 -1248349
2814 -1248349 -1040160 -1170947 -1268412 -1059016 -894142 -1260362 -786746 -993968 -1152604 -932552
2804 -932552 -867300 -779569 -1165281 -813543 -863176 -583095 -1086260 -1119617 -1288684 -1321083 -1327611
2793 -1327611 -702392 -1250113 -1152615 -1255392 -1175483 -1237613 -819279 -540779 -1436596 -918296
2783 -918296 -1286292 -1177688 -903679 -474284 -941929 -1177095 -1054864 -765404 -970933 -1417662
2773 -1417662 -864913 -1052895 -1013910 -982403 -998301 -951160 -982974 -1210108 -957748 -700654
2763 -700654 -1333203 -1103899 -853505 -1145997 -814083 -993923 -917391 -1089476 -684995 -1109754
2753a109754K21069J57407m2511J44844l61749q1097N5985j39282K27462p4089
2743a001715j67270K2322K59159j34769J81054Q2429L5908l49385L82381k28310
2733i18196k84168R8276N3806j51410K75376p3517M96774l24728l33168O47291
2723e13664m94457J88010l0307J20008j80426N9436J08549k28015n0270K17159
2713h03977q5434J29570l1961q4154p6543k41824K79850n3460m6644J18142j14004
2702a010439J38712p6506J03479j95066K28213p0102k7107K08062j05196J81469
2692f24481l862m13392K49567k86832K46776p6761j66248L09018j44622k96439
2682a207276j49681L69940k2109m2818r3042n9297j29876P19960l40673j24114
$$ plain form
2753 -1109754 -888685 -731278 -773789 -628945 -990694 -1071791 -1015806 -1155088 -927626 -1001715
2743 -1001715 -1168985 -1146663 -887504 -1022273 -841219 -758790 -722882 -1072267 -689886 -918196
2733 -918196 -1202364 -1104088 -1050282 -1201692 -926316 -999833 -503059 -827787 -1160955 -513664
2723 -513664 -1008121 -820111 -850418 -730410 -910836 -851400 -742851 -970866 -1021136 -803977
2713 -803977 -889411 -759841 -791802 -875956 -952499 -1194323 -914473 -967933 -1014577 -896435 -1010439
2702 -1010439 -871727 -948233 -844754 -1039820 -811607 -881709 -908816 -700754 -805950 -624481
2692 -624481 -628343 -1041735 -792168 -1079000 -832224 -908985 -1075233 -766215 -910837 -1207276
2682 -1207276 -1356957 -987017 -1009126 -1051944 -1144986 -1204283 -1334159 -614199 -954872 -1078986
2672a078986o3299K42717k56114K44186r4305J18906j36109L0889l56009N88174
2662g59950m00481J99950L0725l37299J96204j27426O1655K76072q487j16365
2652i85402j49717Q5790K17879k89364M53544l18176K55958J04349n00437R0305
2642a035271K1710O0415O5085j36256J73953j26155J75124k81676K15413N4597
2632h13061L6652q3994K14600l08690J45853p5026j63208J12597K01299J73823
2622e59155k50611m20224P1859Q2053J10306m1868j02107K16254J10764j12534
2612h95263J76647n22337K82372J15482Q5338J92522k13158K55969j16669l05453
2602i44550k60267J90270M6064J11678k70841J24019J08443K70116m41380M27994
$$ plain form
2672 -1078986 -1142285 -899568 -1155682 -911496 -1005801 -886895 -1023004 -992115 -1348124 -759950
2662 -759950 -1160431 -960481 -929756 -1267055 -1070851 -1198277 -1136622 -860550 -869037 -985402
2652 -985402 -1135119 -1049329 -831450 -1120814 -667270 -985446 -729488 -625139 -1125576 -1035271
2642 -1035271 -1013561 -953146 -888061 -1024317 -850364 -976519 -801395 -1083071 -867658 -813061
2632 -813061 -776409 -860403 -645803 -954493 -808640 -883666 -1046874 -934277 -732978 -559155
2622 -559155 -809766 -1229990 -1158131 -1076078 -965772 -1007640 -1109747 -893493 -782729 -895263
2612 -895263 -718616 -1240953 -958581 -843099 -757761 -565239 -778397 -522428 -639097 -944550
2602 -944550 -1204817 -1014547 -968483 -856805 -1127646 -1003627 -895184 -625068 -1066448 -638454
2592f38454j03442j23436R9867K21092m00790k28275L07766k83882L02894P0804
2582g75856k49935K2943J17775k09585N29671l42574l0514P1788k19330K53538
2572h32079k3550J21827l27408J79115j66398J21422j2548j973K58796n8797j99139
2561i40732K68605k07927j12249l30291J55520N22340j39175J11381o28959R4742
2551a206745J82017J53226k39111J76734m22298O70360k31767p5808Q2699J10010
2541h00683L9930j40204L0628L03972k40944R303k73152j30986N71692j74822
2531h05266K9944L57156p82077L63390K19911J43851R9715o65248l62121N77950
2521h22795j10989K11678J33110o31849K59404J38532J9433j92027K00988k90312
$$ plain form
2592 -638454 -741896 -865332 -765465 -544373 -945163 -1173438 -865672 -1149554 -846660 -775856
2582 -775856 -1025791 -1002848 -885073 -1094658 -564987 -907561 -938075 -866287 -1085617 -832079
2572 -832079 -855629 -733802 -1061210 -882095 -1048493 -927071 -939619 -941592 -682796 -741593 -940732
2561 -940732 -672127 -880054 -992303 -1322594 -1167074 -644734 -783909 -672528 -1301487 -1206745
2551 -1206745 -1024728 -871502 -1110613 -933879 -1356177 -685817 -917584 -993392 -910693 -800683
2541 -800683 -760753 -900957 -870329 -566357 -807301 -797998 -1071150 -1202136 -630444 -805266
2531 -805266 -775322 -418166 -1200243 -836853 -616942 -473091 -373376 -1038624 -1400745 -822795
2521 -822795 -933784 -722106 -588996 -1220845 -961441 -822909 -803476 -995503 -794515 -1084827
2511a084827j10706M32932k83746K04889J66395j44359j82661L51496j76073M11378
2501d15282o40504J63298k6799M9052K6825K60833m80375r8498L55629N1480n0395
2490h04736J82843p53295O19771l1941L9679l24180P4367j67908P144M52752l68712
2479a074216L40915m38793r8325M88875j82814J4887q707k58145K59536J82869
2469g73918p1610J03912j76817k6150K55133j36541m04921N55424k22162J76184
2459g21466m57616K31308o1390L69378l58476j08074K37529P9225J72910j06449
2449g23121l0651M6871L7551k11004o3461j8734K77563L4289l24261j46181L30548
2438g90591m14814M55821J88077l14773o8255Q1799J03874L75924k71538J44883
$$ plain form
2511 -1084827 -1195533 -762601 -1046347 -841458 -675063 -819422 -1002083 -650587 -826660 -415282
2501 -415282 -1055786 -892488 -919287 -870235 -843410 -582577 -1062952 -1161450 -805821 -754341 -804736
2490 -804736 -621893 -1375188 -755417 -787358 -747679 -1071859 -997492 -1165400 -1158256 -705504 -1074216
2479 -1074216 -733301 -1172094 -1270419 -781544 -964358 -949471 -958178 -1216323 -956787 -773918
2469 -773918 -845528 -741616 -918433 -944583 -689450 -825991 -1230912 -675488 -897650 -721466
2459 -721466 -1179082 -947774 -1009164 -639786 -998262 -1106336 -868807 -789582 -616672 -723121
2449 -723121 -753772 -706901 -669350 -880354 -943815 -962549 -684986 -650697 -974958 -1121139 -790591
2438 -790591 -1205405 -749584 -561507 -876280 -944535 -862736 -758862 -382938 -654476 -509593
2428e09593k81302l53218N63987j10732j27886M53179o88035L08134n547l16709
2418a067722J65389k39617K20625r3382K7255Q0126L1228j82136J37833k80532
2408a200933J20085J89382J56373J23106k83943K36848K02446n74259R104N49626
2398d72165o58144K06310K93882l29959j52048J02268k34357J22956M21285k94530
2388i94502N93670j80611k47926J12811j13307j44770K54460o02043N76682k67236
2378a012772M86636n66414K15096Q2795j59499P4281L00259n63248L1520K50631
2368h60715K01776P9473J49767m50240K0723M50701j18065n1663m39653O8241
2358i49655L80979l83470L04166l72167j21473J33754k30150P1739P9413M46649
$$ plain form
2428 -509593 -790895 -1144113 -580126 -690858 -818744 -365565 -1053600 -745466 -751013 -1067722
2418 -1067722 -902333 -1141950 -921325 -1014707 -987452 -907326 -876098 -1058234 -920401 -1200933
2408 -1200933 -1080848 -891466 -735093 -611987 -895930 -659082 -456636 -1030895 -1021791 -472165
2398 -472165 -1130309 -923999 -630117 -960076 -1112124 -1009856 -1244213 -1121257 -699972 -994502
2388 -994502 -400832 -581443 -829369 -716558 -829865 -974635 -720175 -1322218 -745536 -1012772
2378 -1012772 -526136 -1092550 -877454 -794659 -954158 -879877 -579618 -1142866 -1111346 -860715
2368 -860715 -658939 -579466 -429699 -879939 -859216 -408515 -526580 -578243 -1017896 -949655
2358 -949655 -568676 -952146 -647980 -1020147 -1141620 -1007866 -1238016 -1166277 -1086864 -640215
2348f40215l06014J87326m50556M09245k14372k29940K42343p7927K2324K43304
2338h14482j03779K28795k16723m84896L32793L00686l25844O4498j45843j07031
2328a271826L34635J96293r2138K45605l98746J55834J77714l63443M18344k50126
2318h47854j35856K04062p9205J37382P4824j40546l07683K23371l11100k0193
2308a202798M90551q985k6145k01077n2126q9395j01171L03067N11388m79336
2298h56027j26258K06470k27449M17191n74773J003161p30246L98104p38810L66472
2288h62165K76639l23736O0910O8559J2715J68228j13739k6112m345K78758m24001
2277h88289r9770K42368l95188R5679J30972N4536m1581M5529l98043J81052q122
$$ plain form
2348 -640215 -946229 -758903 -1209459 -800214 -1014586 -1244526 -1002183 -1080110 -1057786 -814482
2338 -814482 -918261 -689466 -906189 -1391085 -1058292 -757606 -1083450 -1018952 -1164795 -1271826
2328 -1271826 -937191 -740898 -833036 -587431 -986177 -830343 -652629 -1016072 -597728 -847854
2318 -847854 -983710 -779648 -858853 -721471 -646647 -787193 -1094876 -871505 -1182605 -1202798
2308 -1202798 -712247 -721232 -747377 -948454 -1000580 -1089975 -1191146 -888079 -376691 -856027
2298 -856027 -982285 -775815 -1003264 -586073 -1160846 -157685 -887931 -489827 -1228637 -862165
2288 -862165 -585526 -909262 -848352 -779793 -767078 -598850 -712589 -738701 -743046 -464288 -888289
2277 -888289 -988059 -745691 -1140879 -1045200 -914228 -859692 -901273 -855744 -1253787 -1072735 -1080857
2266a080857J96422m5797L3843m37675J64979M13372o12639N42649m50582M9278
2256a227007K88613M9712j55550M9196M08466n53040J85596J58920J8514n6710
2246h33290o1208r0448j95553K79370k61778O34291o07365J55655J36893r4401
2236i37834N28381n98706Q9833R0884l00161J95290L08400n20420O43323j88357
2226f89367M963k0985K8160N6622k38410J28449o7700K60703o05730M7324K76077
2215h19894j10555M07440m64103J80567L02332P6567m97983L94959l23390J34878
2205g19182J26455m66219L60391k95310K44518K9723k46946J77510K3315J50365
2195f15380k44910M2759L5915J1764k9466l28159M98217l47026J82554l25051
$$ plain form
2266 -1080857 -884435 -930232 -896389 -1334064 -1169085 -755713 -1368352 -825703 -1276285 -1227007
2256 -1227007 -938394 -888682 -1044232 -995036 -586570 -1139610 -954014 -795094 -776580 -833290
2246 -833290 -894498 -984946 -1180499 -901129 -1162907 -528616 -1135981 -980326 -843433 -937834
2236 -937834 -409453 -1008159 -918326 -827442 -1127603 -932313 -623913 -1144333 -501010 -689367
2226 -689367 -684404 -705389 -677229 -620607 -859017 -730568 -798268 -537565 -1143295 -1095971 -819894
2215 -819894 -930449 -523009 -987112 -806545 -504213 -427646 -925629 -530670 -854060 -719182
2205 -719182 -592727 -1058946 -698555 -993865 -749347 -719624 -966570 -789060 -765745 -615380
2195 -615380 -860290 -817531 -781616 -769852 -799318 -1127477 -629260 -976286 -793732 -1118783
2185a118783J91475K4467J82456k74311J50242J79431R2997j51303k3818k64920
2175a012067N5077J11159m49313L65704K09171l95753O096N0063L42139l27548
2165a045272J48109K58514M3405j49114m04659L44466k4010k26807q716Q729L72510
2154f82845K7064k18083K28609k26556K4664j97190L5835P05280l58927j75969
2144h38118m15183K28380J87159j25115K47118j6072L23939k19519l68627K32713
2134g63325j10821l02555J87787M90743k57012k93002J40946j40889Q3154K50864
2124g14110n4917L07881M8734n31637R0998j10602K23828J55845m62278L79110
2114f67148r3744k24537J80717N6586j47184K1016K39821k47288O4122J7110j6998
$$ plain form
2185 -1118783 -927308 -902841 -720385 -994696 -844454 -665023 -572026 -723329 -747147 -1012067
2175 -1012067 -956990 -845831 -1295144 -929440 -720269 -1116022 -1109926 -1059863 -717724 -1045272
2165 -1045272 -897163 -638649 -595244 -744358 -1149017 -804551 -828561 -1055368 -1064084 -1055355 -682845
2154 -682845 -655781 -873864 -645255 -871811 -847147 -1044337 -1008502 -303222 -662149 -838118
2144 -838118 -1253301 -1024921 -837762 -962877 -715759 -731831 -407892 -627411 -996038 -763325
2134 -763325 -874146 -1176701 -988914 -498171 -755183 -1048185 -907239 -1048128 -964974 -714110
2124 -714110 -769027 -461146 -412412 -944049 -853051 -963653 -739825 -583980 -1046258 -667148
2114 -667148 -760892 -985429 -804712 -748126 -895310 -874294 -634473 -881761 -817639 -800529 -817527
2103h17527L48746l47609j35283q4884K11292K61575j36909j96164M83830l74728
2093g87661J25200m57573K78384l3862q6394k34896L96877m76735L50250j81680
2083a108090r2470K10099o2728L71852K80678k82593l23637K3110O4397k31050
2073a150432M73127J38034r6921l22493n4477J30283J15620J21522q0943l93331
2063a120011q2468M63564l1696J47179L9638l19045j49541J72479N70277m37805
2053g47429K89249m46408L88212l47674M6861K39705l13007j96631M75883n78238
2043a189477p725L21445L71578l62225l78727M01439K83745m80948L27131p6599
2033g90363m0074j26241R4544L05730j20457n46821L03087K83516k51826j1660
$$ plain form
2103 -817527 -468781 -816390 -951673 -1036557 -825265 -563690 -700599 -896763 -412933 -787661
2093 -787661 -662461 -1120034 -841650 -875512 -961906 -1196802 -799925 -1276660 -926410 -1108090
2083 -1108090 -1200560 -990461 -1053189 -681337 -400659 -683252 -1006889 -983779 -919382 -1150432
2073 -1150432 -677305 -539271 -636192 -958685 -1013162 -882879 -767259 -645737 -726680 -1120011
2063 -1120011 -1202479 -738915 -770611 -623432 -583794 -902839 -1052380 -879901 -309624 -747429
2053 -747429 -458180 -904588 -516376 -864050 -817189 -577484 -890491 -1087122 -611239 -1189477
2043 -1189477 -1197202 -875757 -504179 -866404 -1245131 -843692 -559947 -1040895 -713764 -790363
2033 -790363 -830437 -956678 -862134 -556404 -676861 -1223682 -920595 -637079 -888905 -900565
2023i00565j36122N60349l95157N62067n07487k74791n1599L42103J54897k53347
2013h99652J76809l54130N35986p1507m14472j5361j68838O23687j69711n0068
2003h07257N8471J58071l13409L86667l26852N0684J40075j68539j61093j9907
1993a003089K81984j39329K4603K05528j72026j61042K81346k247o474m42188
1983a132934L6839L83408j11969j46078L13234k75402n2708o3604L41203J35895
1973e72116k55646Q3250K23110n54314L03497l04385K54174L50371k69843j68465
1963i10367j32638j05639N12312o35722K71660K19893j32200l62638K11437L55835
1953g08067K24563m20448K39383j48767k15232K59942K21872l67412M56877l66070
$$ plain form
2023 -900565 -1036687 -476338 -871495 -309428 -816915 -1091706 -1143305 -801202 -646305 -899652
2013 -899652 -722843 -1076973 -540987 -612494 -1026966 -1042327 -1211165 -587478 -757189 -807257
2003 -807257 -748786 -590715 -904124 -517457 -844309 -793625 -653550 -822089 -983182 -1003089
1993 -1003089 -721105 -860434 -835831 -630303 -802329 -963371 -682025 -684272 -690746 -1132934
1983 -1132934 -1096095 -712687 -824656 -970734 -657500 -932902 -985610 -1049214 -708011 -572116
1973 -572116 -827762 -744512 -521402 -1075716 -772219 -1076604 -822430 -472059 -741902 -910367
1963 -910367 -1043005 -1148644 -636332 -1272054 -1000394 -780501 -912701 -1275339 -1063902 -708067
1953 -708067 -483504 -903952 -664569 -813336 -1028568 -768626 -546754 -914166 -457289 -823359
1943h23359n2778K5275k22599J83682L57981n793l44605R3013j82430K69359k57414
1932i59668n9489J6701J32382N31474m46656O6123N6670q8604k99239J45816N94156
1921c10334o04129J25877j77393P4583J43280l25227k16924J36295O11237j14240
1911f56975m52157J19331J65825L15775n10313K00245j47269p6323L82363k07112
1901h66610J94318j82379J86010m9973j85421L81K30209K17043j67678j21673
1891g45773k57107L40763m44938L10463P1706k01810L68733k14716j16004k34303
1881a122986N92911l45497M16237l67781j81007M62659k37605K89634q991j13764
1871f16190k01436j31516N72802l86548j71829L22134q3038n2437K16770n14759
$$ plain form
1943 -823359 -876137 -850862 -1073461 -889779 -531798 -537591 -882196 -789183 -971613 -702254 -959668
1932 -959668 -1019157 -1002456 -870074 -338600 -785256 -719133 -662463 -751067 -1050306 -904490 -310334
1921 -310334 -914463 -788586 -965979 -891396 -748116 -1073343 -1290267 -1153972 -542735 -656975
1911 -656975 -1109132 -989801 -823976 -508201 -1018514 -818269 -965538 -1041861 -659498 -866610
1901 -866610 -672292 -854671 -668661 -718634 -904055 -903674 -673465 -456422 -624100 -745773
1891 -745773 -1002880 -662117 -1107055 -796592 -724886 -926696 -557963 -772679 -888683 -1122986
1881 -1122986 -530075 -875572 -459335 -827116 -1008123 -545464 -783069 -493435 -502426 -616190
1871 -616190 -817626 -949142 -376340 -762888 -934717 -612583 -695621 -748058 -531288 -1046047
1861a046047N10972j81010P6441k06557O4383J55164r3972q3364J21358m1336
1851g23968l5741o3617k99643K88905m5388P4109j37242j52750L82014L3091J01853
1840e78377l2120M2013j75987J82253n5115k43497L89513m86584L26426m68782
1830a100257L29433J2200K8901j15821o4161J46349p9511K57054o76370L07690
1820i54493J08612j29027M3038N89447m38664k87713L88481o2887j43274R6264
1810g90216J59499M69893r24004N24230l56426o4225k32851M72186L4294K04225
1800e03395l23568M3768K07948J37044n99237J59912J15860K1525J79719k04276
1790g64700J42911K61213m91105m10811M45949j89122Q9618l54719M42225L32235
$$ plain form
1861 -1046047 -535075 -716085 -639644 -846201 -781818 -626654 -720626 -803990 -682632 -723968
1851 -723968 -759709 -823326 -1122969 -834064 -879452 -805343 -942585 -1095335 -713321 -680230 -578377
1840 -578377 -610497 -568484 -744471 -562218 -617333 -860830 -471317 -957901 -631475 -1100257
1830 -1100257 -770824 -758624 -729723 -845544 -909705 -763356 -842867 -585813 -1262183 -954493
1820 -954493 -845881 -974908 -931870 -342423 -781087 -1068800 -680319 -743206 -886480 -790216
1810 -790216 -630717 -160824 -1084828 -560598 -917024 -981249 -1214100 -741914 -707620 -503395
1800 -503395 -826963 -783195 -575247 -438203 -1037440 -877528 -761668 -740143 -560424 -764700
1790 -764700 -621789 -360576 -851681 -1262492 -816543 -1005665 -916047 -1270766 -828541 -496306
1780d96306j71224j82194j18504J56954k39859K53827l94186K63527J28616N4958
1770g44391J69396P9793o35677J65418K50452j07114N8633k34395J62909L34161
1760e00815k74317m9360j21767k067J52438L4871o8532p2782q2610J07664K74604
1749f02673k45425Q7414m2741N4123q1255j52195L27328r4750k15443K60346l43838
1738a049109L28066J44399q76767N64521k52915M72842l44942M99459j78632p6868
1728g69946J60182l43875N936K69353r1928j70429j92075M38868j68462Q2493
1718g79883j37662M51032k76842j16033J10010J81637j25086Q377K02904l15801
1708g97347o1965j08405m276J43245J70134l5877k23976N84617j18731l75836
$$ plain form
1780 -496306 -667530 -849724 -968228 -811274 -1051133 -797306 -1191492 -927965 -799349 -744391
1770 -744391 -574995 -495202 -1130879 -965461 -715009 -822123 -763490 -997885 -834976 -500815
1760 -500815 -775132 -824492 -946259 -948326 -795888 -761017 -829549 -902331 -984941 -877277 -602673
1749 -602673 -848098 -760684 -803425 -749302 -830557 -982752 -655424 -750174 -965617 -705271 -1049109
1738 -1049109 -721043 -576644 -1453411 -888890 -1141805 -668963 -1013905 -514446 -693078 -769946
1728 -769946 -609764 -953639 -947703 -678350 -770278 -940707 -1132782 -693914 -862376 -779883
1718 -779883 -917545 -466513 -743355 -859388 -749378 -567741 -692827 -684450 -481546 -797347
1708 -797347 -859312 -967717 -971993 -828748 -658614 -694491 -918467 -333850 -452581 -828417
1698h28417j77585k5162N67589l6368p3917l45999N93570m6393p0592l16628P3476
1687f86426Q2163k32087n4494J45957k01229O8527n8544J58460L20436n1843O5224
1676d43856q6524m1977J81106n04650M64315n46508L09389L7318M96031m45793
1666e81149j09343m83508M77095l01322j66647J47398J64958O13153p91602K77945
1656g53022l86739L85081l46932L00868l45675K14917j54752N12234l17168K37683
1646f53505k14520J0662O1542P2668j79532M6904K14988m22469L45238l08034
1636a026058J43722j61484j2783L20902L938k19418J37871m3480J37848R9363
1626f19579k92964L26620l51821M6482M8712K39759j49590r4705K37573m43675
$$ plain form
1698 -828417 -1006002 -1031164 -463575 -499943 -573860 -919859 -326289 -372682 -443274 -759902 -686426
1687 -686426 -604263 -836350 -890844 -744887 -946116 -877589 -936133 -777673 -457237 -509080 -443856
1676 -443856 -530380 -572357 -391251 -895901 -431586 -978094 -668705 -631387 -135356 -581149
1666 -581149 -690492 -1174000 -696905 -998227 -1164874 -1017476 -852518 -239365 -1030967 -753022
1656 -753022 -1139761 -754680 -1101612 -800744 -1146419 -931502 -1086254 -574020 -891188 -653505
1646 -653505 -868025 -857363 -795821 -723153 -902685 -855781 -640793 -1063262 -718024 -1026058
1636 -1026058 -882336 -1043820 -1056603 -735701 -731763 -951181 -813310 -856790 -718942 -619579
1626 -619579 -912543 -585923 -937744 -891262 -842550 -602791 -752381 -847086 -609513 -1053188
1616a053188J90599J0587L45853k79655J43970n8021l8201l19431K07453L24775
1606e25259j84767R0945J91361m61882J97260k59002K49188L44441p2799m06207
1596h36721k48134L55808k13789J63477J3145N5217j50591N21317m48840L66565
1586d22546l40346m14415M10912N1512p4265m8970k7918m1555j34296K63879k36299
1575a014307K84262j51020J30558J72475O4537k33662j81468J88268J82363l19229
1565h77223l4726J38960j42358K76960q1707j18444L97398o65715K23317J4784
1555h68754k758J07245j80202J87062n57564L6050P62754k67416L95827m42996
1545h30752n911J81895j03240P9639l5720J59553n46844K92631r8726J07509j2570
$$ plain form
1616 -1053188 -862589 -852002 -506149 -785804 -641834 -699855 -738056 -1057487 -850034 -525259
1606 -525259 -710026 -619081 -427720 -889602 -692342 -951344 -702156 -357715 -430514 -836721
1596 -836721 -1084855 -729047 -942836 -779359 -766214 -710997 -861588 -340271 -789111 -422546
1586 -422546 -762892 -1177307 -766395 -714883 -789148 -838118 -866036 -907591 -1041887 -778008 -1014307
1575 -1014307 -730045 -881065 -750507 -578032 -513495 -747157 -928625 -740357 -557994 -877223
1565 -877223 -911949 -772989 -915347 -638387 -720094 -838538 -441140 -1106855 -883538 -868754
1555 -868754 -871512 -764267 -944469 -757407 -1314971 -1278921 -516167 -783583 -387756 -830752
1545 -830752 -836663 -654768 -758008 -678369 -714089 -554536 -1101380 -808749 -907475 -799966 -812536
1534h12536J08122M1504j88726j10518l1l6617K77619k60616L23626J23483o24277
1523a158967O80273k74444P5665J22915l54730J57902k46452K19164k76253K14273
$$ plain form
1534 -812536 -704414 -662910 -851636 -962154 -962185 -998802 -721183 -981799 -658173 -534690 -1158967
1523 -1158967 -478694 -753138 -677473 -554558 -909288 -751386 -997838 -778674 -1054927 -840654
$$ [...]
##END NTUPLES=NMR SPECTRUM
##END=
