##TITLE=abcd
##JCAMPDX= 6.0         $$ Bruker NMR JCAMP-DX V2.0
##DATA TYPE= NMR FID
##DATA CLASS= NTUPLES
##ORIGIN= UXNMR, Bruker Analytische Messtechnik GmbH
##OWNER= root
$$ XWIN-NMR		Version 3.5
$$ Wed Jul 23 12:15:46 2025 Russian Standard Time (UT+4h)  servis@DPX200
##.OBSERVE FREQUENCY= 200.131235884673
##.OBSERVE NUCLEUS= ^1H
##.DELAY= (6, 6)
##.ACQUISITION MODE= SIMULTANEOUS
##.ACQUISITION SCHEME= undefined
##.AVERAGES= 32
##.DIGITISER RES= 18
##SPECTROMETER/DATA SYSTEM= spect
##.PULSE SEQUENCE= zg
##.SOLVENT NAME= CDCl3
##.SHIFT REFERENCE= (INTERNAL, CDCl3, 0, 16.5164)
##AUDIT TRAIL= $$ (NUMBER, WHEN, WHO, WHERE, WHAT)
$$ ##TITLE= Audit trail, XWIN-NMR		Version 3.5
$$ ##JCAMPDX= 5.01
$$ ##ORIGIN= Bruker BioSpin GmbH
$$ ##OWNER= servis
$$ F:\spectra/data/av/nmr/H1/1/audita.txt
$$ ##AUDIT TRAIL=  $$ (NUMBER, WHEN, WHO, WHERE, WHAT)
(   1,<2025-07-23 12:14:58.85 +0400>,<servis>,<DPX200>,
      <created by zg, POWCHK disabled, PULCHK disabled
       configuration hash MD5:
       00 E9 B6 7A A2 85 ED C7 34 08 36 98 17 FE 4E 26
       data hash MD5: 32K
       61 6F C7 EE B4 46 89 8D 65 BC 2A 97 8F 62 D8 33>)
$$ ##END=
$$ 
$$ hash MD5
$$ D0 2A A4 90 49 85 BF A3 BF 66 A8 CE E7 98 D9 6A
##$RELAX= 
##$RELAX= 
##$RELAX= 
##$RELAX= 
##$RELAX= 
##$RELAX= 
##$RELAX= 
##$RELAX= 
$$ Bruker specific parameters
$$ --------------------------
##$DU= <F:\spectra>
##$EXPNO= 1
##$NAME= <H1>
##$PROCNO= 1
##$TYPE= <nmr>
##$USER= <av>
##$AMP= (0..31)
100 100 100 100 100 100 100 100 100 100 100 100 100 100 100 100 100 100 
100 100 100 100 100 100 100 100 100 100 100 100 100 100 
##$AQSEQ= 0
##$AQ_mod= 1
##$AUNM= <au_zg>
##$AUTOPOS= <>
##$BF1= 200.13
##$BF2= 200.13
##$BF3= 200.13
##$BF4= 200.13
##$BF5= 500.13
##$BF6= 500.13
##$BF7= 500.13
##$BF8= 500.13
##$BYTORDA= 1
##$CFDGTYP= 0
##$CFRGTYP= 5
##$CHEMSTR= <none>
##$CNST= (0..31)
1 1 145 1 1 1 1 1 1 1 1 1 1 1 1 1 1 1 1 1 1 1 1 1 1 1 1 1 1 1 1 1 
##$CPDPRG= <>
##$CPDPRG1= <>
##$CPDPRG2= <>
##$CPDPRG3= <>
##$CPDPRG4= <mlev>
##$CPDPRG5= <mlev>
##$CPDPRG6= <mlev>
##$CPDPRG7= <mlev>
##$CPDPRG8= <mlev>
##$CPDPRGB= <>
##$CPDPRGT= <>
##$D= (0..31)
0 2 0 0 0 0 0 0 0 0.06 0 0 0 0 0 0 0.0002 0 0 0 0 0 0 0 0 0 0 0 0 0 0 
0 
##$DATE= 1753258498
##$DBL= (0..7)
120 120 120 120 120 120 120 120 
##$DBP= (0..7)
150 150 150 150 150 150 150 150 
##$DBP07= 0
##$DBPNAM0= <>
##$DBPNAM1= <>
##$DBPNAM2= <>
##$DBPNAM3= <>
##$DBPNAM4= <>
##$DBPNAM5= <>
##$DBPNAM6= <>
##$DBPNAM7= <>
##$DBPOAL= (0..7)
0.5 0.5 0.5 0.5 0.5 0.5 0.5 0.5 
##$DBPOFFS= (0..7)
0 0 0 0 0 0 0 0 
##$DE= 6
##$DECBNUC= <off>
##$DECIM= 32
##$DECNUC= <off>
##$DECSTAT= 4
##$DIGMOD= 1
##$DIGTYP= 9
##$DL= (0..7)
0 120 120 120 120 120 120 120 
##$DP= (0..7)
150 150 150 150 150 150 150 150 
##$DP07= 0
##$DPNAME0= <>
##$DPNAME1= <>
##$DPNAME2= <>
##$DPNAME3= <>
##$DPNAME4= <>
##$DPNAME5= <>
##$DPNAME6= <>
##$DPNAME7= <>
##$DPOAL= (0..7)
0.5 0.5 0.5 0.5 0.5 0.5 0.5 0.5 
##$DPOFFS= (0..7)
0 0 0 0 0 0 0 0 
##$DQDMODE= 0
##$DR= 18
##$DS= 0
##$DSLIST= <SSSSSSSSSSSSSSS>
##$DSPFIRM= 0
$$ [...]
##$SUBNAM0= <"">
##$SUBNAM1= <"">
##$SUBNAM2= <"">
##$SUBNAM3= <"">
##$SUBNAM4= <"">
##$SUBNAM5= <"">
##$SUBNAM6= <"">
##$SUBNAM7= <"">
##$SUBNAM8= <"">
##$SUBNAM9= <"">
##$SW= 20.6817932712277
##$SWIBOX= (0..15)
0 0 3 0 0 0 0 0 0 0 0 0 0 0 0 0 
##$SW_h= 4139.07284768212
##$TD= 32768
##$TD0= 1
##$TE= 0
##$TE2= 300
##$TE3= 300
##$TEG= 300
##$TL= (0..7)
0 120 120 120 120 120 120 120 
##$TP= (0..7)
150 150 150 150 150 150 150 150 
##$TP07= 0
##$TPNAME0= <>
##$TPNAME1= <>
##$TPNAME2= <>
##$TPNAME3= <>
##$TPNAME4= <>
##$TPNAME5= <>
##$TPNAME6= <>
##$TPNAME7= <>
##$TPOAL= (0..7)
0.5 0.5 0.5 0.5 0.5 0.5 0.5 0.5 
##$TPOFFS= (0..7)
0 0 0 0 0 0 0 0 
##$TUNHIN= 0
##$TUNHOUT= 0
##$TUNXOUT= 0
##$USERA1= <user>
##$USERA2= <user>
##$USERA3= <user>
##$USERA4= <user>
##$USERA5= <user>
##$V9= 5
##$VALIST= <valist>
##$VCLIST= <CCCCCCCCCCCCCCC>
##$VD= 0
##$VDLIST= <DDDDDDDDDDDDDDD>
##$VPLIST= <PPPPPPPPPPPPPPP>
##$VTLIST= <TTTTTTTTTTTTTTT>
##$WBST= 1024
##$WBSW= 30
##$XGAIN= (0..3)
0 0 0 0 
##$XL= 0
##$YL= 0
##$YMAX_a= 1796311
##$YMIN_a= -703552
##$ZGOPTNS= <>
##$ZL1= 120
##$ZL2= 120
##$ZL3= 120
##$ZL4= 120
##$ABSF1= 10
##$ABSF2= 0
##$ABSG= 5
##$ABSL= 3
##$ALPHA= 0
##$AQORDER= 0
##$ASSFAC= 0
##$ASSFACI= 0
##$ASSFACX= 0
##$ASSWID= 0
##$AUNMP= <proc_1d>
##$AZFE= 0.1
##$AZFW= 0.1
##$BCFW= 1
##$BC_mod= 2
##$BYTORDP= 0
##$COROFFS= 0
##$CY= 19
##$DATMOD= 1
##$DC= 2
##$DFILT= <>
##$DTYPP= 0
##$F1P= 11.0000007629395
##$F2P= -0.999999237060547
##$FCOR= 0.5
##$FTSIZE= 0
##$FT_mod= 4
##$GAMMA= 1
##$GB= 1
##$INTBC= 1
##$INTSCL= 1
##$ISEN= 128
##$LB= 0.05
##$LEV0= 0
##$LPBIN= 0
##$MAXI= 10000
##$MC2= 0
##$MEAN= 0
##$ME_mod= 0
##$MI= 0
##$NCOEF= 0
##$NC_proc= 0
##$NLEV= 6
##$NOISF1= 0
##$NOISF2= 0
##$NSP= 1
##$NTH_PI= 0
##$NZP= 0
##$OFFSET= 16.51637
##$PC= 1
##$PHC0= -275.1915
##$PHC1= 4.101552
##$PH_mod= 0
##$PKNL= yes
##$PPARMOD= 0
##$PSCAL= 4
##$PSIGN= 0
##$REVERSE= no
##$SF= 200.13
##$SI= 16384
##$SIGF1= 0
##$SIGF2= 0
##$SINO= 400
##$SIOLD= 16384
##$SREGLST= <1H.CDCl3>
##$SSB= 0
##$STSI= 0
##$STSR= 0
##$SW_p= 4139.07284768211
##$SYMM= 0
##$S_DEV= 0
##$TDeff= 0
##$TDoff= 0
##$TI= <>
##$TILT= no
##$TM1= 0
##$TM2= 0
##$TOPLEV= 0
##$USERP1= <user>
##$USERP2= <user>
##$USERP3= <user>
##$USERP4= <user>
##$USERP5= <user>
##$WDW= 1
##$XDIM= 8192
##$YMAX_p= 0
##$YMIN_p= 0
$$ End of Bruker specific parameters
$$ ---------------------------------
##NTUPLES= NMR FID
##VAR_NAME=  TIME,          FID/REAL,        FID/IMAG
##SYMBOL=    X,             R,               I
##VAR_TYPE=  INDEPENDENT,   DEPENDENT,       DEPENDENT
##VAR_FORM=  AFFN,          ASDF,            ASDF
##VAR_DIM=   16384,         16384,           16384
##UNITS=     SECONDS,       ARBITRARY UNITS, ARBITRARY UNITS
##FACTOR=    0.0002416,     1,               1
##FIRST=     0,             0,               0
##LAST=      3.9581328,     0,               0
##MIN=       0,             -703552,         0
##MAX=       3.9581328,     1796311,         0
$$ Real data points
##PAGE= N=1
##DATA TABLE= (X++(R..R)), XYDATA
0 0 0 0 0 0 0 0 0 0 0 0 0 0 0 0 0 0 0 0 0 0 0 0 0 0 0 0 -2 3 -8 16 -19 21 -23 25 -33 34 -39 49 -53 56 -59 74 -82 89
44 89 -100 110 -122 137 -149 165 -180 202 -220 242 -260 291 -314 352 -383 420 -459 502 -546 590
64 590 -630 644 -611 442 -59 10527 212517 889070 924468 717052 983872 744890 391614
77 391614 552021 403816 148407 372159 377135 276871 555194 621108 511037 695718 705874
88 705874 526292 549845 417099 131987 116804 102508 18880 151462 239303 195822 297561
99 297561 342827 223748 167649 54579 -155744 -209156 -189015 -182652 -36163 147075 254039
110 254039 394969 477131 401586 293307 140065 -97038 -285008 -422792 -559749 -603844
120 -603844 -565455 -512020 -383131 -194463 -29373 130401 244134 233998 155152 50252 -81922
131 -81922 -169251 -186886 -165243 -69086 100884 277535 439560 553899 580372 554924 512470
142 512470 444863 372071 311549 262805 255822 302464 366813 423374 457547 446873 396481 317469
154 317469 199000 54473 -84979 -202753 -276548 -286893 -243919 -152880 -21147 114514 221256
165 221256 274890 254926 168688 40168 -110435 -251188 -348047 -379744 -342339 -253099 -149095
176 -149095 -61506 -1169 27539 23339 -16280 -92133 -193268 -293622 -370076 -414909 -425229 -401899
188 -401899 -347533 -263090 -166414 -86930 -45667 -50481 -91956 -147132 -199523 -233768 -232857 -187385
200 -187385 -97247 22884 145223 244472 304812 321816 295305 228675 135459 39006 -34685
211 -34685 -69543 -65969 -37340 5382 55444 107866 151751 169068 150271 97991 25559 -51797
223 -51797 -125506 -188636 -227522 -228356 -184883 -105911 -16110 58151 101718 108042 80024 25855 -42334
236 -42334 -105229 -143984 -150705 -128221 -87590 -40002 6402 42541 58904 48894 12724 -37319
248 -37319 -89254 -136436 -176041 -205280 -214442 -192423 -141671 -76715 -16037 26278 49777 57022
260 57022 45345 13097 -35046 -82354 -104451 -89544 -42352 19560 80233 131822 170424 189377
272 189377 181965 147712 96192 46143 9480 -9342 -13686 -9003 4493 25599 49533 70968
284 70968 84057 85116 71857 43792 3225 -39416 -73331 -87791 -80829 -57275 -22012 20627
296 20627 64707 99665 110487 90588 49411 4845 -26589 -41586 -46464 -45915 -37119 -15659 15100
309 15100 41272 48071 34820 11460 -9676 -25336 -44537 -69536 -95305 -109911 -103969 -81317
321 -81317 -50960 -22211 982 18245 27501 23711 6268 -19887 -46018 -61401 -60666 -43279 -12810
334 -12810 22299 51920 68459 69875 61567 49753 34987 16841 -4140 -21224 -25562 -16405 -2195
347 -2195 7860 10196 13090 24156 39852 47936 38181 12834 -12960 -28294 -30562 -26770 -22443 -13365
361 -13365 6312 33692 58008 65124 51737 27665 4588 -9717 -16741 -19721 -20209 -16449 -8086
374 -8086 1822 9303 11010 8237 2666 -5688 -13958 -21890 -28159 -33645 -41142 -47869 -48148 -37161 -16570
389 -16570 4578 15715 15266 8954 3309 -767 -9107 -21881 -32074 -29724 -11916 11501 26561
402 26561 27235 18551 11179 9135 7634 1167 -9925 -18450 -19205 -14138 -11067 -12844 -17004 -17439 -11801
417 -11801 -3093 2121 1468 -5310 -14480 -25080 -34547 -38900 -36440 -28138 -17249 -9299 -4745 -1802 -670
432 -670 -4025 -13008 -24100 -29994 -26202 -15877 -7268 -6587 -11599 -14558 -12168 -7662 -6294 -10032 -12457
447 -12457 -10013 -3101 1789 -344 -6193 -8126 -1315 11302 23084 29731 32169 31965 29527 23600 14267
462 14267 5685 3311 7436 14459 19606 22327 24596 26030 25595 21890 17085 15930 19559 23983 22986
477 22986 14802 3667 -4159 -6810 -7612 -9160 -11214 -9203 -1316 7767 12294 11123 8276 9757 17013
492 17013 25798 31978 34488 34713 33704 30497 23293 15154 10395 12307 19206 27898 35942 43840 52190
507 52190 59922 63537 63607 63868 67901 74933 77994 72175 59059 46268 38174 35716 33045 29982 30098
522 30098 36993 49826 60731 64176 59742 54970 54045 56738 56675 49914 38039 24278 11980 -179
536 -179 -13678 -26518 -35407 -36841 -32583 -25229 -17978 -11731 -7422 -5950 -7354 -10232 -11860 -12357 -14830
551 -14830 -22547 -35272 -47870 -56092 -59620 -61396 -62284 -58866 -46383 -25240 -3433 10732 14287 13459
565 13459 14922 19472 22160 17736 5826 -6416 -14178 -19351 -25580 -34296 -41495 -39333 -27487 -10951
579 -10951 3481 11908 15336 16669 17296 16067 11074 3526 -6111 -16650 -28946 -41715 -53534 -62989
593 -62989 -70000 -74103 -73018 -65024 -51444 -36541 -26562 -24429 -26664 -29505 -31994 -37241 -49172 -66086
607 -66086 -81120 -89671 -92440 -95617 -101665 -106112 -101140 -84371 -60422 -39660 -26546 -19110 -12573 -6016
621 -6016 -2869 -6484 -14264 -21216 -22570 -19785 -18102 -19479 -22359 -23265 -17950 -8148 4868 18293 31608
636 31608 41892 48057 50387 49634 46905 41983 34015 23498 13360 6223 872 -4236 -11103 -16126
650 -16126 -14571 -3971 11860 25367 32985 35850 37861 39436 36779 25697 8862 -7106 -15622
663 -15622 -17059 -17278 -19937 -24493 -25250 -20009 -11379 -3269 1221 5342 10541 16225 18651 16350 9928
678 9928 3662 966 1776 3969 6242 8213 9626 9637 9677 11616 16896 26917 38377 48684 55809 61986
694 61986 65615 66332 61216 50606 39629 32512 30399 28460 23928 18427 15945 19537 27336 33102 34772
709 34772 34019 34092 35749 34769 27642 16057 3943 -3354 -4865 -4644 -4382 -3567 -2025 1144 2321 7
725 7 -4399 -8638 -9300 -7790 -5491 -4157 -3363 -2716 -3668 -6965 -12102 -15205 -15577 -13977 -14454 -17530 -21726
742 -21726 -22937 -19641 -14542 -8988 -4681 1234 8157 14446 15022 10079 1840 -3601 -4819 -3382 -1701
757 -1701 -582 2986 8484 14391 17236 16137 13022 10671 9045 6736 2911 -1066 -3136 -3123 -3323 -4871
773 -4871 -7285 -7161 -4014 -432 -659 -4828 -11196 -14838 -16249 -16684 -17524 -17526 -13077 -5122 2348 4351 390
790 390 -5976 -10325 -11375 -11400 -11913 -12733 -12250 -9238 -5725 -3822 -3947 -3572 -1881 -419 -207 -2562 -5540
807 -5540 -7938 -9267 -10665 -11200 -8865 -3160 4206 9113 9777 8166 6897 6660 5300 1122 -4064 -5444
823 -5444 -1132 6834 12536 12885 9333 7453 8392 9839 7753 2511 -2526 -4035 -1803 -203 -1765 -5301
839 -5301 -6280 -3198 2472 6077 6340 2520 -2138 -6449 -8805 -9892 -8619 -5774 -2058 1589 4517 6364
855 6364 7193 6231 2544 -2944 -6068 -5455 -1604 418 -1408 -4942 -5212 -1022 4390 6316 2525 -1937
871 -1937 -4049 -1503 356 -2224 -8581 -12735 -11019 -3520 3704 6523 5306 3679 3846 4465 3081 -1189
887 -1189 -5153 -5945 -2697 2012 5598 6591 5681 4051 2543 2025 2197 2758 2340 -42 -3312 -4918 -4001
904 -4001 -1323 546 361 -99 1718 5315 7439 4408 -2548 -8793 -9141 -4341 549 2348 1023 1018 4034
921 4034 8423 9066 4306 -1858 -5133 -3580 -790 578 -1761 -4201 -3933 -1506 1252 1939 1354 643
937 643 913 1018 -180 -2645 -5010 -6100 -5713 -4116 -682 3695 6833 7308 4201 314 -2043 -1737 -825
954 -825 -1144 -2391 -2467 323 4359 5865 3282 -1101 -2835 -991 1504 1280 -2957 -7970 -9972 -8042
970 -8042 -5563 -5132 -5915 -5715 -3462 -399 -84 -3436 -8266 -11629 -12149 -10726 -9461 -8349 -6388 -3667
986 -3667 -1814 -1999 -3824 -6181 -7098 -7876 -9332 -10436 -10222 -8567 -6677 -5748 -6337 -5715 -3343 614 3213
1003 3213 2271 -727 -4062 -5296 -5268 -6303 -7366 -7054 -3645 2041 5799 6187 3801 1618 921 1539 942
1020 942 -289 -782 925 3211 4251 2496 27 -1071 -750 -703 -2653 -5308 -7268 -6966 -5747 -5198 -4879
1037 -4879 -3209 554 5650 8225 7624 3804 150 -2592 -5685 -8836 -12015 -11767 -7813 -1751 3377
1052 3377 6568 8304 9371 11641 12429 11457 9107 7418 6900 6391 5353 3718 3206 5075 7991 10456
1068 10456 11405 11996 12648 13317 13253 11803 11050 13170 18116 21691 23269 20842 18073 15426 12765 8128
1084 8128 1633 -3386 -4331 -600 4125 7530 8852 10739 14440 18279 19415 16004 9729 3608 -1033
1099 -1033 -5021 -9812 -14165 -15994 -14075 -9074 -2812 2473 5795 7850 8063 6423 4006 1505 52
1114 52 -22 -269 -434 191 1451 2433 1509 -1812 -5145 -5840 -3452 -92 1619 986 1336 5867 11958 16839
1132 16839 17193 14131 10514 7847 5073 -662 -9504 -16818 -18772 -14478 -7069 72 4549 8504 12038
1147 12038 14614 14532 9505 2429 -5156 -10540 -13881 -15981 -17021 -17184 -16130 -14378 -12341 -9715 -6772
1162 -6772 -5717 -6621 -9616 -12544 -13576 -12429 -10750 -10757 -11046 -9587 -6039 -2699 -3836 -9535 -17101 -21229
1178 -21229 -20441 -16186 -12858 -10306 -7032 1 8515 14554 14434 9730 4274 565 -1907 -5208 -10329
1193 -10329 -15500 -16281 -12788 -6332 973 6853 10887 13690 14134 12587 8723 3693 -1911 -6621 -9143
1208 -9143 -8161 -4598 583 4419 5030 3587 2049 1488 508 -2311 -6792 -10160 -8917 -4263 816 2798
1224 2798 2030 1231 2470 4337 3806 -1827 -9205 -14982 -16005 -14100 -11078 -8105 -3939 2844 10181 15202
1240 15202 14971 11155 5156 -249 -4487 -7368 -8450 -7614 -4341 -12 4908 8973 12202 14279 14269 11144
1256 11144 6753 2388 114 -843 -1888 -2505 -1464 2886 8921 13431 14672 11674 7736 4409 1763
1271 1763 -1979 -6028 -8486 -6656 -823 5858 10235 11211 10189 8764 6653 2766 -2753 -7541 -9932
1286 -9932 -9773 -7851 -6014 -3459 286 4552 8202 8650 6367 2507 -1361 -5697 -9771 -13268 -13802 -10672
1302 -10672 -4089 2177 6365 8285 8480 8586 6350 1891 -3828 -8351 -9743 -7577 -4320 -1585 1471
1317 1471 4876 8480 10444 9541 6569 2764 -189 -3179 -5646 -7443 -7231 -4439 258 4940 7729
1332 7729 9209 9926 8916 5555 -331 -6754 -10014 -9158 -6098 -2304 209 2928 6642 9840 10788 7336
1348 7336 2082 -2712 -4864 -5877 -6783 -8140 -8545 -5766 -719 4283 7449 7447 6070 4350 1233 -2468
1364 -2468 -6761 -9781 -10128 -8381 -4893 -590 3765 7201 8659 7712 4441 393 -2372 -4134 -6018
1379 -6018 -7007 -6786 -3430 1486 5822 7388 6711 5195 5006 5050 3091 -1800 -6870 -9283 -7230 -3273
1395 -3273 331 2343 4261 7120 10101 10076 6615 303 -4859 -7299 -6405 -4763 -3251 -1548 1090 4226
1411 4226 6879 7389 6154 3756 805 -2020 -4441 -5654 -5969 -5233 -3652 -2264 12 3341 6269 7024
1427 7024 4666 -58 -3666 -5111 -5685 -6350 -7493 -6877 -3108 2534 7281 7978 4883 1392 -413 -760
1443 -760 -1798 -4723 -6792 -6810 -4006 770 3343 4119 3838 4154 5020 5198 2722 -1043 -4504 -6302 -6089
1460 -6089 -4454 -2215 750 3603 5986 7062 6597 4887 2673 -351 -3448 -5336 -5137 -2928 -97
1475 -97 1380 1882 2361 3792 5487 5516 2382 -1598 -3938 -3649 -2119 -1425 -2562 -3131 -1272 2940 6266
1492 6266 6336 3452 -72 -1955 -2560 -3398 -5172 -6413 -5395 -1425 2697 5215 5698 4783 3111 2053
1508 2053 430 -1262 -2850 -3773 -3723 -3201 -2567 -761 1619 3658 4119 3454 2573 2147 1464 -356 -3246
1525 -3246 -5463 -5500 -2935 573 2894 2489 1977 1966 2843 2295 -742 -4278 -6230 -5101 -2521 -809 -347
1542 -347 -493 475 2302 3260 2369 424 -1734 -2711 -2801 -3819 -4800 -4735 -3612 -1455 443 1762 2278 2736
1560 2736 2304 783 -2101 -4272 -5126 -3915 -2497 -1277 -687 567 2127 3171 2416 143 -2101 -2904
1576 -2904 -2471 -2158 -2539 -3303 -2918 -1278 1531 2511 2532 2344 2288 2022 1025 -1912 -4149 -5313 -4666 -3111
1594 -3111 -2161 -995 248 2603 3658 3389 1029 -558 -1464 -831 -811 -1675 -2200 -1649 96 1893 1510
1611 1510 269 -519 -332 817 1161 -406 -1901 -2375 -457 1031 2464 3319 3584 4124 4723 3765 1486
1628 1486 -1069 -2799 -3560 -3320 -2504 -1357 1142 3175 4616 4754 4506 4128 4395 3616 1706 -774 -2161
1645 -2161 -1978 -913 -688 -1774 -1945 -431 2134 4060 3633 1262 -492 -321 811 1637 625 -582
1661 -582 -398 1609 3204 3325 912 -1642 -3059 -2844 -2206 -1800 -1297 -676 889 2871 3940 4475 4631
1678 4631 4217 3110 1663 -107 -1014 -1480 -2995 -4219 -4582 -2741 572 3554 4614 3815 3057 2956 3438
1695 3438 3011 639 -2262 -3305 -1686 584 1282 -45 -1644 -1982 -135 937 612 -611 -1936 -1725
1711 -1725 -25 1016 1152 563 -21 592 1350 1051 -76 -1798 -3443 -4503 -4936 -4620 -3541 -1489 499
1728 499 1526 2268 3228 3510 2729 589 -1998 -3734 -3440 -2460 -1936 -2731 -3453 -2561 135 2503 3292 2307
1746 2307 606 488 1491 1759 -101 -2637 -3399 -1904 789 1933 2144 383 -39 117 231 -315 -1850
1763 -1850 -2471 -1814 -353 939 1770 1730 1867 1724 1068 60 -855 -1531 -2048 -2804 -3399 -3265 -2029 -66
1781 -66 1385 1642 1628 1924 3015 2848 402 -2820 -4739 -4296 -2681 -931 -699 -531 165 1819 3535 3021
1799 3021 782 -975 -1297 -495 -374 -824 -1650 -1353 -245 1404 1998 1763 1011 1144 875 391 -921 -1953
1817 -1953 -2049 -977 31 745 1790 2731 3413 3196 1305 -265 -1937 -2227 -2297 -2101 -2205 -1287 193 2207
1835 2207 3230 2421 1612 930 847 712 -409 -2538 -3693 -3374 -2006 -826 -356 459 1456 3033 3489 2145
1853 2145 37 -1925 -2429 -2201 -1945 -2036 -1232 93 1721 2556 2230 757 -194 -35 -786 -1274 -2320 -2660
1871 -2660 -1422 112 1269 1258 1532 2280 3025 2611 1271 -904 -2284 -3085 -2709 -2370 -1763 -1196 916 3195
1889 3195 3944 3366 2143 825 156 -1006 -2172 -2867 -2433 -1016 222 712 873 1007 1794 2729 2167 295
1907 295 -1627 -1833 -1591 -1239 -1357 -1670 -848 1143 3210 3873 2477 463 -942 -1102 -1258 -2197 -3180 -3197
1925 -3197 -1181 1333 2925 2754 2503 1596 1691 990 -464 -1640 -2490 -2440 -2321 -1500 -537 547 1911 2698
1943 2698 2525 1919 1531 1080 -274 -1477 -3334 -3406 -1829 172 2033 2054 1593 1493 2093 2352 938 -1672
1961 -1672 -3022 -2730 -890 417 399 -344 -50 1594 2807 2961 1528 -303 -1512 -1632 -1444 -1524 -2004 -1806
1979 -1806 -214 1271 2446 2788 2524 1699 576 -971 -2084 -2516 -2569 -1916 -1431 -856 356 2033 3278
1996 3278 2554 1230 -321 -670 -217 -192 -1282 -2634 -3144 -1401 928 2382 1743 783 777 1534 1966 825
2014 825 -1437 -3197 -2941 -1116 672 1422 1343 942 1220 1677 1250 142 -1221 -1716 -1792 -1296 -915 -299 510
2033 510 1074 1245 1366 1854 1744 1340 94 -1603 -2780 -2695 -1484 -540 -345 -519 357 2148 3518 3294
2051 3294 1095 -1052 -1809 -1172 -499 -683 -1373 -1613 -655 1275 2055 1424 34 -141 362 603 289 -624
2069 -624 -1419 -1069 -395 669 1093 1126 1425 1583 1140 120 -576 -1517 -1636 -1701 -1512 -941 155 1572 2387
2088 2387 2063 1358 703 510 537 -325 -1579 -2287 -1837 -852 136 52 -176 -188 626 1611 1821 542 -769 -1343
2108 -1343 -796 -573 -1034 -1164 -781 426 1526 1740 567 -389 -674 -846 -939 -1383 -1457 -993 237 1049 1132
2127 1132 863 551 1240 1105 603 -461 -1325 -1405 -1081 -1013 -1498 -1414 -586 752 1700 1614 888 456 -84 165
2147 165 -434 -1373 -1608 -1209 -13 211 270 -72 -148 338 222 -465 -1185 -1379 -821 -67 282 -221 -272 382 1273
2168 1273 1573 1198 -5 -599 -435 -271 -762 -1928 -2422 -1414 219 1741 1698 1130 1094 1177 1258 797 -325
2187 -325 -1218 -1309 -393 -326 -71 -615 -156 96 586 511 520 478 484 358 -106 -456 -375 302 725 948 460 293 697
2210 697 1047 107 -1141 -2104 -2224 -838 466 607 344 259 1123 2549 2053 804 -603 -1250 -622 -347
2228 -347 -422 -1521 -1940 -1383 58 1432 1519 1154 994 1208 1188 894 264 -653 -806 -778 -139 153 613 662 897
2249 897 387 -296 -325 -87 138 -73 -162 -503 5 1477 1696 928 220 -386 263 744 196 -1194 -2556 -2293
2269 -2293 -1059 614 664 220 112 1067 2296 2114 908 -900 -1599 -1376 -937 -648 -685 -903 -278 341 900
2288 900 990 781 282 11 34 -355 -362 -161 -315 -283 -388 -242 702 1349 1190 154 -1067 -1095 -630 -187 -496
2309 -496 -915 -892 457 1854 2359 1545 334 -760 -534 207 -162 -1473 -2230 -1819 -366 920 1126 575
2327 575 453 442 1424 1433 426 -577 -1315 -1288 -1035 -716 -322 -213 608 871 853 425 219 72 -232 -1050 -1219
2348 -1219 -838 53 957 753 248 102 657 909 972 -153 -1249 -1489 -702 118 22 -529 -796 374 1599
2367 1599 2191 1418 527 -449 -692 -545 -809 -1543 -1831 -1192 -172 1008 1059 928 507 809 480 51 -652
2386 -652 -901 -636 -574 -244 -390 -5 398 1048 1008 477 -220 -239 -251 -427 -1193 -1627 -1041 151 1168 1635 1126
2407 1126 799 709 534 360 -949 -2023 -1896 -1125 -522 -236 -60 277 755 1383 1626 649 30 -444 -103
2426 -103 -537 -990 -1807 -1300 -265 523 797 583 329 641 714 118 -662 -1596 -1717 -777 257 527 542 638
2446 638 814 1230 940 -71 -806 -1216 -1135 -1020 -555 -803 -174 288 1030 1176 1140 1347 1152 511 -456 -1288
2466 -1288 -1753 -1254 -645 -301 -108 83 1066 1689 1936 1042 -403 -1030 -701 -62 -266 -592 -1037 -436 694
2485 694 1555 1126 436 -191 86 75 59 -934 -1351 -1232 -1115 298 798 988 1168 975 1187 509 -131 -651
2505 -651 -1342 -1378 -1267 -969 52 879 1475 1299 949 487 686 846 82 -836 -1893 -1832 -375 162 616 156
2525 156 92 734 2047 1995 859 -673 -1535 -1539 -648 -270 -478 -804 202 1116 1891 1766 815 -364 -578 -542
2545 -542 -470 -583 -1030 -675 -323 236 717 904 756 855 385 -95 -580 -655 -674 -1065 -1322 -884 -159 1017 1635
2566 1635 1248 633 -200 -136 -100 -436 -1239 -1928 -1707 39 1083 1646 846 75 668 1203 1256 203 -1141
2585 -1141 -1597 -1623 -685 -341 -514 -391 4 1085 1789 1379 738 -89 -646 -721 -970 -1210 -505 9 515 826
2605 826 731 748 1072 516 48 -800 -1298 -809 -40 50 -237 -146 595 1471 1864 1306 189 -313 -549 -174 -333
2626 -333 -1384 -1744 -1379 119 1385 1539 1298 895 765 817 512 -219 -785 -1322 -645 -273 194 -60 -92 592
2646 592 777 710 129 63 -212 -235 -558 -724 -722 35 783 787 723 557 456 644 249 -405 -1592 -1653 -1208 -345 200
2669 200 319 728 981 1338 1437 998 -130 -677 -430 -402 -571 -967 -1063 -594 236 914 944 660 329 778 519
2690 519 202 -957 -1119 -839 -273 -160 324 -74 232 542 560 -285 -858 -1270 -850 -613 -377 -387 -278 160
2710 160 895 1256 476 140 207 102 -502 -748 -1313 -1313 -729 -535 -242 70 125 1058 1310 1271 170 -426 -570
2731 -570 -251 -457 -718 -844 -733 211 783 604 65 -328 -73 528 457 67 -655 -711 -366 646 464 298
2751 298 5 2 531 180 99 -743 -1153 -899 -632 -531 -43 204 590 1025 1239 793 551 363 -308 -772 -753
2772 -753 -872 -874 -261 85 -26 -160 286 1007 1264 771 -224 -356 -217 242 303 -177 -895 -504 618 1270 1140
2793 1140 110 -378 -464 160 211 95 -533 -663 79 680 1226 686 310 248 123 176 -41 -361 -940 -711 -573
2814 -573 -94 127 481 660 749 388 179 356 437 190 -758 -1126 -1059 -211 589 764 -75 -135 7 919 1021
2835 1021 275 -522 -1186 -528 455 672 266 -394 -411 317 973 928 -58 -194 -546 16 253 -319 -419 -623
2855 -623 7 575 917 835 447 360 319 -330 -354 -215 -231 -83 -250 -211 -132 522 899 480 -13 -219 -19 370
2877 370 233 -144 -622 -872 -65 991 682 248 -120 -199 362 618 -67 -962 -1181 -647 144 741 447 222
2897 222 133 478 708 319 -110 -493 -389 -347 -238 -516 -216 8 402 354 515 540 574 505 323 -25 -718 -370
2919 -370 -24 174 -76 -152 6 543 818 582 -557 -697 -600 -147 36 -126 -413 -163 365 728 676 314 93
2940 93 -153 108 38 -823 -1143 -931 -474 -76 211 7 63 359 888 693 225 -438 -709 -473 -323 -392 -473 -490
2962 -490 245 783 462 -118 -149 -225 83 -5 -311 -643 -412 -118 192 16 -9 49 153 212 -112 -583 -892 -696
2984 -696 -491 -314 -354 -334 -30 761 925 947 -33 -217 -58 -84 -306 -764 -1245 -614 359 612 248 -79 212
3005 212 335 703 500 -14 -707 -141 -88 -232 -91 -213 30 386 858 586 -210 -238 -426 -281 -656 -546 -587
3026 -587 123 305 403 643 444 323 546 -100 -561 -684 -737 -356 -157 -77 -136 -224 297 1064 1064 190 -326 -86
3048 -86 -167 143 -424 -903 -926 -495 734 628 733 356 176 160 596 467 -272 -740 -150 108 455 615 272
3069 272 433 534 595 453 146 -92 -213 -435 -556 -318 -126 354 653 682 391 495 851 684 275 -503 -1029
3090 -1029 -833 47 345 117 -198 -136 379 1000 499 103 -668 -604 -180 130 -310 -698 -477 13 465 1041
3110 1041 531 129 9 -27 -219 -402 -769 -608 -553 41 560 439 672 801 853 120 51 -266 -128 -131 -267 -541
3132 -541 -488 293 519 704 159 -37 5 479 397 -61 -791 -1030 -674 -49 384 372 89 -41 432 661 437
3153 437 -434 -984 -903 -532 30 -8 -215 27 346 829 784 394 241 -298 -257 -315 -531 -856 -748 -285 -37 88
3175 88 264 389 655 502 -137 -177 -454 17 -181 -231 -393 -151 206 982 721 210 -262 -375 169 300 -77
3196 -77 -478 -400 -128 190 919 319 166 328 465 425 243 -568 -856 -809 -217 -195 -161 123 430 800 817 557
3218 557 39 -120 24 26 -410 -715 -595 -33 213 392 200 186 315 229 616 -115 -348 -497 99 11 98 -282
3240 -282 -65 196 613 503 259 -338 -266 -359 -284 -615 -642 -190 413 704 804 455 338 347 418 128 -433 -810
3262 -810 -800 -446 -96 -228 -206 -35 223 714 868 550 -133 -115 -65 -81 -484 -560 -568 -207 323 192 135 343 -24
3285 -24 -82 -59 -182 -455 -263 -80 295 20 137 469 311 695 40 -459 -530 -349 37 -160 -666 -598 -153 323
3307 323 873 590 81 248 346 452 262 -642 -848 -716 -511 147 141 -17 -119 219 828 582 -79 -372 -309
3328 -309 -277 -285 -93 -68 -168 128 282 328 235 95 238 134 -405 -534 -304 70 5 156 -144 102 551 813
3350 813 805 121 -680 -388 155 74 -97 -540 -513 -103 449 923 508 64 -352 -54 -26 43 -577 -615 -936 -120
3372 -120 258 199 73 190 433 394 40 -321 -304 -293 -216 -372 -117 92 234 260 130 -64 236 -71 214 159
3394 159 -381 -378 -561 -16 503 252 -30 -9 86 907 657 23 -479 -473 -262 39 66 -160 -251 369 612 435 492
3417 492 -177 -273 -76 -14 -33 -191 -253 -75 182 210 275 253 180 243 187 -152 56 -185 -248 -231 -472 -149 63 350
3441 350 609 264 -52 -372 168 344 185 -269 -401 -142 223 433 216 -105 -106 14 420 531 -26 -425 -357
3462 -357 -56 90 197 -44 -30 342 623 505 125 -170 -482 -328 -437 -490 -224 -91 268 356 447 145 232 211
3484 211 422 -38 -372 -6 -320 24 -10 -254 -205 -175 250 303 75 122 124 297 243 130 -411 -328 -113 134 415
3507 415 -162 -147 -235 -13 127 42 -350 -658 83 211 495 -14 65 -16 329 239 41 -338 -335 -142 -212 -246 -442
3530 -442 -524 -291 42 362 249 163 309 47 175 -124 -332 -149 -157 -43 -333 -411 -80 -21 263 251 -26 -273
3552 -273 -333 58 -107 -128 -115 -87 333 300 181 45 -214 -187 267 -135 -182 -590 -531 54 444 237 -22 -35 146
3575 146 703 409 97 -528 -463 -128 -106 -80 -387 -209 -115 16 381 287 -188 -58 224 101 -20 -52 45 -104
3597 -104 -58 233 72 87 220 323 -42 -459 -477 36 138 -14 -110 -263 16 615 806 151 2 -325 -47
3618 -47 293 166 -382 -431 -487 -173 422 314 -48 -364 318 383 390 172 -138 -408 -414 -112 49 11 186 33 131
3641 131 205 359 185 51 -263 -67 -136 308 160 72 216 39 104 283 122 54 -256 -278 -553 -284 -85 -144
3663 -144 -163 -247 41 455 514 505 201 -558 -177 36 10 -189 -427 -288 311 482 212 -71 -382 -224 209 338
3685 338 41 -375 -171 24 124 84 270 112 -184 -165 -12 -124 -15 -51 -99 -609 -639 -30 390 515 235 123
3707 123 -277 197 455 161 -238 -597 -520 -215 138 207 -221 -186 72 452 297 466 -64 -288 -159 187 145
3728 145 -324 -514 -6 58 1 16 139 -47 -66 -56 8 -363 -82 48 26 13 -87 213 327 325 55 -249 -294 -213
3752 -213 -224 -32 -496 -135 -401 236 501 535 152 -57 36 9 42 -424 -568 -437 -194 123 177 -42 -211 -20
3774 -20 139 400 93 -97 -130 -102 117 -153 -79 -64 102 358 325 168 32 137 -63 -130 -14 -339 -153 -75 157
3797 157 207 280 312 619 409 5 -211 -419 -3 -294 -79 -76 -242 68 182 349 145 -247 -31 -49 260 48
3819 48 -364 -352 -152 103 154 234 -142 22 199 513 293 -301 -270 -132 275 214 -148 -163 -136 207 258 21 -79
3842 -79 -348 -242 81 -93 33 -158 -96 60 317 305 50 294 179 -84 152 -150 -221 -53 -228 -430 89
3863 89 -291 109 401 184 -262 -253 220 278 129 -99 -38 -323 55 346 182 -5 -235 -367 -54 325 -78 -274
3885 -274 -497 -378 120 309 138 -328 287 302 209 -128 -146 -345 -263 -413 -307 -23 -133 -71 247 269 78 -1
3907 -1 -31 98 93 -280 -146 0 -239 13 -273 -260 -53 303 225 353 -169 -186 -102 30 205 -122 -532 -149 38
3930 38 533 483 -109 -181 5 -111 57 41 -287 -221 -87 340 163 45 -126 262 115 64 31 -5 -207 -263 -194
3953 -194 -260 -264 -170 172 337 136 -76 -21 299 328 143 -328 -219 63 65 49 -25 -177 -43 252 271 8 -197 -97
3977 -97 177 287 411 147 -280 -439 28 156 110 182 -41 52 134 126 -117 -144 -153 136 52 188 248 -122 427 279
4001 279 -151 -50 -211 -53 -134 -378 -231 -20 130 443 239 19 -135 168 168 203 -75 -417 -191 -195 171 423
4023 423 47 -197 -85 215 396 162 -54 -193 -64 67 278 51 -96 185 144 336 -59 -82 -76 185 191 -20
4045 -20 -15 -113 -17 117 254 213 32 86 28 182 -16 -298 -296 -95 -188 -60 94 158 135 137 341 21 108 -109 5
4070 5 -6 11 -229 -74 6 -98 -117 -158 -10 48 424 47 252 -117 -161 29 28 88 128 -55 -92 240 49 -56 -199
4095 -199 -145 10 171 -283 -222 -195 -71 227 303 -41 -300 119 -21 -34 -76 -108 -350 -271 11 -247 -315 -7 190
4118 190 302 15 -87 149 188 35 -88 -383 -148 9 147 338 171 -111 -29 -47 97 -42 -94 -193 -165 36
4140 36 517 82 -295 -323 -71 280 289 -192 -301 -180 -126 -212 12 -10 -290 71 236 168 126 -150 -19 -148 -152 -36
4164 -36 -23 -325 -18 -89 -314 -80 36 105 61 -23 -15 67 -33 473 -10 -72 -270 87 333 232 113 101 9 190
4188 190 115 -119 -454 -184 -156 302 423 261 6 2 189 122 35 19 -147 -40 -92 -51 -368 -269 31 -7 128 -52
4212 -52 89 -69 175 -57 -319 -220 -165 -20 -60 -66 -182 16 327 429 8 -70 -184 53 110 252 49 -240 -74
4235 -74 138 284 246 -142 -195 43 78 61 45 -177 -366 -77 248 193 153 14 -11 274 315 56 -307 -159 112
4258 112 -188 75 -231 -210 277 -29 -148 9 -155 -42 133 -58 30 -190 -11 143 57 34 -224 -62 131
4279 131 239 75 -238 -332 -62 -8 36 16 -133 -52 101 421 252 -116 -29 -211 29 220 -193 -348 -88 37
4301 37 404 98 -102 -1 218 9 321 -66 -52 23 -49 126 -266 125 -106 16 221 150 -144 -118 159 205
4323 205 77 -135 37 2 338 276 156 147 -58 170 203 -95 -147 -201 126 42 23 -122 -61 101 186 314 151 68
4347 68 -57 -344 49 161 -156 -382 -318 40 190 126 139 -239 18 262 264 63 -195 149 52 -84 -14 -23 6 -169
4371 -169 105 -152 -126 -74 -92 199 15 -185 157 419 84 92 186 -142 41 222 -36 30 -308 -276 77 263 132
4394 132 30 15 255 407 145 155 -196 -256 93 169 -370 -328 -267 -98 36 302 -64 19 -2 91 94 114 105 -52 49
4419 49 212 -15 39 -23 -155 81 15 56 -109 -168 -172 182 103 -291 179 246 318 183 -31 -158 307 155 -20 -183
4443 -183 -290 -209 72 157 29 -137 -177 216 147 409 16 -41 -451 6 98 -274 66 -235 -87 201 177 450
4465 450 88 58 -34 90 -81 -172 23 101 75 207 275 105 136 68 -70 -289 -256 -88 59 -172 -151 116 -144
4488 -144 435 41 113 -344 -62 -8 137 -6 -377 -382 -305 -91 211 -41 50 -173 109 32 48 -141 -367 -195 -155
4511 -155 -163 -16 15 3 179 138 195 267 -69 8 -34 100 -61 40 133 156 0 86 23 26 307 -169 -159 -258 -342 -97
4537 -97 41 -9 -72 -161 178 177 285 51 93 -443 -7 83 8 -114 -194 -30 306 242 221 -150 -148 43 209 218 17
4562 17 8 39 -124 -103 -120 -113 149 48 192 9 100 -281 225 -174 -210 -138 87 129 140 1 -87 117 12 176 230
4587 230 -69 -102 -357 138 25 -124 -233 -228 245 382 -9 -24 -54 -178 41 254 -22 -483 -152 197 122 282
4609 282 49 -79 138 -88 165 -244 -84 -220 193 159 -62 138 -81 -102 -70 127 13 -257 202 -181 -132
4630 -132 -90 109 -176 -61 163 29 -8 175 221 293 -176 -181 -264 -135 92 182 -40 -31 62 -59 305 151 207 -7
4654 -7 -6 -31 104 -252 -72 -114 -21 238 61 -235 -28 -171 149 -86 -115 -99 -157 44 -42 55 -87 -142 5 236
4678 236 -70 -163 -34 -81 -61 -15 -8 -137 -294 11 211 -69 46 -375 -22 178 -205 3 -413 -43 34 155
4700 155 12 -306 -42 299 138 -199 -450 10 39 226 -94 -239 -170 -185 388 95 -20 -210 37 5 95 28
4722 28 3 -179 -32 -108 54 -79 43 43 -82 -128 161 -43 -28 3 -250 -53 146 77 23 4 -145 38 -5 -118
4746 -118 108 -105 -119 -98 -100 83 2 95 -59 -301 167 296 77 234 -205 -217 57 269 -218 -105 -177 73 76
4769 76 190 110 -120 -187 -128 5 -101 -71 -143 -211 40 131 234 174 -178 157 74 117 -11 53 23 -59 -156 -222 -16
4794 -16 -62 185 28 -47 -133 -42 121 16 -206 -165 66 108 102 132 -117 -147 -22 37 -34 -115 -366 -276 70 192 239
4819 239 294 -12 65 67 26 -36 -295 -48 -186 199 -22 79 42 -65 37 -82 -12 -44 8 137 -251 -147 -288
4842 -288 -113 65 51 -32 -244 168 8 208 -61 14 290 101 2 47 -99 -35 -75 240 98 186 -181 -262 149
4865 149 207 -6 -109 221 -117 -6 87 -101 -66 152 126 42 -312 -157 -221 -162 -160 -233 -74 -107 -93 113 35 148
4889 148 115 29 236 -310 -67 0 -98 -154 232 -80 136 25 4 31 151 -109 161 -11 -3 209 -27 -10 -66 -54
4913 -54 85 93 -136 -115 23 -59 148 -162 -89 -292 53 297 194 308 -53 44 52 -5 24 -134 -140 59 60 168 -6
4938 -6 168 -6 162 52 83 -12 -16 213 30 5 -67 -61 -60 133 -32 -282 69 127 88 -68 -170 -165 -116 87 -1 -41
4964 -41 -221 -245 100 67 62 -132 -80 -33 -84 -53 20 -113 57 59 249 -49 -81 -101 -127 322 -61 -26 -163 -48 -128 -252
4990 -252 125 -173 -96 112 -79 -170 -21 -72 61 84 -80 -152 -215 -34 -138 178 17 -123 50 -7 141 -148
5012 -148 -325 -27 -26 100 71 49 -169 16 -76 -17 139 42 -141 -394 -57 99 161 -409 -303 181 209 -143 18
5035 18 300 -129 185 -31 41 -101 83 -177 -11 -45 -100 73 14 -21 11 43 -116 -67 -29 -308 -102 -97 115 69
5059 69 92 -58 -173 -116 104 -81 -161 -248 -227 66 370 99 33 -231 -45 -87 186 119 -241 -1 67 80 -23 161
5083 161 -48 -148 144 132 -15 94 -59 79 180 -197 -29 63 52 85 -92 -87 202 140 142 -183 52 -85 -20
5106 -20 185 -129 88 19 25 -174 125 82 -81 -15 -89 175 147 -67 -252 168 -22 -56 -200 -237 95 2 74 -94
5130 -94 -206 -459 -45 -147 83 53 -48 -109 -182 179 -180 24 50 -11 115 140 142 87 -183 77 118 -76 -91 -28
5154 -28 209 39 -37 116 80 -172 100 49 -78 182 -134 -28 7 24 299 -146 -127 155 -7 127 -272 -322 98
5177 98 -205 -81 -90 -198 -161 115 302 -173 12 -50 -99 -8 -70 -5 34 -20 208 212 -73 -94 66 49 -128 37 32 -6
5203 -6 142 101 23 -68 95 -66 -40 -326 -179 -125 -13 52 64 -58 49 -99 98 -42 -111 -293 -29 -15 -193 -114
5227 -114 -146 -277 251 207 120 17 98 -46 -115 160 -65 -33 -236 -88 37 302 -139 152 262 -17 142 -21
5249 -21 64 66 -184 -175 161 343 -45 97 -79 -340 39 86 -140 -166 34 48 -300 -143 107 135 62 149 -86 112
5273 112 71 44 -52 -51 -63 183 283 -234 -52 -21 -95 107 43 -38 -32 88 144 52 49 -7 146 38 44 -9 55 -22 -58 -5
5301 -5 -26 137 55 8 -45 -293 -89 77 34 -125 60 -32 3 -61 95 68 -98 -197 -165 59 250 157 -74 -189 -177
5326 -177 102 -29 167 -351 -150 -70 98 183 -55 -166 -141 46 41 -89 19 35 -215 262 -110 -23 -171 -19
5348 -19 94 -77 -34 -102 -11 244 47 -20 -146 3 83 270 11 41 -3 -6 -18 -24 -173 -149 -220 68 92 -155 -250 -27
5374 -27 -128 35 -46 -81 -60 47 232 -68 -64 -53 -7 82 54 24 313 -40 -38 58 -108 -84 -70 211 -7 -212 162
5399 162 -47 -190 66 -17 -61 45 -58 -75 -8 -242 -29 58 -244 -33 -75 61 61 -193 283 121 122 291 -52
5422 -52 -314 153 146 -172 39 -127 43 185 -246 109 202 7 26 -112 -26 -77 -296 -135 -15 220 -52 -175
5444 -175 -101 -30 -17 -104 190 -206 190 -73 121 -18 -146 58 -74 6 -121 -202 125 34 66 82 -217 85 117
5467 117 -62 26 105 33 -70 193 -15 -76 -101 29 -96 225 245 -64 282 98 131 -40 51 -285 313 -58 -166
5490 -166 -300 -307 -85 49 107 325 -39 -281 -53 -82 178 192 -68 -220 -102 157 185 -289 -32 184 89 59 41
5513 41 -8 111 -22 -15 61 29 11 -74 -162 -4 -22 45 -3 -103 130 -191 12 36 188 10 -208 -107 106 240
5537 240 -106 208 -56 7 -137 -111 16 -147 -193 -70 -243 287 69 -13 -147 53 -93 119 -126 -144 123 10
5559 10 131 -128 72 20 -82 -10 27 -189 -226 97 -40 -208 -122 -94 -264 -62 380 -158 -62 233 169 183 45
5582 45 38 97 14 138 -87 27 -145 134 -110 -58 -115 -58 -154 35 90 -76 -257 -137 -115 157 -93 75 229 -14
5606 -14 55 173 55 46 -82 216 14 -101 63 -153 132 26 -197 300 -134 136 0 -83 35 -147 84 27
5628 27 212 179 59 124 14 289 143 -112 -24 84 68 -74 -203 -260 0 -82 28 213 13 -49 -177 63 -67
5651 -67 -186 -34 30 308 158 133 -95 190 22 -21 -43 10 -16 -169 -21 97 112 -64 129 25 120 -59 -44
5674 -44 -139 -12 172 180 69 -68 26 -34 41 190 -4 -64 -87 165 145 44 -116 106 91 -115 -228 -206 -247 77
5698 77 9 40 91 -235 64 200 122 -60 -12 -44 63 98 -117 145 -98 -81 30 -183 -226 123 8 143 165 67
5722 67 -36 66 -21 104 -52 -174 -52 -147 -154 -129 222 203 -30 129 24 -98 -58 23 -12 -87 22 -111 69 -92
5746 -92 49 220 -18 40 133 -17 -35 -19 128 59 143 160 -169 -164 -67 59 -263 -46 -124 79 -290 98 -27 243
5770 243 -92 -66 90 -1 13 -39 186 85 -57 162 64 78 86 -2 -40 -12 -9 28 13 -40 -37 76 -156 -82 -114 54 -102
5797 -102 -2 1 173 -63 -149 -46 23 62 170 45 -110 36 -89 -148 268 -46 -205 -57 -9 15 -21 -29 19 -47
5821 -47 56 119 209 -132 -55 112 -129 94 -191 -18 -190 116 -173 130 -6 48 -81 48 -157 91 -155 202
5843 202 125 -7 17 65 -73 -153 217 50 -52 5 -57 -185 -156 -91 -95 -202 -104 55 -142 111 -2 240 32 -16
5867 -16 283 -237 9 -59 -154 -193 55 224 -120 -140 36 -1 -257 19 -131 198 292 11 1 -95 -40 -49 -142 -35
5891 -35 -28 -42 -27 30 -133 63 -72 -122 -138 -214 31 45 127 199 262 24 -167 -169 53 -36 -49 -223 -131 -203 -73 -58 -6
5918 -6 -141 217 -266 22 12 53 186 85 132 -127 -324 -60 49 35 3 10 107 -37 135 7 -52 249 6 -39
5942 -39 -100 -58 81 -77 -70 -272 -197 -101 158 -175 32 -132 -255 -90 164 -43 23 -113 115 153 158 63 -88 110
5966 110 142 -59 198 44 -184 -67 -169 111 70 87 -70 -83 -98 158 137 -4 47 34 186 27 69 89 91 250
5990 250 3 18 121 -23 116 -120 24 -34 -94 133 119 91 -20 -96 140 237 110 89 76 -22 -52 8 -92 143
6014 143 -164 172 -2 72 -14 -141 -3 -19 -34 61 -133 233 26 91 271 91 -190 121 90 13 -44 87 -91
6037 -91 75 -173 -240 50 183 175 -209 -19 1 193 230 81 -51 -61 -44 96 25 49 -102 -29 341 9 50 -117
6061 -117 133 20 -95 45 -48 57 94 81 -48 25 -1 -11 92 107 -6 109 -79 -45 95 -89 -189 -113 30
6084 30 -222 -100 -129 -29 -151 -226 50 44 14 52 11 272 -35 -85 -83 171 -75 1 39 -33 109 34 -41 -235 -346
6109 -346 152 283 113 275 49 -91 68 -330 4 -102 -27 91 5 -114 59 90 104 -82 -129 -29 197 148
6131 148 -194 -97 -42 172 -132 -28 -115 -75 -150 -30 -85 95 100 -153 -80 45 -77 -66 171 -177 -67 121 74 -55
6155 -55 -40 3 155 -109 24 109 239 -35 -4 84 134 -1 -14 -105 -229 -32 -108 142 84 -169 42 -59 157 -47
6179 -47 -152 -70 177 -125 77 -57 93 36 58 -74 -111 124 -205 1 86 -120 -134 108 261 18 -46 -177 -29
6202 -29 46 -104 62 -219 -55 -63 62 43 260 73 214 95 32 -239 -92 -136 -52 107 35 194 -144 -169 -42
6225 -42 -162 123 91 97 -259 -79 -72 -65 64 -204 -38 -54 16 38 -102 18 -125 28 -341 -83 159 182 23 -171
6249 -171 46 169 -173 -116 4 -206 122 -34 34 306 -186 -82 133 -73 -192 108 217 -201 54 -11 112
6270 112 93 -46 -32 29 96 -150 -164 -118 -153 109 -8 72 120 -94 -130 132 56 161 61 163 246 -236 41 112
6294 112 -222 -55 -42 -12 130 -43 -246 -14 -106 -191 -21 -129 -49 -272 4 171 150 -66 -86 132 -100 92
6316 92 38 18 -39 30 91 -286 -104 -365 -179 -103 -295 173 -355 296 46 -145 30 38 -32 -134 -141 91 -14 -15 41
6341 41 50 175 -45 105 159 -225 96 -63 -131 -189 43 -201 25 14 -271 9 185 56 -10 10 98 -160 57
6364 57 -28 -50 -41 -83 29 -92 -314 -31 -266 8 -98 133 -204 -14 -152 -66 45 10 -13 89 -144 -120 -53 -97
6388 -97 -43 100 84 24 -146 101 -95 -7 -126 89 59 -38 -64 -141 107 -142 196 216 -68 -82 -63 55 130 -112
6412 -112 105 -53 -22 -208 -135 177 -58 -20 -87 81 129 -104 -155 -206 -150 -11 -192 -164 -98 -124 -83 78 -9 161
6436 161 33 21 -60 53 -24 -36 178 -171 -58 202 -62 16 -230 -11 -26 118 -130 128 177 -370 44 -8 -57
6459 -57 -73 104 -100 -212 310 42 81 43 -73 -66 137 96 -102 -29 -145 170 -34 -15 89 11 -93 67 -14 121
6483 121 -73 69 283 207 -76 -105 282 57 -68 66 75 -42 280 3 270 154 78 7 162 177 287 -225
6505 -225 116 76 47 158 -39 -39 15 -91 11 28 -2 197 -134 227 -10 -63 -85 -15 110 19 155 -69 164 -47
6529 -47 -179 43 138 -22 65 8 70 59 -86 -13 9 -53 -188 -58 -52 6 -175 -44 -89 -167 -153 223 53 21 222
6554 222 -31 -161 -170 -2 -235 -236 -143 80 0 69 37 -204 114 147 84 -160 -278 118 -273 -1 95 -269 178 -154
6578 -154 -298 -22 98 -144 259 27 -179 239 52 -58 -45 124 -59 142 -214 174 -72 44 27 273 174
6599 174 0 108 247 34 -129 -33 -42 50 -7 230 60 151 -42 -83 -199 -7 -4 42 -118 31 -316 -206 173
6622 173 -20 116 123 -51 -176 -226 -53 190 -107 23 -12 -105 -116 -189 -117 191 301 -87 -123 50 -6 -241 -85
6645 -85 -28 27 136 -15 -135 148 -5 -128 21 -58 161 46 -220 94 -96 -16 -88 97 -124 4 195 -129
6667 -129 -167 91 -67 -204 -78 -78 -194 -61 260 123 -73 180 35 14 8 158 33 -138 246 117 -147 -65
6689 -65 -80 -45 -107 158 70 -263 -72 261 84 67 -195 -420 -177 -2 -105 222 79 -54 -159 -151 172 -83 -121
6712 -121 25 -58 84 -160 -80 166 200 303 86 68 -167 32 70 -71 95 70 -183 -100 6 -251 -95 -10 -76
6735 -76 220 -42 89 79 -150 83 -99 -75 -77 -193 49 180 29 28 69 134 -235 64 109 298 11 51 -135 120
6759 120 62 -97 37 -135 -42 -209 119 -29 42 -49 102 -64 34 -89 105 206 143 -5 18 250 -1 -144
6781 -144 -65 -128 46 -19 -29 -11 33 147 77 60 -8 162 5 192 13 -265 11 179 40 188 50 -53 -93
6804 -93 -14 110 -27 269 13 -234 6 119 -63 -125 -14 -96 -136 10 110 -38 97 -33 -64 128 -35 -18
6826 -18 107 88 -110 -283 2 62 -120 -85 -119 -198 130 229 102 65 -13 57 279 -112 -5 -52 38 47 -89 -19 3
6851 3 -75 -203 -96 -19 -218 74 -83 -134 79 134 26 -304 -58 -56 65 124 -162 -163 -64 -11 -81 57 -108 -111 100
6876 100 65 15 -47 211 -89 107 5 19 -74 14 157 0 -56 64 201 40 -28 152 235 194 -62 -231 -107
6899 -107 53 -1 -49 -68 70 414 8 -168 15 20 133 -147 -184 171 139 -93 147 -15 -11 -247 -8 57 -7 156
6923 156 -104 76 -15 15 55 -163 163 -16 -113 70 51 -57 -6 31 -46 -81 347 -183 31 -45 144 -263 -37
6946 -37 3 -126 -60 -80 100 -114 77 185 -19 -167 -85 -174 -180 -252 134 45 -116 -53 -144 163 -83 16 -53 111 -8
6971 -8 193 109 208 -72 -108 -54 -94 23 -34 114 68 34 -118 -80 88 202 -11 -20 2 106 -184 16 51 108 96 9
6997 9 -14 86 278 77 -186 -99 -287 146 -112 -106 9 99 136 115 -159 84 -30 -130 -52 -22 -141 -20 -126 -193
7021 -193 99 136 -30 116 -282 195 177 97 -30 25 12 -36 -37 233 223 134 76 196 -21 -201 -161 76 -93 63
7045 63 13 -282 289 242 -81 56 202 5 42 -124 -42 -17 -58 -223 -30 -74 -242 -51 224 38 -52 70 -90
7068 -90 -15 153 110 145 116 79 67 145 -114 231 -87 138 -131 -41 -183 28 28 -68 18 -148 55 111 2 103 -43
7093 -43 61 -88 -71 -206 -133 -30 -231 52 22 -60 -190 148 5 187 -33 -31 -5 123 -71 -79 -133 18 -119 68
7117 68 -14 115 2 22 88 162 221 -176 -246 -4 -31 5 -143 59 179 262 -137 -93 -67 70 52 119 -57 18 -40
7142 -40 62 140 -42 159 -26 71 141 315 140 376 -94 -111 151 -23 254 79 0 -196 61 -62 50 88
7164 88 21 -209 -23 -2 -58 55 31 14 58 -109 28 -3 135 135 -73 -207 -44 -157 69 18 198 147 -31 131
7188 131 -106 61 157 -235 195 151 -189 74 -162 -63 -68 -112 -161 -115 124 -40 13 -145 3 -71 -133 67 -11 -113
7212 -113 -186 -110 36 -2 4 68 1 -1 -11 -107 -142 72 -25 -8 -13 18 121 -4 64 -20 146 -113 -170 -6 58 -46 -268
7239 -268 131 26 170 90 -162 -118 -245 -173 240 -102 52 -178 -11 -117 -213 135 -81 224 -6 62 108 9
7261 9 -45 -69 138 32 -127 -69 143 122 195 32 -118 8 139 194 -75 11 -173 -56 -128 -10 -100 -236 167 355
7285 355 38 -199 -152 -49 -101 226 -42 48 23 -29 -185 -53 -33 -238 162 -83 -127 -252 -309 49 -223 -9 44
7308 44 -107 4 59 33 4 -23 326 -99 175 197 -149 132 -32 7 21 -93 86 -99 -183 12 45 40 -151 -92
7332 -92 91 123 15 8 133 74 355 40 159 -78 67 43 -86 46 24 -116 -140 147 253 137 -51 89 53
7355 53 -79 -153 91 -41 257 18 -200 -42 46 86 -197 60 43 12 -40 164 0 151 -69 -145 -189 -66 267
7378 267 -430 -113 -96 157 65 6 -71 -28 -246 -39 26 8 -170 -31 -21 26 109 -1 24 329 291 179 102 287
7402 287 93 67 -11 -39 -79 -10 -49 -188 143 133 27 46 -124 -30 94 75 155 -84 19 95 -151 -156 -10 -56 -185
7427 -185 -116 140 8 33 -33 -48 -18 -88 -39 -164 -39 -79 -106 74 57 221 -113 -191 168 150 36 -227 121 -113
7451 -113 66 152 78 -63 210 -131 21 102 65 77 37 -63 -46 140 68 3 111 60 -256 -272 -71 203 -86 -125
7475 -125 47 45 253 -34 -129 140 36 125 28 181 -60 -35 -125 77 -21 -184 -133 -38 -67 -54 6 -74 -44 64 203
7500 203 151 -15 -131 -90 99 -18 -91 -45 -63 -65 -135 -20 -39 244 45 38 54 -213 -119 236 -129 -122 -78 -174 101 -99
7526 -99 -137 -97 -56 -76 -123 223 -93 29 -274 -237 -208 -84 -72 11 37 17 -116 126 264 -95 74 -70 -2 -181
7550 -181 -141 -53 165 -54 -281 56 -96 -39 -35 193 63 -217 204 2 -13 95 -110 -98 -5 21 54 -111 -16 39
7574 39 291 107 -38 -67 106 111 218 14 -109 -42 -69 -135 -250 -6 67 -44 -47 -15 -115 -212 117 136 -10 -169
7598 -169 7 172 193 -108 307 211 -11 294 -42 -127 99 173 -17 49 -320 254 82 -15 139 -11 -215 -22
7620 -22 141 25 218 65 -161 -77 75 -99 155 177 18 83 -52 -92 226 -62 -72 -157 -251 190 -22 59 -55
7643 -55 68 62 -283 82 -11 -57 18 44 28 31 141 227 -5 141 135 -259 55 65 -159 -123 131 105 -104 -11 -8 104
7669 104 93 -4 183 377 75 237 55 -99 -45 232 100 208 23 -125 84 -55 -31 -9 78 28 -92 34
7691 34 291 42 -17 -16 -67 -199 -150 47 -105 -50 -13 -285 -204 32 -135 -284 15 -128 -29 66 -105 64 -3 -272
7715 -272 -10 2 94 -37 28 105 -169 -140 45 -87 116 60 -78 101 65 2 -66 -96 149 187 268 6 135 -145
7739 -145 106 138 -89 14 39 -71 137 -181 -80 52 37 260 -39 17 -11 155 -59 55 59 -90 -114 -43 112
7762 112 18 43 -103 -17 3 31 -206 -112 -79 3 -231 -49 -63 -17 -140 -17 3 50 -64 -87 -143 80 131 79 29 -126
7788 -126 324 119 64 -190 -132 107 136 50 77 150 155 187 -108 -102 30 -195 -111 29 181 -191 59 21 -14 90 184
7813 184 -7 92 -13 -147 218 47 -81 -177 -116 149 -59 10 92 -37 76 -66 7 65 103 7 -166 177 26
7836 26 -137 -53 55 -44 -111 213 282 18 -11 -119 -83 -48 96 40 -40 8 -120 150 133 -88 -242 38 10 94 -29
7861 -29 -13 -207 -83 103 -39 102 232 17 -32 107 -187 -226 23 9 53 -99 -146 -208 -76 -34 -125 -139 68 -74
7885 -74 109 -9 171 -205 146 -36 189 102 60 13 64 221 11 61 47 166 -201 22 39 -77 96 -179 56
7908 56 -197 37 255 -116 2 -75 107 -73 -38 -186 -179 -24 -126 -59 223 -76 -359 -155 -19 -60 -258 91
7930 91 -83 -106 -60 -14 121 -35 -23 -42 -40 -33 -65 -104 63 71 54 44 141 56 6 -27 -142 -30 -271 102 -89 38 33
7957 33 139 164 288 76 -11 243 -252 -178 -135 -65 -29 -21 -12 -51 -199 -65 13 -236 -167 -13 75 -172 -46 68 -96
7982 -96 -55 -210 97 -155 -48 45 -111 220 -108 91 114 121 266 -54 -215 90 -30 12 61 88 104 -156 216
8005 216 164 7 -10 4 119 -122 58 74 -332 11 73 30 -30 -221 -66 131 62 -191 -230 60 92 -33 -162
8028 -162 -63 -5 -142 147 70 -151 154 -160 204 -36 -232 -208 61 10 -129 -212 -242 -77 71 94 255 -93 -182
8051 -182 -206 -79 103 -67 28 -137 0 196 8 -172 -23 -21 21 26 278 -81 214 56 -5 -24 140 -86 19
8074 19 -29 -111 -4 6 -45 48 91 -117 -92 25 84 174 -99 4 259 32 -25 139 -175 -140 92 46 132 -208 -47
8099 -47 -26 -146 -77 136 21 126 -38 -160 -23 -49 141 -104 99 96 -253 -103 57 28 233 -57 88 -98
8121 -98 -100 132 172 -52 -72 -17 -284 -112 3 39 -27 0 -10 -78 -3 -134 163 -43 60 -156 125 9 216 -3
8145 -3 -7 157 71 141 -213 91 127 -265 80 148 155 -136 24 65 -26 -83 33 168 -138 51 102 -151 12 23 -28
8170 -28 -191 117 212 -14 -17 41 -32 -119 91 -186 95 83 -38 -9 -94 40 64 -266 157 30 -35 14 62 -4 114
8195 114 72 -126 -62 206 -228 10 27 183 -22 -7 -243 -100 200 -54 77 -7 -342 18 23 -163 -216 12 34
8218 34 -53 -49 -241 -175 91 174 -200 286 -18 52 230 57 168 34 116 55 -155 215 215 -81 -121 106 85 31 8
8243 8 -136 14 187 -81 -42 -224 115 -152 153 -45 25 -63 13 71 -1 -4 -87 -403 -55 -6 -52 -161 -167 67 164
8268 164 -5 -37 22 81 -232 15 -44 40 -27 -176 31 -110 31 171 16 -26 115 -35 -59 280 158 -24 206
8291 206 -113 21 34 83 110 44 233 21 54 -41 103 -39 67 -136 138 33 -142 157 -34 47 65 14 -74
8314 -74 -170 -49 1 -78 -57 101 -229 206 265 -106 -127 167 126 -74 -98 -64 206 64 12 -41 88 124 111 30 62
8339 62 266 -28 -169 114 -61 -235 115 -80 54 -112 108 4 -189 19 8 32 -135 -78 -261 -64 109
8360 109 28 35 51 -145 85 125 -159 -246 -82 -77 100 -202 -79 -21 -56 -149 -85 -20 -13 -102 65 -11 -125 80 69 21
8386 21 -220 -52 -275 278 37 4 23 -37 153 183 -87 7 12 -92 122 214 263 211 4 -1 106 8 -77 5 98 228
8412 228 47 -144 -314 125 146 66 127 -150 -13 -121 105 -87 188 -149 -209 94 44 154 -204 -16 19 6
8434 6 50 141 34 -76 21 44 77 187 304 136 -37 14 -29 -147 6 23 12 -87 -93 -49 7 -53 -10 13 17 -197 -201 -56
8462 -56 186 -72 118 -34 149 175 116 31 1 169 89 48 -57 -306 91 115 186 105 -141 91 99 -140 -213 -134 -74
8487 -74 -457 -82 -45 -118 -3 122 232 117 -151 145 93 150 -164 -79 -235 -96 86 -100 -121 -66 103 95 -84
8510 -84 34 -82 85 136 6 -60 36 -178 -112 57 2 150 -191 29 -54 -116 -96 114 58 85 -67 -115 -61 -76 -51
8535 -51 177 34 -216 -16 8 -221 -35 -52 -85 -144 -67 -75 -20 -174 -77 -186 -87 -132 -45 37 -95 -11 166 -109 -89
8560 -89 90 -60 161 43 133 20 -41 -187 34 87 -40 116 37 225 74 184 67 44 -53 -67 -6 39 -16 154
8584 154 -131 73 39 -60 46 14 49 -198 -60 10 34 -208 -7 -169 91 -121 -92 -99 -21 97 9 -35 -232 -91
8608 -91 106 248 186 -121 -318 127 -36 -13 -19 -224 66 204 72 136 17 -32 17 -118 -53 132 -54 160 -122
8631 -122 -23 -26 -71 174 100 86 28 159 -88 -124 110 -35 -54 45 -82 -234 56 18 -134 60 -111 46 -147 -153
8655 -153 -112 170 122 258 48 51 9 61 -304 -95 -28 -265 -102 8 31 19 -136 23 -182 -74 136 105 148 -21
8679 -21 132 82 46 -84 221 -46 -219 -144 133 135 -42 90 -191 -124 38 -136 3 -154 149 -98 48 -21 -42
8702 -42 108 -46 -98 -117 202 209 271 217 95 95 -53 63 80 6 197 46 38 84 214 26 66 32 128 190 -142 114
8728 114 22 -25 -158 -249 390 32 -155 118 149 -95 -101 -69 154 76 -35 11 25 -162 127 -101 253 -321 182
8751 182 111 -129 -33 65 -47 -178 91 -6 61 -73 181 116 88 79 -110 -89 59 27 -57 161 -101 111 -27 30
8775 30 130 -85 -40 184 33 18 130 -297 -23 -92 -34 -57 -242 -116 -96 -139 89 129 78 -75 126 -98 12
8798 12 62 -57 -162 -108 85 -79 -214 82 69 62 143 110 90 36 17 -65 106 232 22 -29 124 66 116 -5 -27
8823 -27 81 -7 -171 -96 -61 -81 40 25 73 -62 22 61 142 -134 44 226 40 101 -194 211 234 -61 -278 197
8847 197 -28 77 -2 -118 -90 -32 -99 -27 -14 86 40 -214 65 -149 -60 -31 226 64 -19 -43 106 164 -179 -109
8871 -109 31 117 4 39 166 -77 78 -34 -149 109 -32 -174 85 138 194 -40 43 -177 -205 -40 118 158
8893 158 -124 170 135 -10 -82 -90 -171 -148 -139 -226 -134 139 -36 -15 -44 -233 -78 -79 187 60 -41 -69 39 -130 233
8918 233 -39 125 85 46 42 -27 -24 -131 170 -70 139 -96 65 -125 -179 -53 19 -124 -86 -5 80 5 114 -143
8942 -143 -44 137 88 263 -177 -159 -153 -59 -189 234 -144 118 -49 -12 -82 -19 -58 -17 136 19 73 168 -298 262
8966 262 -103 -75 -106 6 142 -74 78 215 -32 174 -174 157 73 26 21 -182 -126 113 -96 -26 33 -81 -6
8989 -6 111 14 -79 63 61 -53 37 110 -24 43 80 50 97 -91 98 -197 59 141 44 -72 -295 -129 -263 -125 54
9014 54 83 -251 67 -7 -38 148 89 -221 85 143 -32 -6 -57 93 -88 143 290 77 -42 61 -110 375 -28
9037 -28 -37 -280 -125 56 -91 262 -152 -187 126 -54 -71 -24 136 9 -111 179 144 -27 -40 -93 -108 -15 155 85
9061 85 157 154 70 -71 -71 -244 118 -24 -138 77 -63 72 61 45 -34 52 163 44 -134 104 -172 72 -69 153
9085 153 -163 92 -192 -195 5 52 -244 -119 51 -30 47 -107 17 -253 -72 113 -10 8 -136 305 69 12
9107 12 85 95 118 27 112 -111 38 8 63 -42 -37 1 115 14 266 86 -297 8 -107 -51 -47 -183 130 -59 82
9132 82 -155 180 -205 -169 21 -9 285 -33 -123 -308 69 90 77 -186 -199 3 -84 22 181 -45 -59 -31 -28 -101
9156 -101 -68 -167 -104 -38 -191 4 -35 102 158 180 265 201 -279 27 79 98 -125 -9 -58 297 49 -161 249 163
9180 163 135 46 -13 -90 -215 -220 25 76 -73 -150 141 -171 -24 -82 71 -48 102 -74 188 -127 68 -106 -19
9203 -19 163 204 -160 -80 145 44 -15 -13 159 -93 -17 130 -79 -186 -31 -184 144 125 83 -131 -65 0 -56 -237
9227 -237 -71 21 14 -7 -15 -47 57 -60 -15 70 120 14 -40 292 -2 9 -151 250 70 -327 81 -218 -28 51
9251 51 -241 -138 58 -49 46 -126 209 17 -219 20 109 103 -172 -18 -55 73 -64 257 14 -173 -133 -11
9273 -11 224 -87 126 -10 -22 322 -197 -45 -140 -7 -103 173 -127 115 -56 -137 -7 -112 -154 -137 -46 109 -109
9296 -109 -25 -49 61 226 -72 114 108 -77 113 -54 -115 -22 -38 154 56 68 203 196 -57 86 164 54 38 108 29
9321 29 -66 5 117 -85 -283 75 -111 -170 10 15 -75 102 -184 -70 32 162 -108 70 -19 151 29 30 -110
9344 -110 -214 142 118 165 -144 -75 -94 43 -43 227 232 -47 -118 -52 137 -142 62 45 -48 -63 -160 7 99 -101 -48
9369 -48 0 -112 158 255 -201 -69 137 29 97 -362 -91 -90 78 -80 39 -141 139 -41 -145 34 81 10 157
9392 157 -37 -204 119 -158 -121 33 -42 45 -94 44 140 126 3 -93 130 39 -128 -176 55 222 133 237 56
9415 56 52 84 79 42 58 -163 -31 -40 15 112 -37 -117 -307 -174 116 64 -46 71 143 -285 -60 -152 -17 39 47 0 -24
9442 -24 -154 177 11 38 -46 5 64 153 57 -96 -162 -112 -4 -27 145 123 51 129 -17 21 172 -131 -142 159 -136
9467 -136 164 -103 -199 50 59 -160 -96 -88 -118 111 209 -115 99 75 -81 -89 -4 45 54 143 202 176 119 -214 149 109 -120
9494 -120 -171 107 164 103 -67 -46 123 -95 -39 60 -166 -34 -86 -201 240 -23 47 -2 121 193 -114 127 179 67
9518 67 83 14 32 -160 26 24 71 -286 -137 132 -83 -6 -129 346 -169 -72 -166 176 -33 -40 -139 179 -124 143
9542 143 113 -51 58 -133 122 41 -4 29 -14 224 -136 -142 -182 174 92 -76 -38 84 -105 -102 -87 -236 -166 55 56
9567 56 260 144 -4 -125 22 -138 -98 -23 -249 8 5 21 -67 38 90 225 -290 -278 -148 -26 -95 49 -75
9590 -75 -217 77 -183 -157 -124 -293 314 -121 -186 -250 75 -16 -125 -61 113 146 246 124 -110 -8 -114 -289 -110
9613 -110 -94 -110 134 187 21 141 24 116 -5 39 6 388 -76 68 72 -7 38 -151 29 -216 154 136 -255 -119
9637 -119 -71 -123 -3 -53 -117 -148 97 40 -173 82 59 56 -123 -159 -161 -101 -108 94 171 -156 -50 117 -165 -144 7 -14
9663 -14 -17 -78 173 -187 -9 -164 -187 -176 -86 28 -74 42 -2 114 -23 -38 45 -51 11 -12 102 117 -54 -83 71
9688 71 -85 -12 48 -186 -38 89 -64 -42 12 8 68 1 -85 129 5 162 -190 138 -25 11 -45 -45 76 -75 205
9713 205 -37 2 -149 -33 -37 -80 213 -120 90 26 163 -34 106 -54 -85 -171 71 143 1 35 22 -31 99 109
9737 109 -68 88 -231 282 104 -214 -1 133 -33 27 61 -103 23 23 -53 34 -200 -54 23 -25 -4 -148 61
9760 61 -88 183 -21 -7 132 111 234 -45 -42 -175 40 -153 -133 137 -110 34 -101 31 -74 -169 -77 -77 -179
9783 -179 13 69 142 122 -70 -266 147 153 -5 9 80 -134 27 -75 109 -116 -111 80 188 -197 -57 -264 -119
9806 -119 79 -118 10 -266 165 -118 -68 -92 -26 60 53 -162 3 -119 32 -135 -56 230 -53 -101 -87 93 14
9829 14 27 63 41 -121 109 23 216 -83 50 13 24 168 -142 -193 -18 -171 113 109 -310 105 -71 -110 -50 130
9853 130 11 -99 -241 47 20 56 180 136 9 -186 85 88 131 -173 -117 34 45 64 -78 14 -3 78 -199 167
9877 167 20 -89 -57 167 93 67 49 -200 -60 -127 -95 -155 -8 16 -71 -40 -36 -65 32 21 -87 17 -39 -41 145 90
9903 90 -71 -146 312 -45 117 -116 20 130 269 112 -4 31 115 44 -23 -59 -31 47 -84 -74 120 50 85 36
9927 36 -21 80 33 -65 -63 60 57 -126 -81 153 178 130 -47 -18 -79 154 4 -215 108 52 102 -30 -69 19 -167 -65
9953 -65 200 -37 -208 -22 144 -72 -107 22 115 -244 -34 -49 21 55 148 126 84 -139 -130 295 -47 -61 211 -175
9977 -175 -110 5 -134 -214 261 -143 35 31 42 -4 56 249 -72 -163 -161 -166 -71 -135 -48 209 -182 -110 34 79 -154 7
10003 7 -142 202 -85 279 85 -67 -56 -78 -89 -39 41 175 -139 -27 56 221 189 43 -9 43 60 104 60 79 13
10028 13 -3 -40 -185 226 94 66 -117 112 34 21 130 -94 61 172 -179 166 14 -62 137 -36 18 -5 27
10051 27 105 262 331 -127 269 11 123 -90 -104 -102 54 163 31 233 -96 135 -112 51 -7 -13 5 -297 94
10074 94 27 -240 -185 -124 -67 211 -104 99 38 146 -95 4 -108 -68 -112 146 12 -311 -50 103 -23 43 177
10097 177 -151 -21 -63 -132 76 -75 54 66 -53 22 34 71 -399 -22 -19 91 -50 2 -29 68 -198 34 76 22
10121 22 -281 -27 67 108 142 -112 301 -34 -93 -18 -110 33 -107 252 -15 284 -140 -244 -78 -31 161 62 107
10144 107 -111 -57 67 -209 50 239 -139 41 -266 -28 -130 -32 141 130 44 132 51 82 -117 -253 -16 247
10166 247 -39 92 -51 102 179 -247 22 101 113 -23 -80 -113 223 95 173 -88 -86 188 -106 62 53 -115 -254
10189 -254 -254 -122 63 75 -83 -43 -51 134 21 -65 42 -5 21 141 -76 155 -388 -93 -257 -89 -95 56 117 -226
10213 -226 -63 1 -10 73 -47 92 -105 -229 243 -116 272 -254 23 -176 131 -36 -58 10 -43 99 -61 55
10235 55 7 -8 121 -38 -20 125 -52 60 -90 117 59 79 233 -159 124 80 68 312 45 148 -252 -164 169
10258 169 -72 -125 -132 75 -202 57 270 161 72 -104 -62 -36 69 -26 225 -124 -58 -6 -81 19 5 -2 24 47 -41
10283 -41 167 -150 -2 172 98 65 122 -119 -59 -36 260 38 -11 25 85 -84 -96 119 -343 -25 -19 -46 -148 -185
10307 -185 92 -8 -103 -61 -202 -156 156 -97 118 162 121 -22 -37 -56 200 -82 80 -364 -116 -154 -284 -47
10329 -47 -90 -13 34 41 -17 -153 -147 373 81 74 45 188 -151 -63 -198 84 219 -162 -1 20 45 -108 -81 -82 49 141
10355 141 96 129 -5 -207 -87 -117 143 -191 77 148 69 68 -18 33 -77 -160 -162 124 -67 68 -73 -220 112 -49
10379 -49 102 -104 117 229 -63 -38 45 -218 -145 21 16 -74 225 19 139 270 73 -200 -88 -4 136 -57
10401 -57 84 -121 100 49 -90 -191 -18 328 -50 -100 157 204 75 207 179 80 -115 -80 101 98 -166 -58 190
10424 190 171 -48 -88 -179 49 -252 -88 -57 -54 24 -241 -173 -19 165 12 8 85 -26 -41 50 -226 61 119 2
10448 2 151 -58 -259 -139 -41 -61 163 11 -57 -51 34 78 -65 74 -212 217 -102 119 115 -273 -67 -75 -131 -15
10472 -15 130 276 11 124 -107 -290 -142 113 117 -170 -201 -52 -154 226 -175 51 -206 124 43 119 -82 -77
10494 -77 122 -74 16 46 111 107 233 93 118 159 79 -144 -1 -51 -29 -165 -110 -119 -147 160 -176 -124 2 194 -96
10519 -96 68 -158 -184 17 -12 -10 68 -23 -42 -115 178 64 -97 -23 122 24 -32 -100 -248 -117 96 39 107 -39 -237
10544 -237 1 146 79 68 -98 -37 -67 56 -84 -64 -17 58 42 148 148 -48 -56 -99 -28 4 -60 -163 24 1 71 110
10570 110 240 -4 78 71 -155 101 -88 -133 -106 62 -56 24 56 -2 -82 -33 -71 90 -133 -185 -24 -126 102 -127
10594 -127 -101 25 80 -16 -92 -107 202 10 64 51 167 52 70 -155 64 -217 -120 44 43 -78 171 100 32 38 73
10619 73 -50 16 -125 -116 -99 168 186 -82 -107 -153 56 78 -2 -75 -41 38 243 -26 -102 64 104 53 81 26 73 186
10645 186 -246 -39 218 157 -102 -232 -150 -33 69 13 -66 282 -56 38 170 76 -67 265 -21 -192 -209 -91
10667 -91 93 -250 71 -131 109 -61 -290 67 90 -49 180 -26 -41 14 -128 -177 9 -11 24 259 -69 -241
10689 -241 -157 4 -32 120 -121 144 -28 -56 2 75 -28 0 -114 -60 -14 25 -45 -1 -81 -87 -22 26 -93 128 -6
10714 -6 -9 87 67 -58 -167 -55 21 147 -176 40 68 -230 3 -1 100 52 58 158 2 -41 -84 -76 -74 120 -24 127
10740 127 -93 -27 207 -182 72 125 137 157 -182 142 -151 112 98 -125 22 71 78 -126 265 -3 35 -12 -42
10763 -42 5 -190 -191 220 -12 -132 -268 55 125 -37 15 -93 62 -130 -186 -64 95 -276 -35 4 13 243 -59
10786 -59 68 14 -348 244 -4 -33 -78 -235 -100 23 -37 175 153 97 -102 1 -106 -120 91 16 23 -95 61
10809 61 161 -27 101 -34 219 -29 160 144 40 262 -47 20 56 -127 16 -292 49 98 101 106 49 -122 -114 -104
10833 -104 44 22 -216 86 -81 -48 4 100 -95 1 -10 163 -99 -92 14 -80 -66 50 124 52 77 -122 125 174
10857 174 67 41 -210 37 35 139 59 -152 -103 61 -44 -156 29 72 149 -37 -108 -14 -32 -148 -35 33 172
10880 172 119 -58 -151 101 70 33 312 140 -117 -148 -90 -12 -88 64 -65 -228 -80 164 114 191 -54 86 61
10903 61 -13 -155 -78 101 -241 -4 -215 46 160 73 -142 101 -33 60 33 101 159 -183 -70 67 56 -154 97
10926 97 109 -6 -63 -9 -13 21 262 -14 -143 -59 -10 6 -30 70 107 92 127 143 -88 2 278 45 -94 -108 -5
10951 -5 20 -74 -16 52 22 228 84 98 -147 -121 -92 49 143 -356 15 -202 -130 185 145 -189 182 -159 175 51
10975 51 -34 -140 -187 66 -127 320 65 -49 74 246 -258 -72 -75 -288 132 171 -6 4 -96 -25 65 -107 -353
10998 -353 -2 8 47 51 -12 -142 4 95 -54 148 3 64 -2 126 16 -10 90 -110 31 28 -134 -229 17 -25
11022 -25 -84 -57 4 -166 -188 -78 -181 -188 -104 130 -140 48 -236 -44 92 20 -47 235 46 -12 -101 83 -22 -18
11046 -18 -117 -82 72 -150 298 -61 146 -139 165 -179 16 -58 -53 145 -26 105 -113 -101 200 -16 7 7 -156
11069 -156 113 -60 -8 -13 -300 -53 -301 174 -13 -175 83 178 1 -92 55 -257 125 -40 -79 93 173 -71
11091 -71 114 -32 46 121 -9 49 -210 -40 -230 -107 251 -212 66 -44 -190 79 96 60 -19 30 103 92 65
11114 65 4 -78 24 47 115 -219 -115 -117 82 -137 -65 22 40 121 -110 190 -10 -292 203 201 -87 -46 9 35 247
11139 247 173 -42 22 -153 83 41 261 -202 174 -25 -105 176 -139 -30 124 -24 -66 93 54 -19 109 74
11161 74 153 -55 -63 159 50 233 -13 160 110 87 149 75 -185 208 237 -135 -58 114 35 -10 166 23 -90 -27
11185 -27 -69 41 -101 30 -62 -4 97 152 -183 57 21 -268 -147 167 166 219 134 -42 141 67 -56 93 145 -112
11209 -112 -166 -32 -88 -208 -27 31 84 -155 165 -19 -112 46 -103 63 -138 32 33 -76 -86 222 5 4 39
11232 39 13 -29 -11 179 -90 -44 4 94 16 -51 102 194 -56 283 -95 10 -142 6 87 82 -41 47 68 249 -22
11257 -22 15 0 -165 116 -79 -47 176 -9 44 125 13 23 -179 -125 168 104 -274 46 -42 -144 -76 17 -93 -17
11281 -17 -264 84 -113 131 41 127 -158 -3 -185 -26 -186 -19 35 -209 -49 -1 -56 -97 122 36 114 -299 120
11304 120 -114 -161 104 -53 146 89 80 150 218 142 117 -38 117 -289 -181 -27 27 -240 -52 57 164 -112 33
11327 33 -28 -190 -129 107 77 48 92 -27 39 2 -4 -106 -275 54 108 -96 -58 -97 69 39 223 89 -59 -354
11351 -354 0 -87 -92 -176 75 -152 -26 -72 146 -121 82 81 -61 -94 -25 182 -63 9 205 -74 -183 -32 24
11374 24 -34 100 -186 124 29 -29 55 -118 26 123 251 95 97 88 257 -5 38 -44 -59 227 36 -151 136 135 -99
11399 -99 12 205 101 103 135 235 -100 -68 -179 -187 17 74 108 11 -84 196 -23 185 -88 -16 12 49 -378 12
11423 12 -85 -27 63 21 101 46 106 12 77 210 99 74 27 -92 44 86 25 8 -8 -32 141 -66 52 -149 22
11448 22 70 92 -85 -8 200 108 36 43 139 -89 39 -37 -54 -176 -156 -179 133 113 -64 99 -279 -194 128 -275 44
11473 44 -185 239 40 143 -89 -78 -124 44 -47 44 -192 -172 86 -95 -67 -156 -187 -68 -99 -225 -314 100 89 51
11497 51 -159 -36 -127 -19 87 -117 -150 -13 37 -35 154 -63 27 124 -31 -42 -144 14 133 130 192 -37 -123 34
11521 34 -112 -51 -67 -13 -79 115 96 62 9 -138 53 -67 -222 133 94 118 1 -171 190 33 -201 143 30
11544 30 -170 134 -119 136 -89 -44 -69 10 -176 -42 -87 -132 -41 -117 101 65 -33 95 40 26 49 -39 -23 79 -76
11569 -76 -204 -69 261 155 29 174 -19 -45 -19 -28 -141 -129 99 153 70 27 -90 92 50 -7 -56 -65 -232 34
11593 34 -138 16 -127 -302 113 -80 117 37 12 73 -65 -49 -118 -10 177 -191 44 -81 158 93 -97 -248
11615 -248 12 250 -5 209 32 31 -149 -91 -38 5 -135 36 -16 -21 -45 150 -100 -156 180 63 -83 -21 61 107
11639 107 -4 139 -97 -93 -211 208 138 -156 124 -86 13 113 20 123 256 54 -140 28 -125 -38 103 82
11661 82 165 91 85 -184 -116 -6 136 -139 -86 38 35 98 45 107 204 -103 -33 25 23 -94 -284 -246 61 21 -192 57
11687 57 -3 -101 74 -194 32 45 228 -70 175 -103 -132 60 294 -177 -66 -83 18 56 5 186 -35 -200
11709 -200 166 104 207 -71 76 10 96 19 69 -97 7 8 -100 -18 -194 -37 -111 -4 38 -135 -239 137 -133
11732 -133 -134 99 -220 -112 -89 -122 15 -308 122 105 -106 -7 -51 -6 -151 -118 -60 -151 -33 8 121 12 63 -79
11756 -79 -106 -79 -128 -2 55 -194 109 -118 -107 -87 -277 74 0 41 -148 137 238 19 31 18 -59 -148 -2 -162
11780 -162 -15 -124 233 33 -13 31 69 -49 -3 111 311 -94 69 215 -91 145 -162 149 134 -209 -69
11801 -69 26 187 188 -88 -13 -46 169 7 0 -123 122 -6 114 -245 54 -91 -101 32 13 58 194 155 119 -62
11825 -62 11 42 -87 40 62 7 42 21 -112 -137 -30 185 -85 -27 145 -48 -114 -95 127 64 -71 42 115 64
11849 64 20 -163 -143 -3 -52 -252 308 106 246 46 18 7 229 94 227 68 -233 -116 32 48 114 -29
11871 -29 -97 -147 -179 -41 98 -1 33 307 -127 -122 -19 -46 162 37 -61 13 23 135 -54 50 74 -88 117 -130
11895 -130 -29 111 -234 -3 18 108 91 -2 -123 179 -101 -70 -36 83 -122 -75 78 249 29 49 -296 103
11917 103 -80 339 -223 -125 101 -9 195 -76 -151 76 55 -94 66 26 155 -160 -50 118 -173 -322 83
11938 83 -397 -24 0 -45 -54 206 200 -39 136 -56 -60 -104 -37 7 29 -153 -238 62 47 -63 -83 -205 152 27 47
11963 47 -33 52 41 353 288 57 -120 -59 60 -99 -33 9 -151 -44 401 -204 121 161 -237 -25 98 23 -24
11986 -24 95 74 6 23 126 5 -34 93 -47 173 236 115 -163 219 -101 -24 119 118 -67 -147 25 -177 -189
12009 -189 67 155 -95 150 127 -58 -16 -104 -65 -252 326 349 -66 -170 -110 38 190 -63 22 25 -139 141 27
12032 27 -3 92 -243 162 171 44 -132 -118 -71 -43 111 -198 -50 -93 164 -222 -251 138 -51 43 198 -179 109
12055 109 72 -180 -16 -102 -35 97 27 187 -87 -48 -34 -64 158 -207 -27 -58 86 -43 -16 -44 52 106 86 -34
12079 -34 204 -71 49 -4 67 171 6 -129 -54 -41 44 -65 -146 166 -59 26 -22 -147 -146 33 -29 63 262 -159
12103 -159 -23 77 96 208 -132 72 78 -10 132 -216 204 -6 103 -65 -110 -92 121 -67 -184 86 -200 -276
12125 -276 94 -73 -56 69 208 -64 81 -98 -76 -330 -32 -57 -214 117 -139 234 -128 32 -74 22 85
12146 85 193 -66 30 -164 262 -83 175 -94 91 -36 91 -75 -51 -7 240 -51 49 27 56 -159 -130 -56
12168 -56 -38 -3 -45 76 195 86 171 23 -62 84 77 -27 154 -262 76 64 -165 66 -93 -104 149 41 134
12191 134 36 42 130 86 161 69 69 -108 -190 232 -3 -72 -18 -13 -82 45 15 -22 -83 26 -184 -53 -98 130 -70 231
12217 231 188 53 51 170 165 -45 79 113 -30 33 -72 -175 184 -181 143 -154 29 -105 -56 26 137 169 30
12240 30 -262 210 89 -15 -199 -224 91 19 23 82 -14 49 94 6 146 44 -95 53 -63 117 -210 -16 11
12263 11 58 -24 -141 65 42 -158 -184 84 -50 64 -167 148 111 9 -60 -172 -174 243 52 48 16 -80 40 -42
12287 -42 101 -77 184 -89 73 315 10 -106 -30 64 -81 -112 3 27 -24 -139 68 93 47 -49 -5 54 -199
12310 -199 -191 -80 -19 -206 15 -33 143 94 222 -340 -62 -142 191 40 -32 -75 -136 -215 26 71 -65 59 -64
12333 -64 116 -7 -26 -97 -202 94 59 88 -132 -186 170 -17 -92 -155 272 185 -38 133 -69 -87 38 -266 230
12356 230 172 -89 -17 -234 1 -226 20 115 -58 -137 -60 -112 53 -12 48 142 268 140 89 -237 106 -103 43
12379 43 -54 45 196 44 14 212 -249 191 18 -14 -162 28 122 -100 180 90 -18 -62 -41 -138 -140 -88 -22 12 8
12404 8 125 -105 46 -26 -124 105 -132 -48 -114 221 44 270 -251 -334 -129 -197 74 -88 -130 -47 92 202 -51
12427 -51 232 160 -131 32 -4 -72 -17 263 278 52 116 195 15 -239 -57 -56 -9 309 83 -60 -90 94 -20 -129
12451 -129 -160 146 74 92 -155 -215 51 91 -234 -116 245 213 -131 -122 -24 12 118 187 -193 115 99 35 184 33
12475 33 -147 -90 50 86 -79 -221 58 -150 7 90 -27 -75 247 9 -90 155 -239 145 -145 74 -55 131
12497 131 57 -115 -244 28 28 -181 111 -171 -16 -29 -21 26 223 5 217 -39 100 92 -119 -220 -231 -57 70
12520 70 -220 191 41 118 -96 -9 82 44 -243 -71 -91 -251 75 -173 258 -102 118 55 -110 103 -87 147
12542 147 -94 90 273 -106 130 -25 -14 0 6 -108 19 -67 -9 17 -65 11 24 54 176 -24 -86 -251 -158 -68
12566 -68 -124 -120 100 -6 -93 -157 27 19 -85 -129 -54 192 88 25 -87 -48 -180 -250 12 -5 -57 18 -46 -252 -29
12591 -29 -25 33 344 -172 -63 21 -294 -252 -342 -103 -45 17 -136 -116 -274 -20 42 -87 15 305 181 44 81 -216
12615 -216 221 -75 -239 102 116 0 139 -70 128 61 -30 -227 21 -84 -13 99 -344 -15 22 54 58 -205
12637 -205 -4 -45 110 -13 243 -98 88 143 -227 -34 -88 76 -87 -113 63 -62 107 59 155 -94 -25 -149
12659 -149 131 114 101 104 -164 81 36 -109 101 174 41 69 185 -121 -73 132 -239 74 -142 -200 -83 112 254
12682 254 -2 -285 -20 154 53 -132 206 -8 -65 -97 277 322 11 -144 10 -13 -70 121 -124 82 -114
12703 -114 -79 -119 27 -30 -220 -76 -108 48 -94 32 168 -108 22 -72 35 73 101 -11 -12 -162 -20 207 -94
12726 -94 -122 -209 47 -136 -9 108 -37 87 12 160 23 32 53 -200 75 -15 -15 -73 -166 -126 -82 -185 88 -213
12750 -213 -11 -141 -193 16 -51 -191 50 194 49 21 -37 26 -373 65 157 -126 -39 149 65 -116 -229 -275 -19
12773 -19 304 -26 113 -2 195 -39 229 154 -52 -178 -191 -105 67 -153 113 -154 94 -104 -61 223 -123
12794 -123 -96 63 -30 -142 -51 9 -10 -136 -44 54 -178 -142 78 -247 163 263 4 -28 -54 -154 63 148 -16
12817 -16 37 69 10 14 -70 -23 124 12 -20 63 195 15 -40 -93 23 -222 -324 251 67 177 -81 168 -10 61
12841 61 -33 -102 -54 -76 130 -150 -84 -150 -25 -19 86 130 113 38 -6 23 150 119 134 -229 201 -251 27 -149 14
12866 14 -97 3 -130 85 11 151 -89 5 90 -148 -46 14 -224 -132 30 34 -179 191 -82 -258 -81 121
12888 121 -175 -102 55 10 14 -57 41 9 229 118 -175 -15 -30 55 221 181 96 115 -52 112 63 131 38 93 -219
12913 -219 125 -73 0 -149 38 -114 73 69 -101 -148 -48 -93 -61 58 321 162 -344 -61 207 -127 -13 -138
12935 -138 -41 80 -101 112 2 -148 -253 24 -21 103 -134 -151 3 -64 -18 32 -20 26 -55 43 59 196 236 111
12959 111 -218 -171 -53 -63 -5 1 -160 -58 -93 -57 164 130 -36 -22 149 -94 -99 -119 63 -140 119 142 84 175 -49
12984 -49 -114 63 -5 -43 6 -128 138 -8 -130 -216 164 -70 60 48 152 -225 -168 -214 -91 -15 152 -101 193
13007 193 -109 -55 -90 19 68 -48 35 -87 -208 -130 -54 8 -3 -27 73 -95 120 -49 -108 109 -75 -44 -143 -91
13031 -91 -61 -45 -128 -128 99 -105 44 -43 106 -84 159 -247 -92 -9 53 196 -182 177 127 -9 200 0 -49
13054 -49 -5 101 75 -33 -7 -16 -5 -121 -155 -172 -155 -240 -198 183 114 25 271 -38 -36 50 -70 45 -151 143 -165
13079 -165 41 -22 -138 -27 -54 -174 -40 38 -107 82 -117 120 275 -244 -328 -92 39 23 -149 -100 -161 79
13101 79 41 -350 18 16 18 122 197 87 296 -192 -7 -34 11 -129 189 116 3 116 101 147 -208 -101 -92 169
13125 169 119 171 209 -116 -17 -11 53 -95 -15 -120 53 100 -37 41 156 97 -30 25 2 79 -139 43 -106 37
13149 37 111 169 -136 -91 60 -48 -30 188 -29 73 210 234 85 -29 114 108 207 227 -198 -45 117 273 -35
13172 -35 -174 -24 -151 201 112 324 61 25 289 -171 233 -22 -89 99 -67 81 157 -29 -288 -86 -35 -97
13194 -97 45 15 60 173 -16 72 -52 -79 -223 -84 -130 70 -28 20 -79 31 2 -21 70 202 -222 -62 28 -226
13218 -226 -43 -167 184 -51 251 -58 11 -137 11 -62 67 -31 73 -96 -14 -52 75 157 -125 54 213 -155
13240 -155 87 -3 -195 -22 -18 -44 -129 -108 120 -168 166 145 -174 -106 -184 162 105 148 48 90 88 48 51 -24 7 9 -180
13267 -180 188 69 24 -208 131 21 16 60 35 175 87 -58 -36 -224 -69 -97 -102 33 23 -32 168 35 101 0
13291 0 -84 72 296 115 0 -177 -82 57 -206 -150 -149 46 -136 1 -100 -202 47 -9 196 -106 32 -101
13313 -101 35 62 262 -50 44 119 81 -86 -180 -34 -95 104 -22 -170 -140 190 54 -68 -240 228 -20 -16 4
13336 4 -22 -86 -395 1 210 -94 27 112 11 138 -66 -33 -28 187 128 -157 30 -18 -314 -55 74 -41 64
13359 64 18 48 110 81 -97 -42 193 182 279 -107 62 -251 120 50 -50 122 -130 -66 -90 -24 113 -117 -183 -66
13383 -66 -304 43 -256 -5 -94 -452 -161 192 79 25 -30 -124 -61 100 -2 -217 85 -19 -336 -158 -15 -88
13405 -88 -96 133 14 -21 -36 -75 108 -3 176 -177 -79 -16 97 -1 2 -38 75 -227 73 -85 166 105 -60 207
13429 207 -185 135 -378 -150 -28 69 -317 -259 79 -52 -84 -17 -124 133 174 -44 157 -94 -10 13 38 50 -61
13452 -61 -64 193 0 144 -7 -156 -78 55 -92 112 -117 26 -128 174 79 49 3 83 -395 -87 -77 59 -221
13475 -221 51 -196 -45 -32 -10 -222 -167 74 -193 67 -97 10 165 345 0 -170 -74 -68 -108 -325 -133 -63
13497 -63 -118 -75 -15 62 66 -41 -38 242 245 187 30 -44 188 47 -86 -262 76 18 11 130 189 -79 -150 140 87 -60
13523 -60 -94 122 -43 -17 -41 -214 53 -147 35 3 88 -64 154 186 -6 -7 -235 -45 99 -171 -83 -160 16
13546 16 205 -209 -26 -16 107 104 -155 243 60 -50 69 6 70 -305 129 173 -41 33 -41 -134 -91 -40 34 117
13570 117 -76 -173 84 -21 -50 85 21 -81 91 97 48 108 -194 180 -233 -79 -157 51 -95 1 44 175 19
13593 19 -58 63 -26 -17 -11 -176 230 108 -17 -239 -116 -135 87 94 -92 22 -25 233 14 15 -122 67 51 78 74
13618 74 -18 -150 -264 -47 -110 -74 -21 43 -286 -124 89 -117 -20 -247 116 -7 -163 21 -100 -47 -203 178
13640 178 -20 -43 -180 67 12 74 -148 155 -40 206 -91 -126 224 77 132 5 114 -47 100 152 -84 96
13662 96 13 -174 -20 48 -188 -11 147 -64 54 -172 -58 -38 -54 65 -33 -166 -162 -37 34 84 2 113 -79
13685 -79 138 250 18 16 -169 -182 -17 -75 43 -146 -89 93 -81 241 -20 -64 103 -80 -185 -124 -148 120 333
13708 333 1 51 61 -100 -29 -166 13 135 -56 142 -140 -209 86 159 91 -14 141 96 -159 84 78 -9 76
13731 76 -108 84 -124 -21 -90 -20 -229 5 16 -204 -33 21 -153 -133 140 -102 140 12 -126 -34 76 120
13753 120 -153 19 -297 -116 303 -260 -149 -97 18 -114 19 35 -13 -69 -40 -50 -93 89 -2 217 -137 69
13775 69 58 62 314 -44 -209 38 194 -99 -85 -239 -126 -116 18 227 -58 -62 41 46 -55 149 -20 -97 -31 -213
13799 -213 5 95 80 -36 49 30 28 146 113 56 86 -80 -84 190 10 -79 99 10 117 20 -12 -72 39 132 9
13824 9 53 115 -62 -187 -142 120 230 80 207 21 184 -68 13 109 46 -13 74 -64 89 -206 -145 -93 72 154
13848 154 -102 -184 32 -272 106 92 -142 5 23 63 39 -40 12 2 -269 -2 135 193 -33 -102 -17 -67 115 95
13872 95 -84 -224 -32 -34 109 19 -150 37 99 -5 209 -66 31 -51 86 31 107 -128 -86 -107 96 -32 -145
13895 -145 51 110 41 -104 12 123 -23 61 -144 94 93 -90 147 -91 78 46 73 -1 112 -63 -79 -10 -12 -38
13919 -38 55 -203 -159 -238 -155 143 64 93 121 66 17 114 -34 -225 -118 -212 223 162 -57 -249 20 -133 -290 109
13943 109 44 -158 43 -201 -51 -225 160 167 13 28 -111 71 -19 -65 -22 -38 -45 -40 146 122 79 137 -291 -23 -23
13968 -23 157 -162 -112 -120 106 96 154 210 116 70 -24 -44 -11 -194 237 -42 106 106 -9 183 -96 -6 -67 -76 132 -251
13994 -251 -28 174 -15 9 -70 -114 -167 -141 -44 172 96 95 -1 54 -78 47 -23 -198 131 -156 67 15 18 -56 -155
14019 -155 46 81 10 -125 126 20 16 -9 80 106 -124 -262 -36 -106 4 -124 -247 28 -78 86 -1 -113 15
14042 15 68 -56 43 -196 -36 63 94 -73 21 297 -18 237 -2 -188 -314 42 26 118 66 -176 -27 8 155
14065 155 -237 -2 -127 -170 -142 -88 36 20 -64 203 -43 17 -74 -128 -18 -140 -106 325 -13 259 162 11 30
14088 30 253 -45 -132 45 0 116 16 176 -10 -50 -184 -158 198 92 -86 -106 -155 -19 78 -9 222 -121 -108
14111 -108 66 -198 58 -63 19 -6 -257 -234 60 36 -34 12 237 -68 35 159 -28 27 -85 -50 85 139 -198
14134 -198 -46 -208 -96 138 6 -140 -110 -42 -227 89 127 -165 -54 138 -182 90 88 68 147 -94 -63 -118 15
14157 15 16 86 -194 -171 -157 -93 -86 -82 -67 61 66 -25 143 252 96 -49 25 5 220 -50 64 -36 98 79 -3 40
14183 40 30 -94 -99 -77 -68 3 308 257 -97 -120 -260 144 -9 -159 -85 10 -100 -153 -52 -27 -34 -11 150 -68 161
14208 161 -18 -35 -7 -208 38 -9 240 2 -192 389 0 -81 -117 121 23 -66 32 57 -1 -91 -5 95 -237 -70
14232 -70 -27 149 16 -111 -71 12 15 -149 -163 -170 203 34 154 -113 -112 -8 2 -72 -76 35 -22 197 -196 -83 48
14257 48 7 -149 -132 -173 176 -41 255 190 29 -134 -91 -69 208 442 -126 -31 43 -15 -190 12 -66 -16 70 -5
14281 -5 -199 -273 71 -100 47 -115 2 -160 -140 78 -18 -195 -104 -53 90 -9 46 -177 210 146 9 63 27 44
14305 44 175 59 31 -64 42 204 -183 7 8 28 -24 -37 -18 76 68 53 120 72 19 -62 -270 -36 -82 221 21 -59
14331 -59 -58 18 182 87 -121 89 90 59 -67 -131 -44 226 -17 -269 8 -21 177 -179 179 -109 -160 -117 27 -44
14355 -44 -262 -68 7 -127 -69 102 62 87 -60 2 71 -24 -9 -115 11 -17 115 185 1 35 156 -175 -92 -57
14379 -57 -116 43 17 -194 -110 31 -140 144 88 -81 190 2 19 -69 219 80 140 -9 -31 -36 -5 -144 -21 78
14403 78 109 29 -74 124 -46 41 -186 -50 223 -176 98 8 110 -192 -39 -6 -1 -137 -87 80 -144 -168 138
14426 138 -8 8 -239 -188 119 -99 -20 -100 180 -121 22 -166 69 -149 -124 -107 68 -311 -38 151 105 219
14448 219 -134 -75 56 167 92 -59 155 -153 -42 135 -222 -26 -192 41 114 166 -176 -192 158 29 136
14469 136 115 294 185 -10 140 68 176 -25 217 -94 -245 -35 -38 -32 -175 -4 172 22 -41 -107 -229 68
14491 68 -111 -103 -168 -49 225 -50 71 -36 151 49 -10 187 37 -38 -27 203 -108 142 125 270 -205 -29
14513 -29 104 19 -155 -21 237 59 42 55 -57 20 270 69 -22 -8 197 -7 116 -19 185 141 16 -59 64
14536 64 273 -16 211 183 -125 -129 20 -75 -132 -279 -86 171 85 -69 228 202 -64 229 19 -70 -65 -71 104 -65
14560 -65 240 -11 84 -70 -157 -27 -89 -110 -89 -77 9 221 87 -34 21 -31 105 4 -30 199 -111 107 96 210
14584 210 -4 -37 148 -119 -86 83 -108 -175 -118 -20 -172 -41 33 -151 -282 -36 21 -17 71 200 -146 -19 -55
14607 -55 95 -42 -21 -7 118 216 234 -38 -70 -70 -250 -70 143 -114 -82 198 8 49 -9 196 -40 212 163 66
14631 66 10 -12 -136 -19 9 -52 -20 -101 116 161 27 230 93 100 -2 -160 -4 160 63 40 103 9 76 168 -123
14656 -123 -37 -66 109 -137 -29 89 96 -66 -207 14 93 220 61 -16 177 84 -66 -48 353 137 -189 -255 -13
14679 -13 -34 -49 -24 137 -141 -3 57 48 -190 -53 136 -81 -123 38 15 -48 -41 90 -209 -130 88 49 -39 -41 147
14704 147 -77 93 -38 -157 -91 77 -4 -16 137 31 16 -158 20 -12 47 -51 69 -30 146 -43 -109 -43 19
14727 19 -43 -153 84 -28 -90 -231 -193 -8 55 -32 -60 37 -220 162 169 104 -271 184 81 141 105 -228 119 100
14751 100 -29 -21 149 67 -3 -67 -164 75 158 43 -12 147 -46 -197 143 -498 167 125 126 56 185 15 179 28
14775 28 -56 20 -146 5 43 98 87 -138 -77 -11 12 196 -105 170 -171 120 99 96 88 165 -126 -81 -60 -196 26
14800 26 -32 212 -59 228 -141 141 -19 -30 51 -84 276 -10 91 119 123 -188 97 -21 20 -166 -122 32 171
14823 171 29 110 -167 -34 160 64 -101 79 -24 -188 -35 18 -136 -143 131 -81 -30 -235 -28 -94 254 -2
14845 -2 300 266 79 35 147 -22 52 119 72 -1 -18 -282 -13 125 212 28 88 -216 -105 246 156 -279 -167 39
14869 39 -123 -41 5 5 110 -84 -56 -72 33 124 -46 38 145 -99 95 -77 168 -23 -179 -38 69 -289 -10
14892 -10 78 36 16 -54 63 -7 -64 -55 37 113 91 -104 -39 -32 -115 -163 -30 -174 226 -29 -77 -245 -182 -4 -115 40
14918 40 30 37 46 -386 161 -285 -43 6 -53 157 198 13 100 148 -169 39 -5 181 -25 128 -10 -6 98 -22
14942 -22 119 -153 160 83 -55 120 157 -47 -129 -104 -142 1 -64 -19 122 -136 246 167 -40 -34 21 55 93 48 -39
14967 -39 -2 65 15 143 6 -39 96 -109 96 35 131 52 -67 -71 -7 200 158 -205 131 164 -60 99 -102 -9
14991 -9 105 2 -119 17 43 -39 -147 -166 -33 -43 165 -82 91 -6 4 -112 185 -213 -64 -40 -101 128 187
15014 187 102 72 -23 -81 167 -63 60 -76 -43 133 22 143 18 146 -9 12 -29 -13 -173 50 -60 -46 -10
15037 -10 -51 -127 6 -53 -38 -52 147 139 299 128 177 144 -115 151 131 24 66 5 127 126 -74 -31 -10 128 -23
15062 -23 143 0 51 -243 114 73 -8 10 40 96 -29 3 -13 87 175 10 125 -132 -30 -21 19 114 -139 0
15086 0 203 0 -78 -50 69 -4 -88 83 -114 39 57 109 -114 -97 183 -43 -127 -50 151 37 -114 -120 140 29
15110 29 21 -187 105 -172 45 40 17 13 -102 61 230 146 -102 271 -35 -138 6 154 14 58 -130 101 -178
15133 -178 -211 -117 52 -142 -16 -124 18 90 89 43 107 26 140 18 -109 48 -32 103 -107 176 95 84 46 -108
15157 -108 174 -179 19 10 32 -137 -21 121 390 45 -187 -320 -83 0 235 -24 -65 -41 217 -35 72 8
15179 8 77 111 -164 -215 -107 -97 -128 -88 24 31 136 -4 -57 110 74 126 -133 -18 -270 -150 -137 -72 93 125 -110
15204 -110 -96 122 -16 -59 -22 -211 97 -169 4 18 132 -73 98 -68 142 -202 -31 12 58 -36 73 7
15226 7 242 -101 -126 -84 -85 84 -128 202 -116 -101 40 -47 -19 -101 -13 -63 -108 -2 120 123 101 38 -278 56 232
15251 232 182 22 189 -84 81 113 89 -291 74 322 88 -205 -94 -16 183 121 187 88 -71 -117 167 55
15273 55 66 -19 36 31 -51 -223 -115 48 -196 -30 37 53 134 -20 81 -5 42 90 166 208 51 -64 -420 49 33
15298 33 -17 -82 35 13 24 153 -21 21 -31 -259 -112 165 163 33 -68 -77 -113 -72 -107 110 -47 -2 74 -134 33
15323 33 -163 58 43 186 -200 288 -23 117 -47 117 -67 181 -145 -240 -30 -191 -173 3 -155 -197 65
15344 65 124 184 -136 -27 8 -21 81 91 108 46 51 118 186 164 142 -4 -78 81 -125 -4 157 -78 -108 -249 -57
15369 -57 26 -96 -146 258 -75 -19 -13 165 79 -22 -116 18 67 -2 96 -193 22 -150 66 70 234 -93 111 -9
15393 -9 52 83 -37 -132 -158 -234 240 -224 -210 -83 -13 -214 -152 90 204 117 -69 -34 -83 -155 9 70 75 86 1 -106
15419 -106 350 -43 79 -189 143 -164 -175 105 139 455 -164 -8 -78 299 151 -35 -16 -29 -81 56 63 50 166
15442 166 -70 75 -56 254 -122 162 306 -147 -60 319 88 56 73 -47 126 72 -110 -91 -101 -107 -2 -216
15464 -216 -161 -39 -97 -29 -39 -168 -161 84 -2 -18 -134 166 -68 -317 194 -65 115 -89 -23 -10 -17 -164 37 54
15488 54 -110 -49 81 -18 9 210 7 -63 72 -89 47 173 -18 255 -53 -147 -154 -183 194 62 -100 -55 -174
15511 -174 224 235 -153 227 -50 -1 255 109 150 -45 -99 148 93 102 24 94 -180 -46 160 -40 91 -181 -37
15534 -37 -2 148 -328 -99 -181 -36 -183 176 26 -12 -11 270 147 106 131 -42 -145 6 115 -40 -27 91 7
15557 7 90 -239 -101 -92 13 -31 -29 52 -2 302 -1 170 151 -246 -27 100 -82 84 -131 -118 -281 -15 -4 127
15581 127 -80 88 -93 -27 -274 37 214 56 81 -163 -268 195 28 76 -10 21 17 49 -37 -1 -107 98 276
15604 276 -4 237 -118 -7 17 -5 -116 35 34 151 5 -73 -128 -23 -51 53 -100 67 -111 -35 127 166 -29
15627 -29 52 -109 -141 52 15 92 -88 65 100 115 -349 57 190 -8 -254 -165 -148 120 139 134 125 11 -284 -48
15651 -48 136 106 -20 176 30 -88 -87 63 -160 11 -134 174 -18 -35 80 61 92 -91 120 160 42 372
15673 372 110 -416 126 177 188 20 -68 -50 124 148 75 19 57 -62 120 -101 32 -61 37 191 -60 25 4 83
15697 83 -66 -22 173 74 62 89 -16 -44 -6 125 -8 -171 19 45 214 -110 -169 -168 -48 -63 65 116 118 20 -32
15722 -32 228 -281 119 300 -113 -140 115 -107 0 39 -54 -88 147 -60 -21 95 -35 -28 -18 87 144 -98 -16
15745 -16 167 103 37 92 -52 -159 -66 -46 -124 122 118 2 -110 -63 164 -167 17 -49 -200 -160 48 -98 154 87
15769 87 -105 -55 16 11 -110 -136 102 -74 -62 54 178 -266 107 91 -217 -136 112 -7 173 -92 -23 76 -51
15792 -51 273 -307 193 228 83 155 -113 -151 212 31 137 243 -50 246 -57 -49 -75 -89 5 324 -96 -51 -109
15815 -109 25 223 -178 -27 169 -188 -11 63 -85 70 -126 -73 230 -85 147 15 276 -3 101 101 -171
15836 -171 359 140 -69 -230 98 -14 136 -82 1 -107 61 137 131 -114 -157 -16 62 110 113 25 25 75 -41 32
15860 32 117 -2 246 -2 34 234 242 21 -110 2 9 -90 -18 89 -1 -195 119 33 -69 98 166 171 -88 80
15884 80 83 98 -122 165 -38 5 -159 175 12 -167 -200 -100 -32 -69 -4 -28 48 -107 270 2 89 69 35 -54 90
15909 90 220 156 -30 145 -45 -200 -42 80 -30 23 -250 180 25 85 8 -177 141 -144 -185 104 98 15 100
15932 100 153 145 -1 -13 195 -9 22 109 -166 -11 -62 -55 -52 -63 -10 52 -51 237 177 -20 35 133 152 11 311 -211
15958 -211 -227 7 1 43 -209 151 -245 -147 -106 -31 180 100 49 235 -120 -257 -25 -128 -34 -107 -68 191 42 19
15982 19 -5 -187 15 150 27 -52 -248 -126 -119 -27 93 215 -65 138 43 34 4 -38 81 -2 -78 231 11 103
16006 103 -6 -61 156 -78 78 -128 115 -127 123 7 -195 -11 -112 103 -73 -199 61 -134 -39 -42 25
16027 25 -84 -56 106 52 223 -67 -39 150 -254 15 -20 77 -49 -121 -49 -12 -16 118 -114 -3 71 -119 90 140
16051 140 -158 -30 -238 314 87 -122 -115 69 13 -141 -270 -171 -56 -37 84 -73 157 98 228 -23 -179 -138
16073 -138 -90 69 54 78 -77 62 87 117 -143 -163 -10 -53 142 112 -76 -64 51 -111 -115 -15 222 -143 -144 -96
16097 -96 28 116 52 -117 125 189 -169 -203 127 -136 4 3 266 -35 -201 34 65 37 55 -1 101 -82 -55 -80
16121 -80 -26 6 -347 -201 -206 -114 -59 25 57 -38 22 40 -44 -108 -86 -73 -161 -148 64 -263 47 -133 223 -47 -195 -4
16147 -4 152 149 -60 184 20 -131 102 -63 -98 -26 21 97 -233 -58 34 244 37 72 -86 -60 -374 72 240
16170 240 40 -164 -34 -95 136 94 -197 -56 137 -5 91 -88 -8 -67 -97 -49 133 22 78 -216 -158 -20 -80
16193 -80 57 50 -135 -166 -1 182 -147 253 25 57 -182 -89 58 -297 -20 55 172 -189 91 17 -86 -37 -17
16216 -17 -107 127 -162 14 147 -120 101 401 -93 185 206 262 91 -139 220 156 -207 -115 -165 98 -111 224
16238 224 -35 -212 -32 57 228 -175 137 215 -16 -15 -192 -55 148 152 -3 -65 -152 162 1 -131 109 24 -185
16261 -185 114 14 23 -259 -95 1 304 -103 -135 92 39 166 155 40 145 106 132 154 75 -187 130 -311 86
16284 86 236 -123 210 25 -75 -242 143 64 153 -253 -155 -146 -50 -109 -107 40 -88 41 171 24 14 -58 119 117
16308 117 1 36 -207 208 312 -30 127 -23 -41 107 64 172 84 -65 -198 58 56 24 -70 65 129 -1 65
16331 65 -72 -121 -151 -71 57 -89 127 -82 -172 290 -205 132 -134 18 34 -168 257 -80 91 14 -53 157
16353 157 -30 6 -37 -34 -158 5 17 33 185 -84 132 13 -246 26 201 -227 33 -52 8 38 -86 48 149
16376 149 -54 29 78 114 20 -162 -22
16383b2
$$ Imaginary data points
##PAGE= N=2
##DATA TABLE= (X++(I..I)), XYDATA
0 0 0 0 0 0 0 0 0 0 0 0 -32 32 -32 32 -64 64 -96 96 -128 160 -192 224 -288 320 -384 448 -513 608 -704
29 -704 800 -928 1056 -1185 1345 -1515 1710 -1921 2147 -2402 2688 -2984 3323 -3682 4075 -4511
45 -4511 4980 -5496 6063 -6676 7363 -8106 8935 -9843 10865 -12004 13294 -14758 16442
58 16442 -18400 20713 -23495 26901 -31209 36843 -44564 55859 -74033 108193 -195496
69 -195496 926322 1796311 1104553 1208332 377695 85827 105528 -137122 -240568 214878
79 214878 185407 312726 619057 539236 361073 462556 172549 -98602 -156743 -381352 -576781
90 -576781 -413765 -375039 -285483 -6054 106046 84175 167530 40739 -168713 -250956 -392964
101 -392964 -543584 -474910 -385525 -251582 30558 241309 311871 366173 273028 56026 -134487
112 -134487 -362510 -607047 -703552 -701409 -625170 -419914 -193847 -10614 201756 383226 479512
123 479512 529983 485435 331630 177139 43830 -63894 -75042 -6672 103776 275711 451067
134 451067 555797 595901 553843 424455 269139 113486 -33257 -124010 -153525 -147314 -105701
145 -105701 -50362 -15803 -2064 -21382 -100306 -221368 -357802 -488281 -575040 -604273 -592159
156 -592159 -535292 -428598 -290407 -136180 678 75487 80748 27799 -75199 -204851 -339445
167 -339445 -457091 -519590 -501650 -411624 -276294 -136439 -27349 35714 51613 19980 -49506
178 -49506 -136750 -219068 -276891 -299343 -288554 -249571 -180291 -86682 15031 107765 170227 195312
190 195312 189500 157992 109071 58412 22930 24324 73481 156238 248963 325368 369487 376651
202 376651 343690 268919 160017 37201 -70324 -138739 -161705 -145899 -104866 -50816 6343
213 6343 51808 72638 62255 24784 -27903 -84650 -141107 -190381 -221821 -224048 -190057 -126590
225 -126590 -50493 24310 86949 128129 136857 105533 40176 -36121 -96963 -124046 -117082 -88252
237 -88252 -46451 -19 45899 80145 88179 65205 21870 -25622 -62587 -87063 -101740 -103740
249 -103740 -87482 -49392 6621 66378 117558 153416 170735 169433 148354 110276 65911 28996
261 28996 10551 15394 40665 82373 132073 175403 197577 189016 151401 98412 43778 -4871
273 -4871 -43707 -71336 -80220 -65610 -35895 -5587 12738 17049 16880 17449 14636 -467 -32155 -68409
287 -68409 -91663 -93868 -77131 -51248 -22119 11524 47876 77310 86458 67373 26316 -19799
299 -19799 -56820 -77538 -81858 -74224 -56245 -31170 -6065 12407 18746 13474 -781 -20959 -43130
312 -43130 -61041 -70762 -69936 -62830 -53270 -39237 -16556 15972 51190 73809 76316 62142 42164
325 42164 25189 10976 -3762 -15964 -14942 6535 43142 76709 90305 82145 61649 41348
337 41348 24798 6624 -14531 -32819 -39476 -30002 -12860 1232 8243 11251 15107 21788 24946
350 24946 21152 8966 -8418 -24830 -36295 -39074 -30600 -13614 6436 24118 34936 39270 35977
363 35977 23367 591 -27338 -49258 -54708 -43890 -26609 -14774 -12264 -11238 -5500 2302 3872
376 3872 -5751 -21102 -30750 -29311 -22660 -19906 -24604 -28308 -20968 -1212 21568 36043 37811 31946
390 31946 23978 15643 5969 -6559 -15753 -16326 -7108 8307 22603 30716 31129 23728 11132 -2175
404 -2175 -11943 -14900 -14432 -14374 -16444 -17289 -14112 -6260 813 2405 773 771 6573 12756 11107 -1728 -17419
421 -17419 -24913 -18671 -4381 8205 14737 18152 23288 29399 29340 20132 6096 -3073 -1733 7293 15922
436 15922 20616 21322 22023 23234 23687 22324 21367 22438 26386 29344 29258 27826 26917 28539 30358 31344 33857
453 33857 39702 46450 49482 43577 28739 14276 5951 5172 7579 9056 10444 15228 22743 27642 25191
468 25191 16030 6784 3922 6667 9513 7284 1447 -3835 -6624 -7728 -9341 -9707 -5597 3459 14272
483 14272 21662 24156 24845 25788 27327 27763 26183 25737 29391 34026 34550 27516 15582 6518 4302 7716
499 7716 12145 15197 19294 27073 36878 41620 38812 29095 20775 17403 16360 13253 4530 -8047 -19544
514 -19544 -28006 -34652 -38774 -39540 -35233 -26175 -17423 -12062 -11242 -13823 -18364 -25855 -36102 -45919 -53063
529 -53063 -57220 -61657 -71201 -83907 -93847 -95637 -89690 -81248 -74666 -67520 -56386 -40964 -27604 -23342
543 -23342 -28448 -36563 -39999 -38346 -36295 -40206 -48317 -55619 -57035 -52547 -46500 -40673 -32626 -19142 -171
558 -171 18395 30549 34047 30150 22324 12812 2672 -7094 -14964 -22288 -30223 -38034 -43958 -44472 -40090
573 -40090 -32512 -24691 -16256 -5745 6421 14811 13815 2893 -12519 -23185 -29159 -33042 -41785 -54671
587 -54671 -65302 -68403 -64224 -58747 -55676 -52236 -42634 -24638 -4935 8585 11805 7107 1274 -4049
601 -4049 -9691 -17882 -28242 -35986 -37605 -33274 -25895 -17476 -8136 4822 20919 39551 57732 73644
615 73644 84222 86751 81334 70772 60299 52125 46787 41589 36158 33626 36429 43065 47735 48817
629 48817 48228 51862 62285 75101 81385 77292 66454 55448 47403 39352 27079 12000 -1168
642 -1168 -7114 -6346 -4684 -5345 -6983 -3965 5990 19551 31680 38123 39022 37127 31717 22670 10011
657 10011 -3830 -15638 -23014 -25519 -23693 -18176 -9976 -1222 5905 11019 16506 23850 31854 37213
671 37213 37031 32152 27517 24808 22352 18021 11969 9338 13079 21111 28272 29332 25578 22733 26256
686 26256 34127 41275 43852 42988 42195 40803 36467 25615 9857 -5166 -14422 -18418 -19692 -21350 -22632
701 -22632 -21482 -17626 -12955 -9420 -7387 -6542 -6392 -9279 -14435 -21774 -28977 -34784 -39277 -43106 -44227
716 -44227 -40461 -32453 -23334 -18136 -17875 -20117 -20929 -19829 -18982 -20188 -21706 -20188 -14697 -9421 -8744 -13238
732 -13238 -18433 -20684 -18039 -14051 -12750 -13296 -13164 -10224 -5573 -1590 1339 5149 10515 16823 19812
747 19812 17312 11280 4499 -787 -4763 -7950 -8967 -5603 580 6580 9179 7628 4482 2487 543
762 543 -3338 -9463 -15316 -17241 -15784 -13864 -13704 -15709 -16394 -14139 -9929 -6904 -7309 -9668 -10964 -11456
778 -11456 -12180 -13763 -14720 -12339 -5992 1704 6818 7996 6631 4450 716 -4043 -8733 -10109 -6720
793 -6720 -868 3343 4178 3268 3509 6901 9498 8328 4841 1547 1416 3276 2690 -140 -2955 -1511
809 -1511 5275 12750 16850 15773 13043 10866 9856 7166 2281 -3017 -4908 -2022 3017 7114 9112
824 9112 8640 6959 4040 56 -3269 -5892 -6801 -7156 -8091 -8772 -8378 -5579 -2656 -1768 -2604 -2194 581
841 581 3921 3884 -1846 -9430 -13057 -9689 -2332 3047 4335 3735 4593 7694 9126 5372 -2567 -8679
857 -8679 -9129 -4881 -348 456 -1779 -2866 -844 2532 4432 3549 860 -1291 -2260 -3123 -3458 -4000 -3965
874 -3965 -3832 -2381 1009 5647 10306 11970 9311 3560 -1341 -2515 -1257 -1260 -2115 -3413 -968 4675
890 4675 9332 8450 2076 -4237 -5445 -1672 1520 255 -4537 -8266 -6782 -2056 1129 1085 -918 -703
906 -703 2137 4848 3998 -747 -6359 -8518 -7063 -3532 73 2590 4170 4746 4566 3005 1132 -1312
922 -1312 -3417 -6005 -7566 -6865 -3820 -444 91 -1598 -3429 -2838 1167 3864 2992 -1344 -4873 -4658
938 -4658 -2591 -1247 -3228 -5336 -4687 1272 7508 9020 5166 -714 -4185 -4489 -3353 -3575 -5229 -5106
954 -5106 -2691 1005 2585 638 -2466 -4764 -5363 -4853 -4946 -5998 -6836 -7515 -7704 -7979 -6763 -4219 -836
971 -836 988 796 -950 -1954 -2136 -2955 -5015 -7568 -7712 -3614 2216 6219 6164 3671 1762 2177 2527
988 2527 1049 -2183 -3902 -2027 1732 5382 5684 4470 4566 7439 10169 10943 9449 7037 5390 4473
1004 4473 2881 750 -428 1328 5591 9509 11571 11199 10675 9617 7888 4945 1782 310 1707
1019 1707 4327 5389 4782 2861 2272 2828 2556 949 -1353 -2315 -589 1273 2033 1549 1945 4631 8845
1036 8845 11887 12197 10962 9341 7283 4613 472 -3625 -4588 -1620 3778 8519 12216 15429 18014
1051 18014 20025 19730 15918 11341 8594 8242 7735 5811 3083 1233 2686 5547 7742 7872 7580 8303
1067 8303 10446 11095 8818 4437 2063 2512 5159 6828 6254 3914 1538 -1210 -5062 -10062 -15087 -17416
1083 -17416 -16612 -13500 -9535 -5419 -1777 1713 3487 3244 422 -3274 -6473 -10255 -15386 -20648 -24369
1098 -24369 -23718 -19596 -14732 -10910 -6806 -1257 5566 9986 9738 4063 -2164 -5388 -5296 -4841 -6314 -7945
1114 -7945 -7823 -5075 -1439 -885 -3763 -7456 -8361 -6245 -2722 -127 134 327 1924 4365 6142 5340
1130 5340 2976 -592 -5381 -10452 -15595 -19806 -22093 -21688 -19302 -14597 -7203 1205 7869 10067 7315
1145 7315 1398 -3909 -8102 -12968 -19086 -25119 -27373 -23848 -17261 -11561 -9692 -8978 -6664 -1721 2824
1160 2824 3027 -834 -5468 -6706 -4784 -2131 -1157 -1774 -1376 1610 5038 5986 3388 -1230 -5028 -5725
1176 -5725 -3380 762 6169 11541 16409 19647 20826 19689 17264 12002 5001 -2095 -6747 -8319 -6570
1191 -6570 -4572 -2782 -466 4889 12843 19620 21301 17353 10737 4978 1884 -974 -5785 -10581 -11863
1206 -11863 -7918 -95 5977 7731 5335 3314 2001 1548 -749 -4322 -7034 -6368 -2644 2100 5363
1221 5363 6215 6192 5639 4342 2521 -123 -3093 -5538 -7392 -7309 -5104 860 8131 14265 17635 18132 16958
1238 16958 15211 11149 4414 -3801 -9148 -9126 -4423 1444 5373 7934 9737 13165 15863 14665 9819
1253 9819 2890 -2375 -4088 -4405 -4860 -5368 -4539 -642 4675 8490 8988 6880 3419 -164 -3957 -8100
1269 -8100 -11301 -11803 -8662 -4444 201 4058 6614 7803 6210 1439 -4765 -9886 -12155 -11688 -10925 -9771
1285 -9771 -7719 -3344 2281 6764 7607 6219 3880 1609 -950 -4822 -9427 -12333 -11551 -6737 -495
1300 -495 4646 8522 10681 11745 10669 6620 664 -4602 -7551 -7783 -6689 -4574 -1680 3169 7834
1315 7834 10610 9886 6872 3585 1152 -1438 -4368 -7928 -9616 -7633 -3055 1355 4556 5962 7115
1330 7115 7971 7344 3424 -2647 -8763 -11179 -10612 -7478 -4149 -328 3717 7634 8969 7786 4061 -223
1346 -223 -3858 -6954 -9149 -10099 -8708 -5795 -2043 1288 3466 5337 7556 8047 5990 483 -5235 -8329
1362 -8329 -8336 -6946 -5358 -3699 -383 4709 9759 11876 9320 4218 -577 -3211 -3992 -5143 -6311 -6090
1378 -6090 -2571 2646 6728 8595 7355 5496 3630 2083 -704 -3579 -6276 -7676 -6853 -4552 -1168
1393 -1168 2666 5965 8113 7916 5905 2603 -383 -3883 -7387 -9717 -9277 -5921 -407 4197 5657
1408 5657 4912 3525 3671 3093 818 -3945 -8389 -9343 -7109 -3530 -1419 -1395 -268 2564 5870 7133
1424 7133 5005 16 -3984 -5649 -5692 -5534 -5312 -4112 -1081 3444 6762 8459 7095 4424 1186 -1988
1440 -1988 -4547 -5267 -4596 -3116 -1082 413 2480 5028 7052 6863 4487 1251 -770 -1574 -1990 -3720
1456 -3720 -5996 -6507 -3346 1965 6146 7163 5918 3740 3254 2242 -326 -4229 -7710 -7975 -4623 -152
1472 -152 2190 2583 2425 2547 3882 3343 1005 -2314 -4648 -4892 -4285 -2959 -2480 -1100 464 2173 3235
1489 3235 3614 3170 1473 -455 -3861 -6350 -6382 -4622 -2000 -4 1603 3057 5210 6634 5419 1604
1505 1604 -2883 -4987 -4475 -2982 -2361 -3140 -3378 -1198 2355 4783 4446 2339 705 359 719 -580 -3738
1522 -3738 -5999 -5731 -3526 -619 1594 2491 2671 2495 1971 231 -2185 -4157 -4642 -4602 -3500 -2288 -293
1539 -293 1962 3501 3453 2014 343 -203 -462 -1042 -3228 -4908 -4711 -2663 -75 949 1096 1607 3029
1556 3029 4559 4535 1776 -1685 -4003 -3640 -2310 -1395 -922 -158 2142 3894 4600 3084 696 -1089 -1247
1573 -1247 -1335 -1988 -2300 -1570 66 1661 2789 2828 2841 3206 3635 2547 26 -2073 -3554 -3239 -2363 -2052
1591 -2052 -1295 285 3245 5136 6054 4481 2241 842 237 -54 -1029 -1876 -1181 488 1927 2523 2080
1608 2080 1534 1876 2299 1823 738 6 185 1169 1556 1192 1426 2562 4287 5161 3983 1595 -704 -1426
1626 -1426 -1796 -2438 -3875 -3646 -1690 2030 5106 5603 4105 2859 2721 2588 1618 -973 -3644 -4359 -3610
1643 -3610 -2266 -1920 -1896 -1621 -406 1702 2770 2521 1636 737 -144 -928 -1516 -1385 -366 188 601 59
1661 59 -18 -256 -333 -1207 -2641 -4513 -3470 -859 2221 3283 2292 1618 2173 3786 4053 1679 -1782 -4082
1679 -4082 -3828 -2649 -2778 -3825 -4533 -3425 -167 3713 4798 4148 2507 1672 707 -274 -1865 -3741 -4334
1696 -4334 -3847 -2959 -1640 -824 -562 -711 -822 -1348 -1085 -507 147 -56 -856 -1888 -1177 431 1474 619
1714 619 -1200 -2375 -1797 -815 -1334 -3217 -4911 -4744 -2324 1417 2944 2925 2268 2977 3841 3527 1200 -2099
1732 -2099 -4457 -4285 -2654 -1231 -973 -1354 -379 1267 2951 3765 3146 2489 1494 634 -151 -1140 -1639 -1378
1750 -1378 -1358 -880 -315 1227 2079 2260 700 -1070 -2068 -1672 -587 -313 -481 -546 341 2315 3610 2616
1768 2616 -315 -2261 -2216 -1217 -917 -1803 -3398 -2895 -762 1539 2904 2282 1714 2004 2451 2295 561 -2128
1786 -2128 -3949 -3536 -2583 -1459 -204 1047 2438 3132 3370 2115 1232 294 -231 -1105 -1732 -1712 -641 458
1804 458 1088 903 751 1119 1935 2334 758 -872 -2002 -1665 -768 -264 -238 -385 835 2574 3608 2728
1822 2728 491 -1792 -2463 -2225 -2317 -2723 -2737 -1180 935 2860 3269 2369 1322 578 356 -388 -2267 -3098
1840 -3098 -3184 -2386 -1690 -866 -151 986 2467 3442 2875 1482 -163 -970 -1431 -2323 -2684 -2365 -571 1438
1858 1438 2624 2588 1828 761 823 593 -766 -2182 -2508 -1358 -151 726 1218 1384 1975 2879 2698 1158
1876 1158 -351 -1569 -1643 -2194 -2439 -2875 -2106 55 2457 3640 3417 2523 1758 1100 76 -1532 -3546
1893 -3546 -3951 -2456 -432 754 918 788 1573 2314 2540 1195 -516 -1438 -1871 -1428 -1764 -1504 -1348 -303
1911 -303 1407 2538 2585 1637 1110 182 -1172 -2675 -3146 -2610 -1386 315 1043 1509 2588 3309 3157 1854
1929 1854 -539 -2525 -2465 -1855 -1275 -1529 -2320 -939 1084 3086 3431 2113 957 297 647 107 -1361
1946 -1361 -3151 -3811 -2232 135 1850 2222 2105 1956 1981 1072 -153 -1500 -2349 -2382 -1780 -938 6 922
1964 922 1612 1997 1172 1026 639 498 -199 -1737 -3197 -3135 -1794 32 1000 808 819 1315 2667 2919 970
1983 970 -1764 -3447 -3182 -1773 -290 -601 -885 101 2282 3651 3517 1554 -599 -1483 -1174 -945 -1198
2000 -1198 -1958 -1767 -1045 741 1603 2046 2142 1624 1255 241 -550 -1062 -1407 -1926 -1646 -1287 196 1949 2848
2019 2848 2619 539 -511 -953 -463 -115 -1491 -2602 -1930 -142 1970 2669 1514 270 313 1122 1411
2036 1411 124 -1683 -3279 -2956 -1544 -13 156 112 843 1965 2758 2811 1252 -464 -1385 -1897 -2177 -1632
2054 -1632 -1346 -437 449 616 986 969 1196 1036 222 -771 -1145 -844 -362 159 -253 -916 -419 1046 2052
2073 2052 1806 338 -1159 -1849 -1293 -891 -1220 -2001 -1622 255 2019 2558 1812 698 389 32 -153 -1188
2091 -1188 -1991 -2362 -1652 -834 -88 96 359 756 1226 1306 869 237 -227 -292 -792 -1361 -1380 -1072 63 1170
2111 1170 892 682 337 434 386 -270 -1471 -2185 -1286 -184 1042 1182 697 760 900 1331 676 -351 -1234
2130 -1234 -1239 -876 -1025 -1321 -1407 -982 253 1433 1592 1398 982 764 898 73 -1249 -1797 -1567 -512 265
2149 265 373 131 51 865 1073 616 -470 -886 -874 105 417 391 6 447 1003 1355 1242 638 362 32 -247
2170 -247 -678 -1214 -1462 -1026 -112 503 1060 1430 1948 2273 1837 792 -916 -1399 -761 -349 -689 -1114 -889
2189 -889 19 1030 1368 562 109 -83 922 1249 692 -273 -1212 -707 480 1207 802 -176 -224 326 694
2208 694 287 -862 -1747 -1878 -571 236 919 1088 1323 1415 1644 989 266 -305 -862 -1157 -1508 -1605 -1166 -29
2228 -29 -29 141 421 924 1897 2294 1688 235 -855 -1044 -557 -303 -817 -1314 -1205 326 1479 1833 343
2247 343 -1002 -1112 -390 342 362 -451 -924 -442 895 1659 731 -396 -565 -568 -200 -558 -1029 -1395 -1477 -1024
2267 -1024 -440 571 898 1300 1683 1206 472 -48 -143 -909 -1610 -2220 -1922 -833 471 1269 472 95 383
2286 383 1159 1640 848 -514 -1168 -1154 -6 600 -121 -822 -1015 -28 1368 1584 645 -850 -1432 -979 -180
2305 -180 -64 -663 -570 134 1171 1833 1296 495 -290 -839 -1135 -1164 -1375 -1074 -560 -226 -58 555 1255 1594
2325 1594 1524 444 -291 -385 -415 -183 -954 -1964 -1996 -784 1079 1560 1114 133 42 484 1100 79 -1066
2344 -1066 -1968 -1256 127 1182 731 376 -70 448 710 475 -650 -908 -1087 -1093 -218 -326 -108 208 726
2363 726 1236 1243 808 412 161 -293 -1296 -1847 -1872 -1137 27 237 349 609 1363 1635 1325 205 -778 -1315
2383 -1315 -701 -62 -357 -566 -665 103 1139 1286 801 241 -70 8 99 -382 -1031 -1189 -675 253 987 938 1069
2404 1069 939 1053 424 -583 -1481 -2074 -1250 -941 -630 -331 -87 901 1705 1547 914 112 -78 -90 -500 -956
2424 -956 -1460 -1308 -644 36 483 514 555 786 1208 811 -47 -672 -921 -763 -259 -261 -34 768 1220 1609 898
2445 898 316 -484 -266 -414 -539 -1171 -1345 -540 719 1388 1283 692 491 957 1432 676 -550 -1916 -1971
2464 -1971 -1283 -437 23 58 347 1152 1961 1725 975 -3 -849 -871 -878 -1129 -527 -245 -75 225 601 642 704 602
2486 602 156 -394 -1130 -831 -504 -247 -144 -426 -207 899 1753 2104 797 -391 -931 -715 -461 -742 -1479
2505 -1479 -1388 -573 1001 2132 1846 494 -45 117 245 -20 -857 -1638 -1544 -717 260 502 470 543 749 896
2525 896 905 394 -216 -979 -1167 -1449 -1293 -746 230 1119 890 1006 648 864 895 -55 -1072 -2123 -1641 -446
2545 -446 441 243 -89 -254 621 1693 1330 349 -1082 -1423 -1076 -75 -87 -738 -1153 -101 1058 2040 1469
2564 1469 520 90 -219 -655 -657 -1280 -1339 -906 -119 620 1265 1421 1284 938 569 -203 -544 -526 -524 -1040 -1320 -940
2586 -940 -296 889 1302 1259 542 620 511 568 170 -1194 -1746 -1376 -382 584 919 425 343 914 1028 902 -124
2607 -124 -1260 -1317 -777 65 264 166 -83 747 1257 1412 1018 240 -252 -793 -933 -1047 -1234 -1077 -563 146
2627 146 545 811 1249 1585 1186 230 -778 -1207 -1093 -879 -842 -987 -832 51 801 1263 990 -167 -119 -222
2647 -222 25 9 -729 -1012 -941 408 1150 621 88 211 375 674 100 -650 -1392 -1365 -656 -267 96 265 580
2668 580 1384 1424 1202 -22 -461 -713 -768 -1058 -1097 -1353 -588 117 312 276 298 630 882 777 92 -545 -874
2689 -874 -726 -718 -555 -517 -485 161 638 779 46 -403 -964 -425 -378 -382 -910 -538 22 1054 1034 610 450 79
2711 79 343 93 -469 -1386 -1264 -733 -120 231 -9 115 711 1398 1618 1217 202 -283 -400 -416 -462 -799 -721
2732 -721 -303 300 638 678 263 170 227 252 119 -527 -234 42 177 147 124 273 382 587 523 -42 -744 -586
2754 -586 -444 -325 -526 -577 -207 695 1607 1128 772 36 63 492 -23 -819 -1563 -1315 -354 270 397 395 28
2775 28 529 1104 1249 858 -49 -433 -181 125 -84 -276 -325 -198 254 495 561 512 315 138 -271 -361 -381 8
2797 8 433 377 66 182 345 826 749 -37 -1057 -951 -415 105 89 -646 -811 -392 609 1106 1058 75 -58
2818 -58 -87 365 85 -681 -1356 -1149 -610 139 808 361 540 152 73 440 -14 -150 -127 -491 -160 -240 181 230
2840 230 368 218 157 98 223 471 41 -444 -1046 -748 -66 534 764 72 -221 439 965 774 73 -908 -1472
2861 -1472 -729 -86 47 -66 -746 -232 554 877 604 16 -404 -444 249 129 -121 -704 -670 -256 264 687
2881 687 294 257 182 -207 -36 -160 -423 -428 -168 -536 -330 76 756 1084 742 -188 -530 -430 40 -255 -840
2902 -840 -1074 -783 -190 521 479 -16 -190 74 791 834 235 -871 -1000 -422 -25 276 -220 -386 175 807
2922 807 493 359 -352 -536 -394 -301 -288 -651 -202 144 717 539 157 137 80 -169 -402 -407 -621 -723 -357 -148
2944 -148 -192 -181 251 743 854 430 288 -316 -416 -163 -182 -542 -773 -435 -164 221 561 460 -223 69 530
2965 530 32 -419 -913 -483 317 457 13 61 -209 152 520 166 -106 -555 -496 -91 261 -275 -250 -98 600
2986 600 1222 1017 491 153 1 87 9 -487 -1188 -689 -199 221 242 302 435 627 839 371 -93 -241 -71
3007 -71 121 -241 -406 -440 135 514 354 294 -147 130 208 -71 -269 -779 -821 -22 459 668 502 104 256 328
3029 328 656 -81 -686 -937 -746 -152 267 -133 -242 263 729 878 744 553 268 70 -225 -424 -488 -708
$$ [...]
16383E8
##END NTUPLES=NMR FID
##END=
