##TITLE=abcd
##JCAMPDX= 6.0         $$ Bruker NMR JCAMP-DX V2.0
##DATA TYPE= NMR FID
##DATA CLASS= NTUPLES
##ORIGIN= UXNMR, Bruker Analytische Messtechnik GmbH
##OWNER= root
$$ XWIN-NMR		Version 3.5
$$ Tue Jul 22 17:39:03 2025 Russian Standard Time (UT+4h)  servis@DPX200
##.OBSERVE FREQUENCY= 200.131235884673
##.OBSERVE NUCLEUS= ^1H
##.DELAY= (6, 6)
##.ACQUISITION MODE= SIMULTANEOUS
##.ACQUISITION SCHEME= undefined
##.AVERAGES= 16
##.DIGITISER RES= 18
##SPECTROMETER/DATA SYSTEM= spect
##.PULSE SEQUENCE= zg
##.SOLVENT NAME= CDCl3
##.SHIFT REFERENCE= (INTERNAL, CDCl3, 0, 16.5164)
##AUDIT TRAIL= $$ (NUMBER, WHEN, WHO, WHERE, WHAT)
$$ ##TITLE= Audit trail, XWIN-NMR		Version 3.5
$$ ##JCAMPDX= 5.01
$$ ##ORIGIN= Bruker BioSpin GmbH
$$ ##OWNER= servis
$$ F:\spectra/data/av/nmr/H1/1/audita.txt
$$ ##AUDIT TRAIL=  $$ (NUMBER, WHEN, WHO, WHERE, WHAT)
(   1,<2025-07-22 17:38:41.92 +0400>,<servis>,<DPX200>,
      <created by zg, POWCHK disabled, PULCHK disabled
       terminated by command 'halt'
       configuration hash MD5:
       00 E9 B6 7A A2 85 ED C7 34 08 36 98 17 FE 4E 26
       data hash MD5: 32K
       46 6B 85 8A C3 C9 90 9C B8 39 F6 EF 82 4B 68 92>)
$$ ##END=
$$ 
$$ hash MD5
$$ 62 F3 21 2F 29 05 27 EE 26 AF E9 A0 A1 E7 71 CE
##$RELAX= 
##$RELAX= 
##$RELAX= 
##$RELAX= 
##$RELAX= 
##$RELAX= 
##$RELAX= 
##$RELAX= 
$$ Bruker specific parameters
$$ --------------------------
##$DU= <F:\spectra>
##$EXPNO= 1
##$NAME= <H1>
##$PROCNO= 1
##$TYPE= <nmr>
##$USER= <av>
##$AMP= (0..31)
100 100 100 100 100 100 100 100 100 100 100 100 100 100 100 100 100 100 
100 100 100 100 100 100 100 100 100 100 100 100 100 100 
##$AQSEQ= 0
##$AQ_mod= 1
##$AUNM= <au_zg>
##$AUTOPOS= <>
##$BF1= 200.13
##$BF2= 200.13
##$BF3= 200.13
##$BF4= 200.13
##$BF5= 500.13
##$BF6= 500.13
##$BF7= 500.13
##$BF8= 500.13
##$BYTORDA= 1
##$CFDGTYP= 0
##$CFRGTYP= 5
##$CHEMSTR= <none>
##$CNST= (0..31)
1 1 145 1 1 1 1 1 1 1 1 1 1 1 1 1 1 1 1 1 1 1 1 1 1 1 1 1 1 1 1 1 
##$CPDPRG= <>
##$CPDPRG1= <>
##$CPDPRG2= <>
##$CPDPRG3= <>
##$CPDPRG4= <mlev>
##$CPDPRG5= <mlev>
##$CPDPRG6= <mlev>
##$CPDPRG7= <mlev>
##$CPDPRG8= <mlev>
##$CPDPRGB= <>
##$CPDPRGT= <>
##$D= (0..31)
0 2 0 0 0 0 0 0 0 0.06 0 0 0 0 0 0 0.0002 0 0 0 0 0 0 0 0 0 0 0 0 0 0 
0 
##$DATE= 1753191521
##$DBL= (0..7)
120 120 120 120 120 120 120 120 
##$DBP= (0..7)
150 150 150 150 150 150 150 150 
##$DBP07= 0
##$DBPNAM0= <>
##$DBPNAM1= <>
##$DBPNAM2= <>
##$DBPNAM3= <>
##$DBPNAM4= <>
##$DBPNAM5= <>
##$DBPNAM6= <>
##$DBPNAM7= <>
##$DBPOAL= (0..7)
0.5 0.5 0.5 0.5 0.5 0.5 0.5 0.5 
##$DBPOFFS= (0..7)
0 0 0 0 0 0 0 0 
##$DE= 6
##$DECBNUC= <off>
##$DECIM= 32
##$DECNUC= <off>
##$DECSTAT= 4
##$DIGMOD= 1
##$DIGTYP= 9
##$DL= (0..7)
0 120 120 120 120 120 120 120 
##$DP= (0..7)
150 150 150 150 150 150 150 150 
##$DP07= 0
##$DPNAME0= <>
##$DPNAME1= <>
##$DPNAME2= <>
##$DPNAME3= <>
##$DPNAME4= <>
##$DPNAME5= <>
##$DPNAME6= <>
##$DPNAME7= <>
##$DPOAL= (0..7)
0.5 0.5 0.5 0.5 0.5 0.5 0.5 0.5 
##$DPOFFS= (0..7)
0 0 0 0 0 0 0 0 
##$DQDMODE= 0
##$DR= 18
##$DS= 0
$$ [...]
##$SUBNAM0= <"">
##$SUBNAM1= <"">
##$SUBNAM2= <"">
##$SUBNAM3= <"">
##$SUBNAM4= <"">
##$SUBNAM5= <"">
##$SUBNAM6= <"">
##$SUBNAM7= <"">
##$SUBNAM8= <"">
##$SUBNAM9= <"">
##$SW= 20.6817932712277
##$SWIBOX= (0..15)
0 0 3 0 0 0 0 0 0 0 0 0 0 0 0 0 
##$SW_h= 4139.07284768212
##$TD= 32768
##$TD0= 1
##$TE= 0
##$TE2= 300
##$TE3= 300
##$TEG= 300
##$TL= (0..7)
0 120 120 120 120 120 120 120 
##$TP= (0..7)
150 150 150 150 150 150 150 150 
##$TP07= 0
##$TPNAME0= <>
##$TPNAME1= <>
##$TPNAME2= <>
##$TPNAME3= <>
##$TPNAME4= <>
##$TPNAME5= <>
##$TPNAME6= <>
##$TPNAME7= <>
##$TPOAL= (0..7)
0.5 0.5 0.5 0.5 0.5 0.5 0.5 0.5 
##$TPOFFS= (0..7)
0 0 0 0 0 0 0 0 
##$TUNHIN= 0
##$TUNHOUT= 0
##$TUNXOUT= 0
##$USERA1= <user>
##$USERA2= <user>
##$USERA3= <user>
##$USERA4= <user>
##$USERA5= <user>
##$V9= 5
##$VALIST= <valist>
##$VCLIST= <CCCCCCCCCCCCCCC>
##$VD= 0
##$VDLIST= <DDDDDDDDDDDDDDD>
##$VPLIST= <PPPPPPPPPPPPPPP>
##$VTLIST= <TTTTTTTTTTTTTTT>
##$WBST= 1024
##$WBSW= 30
##$XGAIN= (0..3)
0 0 0 0 
##$XL= 0
##$YL= 0
##$YMAX_a= 760313
##$YMIN_a= -644886
##$ZGOPTNS= <>
##$ZL1= 120
##$ZL2= 120
##$ZL3= 120
##$ZL4= 120
##$ABSF1= 10
##$ABSF2= 0
##$ABSG= 5
##$ABSL= 3
##$ALPHA= 0
##$AQORDER= 0
##$ASSFAC= 0
##$ASSFACI= 0
##$ASSFACX= 0
##$ASSWID= 0
##$AUNMP= <proc_1d>
##$AZFE= 0.1
##$AZFW= 0.1
##$BCFW= 1
##$BC_mod= 2
##$BYTORDP= 0
##$COROFFS= 0
##$CY= 19
##$DATMOD= 1
##$DC= 2
##$DFILT= <>
##$DTYPP= 0
##$F1P= 11.0000007629395
##$F2P= -0.999999237060547
##$FCOR= 0.5
##$FTSIZE= 0
##$FT_mod= 4
##$GAMMA= 1
##$GB= 1
##$INTBC= 1
##$INTSCL= 1
##$ISEN= 128
##$LB= 0.05
##$LEV0= 0
##$LPBIN= 0
##$MAXI= 10000
##$MC2= 0
##$MEAN= 0
##$ME_mod= 0
##$MI= 0
##$NCOEF= 0
##$NC_proc= 0
##$NLEV= 6
##$NOISF1= 0
##$NOISF2= 0
##$NSP= 1
##$NTH_PI= 0
##$NZP= 0
##$OFFSET= 16.51637
##$PC= 1
##$PHC0= -275.1915
##$PHC1= 4.101552
##$PH_mod= 0
##$PKNL= yes
##$PPARMOD= 0
##$PSCAL= 4
##$PSIGN= 0
##$REVERSE= no
##$SF= 200.13
##$SI= 16384
##$SIGF1= 0
##$SIGF2= 0
##$SINO= 400
##$SIOLD= 16384
##$SREGLST= <1H.CDCl3>
##$SSB= 0
##$STSI= 0
##$STSR= 0
##$SW_p= 4139.07284768211
##$SYMM= 0
##$S_DEV= 0
##$TDeff= 0
##$TDoff= 0
##$TI= <>
##$TILT= no
##$TM1= 0
##$TM2= 0
##$TOPLEV= 0
##$USERP1= <user>
##$USERP2= <user>
##$USERP3= <user>
##$USERP4= <user>
##$USERP5= <user>
##$WDW= 1
##$XDIM= 8192
##$YMAX_p= 0
##$YMIN_p= 0
$$ End of Bruker specific parameters
$$ ---------------------------------
##NTUPLES= NMR FID
##VAR_NAME=  TIME,          FID/REAL,        FID/IMAG
##SYMBOL=    X,             R,               I
##VAR_TYPE=  INDEPENDENT,   DEPENDENT,       DEPENDENT
##VAR_FORM=  AFFN,          ASDF,            ASDF
##VAR_DIM=   16384,         16384,           16384
##UNITS=     SECONDS,       ARBITRARY UNITS, ARBITRARY UNITS
##FACTOR=    0.0002416,     1,               1
##FIRST=     0,             0,               0
##LAST=      3.9581328,     0,               0
##MIN=       0,             -644886,         0
##MAX=       3.9581328,     760313,          0
$$ Real data points
##PAGE= N=1
##DATA TABLE= (X++(R..R)), XYDATA
0@%%%%%%%%%%%%%%%%%%%%%%%%%%%%%%%%jKlNoQj0OmKKjJmNnQj1J2j1RqO%rK2m5
59c0P5j22K01l18N12q48J459k711N734j5776J08014O64123p3249p65356m53628
74e31920K20244M55570J51091j63120j77006m4391l9342o4390Q6550K82201J81717
85C57204j91896m28153k04918K96651N24861J68650l66857m43430m8072K63963
95g1997J99468j4311j00966o0436k6067l0074L3814J73541J67999r6481l10774
106a36284j49510J90527K58803J1781j78799q9764P6359L7894j19372p3035J73514
117B114K31498m3352k81142j51893J72073K84820N4925k52455k68536K6413K47938
128B2403J25396j09339j03540P6517R4369j03850j91767L9172L02583J78033k30860
$$ y = [0, 0, 0, 0, 0, 0, 0, 0, 0, 0, 0, 0, 0, 0, 0, 0, 0, 0, 0, 0, 0, 0, 0, 0, 0, 0, 0, 0, 0, 0, 0, 0, 0, -1, 1, -2, 3, -3, 5, -5, 1, -3, -1, 1, 0, 1, -3, 2, -3, 5, -6, 6, -5, 4, -4, 2, 2, -7, 15, -30, 45, -77, 124, -194, 318, -530, 929, -1782, 3952, -11824, 96190, 760313, 687064, -78292, -531920, -311676, 143894, 294985, 131865, -45141, -89532, -128874, -193264, -106714, 175487, 357204, 165308, -262845, -467763, -171112, 353749, 522399, 155542, -287888, -335960, -71997, 127471, 113160, 12194, -48242, -74309, -104383, -70569, 102972, 270971, 174490, -136284, -285794, -95267, 163536, 175317, -3482, -93246, -16887, 21007, -98365, -171400, 2114, 233612, 190260, -90882, -242775, -70702, 214118, 269043, 16588, -251948, -225535, 22403, 147799, 38460, -65080, 11437, 105806, 1956, -189811, -150639, 151944, 329977, 99117]
139I9117l66936k2946L38480K53096j30830l18438j22340J70276K11383K3798
149A34660r6153l5539K0290m0957p5419K8587J35390P3153j02895j72011k8955
160a59849J61533J55154m1871j74532q5793Q7820J28948J8549p3735l6734L3359
171A2849J506o7926j8693R5313O9773q4193j22429L8971J66846O0875j39753j54408
183a41269L8997J73156O9119j19878j37224K3015J33993O2176p6127r8051O685
194f5408Q1789L1026m8253k2557O2790M7737p5988j22861N591J48521R9270r2762
206D8895j72850k4702J60677J38522n1939j51285m9457Q1911P1508j6968l4614
217c02J3917J4716m5414n9606K1629R3299M4855o7662r1963M652R5030P0227l1048
$$ y = [99117, -267819, -290765, 47715, 300811, 169981, -148457, -270797, -100521, 110862, 134660, 38507, 2968, 23258, -17699, -93118, -64531, 70859, 144012, 41117, -130894, -159849, 1684, 156838, 114967, -59565, -145358, -57538, 71410, 89959, 16224, -20510, 12849, 14355, -53571, -72264, 23049, 92822, 8629, -113800, -74829, 92017, 152892, 13139, -141269, -102272, 70884, 140003, 20125, -117099, -94084, 39909, 102085, 25958, -72093, -65408, 16381, 47407, -846, -23403, 39387, 87124, 11136, -111725, -106134, 42387, 141657, 48895, -123955, -148657, 12020, 150542, 98603, -52682, -102139, -20228, 51280, 34312, -302, 13615, 28331, -17083, -76689, -55060, 38239, 83094, 15432, -76531, -71879, 23151, 93378, 62330]
230F2330q7838m0352M4744N5755j1278m6161K486M2599O88n3925k4339N4048O2148
243F0905k0987p8099j8305P3394N4711m6072p4423N083O4040K0889n1472m5410
255e5746L1158O9914J2264o3787m9904K7280N7249J2315l4783l1744P340K9506
267A1062N283k6154q420L1022J6760l7070m0557K2963O7719K6209n9339p6410
279f6932Q490Q1128L7995m8882n1237J2227L6845P339j3798j652J3864j023l1390
292a7026k2105L1371N1185j974n4557m0017J5654N0978L3590k2814n2602j0931
304c9248M2993L2597j4067k6116m745P434k420j3611J139L0977J9257l5885m6934
317d8629J7612N9901J8110l9172l7582O465L6140J9055k0662k7243M150J5025
$$ y = [62330, -25508, -65860, -21116, 34639, 23361, -22800, -20314, 22285, 22973, -30952, -55291, -1243, 60905, 39918, -38181, -56486, 16908, 71619, 25547, -48876, -43793, 20247, 41136, -10336, -55746, -24588, 45326, 57590, -6197, -56101, -28821, 28428, 40743, 5960, -25784, -18444, 11062, 16345, -9809, -18229, 12793, 29553, -7517, -48074, -25111, 42608, 68817, 9478, -66932, -58442, 22686, 60681, 11799, -39438, -27211, 9634, 16973, 3175, 1523, 15387, 14364, -17026, -39131, -7760, 43425, 41451, -13106, -53123, -37469, 13509, 47099, 24285, -28317, -39248, 3745, 36342, 22275, -3841, -8586, -1152, -3572, -17183, -16044, 14933, 34190, -1695, -48629, -31017, 28884, 46994, 7822, -29760, -23295, 12845, 31900, 11238, -16005, -11855, 3170]
329C170o532j1251Q167J3969K359p479j2628l295K0935J9535j5806k9351K26K5313
343G332J3722j3788k4570l566K5909J4946k4049k1983K0814K7976q354k3797k212
356a1620J5249R450q675j5959J788J9211L030j9428p369J5069J0151n321r074
369c498q011J948J7401J0227j5817j7415O021J5606M461q036j0317J023J3279
382F872J845j5282j709J8230J531k2698r551J8031J8272k697j7412j2164J0284
395f448J9905J166j4627m778L790j547k7P321J183p444m076k007k511O606J4361
410A0867K765j2258j2211L79J4460J5251n938k1382n737J2064M463o111K615P755
424F982m669j2451l776J0316J5495M737j1629j2462P81O179K227M157L959p732
$$ y = [3170, -3362, -14613, -6446, 7523, 9882, 2403, -10225, -13520, 7415, 26950, 11144, -18207, -17981, 7332, 21054, 7266, -17304, -20870, 5039, 19985, -4064, -26047, -5233, 22743, 14389, -9408, -11620, 3629, 13079, 4404, -11555, -9767, 9444, 12474, -6954, -14323, 746, 10897, 5576, -3498, -11509, -9561, 7840, 18067, 2250, -15165, -9144, 6462, 10923, 2887, -7430, -6407, 6872, 8717, -6565, -8274, 9956, 11487, -11211, -20762, -2731, 15541, 12844, -4568, -16732, -6448, 13457, 14623, -4, -4782, -992, -2539, -2566, 4755, 5938, -1506, -5582, -7589, -10100, -3494, 10867, 13632, 1374, -10837, -10458, 4002, 19253, 13315, -8067, -13804, -1740, 2723, -3388, -773, 6982, 2313, -10138, -13914, -3598, 11897, 16634, 5005, -7457, -6676, -497, 1730, 5887, 9846, 2114]
438B114j4097l007R193J0489O303j464j1237j1639R8J3425J5874L641j4972j8360
452a3639j076J1851P785K000L451m129j7512j3434J1614K8081J4241j5603k9133
465a5503j2350J5016K4498J2335o146j9088j8822k130J9243K0596K332j3867j5154
478i040q889N84J3628K1036R885j6458l0230j3789J9365L4502J4881j7727k9853
491a2105j6580O828K5028K3861r48k7016k5755O08K0951J9261N180p042j1928
504C43j2648q245P439K6836K2292j2087l8103k4294J1593L3617K7019m067l4590
517d895l1525M723L3433K7189j751k2577j8810p73P853M437Q886J6658k18l0619
531g989l0842N765L8105L4540k590m0584l8469M031M0978L5714j25l2446l5141
$$ y = [2114, -11983, -14990, -5797, 4692, 10995, 9531, -1706, -13345, -13247, 178, 16052, 19693, 4721, -13639, -14715, -2864, 4921, 6921, 10372, 6243, -11269, -24703, -13089, 14992, 29233, 13630, -15503, -27853, -12837, 11661, 23996, 17850, -1238, -20060, -22190, -2947, 17649, 19981, 6114, -9040, -17929, -17345, -3717, 17319, 27204, 10746, -19484, -33273, -13908, 20594, 35475, 17748, -12105, -28685, -21857, 3171, 27032, 26084, -932, -26687, -26079, -5128, 14133, 19313, 12271, 343, -12305, -20550, -13111, 13725, 36017, 23930, -14173, -38467, -26874, 6743, 33762, 29695, -4895, -36420, -31697, 1736, 28925, 27174, 4597, -14213, -14986, -7133, -2696, 6190, 22848, 22630, -7989, -38831, -33066, 5039, 39579, 36989, -3595, -42064, -38033, 2945, 38659, 38534, 6088, -29053]
544b9053m644K7075K5264J779r246r617j5187j3108O639K7570K6669o09l5613
557b081l9993J113M3957M1175N80l8501m5897j0811M0701N0274M075l9955l5506
570c0869j563K3384K2080M686n830l890j0080k0721n794K8089L5818M071l3089
583F292m3660j2385L9658N4271O812m8382m7344J305M1664L6358m440l2253j6114
596a8218J0294P219m917M527J7691O973j7978k9702j2571K5350M1960J0530l4553
609F605m0497o781L0846M0544J0553l1715l6790p10K5986J7378K25q171q982o149
623g658l954k361Q614K0340R767j7195k6612j0375J5306L4054K2718k1293m7971
636b6620j8385L2573M2404O837l1608l3479K13K7990J7625q530j1449J412K998
$$ y = [-29053, -33697, -6622, 18642, 20421, 11175, 1558, -13629, -26737, -20098, 7472, 34141, 33532, -2081, -42074, -40961, 2996, 44171, 44751, 6250, -39647, -50458, -9757, 40517, 44592, 4637, -30869, -32432, -9048, 13032, 17718, 11888, 7998, -2082, -22803, -28597, -508, 35310, 39381, 6292, -37368, -49753, -10095, 44176, 50988, 2606, -44738, -43433, -1769, 34589, 30149, -2104, -18218, -7924, -705, -5622, -1095, 16596, 23569, 5591, -24111, -36682, -11332, 30628, 41158, 6605, -33892, -40673, -9827, 30717, 41270, 9555, -27235, -27945, -1959, 15419, 15644, 7473, -1509, -7658, -11612, -13973, -5359, 14981, 24748, 7553, -19059, -29434, -14128, 19926, 42644, 21351, -26620, -45005, -12432, 29972, 36809, 5201, -28278, -28065, -75, 17550, 9020, -2429, -1017, 1981]
649A981m941o026K196J4545J5494q604l1252j5526K2361L4143N901k7947l1943
662b9618J640L3568K3078j4947k6977l266J6025J0817l600r036k250O919L988
675F341o686p391K581P328M376j885r321p709P197J5205J450j2881p809N135R329
690E260L555n955r096m09Q425N382m142q587m432N483J3110K985j4260j2098Q410
705f369J7530L074j3408j2033L680J4187M984j1951j1179N470J2109P17r551o110
719h850L850R973M043p029r308J850J0107M469o314q825K7R082M524q504r174
734a0079M638J1944J017j0104n673M623P610K874k540m637l518j04M185N396K42
749E874o358o597O96O287L959o94k676l094j618J877M636L001j295l540k885j202
$$ y = [1981, -2960, -8986, -6790, 7755, 23249, 14645, -16607, -32133, -9772, 24371, 30272, 2325, -29618, -27978, 5590, 28668, 13721, -13256, -16522, -497, 10320, 6720, -2316, -4566, 2353, 6341, -345, -7736, -5155, 2173, 6549, 4664, -4657, -12366, -5169, 10036, 11486, -1395, -9204, -4069, 5260, 8815, 2860, -6236, -6645, 1780, 7162, 3020, -5567, -9999, -4516, 8594, 11579, -2681, -14779, -6369, 11161, 14235, 827, -11206, -7526, 6661, 11645, -306, -11485, -6015, 6094, 6811, -2740, -8850, -5000, 4973, 9016, 1987, -7321, -5471, 4636, 9105, 2791, -6034, -6007, 3075, 7599, -905, -10079, -5441, 6503, 7520, -2584, -8257, -3634, 3976, 6850, 4310, -327, -3845, -3949, 236, 5632, 5874, -484, -7081, -6385, -98, 3861, 3167, 491, -2603, -4221, -2344, 2292, 5293, 3998, 458, -2427, -3629]
765c629J916M296K649j849o862n096K362J0133N840o665j0846o67R621O802k947
780E058n715k116J832J915l13N7J129j784l836N4L527K032q36n23j621k251K580
797h11N905K61n858l721K452M632J231l818m058J046K896o47o65K457L87l772
813b083j285L911L345l81k457l250k78L889J833k832j896M30j505k08L667J383
829B283l030j003J559O67Q6J375k54q55l89j369o09K838J233m910j778M927J491
846B262m750n23L866R05j016L29j035l10J588j14j219J480J26m145j162M317J101
863A700k568K98N92k965O11N049J162k669j559j467K11M378J632m707k696K408
879e90j55j957K793K876k958l074Q18J811K450K104k907l685J671K902j747K76
$$ y = [-3629, -1713, 2583, 5232, 3383, -3479, -8575, -6213, 3920, 9760, 3095, -7751, -8418, 1203, 8005, 5058, -657, -2773, -941, 974, 661, 718, 1847, 63, -3773, -3719, -192, 1840, 1004, 481, -1140, -3391, -811, 5094, 5355, -503, -4224, -1772, 2860, 4091, 273, -3785, -2739, 157, -490, -1155, 1302, 1689, -2083, -3368, 543, 3888, 3507, 1050, -2200, -2478, 1411, 3244, 412, -1484, -1054, -2559, -2767, 900, 2283, -747, -1750, -191, 476, 562, 1937, 1683, 828, 439, -930, -1539, 1299, 2532, -2378, -4156, 771, 2262, -2488, -3011, 855, 1760, 744, 1073, 38, -272, 1316, 1202, -17, 1463, 1589, -2556, -3718, 599, 1700, -868, -570, 22, -2943, -2332, 2717, 3879, 1210, -349, -1816, -1605, 2773, 4405, -302, -2998, -590, -745, -2702, 91, 2967, 9, -3065, -2247, -436, 2014, 4118, 1211, -2474, -803, 2099, 352, 628]
895F28J788l237l789L210L579k106j425Q39m16o2J876O36m60O09j401k747K722
912B44L935l330m087J692K162j499j15J380p49n95R80l84N06K709n95l544L78
929i12K678q72j232R21p56k205J156K028j290q69J113L77K27O67j322o89L102
946B122J885m367k693L359J581k074j178R46K56o00n39o70K148L225j491m023
962b113L27K660Q59N99L94l126l056J607K939k39o76k16j288j238M53J910L112
979B908J830l603n791R42O609K677l496m060n51Q28R69N39M90J302p31l538j793
996d469L363N025O49k568l659j813J542M425K092k839l940j622J259J693J438
1011E76J138J45k066l713K99M940M712j686n524j798K032J260l68R06K107j212
$$ y = [628, 2416, -821, -4610, -1400, 2179, 73, -1352, -513, -929, -991, 885, 1521, 1061, 1670, 269, -2478, 244, 4179, 849, -3238, -1546, 616, -883, -998, 382, -367, -962, 18, -366, 140, 2849, 2254, -1290, -912, 1766, 894, -338, 583, -173, -2378, -1222, 806, -484, -1353, -240, 137, 364, 1031, -291, -980, 2122, 4007, -360, -3053, 306, 1887, -187, -1365, -419, -163, -763, -1302, -1972, 176, 3401, 1910, -2113, -1786, 874, 1733, 2332, 2726, -400, -3456, -1849, 1090, 851, 175, -41, -1329, -2567, -2114, -204, 2908, 4738, 1135, -4656, -3714, 2895, 5572, 2076, -1984, -2535, -1707, -738, -199, 291, 1593, 862, -2676, -4469, -1106, 3919, 4568, 2000, -1659, -3472, -1930, 2495, 4587, 1748, -2192, -3814, -2555, -862, 576, 1714, 1859, -207, -3920, -3621, 1319, 6031, 4345, -1179, -2977, -945, 315, -53, 853, 2960, 1748]
1027A748n575l375M019P948K748n667p865j76O548O064o39n576l590J268L178
1042A058k80k534P96L878ko618m827N149J0223L273r067j0298J612J1226N881
1057I470n123p676j350L165K614k85j081K12J217j442k810Q0L131L484J099k959
1073A746n215j594N038N350n78m286l692k107K286N494K718l736n626j414M591
1088a025O023n33o505j777O531L076o295o547L925R162K205q911j0512K215J4054
1103E086P003r427j1996P00J0681P675l822j0766k972R833P381p185j0554J979
1117f384J0650M751p662j1566M95J3695Q171q823j1799J280R483N161l005o334
1131a887l316M098N179j650m377r54J647J892J691j742m349P02N348K342k718
$$ y = [1748, -3827, -7202, -3183, 4765, 7513, 1846, -6019, -6195, 353, 6417, 5778, 202, -3388, -2120, 1058, 778, -1756, -960, 2918, 2916, -3702, -8529, -3380, 6843, 10116, 1049, -9249, -7637, 3589, 9470, 4347, -3329, -4679, -1514, 1100, 815, -266, -54, 1163, -279, -3089, -3009, 122, 3606, 4705, 1746, -3469, -5063, -25, 5325, 4747, 461, -3231, -5338, -3052, 2442, 5160, 1424, -4202, -5616, -1025, 4998, 4465, -2040, -3817, 2714, 5790, -505, -7052, -3127, 6035, 8240, -671, -11183, -8968, 5086, 12089, 2662, -9334, -8634, 2047, 9722, 5900, -4866, -7838, 1995, 9376, 2191, -8363, -6384, 4266, 9017, 1355, -10211, -9716, 3979, 12150, 3327, -8472, -7192, 2291, 7452, 4447, -1887, -5203, -1105, 4074, 2424, -1953, -2907, -1260, 632, 2323, 581, -3768, -3066, 2282, 4624, 1906]
1146A906l132j904P67N655L227n834p251J597O937M071l846q371k089J0626Q551
1161A0910p892j2709J804J3402O580q212j2666j712J3870R945q979j4962O39J2874
1175B892O368o313j0144j577J0834R004o990j3157Q99J3278O209p950j0964j554
1189i165J0405Q586o104j1321M80R001K566m105k541Q23K131K243j743l128J058
1204h14K897m87j421M54j807k458K034M071M50l019l601j306M727P007r79q899
1220c151l538O434O301j303o746m279M943P843k841j1109j188J2010O971p948
1234B399j1611L72J1855Q836o113j3134j628J1226O492n701q092k59O025M048
1248D715l908p200J705R534K469q208p032M582Q991K112o770o985K202P073Q16
$$ y = [1906, -1226, -3130, -2363, 3292, 6519, 685, -6566, -4969, 1968, 6039, 2193, -6178, -8267, 2359, 10910, 3018, -9691, -7887, 5515, 12095, 3883, -8783, -10495, 3375, 13320, 4341, -10621, -9982, 2892, 9260, 2947, -7197, -8774, 2060, 11064, 4074, -9083, -8184, 5094, 11303, 3353, -7611, -9165, 1240, 9826, 3722, -7599, -7119, 1882, 4448, 343, -2198, -1375, 756, 2999, 1256, -1872, -814, 2083, 1596, 175, 629, -1178, -3636, -1602, 2469, 2919, -100, -3701, -5007, -280, 6727, 5748, -3151, -6689, -255, 6046, 4743, -2003, -6282, -1339, 6504, 3663, -7446, -8634, 3376, 10347, 2399, -9212, -8840, 3015, 11851, 5738, -7396, -9024, 2202, 8694, 2993, -5099, -5358, 667, 4715, 807, -6393, -4688, 4846, 7315, -893, -7925, -3343, 5648, 7760, 990, -5995, -3793, 3280, 4096]
1263D096n459j916L599J625l366k527K826M510L48m942l375L859N339j218m988
1278a589q31L440J299k876k857J587M221R96n068m393L322P567J065o670m985
1293e772L794P004N76p099m102N123O188l498p870qP890L975n659o891J836P695
1309C182L447n152o413J697O989J676n761m292L012N027n97n526k818M646N743
1324D860j648p092j415O326N032l456o133k18N644L583m465o150J740P134O1o666
1340b863k417M819M467j706m838j502M976M079k625n644K64M992J689l193l588
1355c090K62L750K418l752m400K494O139o11n743j522M841M198j915n909j735
1370d575N836M478m522o284J890N712M55m366k626K218N127N65n701k882M978
$$ y = [4096, -1363, -3279, 320, 1945, -1421, -3948, -1122, 3388, 3736, -1206, -4581, -722, 4617, 3399, -1589, -2420, 1020, 2319, -557, -3414, -1827, 2394, 3390, -1678, -6071, -2749, 4818, 5883, -787, -5772, -1978, 5026, 5602, -1497, -5599, -476, 5712, 2214, -5656, -5664, 2226, 6201, 542, -6349, -4513, 3182, 6629, 1477, -4936, -3239, 3750, 5426, -335, -4627, -1615, 3412, 2815, -2711, -5529, -883, 4860, 3212, -3880, -5295, 1031, 6063, 2607, -3526, -3744, 1900, 5483, 1018, -5132, -3392, 3742, 3803, -2863, -5280, -461, 4006, 2300, -2538, -4040, 936, 5015, 2390, -3254, -2990, 2002, 3691, 498, -3090, -2828, 922, 3340, -412, -4812, -2318, 3821, 3210, -2533, -4055, 786, 4984, 3069, -2840, -4575, 1261, 5739, 1217, -5067, -3177, 2535, 2990, -1376, -4002, -1784, 3343, 3908, -1793, -4675, 303]
1385C03N230k393n532j055L239L667p05n301k345M886M123l588m596J552N006
1400B491J527l686m372J696O458J125o606l784M874M071k376l970n61K879L017
1415B783j771m312L53N525J575m213k682J917K866R79k331l732N48M877L72n151
1431b397j398L961K541j849l091o04L653L874k569n654Q25N724Q69m573k385J811
1447a262K888L88l447k430L239M005j991m299N71L910J609j600k593j547L022
1462D63L458k481m896R94M240L29k925k174J233L630J424m339k918L884M547k237
1478B232m326N5K693J771j114l190r06L101J968k952k203K183K228j89j559r10
1494a118M55K465P99k694k103K110K080j466j792m96J292J653p05k755N43L733
$$ y = [303, 5533, 3140, -2392, -3447, -208, 3459, 2754, -2547, -4892, -6, 4117, 529, -4067, -2515, 2491, 4018, 332, -4040, -2344, 4114, 5239, -1367, -5151, -277, 3794, 1418, -2552, -3113, -234, 2783, 1012, -3300, -2947, 2578, 4153, -60, -2742, -825, 2041, 3020, 689, -3043, -2495, 2382, 2754, -2397, -3795, 166, 2707, 858, -2233, -2837, 816, 4690, 2121, -3533, -2708, 3016, 3885, -688, -3073, -1262, 1626, 2014, -1433, -3863, -624, 3381, 1390, -2909, -2338, 1572, 3181, 1581, -1012, -2559, 463, 3921, 1440, -3456, -2462, 1778, 2107, -818, -2992, -1759, 1871, 3295, -1044, -3962, -78, 4469, 2232, -2094, -2039, 654, 2425, 1311, -1879, -2785, 316, 2284, -668, -2871, -688, 1540, 1351, -208, -1118, -663, 1802, 2601, -93, -2196, -86, 1994, 528, -1264, -1760, -468, 1185, 480, -2275, -1732, 2001]
1510B001N89l520j355K791K217r93k542j267J793K185r16l008M8K715M86j671
1526d47r37J74J708J694q91k754K14K841R75k076k002L77J538Q77j381j973Q70
1543a193K477m66k204R3K001J042j167j074J25J009P56j003j403M82R63p65p88
1560a115N66N47N4j64l76q3R40J202o37j210l68R34R42p48j441l85J337P58j080
1579c27j461O83J965K28j502m22P45J232M3o09o96k47M22L41r7p97n30m3R57O06
1599D91n35r06N17J402K89r98n81M07O98K28m17j211o10Q09Q09p7p20q09k33J765
1619C18J389j505j394R18J714K63j431j075J63J233Q63j361j906L70J298Q87J90
1636I34j091j723P24L067M09k436j478J305J914J03j566k385M14L286L31k666
$$ y = [2001, 2590, -930, -2285, 506, 2723, 1730, -812, -2079, -286, 1899, 983, -2025, -1977, 738, 1224, -447, -1384, -1210, 498, 2192, 1301, -1453, -1239, 1602, 2577, 501, -1501, -1124, 414, 1291, -90, -2063, -1193, 1284, 818, -1386, -1293, 708, 1750, 583, -491, -366, 643, 1399, 396, -1007, -525, 438, -327, -1115, -549, -2, 52, -112, -488, -571, 369, 1571, 934, -276, -644, 290, 1232, 484, -957, -1342, -5, 753, -327, -1788, -1105, 860, 1088, -414, -836, -91, 1141, 1184, 575, -121, -368, 54, 395, 298, -499, -1029, -1072, -115, 491, -44, -950, -433, 969, 1258, 260, -321, 86, 784, 1012, 595, -616, -1226, -417, 392, 315, -405, -1214, -1447, 318, 1707, 202, -1192, -274, 1440, 1703, 272, -803, -640, 593, 1456, 95, -1811, -1441, -143, 744, 934, -157, -1880, -1156, 1911, 2320, -116, -1594, -289, 1625, 1728, 162, -2223, -1809, 1477, 1808, -858]
1652h58j957J564K003J235p49k997q32L336K836j798l470m81J938K365p2l731
1668a668j650L096L197k123l154P1K483J725K75k718k328K113L522j52k825j665
1684a801M0J871K216j337l787P0L671J191j883j437K22J129J925o5k941j166K462
1701C80J717p14j749k036k29L472K560l106l958J396L825J325j620k944q84L454
1717H89K994k855l679N35L206J090j393k881j442K884M230j356m649r89L413L176
1733C173O4l572k775J905M225l53m506r32K667J473m92j615j479R77L176M40k688
1750c12j627J300J738R03o40k687j167K593K024j576k126R4Q05R77Q92j338j383
1767a530R45J976K29j124j147l08J436J847r82l699l27L197J671j487k641o42
$$ y = [-858, -2815, -1251, 752, 1987, 1238, -1759, -2591, 745, 3581, 1783, -1687, -2168, -230, 2135, 2063, -1668, -3318, -222, 2975, 852, -2302, -2231, 252, 1977, 2252, -466, -2794, -681, 2841, 2689, -136, -1801, -1761, 110, 2326, 989, -2798, -2728, 943, 2134, 251, -1186, -964, 165, 2090, 2025, -916, -2082, 380, 2097, 1383, -366, -2402, -2631, 841, 3401, 295, -3663, -2267, 1558, 2883, 1263, -1681, -2565, 889, 3883, 1028, -2651, -2116, 1090, 2180, 787, -2094, -3536, -652, 3578, 2222, -2427, -3416, -3, 3173, 3237, -335, -3110, -1205, 3020, 2667, -1839, -2771, -104, 1369, 877, -738, -2217, -1240, 1936, 2376, -312, -1939, -639, 1099, 2002, 1362, -1325, -2492, 101, 2125, 549, -1577, -1483, -678, 299, 1191, -147, -1530, -585, 1391, 1620, 496, -651, -959, 477, 2324, 1342, -2357, -2684, 513, 2184, 697, -1944, -2586]
1783b586K328K590n13l371o07K912J700j239k288p19J556K132l91l280j233K572
1799d37K469p92k559j206K125K693l37k893r42K486J456j239j781N8R94O85n98
1816A82j274j9J021N03m39k07J23J13N50J71l51k90M9j47k05L14J31o62l76K29
1836e84N35O48n85p77J64J355P31j393j245R69J737k47k080j160J702J630q25
1853E75k044l85J680J642q46j587m60J803J483o52j842m74J528J185r68k014k11
1870a587J718J341j572j750N71K270N89j580j253O72K084J58j965p74J031J146
1886A099p57j186k39Q31O49k85j121J24J234M38q09l26N78N71q0n54q75L86R85
1905F63j76j609j26J507N00p55j203K31J675Q76j382j373R71J946o70j913j07
$$ y = [-2586, -258, 2332, 1819, -1552, -2159, 753, 2453, 1214, -1074, -1793, -237, 1895, 1504, -1776, -3009, -437, 2032, 1240, -1319, -2525, -400, 2293, 1956, -937, -1879, 607, 2063, 824, -957, -899, 95, 780, 182, -1092, -1111, -90, 413, -26, -233, -110, 3, 553, 724, 373, 83, 132, -15, -220, 94, 225, -437, -813, -584, -49, 599, 14, -763, -599, 756, 1487, 94, -1151, -182, 1555, 1308, -772, -1932, -230, 1400, 575, -1469, -1854, -174, 1468, 622, -965, -1425, 378, 1861, 1209, -633, -1107, 421, 1606, 638, -1376, -1587, 131, 1472, -100, -1850, -1279, 991, 1580, 0, -1253, -581, 1503, 1661, -304, -1078, -47, 1099, 342, -844, -1083, -252, 397, 112, -1009, -885, 349, 787, -22, -348, 230, 801, 721, 167, -708, -322, 663, 487, -1122, -1248, 259, 759, 4, -1199, -968, 707, 1583, 201, -1172, -201, 1745, 1075, -838, -945]
1922i45J185M32l01j563l82J402J278r55j351K51J697L76o46r46k38J190J263
1939A747j493j922R62J343l7j433l75M67J199N55j568r05J806J565j207j445P45
1956DO00o5n10p26l53J141N19j244o32J145M97k43R9m30j36J194O26j741o29J519
1976F35M64j225q42L95L59O45l76j352L13K186k48j733NJ468K61n74l01l84Q6
1995b18J075m51j741N14J366l80q29N7K80M79N22j64j294M55J748l89j635mP56
2014A47K67L6r97r63J069J776q30j945P89J707j47p09m64K8P60O58p34j446O42
2033c56R61n59p19N6Q2M18N83l74j015P21J329l53j090J65M33n9L8k81o86O54
2053e2M99r55o55J361L87r28m75R13L92J55k77p40L20R92n8j374k34P22K08k40
$$ y = [-945, 240, 672, 371, -1192, -1574, -172, 1106, 151, -1200, -949, 748, 1124, 478, -468, -706, 484, 1747, 254, -1668, -706, 637, 600, -833, -1208, -741, 458, 1013, -555, -1460, 346, 1911, 704, -741, 4, 604, 539, 29, -697, -1050, 91, 610, -634, -1266, -121, 376, 133, 232, -198, -334, 860, 1486, -255, -884, 635, 1099, -126, -968, -573, -214, 431, 55, -1297, -984, 1202, 954, -779, -774, 694, 955, 381, 80, -304, -218, 857, 406, -1335, -821, 545, 165, -664, -607, -327, 152, 674, 510, -784, -329, 1419, 1030, -605, -609, 147, 414, 450, -547, -1510, -441, 1335, 505, -1440, -651, 1056, 909, 200, -264, -236, 524, 1182, 448, -998, -356, 605, 46, -673, -617, -535, -117, 466, 92, -923, -202, 1127, 774, -316, -151, 282, 223, 261, -20, -706, -52, 447, -508, -1163, 198, 585, -343, -818, 95, 487, 642, 365, -375, -55, 937, 879, -495, -729, -7, 201, -39]
2073c9m51m97M27J163L43j462m69J213J261n38j283m42Q48J178o65j515l83J437
2091A26P56j053q42L17R57L67l43o31J61R53J31o55m30K53J17j64k81l50J97L12
2111a02J13n34M6O08L79m94n5L04M96m2q21k98N59O15p72j034J5J231L79q79p79
2132a065O74J129J93q71n05L36P97L65r85p17K04Q46R8p04p30J77R23M82p87n87
2152g27O21Q50k46m63j10K93K92k83l88o1K06m5p39M39P10k08o58J11P67K00O5
2173F26o28o42P27J016o23q89j59N26L62j3o84o95O34J453o7j930j05J580Q69
2192A358k69j407q23Q73J677m75j813j50P61O24j67n35n67K98J354J51j077m25
2210f12O59N84L37m17j026m61J224P92q61j263K11L70P04M36m01j023N02J117
$$ y = [-39, -490, -987, -560, 603, 946, -516, -985, 228, 1489, 951, -332, -774, 74, 1252, 587, -928, -1311, 126, 882, -171, -1013, -696, 261, 628, 285, -346, -185, 768, 899, 244, -186, 67, 184, 20, -261, -611, -414, -102, 11, -523, -477, 131, 510, 16, -39, 265, 761, 719, -102, -400, 159, 774, 2, -1032, -1017, 214, 593, -286, -1065, -391, 738, 931, 60, -445, -109, 688, 1053, 68, -649, -445, 401, 499, -205, -935, -758, 165, 647, -140, -727, -106, 744, 498, 35, -75, 218, 510, 227, -161, -222, -16, -61, -800, -361, 349, 141, -517, -406, 361, 561, 626, -2, -644, 83, 1099, 476, -413, -572, -46, 316, 303, -381, -1076, -442, 1011, 944, -986, -1091, 489, 1358, 1089, -318, -1141, -268, 1409, 934, -879, -1029, -268, 356, 189, -346, -913, -615, 739, 890, -187, -612, 47, 631, 968, 551, -475, -936, 288, 1080, 219, -1044, -833, -463, 241, 677, 276, -747, -245, 872]
2228H72j56n52k78j39M66R97p83j868K00J863L20r84q86o8Q21J467j53j947j75
2247i83J366P76m83o46n42j69J147M84j612q77J043J397l46p12j053M80J621J095
2265A986j645j465P03J104L01l49j043j075J040J242l37j571j04J063Q64K25j090
2282a51j165J178K143o94k203l74J202J005O5j273j571Q61J742K71j641n63R32
2299b36P30N96o12j253K41J665J02j577o50O71O77J45m89q59k38J236N36n26l78
2318b19N40m82J76Q90k39j211J15Q08j8l96j31p03L87J155l40j092r3J261N65
2337I73k01o77q40K90J700K43k064r72J138J209R4j530q01P12K040k37j806o53
2355a382J653J484r20j330l70Q43J333l66j873l71J095R47l34r60k99O26Q66j6
$$ y = [872, 716, 164, -114, -253, 213, 1210, 427, -1441, -1241, 622, 942, -42, -928, -996, -175, 1292, 1139, -808, -983, 383, 1159, 676, 30, -512, -681, 466, 950, -662, -1539, -496, 901, 555, -157, -1210, -730, 891, 1986, 341, -1124, -421, 683, 984, 635, -408, -1483, -443, 799, 462, -1109, -1213, -150, 714, 939, -151, -1316, -138, 2005, 1311, -892, -1266, -64, 941, 1006, -267, -1838, -977, 765, 1036, -605, -1168, -236, 494, 1090, 478, -775, -534, 1131, 1233, -344, -994, -323, 354, 499, 10, -849, -1087, 149, 685, 159, -219, 321, -161, 15, 905, 666, -545, -430, 378, 360, -36, -167, -870, -483, 672, 332, -760, -853, 408, 973, 772, 95, -745, -455, 1245, 1488, -576, -1548, -410, 799, 893, -637, -1438, -726, 1314, 1077, -729, -1382, 271, 1755, 835, -495, -865, -22, 1311, 945, -928, -1299, -204, 743, 409, -551, -850, -224, 642, 626]
2373F26r81k49J082M40p37n64K78K67J06n63l87K79N61l16m02N08N64l27o01K61
2393a55O41M72o12r78J47J058L39j031j020K86J328L59j059q98O47J119M18j038
2411B3j068Q25J533Oj523j060R36J436j40j850o51J108J405k55j653k55J465J017
2429A299p25j255M33P40N47o46j106J3R45K62o77p31N77N81Ro15j10M05P59j83
2449E22j020K49J142O7j250n24N05R44l69p82n65Q71J259o78j371M05J312P24
2467A441j005j057N6J093Q70j159j638M68J612J54j396o68L91J115O92r48j145
2484a124P88J709j80j635k28R05N31j73j157m86R62J035r03j224O72J231l49m34
2502f0k78M44O21J62r59p30R38R48j186r61L86P95K47l54q15q8J517O78j404j150
$$ y = [626, -355, -604, 478, 918, 181, -383, -105, 162, 268, -295, -682, -403, 158, -158, -560, -52, 512, 185, -416, -155, 486, 958, 346, -632, -485, 573, 912, -119, -1139, -853, 475, 834, -225, -1123, -476, 643, 1061, 23, -1045, -220, 1313, 1319, -204, -1264, -328, 1108, 968, -882, -1533, -425, 980, 725, -928, -1183, 282, 1299, 574, -681, -248, 492, 1039, 393, -713, -700, 245, 507, -170, -901, -324, 257, 266, -349, -459, -54, 705, 522, -498, -249, 893, 960, -290, -814, -309, 635, 266, -516, -1081, -210, 1049, 371, -1000, -595, 717, 1441, 436, -621, -565, 528, 1398, 239, -1399, -931, 681, 835, -561, -1229, -838, 277, 969, 21, -1124, -336, 1373, 1193, -442, -670, 235, 766, 593, -564, -1050, -88, 947, 44, -1180, -508, 723, 374, -60, -338, 106, 727, 889, -70, -800, 138, 1086, -100, -1061, -675, 120, 367, 13, -802, -890, 627, 1305, -99, -1249]
2522a249J260J244l92j229m86M71J373j89j994l85J762R70j199r52M50Q56O57
2539I68l53j445N5J487L47j190o56N79N52l7m83p92L4J526J86j504j04J330N40
2558A040p58o11J14N19N50o77j332O71J498m38j521j0J030M56k97n14m52R10J110
2577A288r03j040K45J140r2o63o29j57Q18R70j059j239P13J178J79q98l46M52
2595d3R01N0j127o21J048P31q58j137N54P19R8m66n87J77R01M75j204l2O61O24
2615H64n38n68r9L49M95j71j257k6J207N50q70p55M13R24L71p89q43M43J340K6
2635A066j507n92J076P14l76j153k07Q72Q02m38j040L41O14O51n38o13K03L97
2653B72M99m26p29r1Q96q6p72k63O20N58k87o00J41O03K92l54r28P06P29j68q91
$$ y = [-1249, 11, 1255, 863, -366, -852, -381, 992, 803, -1191, -1576, 186, 1156, -43, -995, -545, 311, 968, 615, -830, -775, 712, 1059, -131, -787, -208, 344, 307, -176, -968, -934, 592, 778, -726, -830, 500, 1040, 282, -329, -215, 304, 854, 177, -1155, -484, 1014, 576, -945, -955, 75, 531, 234, -280, -732, 178, 1288, 385, -655, -410, 730, 638, -25, -654, -811, 7, 977, -82, -1321, -608, 570, 749, -149, -495, -43, 858, 908, -219, -840, 208, 939, 81, -1056, -502, 217, 315, -151, -738, -561, 340, 815, -389, -421, 240, 864, 326, -242, -341, 8, 503, 332, -925, -951, 256, 806, -64, -819, -406, 518, 889, 100, -743, -300, 1040, 1066, -441, -1033, 43, 757, 381, -772, -979, -107, 695, 257, -783, -442, 172, 823, 285, -328, -125, 272, 771, 345, -384, -475, 421, 335, -437, -700, -80, 478, 191, -409, -268, 335, 627, 273, -655, 51, 780, 612, -279]
2674b79k67M18O91l18j038j39J085N69n20o83j63Q65N73l52o98j23P87L32n11
2693B29q94O1P16L62n42r38L43J174P8n93m79K13Q21N0l95m97L69j6j77j54J15
2714a54J30ol15oK29K43J49k90j91O22m1k66k00J17K44J47p26n97N43Q60n3r57
2736e18m14P43O78L61q88o70N61J174m18j055K3O19M36l37r24k45M69R52j54q90
2756d97LN23M68O6k33n79j05Q62p6n64m3J56j59J53j01j86J9L56J03j48j6K88
2778B90l22M6P06k26r14m9P15K21k63m12n83K69J010Q0q71k49O18K71M5m6n27
2799a91k26J036J59j083n87P80M28j6l90o40P3J136L73r63l97L57M62J40m2l78
2819C1n12N66M56n95n12K67L07p6K46l26n41K81J187j99p52R1J76J28J48nr16
$$ y = [-279, -546, -128, 563, 245, -793, -932, 153, 722, 202, -481, -644, 221, 794, 442, -256, -379, 408, 740, 229, -665, -604, 112, 474, -68, -1006, -663, 511, 589, -4, -483, -270, 551, 601, 206, -291, 78, 62, -115, -269, -154, -24, -30, -345, -351, -122, 121, 270, -20, -211, 411, 370, 104, -96, 21, 265, 412, -314, -911, -368, 492, 439, -518, -932, -189, 489, 850, -38, -708, -147, 1027, 609, -446, -423, 196, 632, 295, -629, -874, -405, 547, 393, -497, -494, 29, 497, 563, 330, -249, -354, 508, 432, -132, -175, -19, -178, -25, -126, -312, -293, 63, 166, 18, 2, 290, -32, 14, 720, 494, -420, -469, 246, 467, 204, -208, -791, -522, 488, 568, -303, -552, 66, 337, 382, 336, -191, -417, 619, 778, -305, -892, -112, 316, 300, -90, -730, -657, 479, 852, -111, -508, -151, 311, 451, 409, 31, -481, 85, 541, -54, -566, -299, 8, -68, 178, -148, -689, -408, 779, 580, -172, -81, 95, 223, 371, 366, -550]
2840e50n9P27l5k04j75k7oN44K15o85k87O91Q46p55l63m0r4M25K97p78m39M66
2862b86M35o1k34j10j15L88N43l95m46K09M28J8j95l20k59K45N95l33o50O0N35
2883E2K11qq8n59Q3P61K17m32n42J13M48Q4q5p17l9M48K87n91m30N43N81Q1j69
2906B49m90p7Q67J57o31m59j31M15J93j4m39j39L77L18k87j66K50K08J79k91l0
2927E9m9J38q1j7j82rn5m3K14K95m52k12K8M76L18o4n14k8N14K0k78k81k20M79
2951E6L21m48k91k02O15K56q5o60j36P13P26l46p99j62O16M48m67p33J99L52K58
2972B31j87o27L62N60J06k77k54j3L36K93k63n09K70K22J5m74r7K96L2j82j13
2993b73q2O21K16p22P1L90J24k07l26O3L14Q6k57o21O7O07K66n99l97N75L91N0
$$ y = [-550, -609, 118, 83, -121, -296, -323, -329, 215, 430, -255, -542, 149, 995, 240, -123, -163, -257, 168, 465, -313, -752, -286, 149, 88, -146, -256, -371, 17, 560, 165, -281, -72, 356, 374, 179, -141, -400, -155, 440, 107, -543, -483, 52, 263, 255, 167, -392, -309, 452, 669, 237, -305, -192, 256, 340, 255, -462, -501, -53, 234, -357, -787, -244, 337, 418, 249, -241, -318, 549, 706, 75, -384, -515, -100, 93, 79, -360, -499, -122, 196, -91, -257, -7, 201, 380, 89, 59, 10, 148, 67, 50, -132, -141, -196, -239, -25, 270, -182, -394, -366, 110, 428, 364, -150, -178, 336, 356, 78, -203, -423, 56, 377, -71, -362, -564, 51, 307, 222, -438, -574, 139, 865, 519, -280, -442, 174, 622, 155, -578, -379, -27, 231, 44, -583, -221, 339, 445, 168, -86, -99, 237, 530, 267, -242, 28, 250, 265, -209, -306, -10, 22, -160, -273, -355, 266, 482, -240, -169, 221, 345, 138, -188, -125, 189, 275, 18, -603, -536, 71, 337, -262, -659, -84, 307, 357]
3015C57l61k94K89O07J37r93l07N34N67m27n06l27M91P23o5q66j42P48M43k73
3035C35l55j61M19K92l85n89K17N67m2p05P7K01L22o3j39j79K23M63k25n42L68
3056I9M51m54k94L2k5L11K10o10m45P68M22l33m10Q5L35M92l93o80K3R13L54q11
3078D0q52L71Q32l1l58o27N1O10M11n89l82N68N63l94l80nL1N82Qj001k40P34
3100e8M87m93m51K44N59j81M4j83m0P95l02r05L73M18J40n03j38k58M28L38j50
3121A64p79L94Q52k70n03m4K74K39J73l73p04L05Q05k82r12L7P02K08n5o10j29
3142e08N69Q94p10o75J40Q18k35l31l23J70K97J39m80m22N79L13j80l68K45K29
3162A61J72n4k70j43M15K10m65n51K90M55q3n09J32N1P06k37o52j94R61K56l28
$$ y = [357, -4, -298, -9, 598, 735, -258, -565, -31, 536, 109, -397, -724, -233, 490, 425, -441, -583, 165, 608, 335, -20, -181, 238, 530, 145, -444, -227, 340, 298, -407, -330, -129, 193, 130, -9, -188, 35, 498, 273, -269, 99, 550, 96, -198, -166, -191, 120, 330, -280, -725, 43, 465, 132, -278, -193, 142, 634, 241, -439, -416, 497, 851, 40, -812, -441, 391, 360, 2, -625, -574, 36, 447, -142, -524, 44, 607, 213, -167, -172, -141, 441, 449, -552, -792, -58, 429, -64, -515, -271, 288, 107, 151, -32, -72, 723, 421, -484, -111, 307, 447, -56, -194, -452, -24, 314, 164, -615, -221, 631, 361, -142, -186, 88, 327, 500, 127, -577, -272, 533, 251, -661, -624, 78, 286, 231, -379, -508, 61, 955, 245, -430, -290, 528, 293, -38, -361, -191, 106, 245, -235, -657, -78, 235, 55, -313, -68, 161, 333, 279, 9, -134, 281, 491, 26, -525, -235, 220, 137, -372, -240, -189, 517, 280, -372, -566, 395, 651, 323]
3183C23o60R0N39J32k96o73R5P23K2m20o36M11N51P3j90n11M22M04K57o15l54
3204c13M48L01k99n67m9N25L4J8n14P3N34K77m21k21K77K13j3k03k31J15K74j18
3226A40o25J24M40R1l07n22K10Q89O0n48j03Q3O83l9o06l94L18M24j56o15o4M10
3248a07O53m08n30qN56M59l08o48L6N51J31k25l61o6L04J66k41l41K63K95j15
3269E6r6M1R6Q5K36n87P0N13lm63k31K63J46q0l86kK86L72j42o26J02O99J88n30
3293Gm64M51K25J61l54l85j07P23J61o50l05J43N38K99m14n33K21Q46L7o04l20
3314c24L76K79j03j95l56J47J92K57m45n5K35J52j01n5O8l03N19n0l08M2K76k98
3336e0k64M29ml45j10L68j21K61j6l59k74Q73K18m84l51J99J08J28J10o61l98
$$ y = [323, -337, -247, 292, 424, 128, -545, -450, 273, 295, -125, -761, -350, 201, 274, 84, -427, -5, 399, 656, 41, -313, 135, 436, 137, -430, -479, 46, 80, 98, -416, -343, 191, 468, 47, -174, 103, 316, 303, 100, -131, -16, 258, 140, -485, -361, 79, 170, -137, -659, -449, 440, 500, -48, -151, -68, 615, 576, -30, -424, -106, 318, 162, -453, -517, -107, 546, 138, -392, -400, 156, 615, 307, -341, -305, 246, 377, 152, -209, -275, 29, 195, -46, -387, -124, 171, 56, -40, 1, 97, 182, 418, -169, -99, 414, 411, -52, -283, -20, 126, 46, -340, -342, -56, 316, 174, -452, -350, 349, 537, 7, -457, -6, 219, 380, 26, -359, -466, 257, 418, -232, -537, -394, 144, 443, 29, -504, -283, 563, 600, -4, -324, 52, 331, 228, 33, -323, -176, 16, 273, -172, -227, 8, 160, 59, 4, 72, -231, 288, 238, -70, -28, 248, -50, -314, 115, 111, -234, -344, 24, -97, 164, 148, -211, -485, 388, 606, 122, -229, -30, 78, 206, 316, -345, -743]
3357g43O58N06m63m64M02K35J37J6o36K10L09N75n76o40M28K03j7n2l70k23M42
3378f3L30j08l74J26L81k71R5O2j46N0J23k59l18J42R1j3r8K97j1l15J97J77o7
3401B8L32n24J9L25K56l14m50l9K44Q3L5j84k90L56M40j50j76r1J02L31P5j03
3423C05m94J93L53k06m15q5K10J89n7p0j94N3M14J16l66M0J93o0R0R8m74l3J49
3446e1Q4j54k21J04L3K5L50j05j78K53n5J16r0o7j71J56K43l76j92o0J12L47j36
3469c3jl09J32N58j37l55J36J10J5J86j84k87n2L58n9k52pj5K45J06O8k63l2J21
3493D9J47J51l05k5n7K30K06m74j45J23R5L7j13o8n9L32J38r1l32R9K10K17j23
3516B42l44j72K08L36k08l44r0K10J87J73j79J4j58K49Q1M0j21j71L9P2k07O2
$$ y = [-743, -85, 421, -42, -506, -104, 131, 268, 284, -352, -142, 167, 742, 166, -474, -46, 157, 140, 88, -282, -505, -63, 267, 159, -215, -89, 292, 21, 116, 178, 32, 82, 205, -54, -372, -230, -139, -152, -250, 47, 36, -279, -82, 95, 28, 360, -164, -145, 180, 436, 122, -328, -367, -123, -40, -5, -189, -479, -123, 317, 167, -9, -100, 2, 333, 408, 305, -189, 4, 357, 151, -264, -349, -139, 50, -7, -77, -271, -218, 196, 312, -54, -14, 179, 119, 209, 307, -167, -200, -51, 33, -121, -342, -238, -205, -180, 170, 65, -113, 140, 85, 201, 111, 44, -127, 29, 272, -104, -296, -356, -244, 103, -33, -34, -343, -211, 347, 210, -145, -9, 101, 116, 302, 118, -169, -221, 137, 78, -174, -181, -196, 49, 155, 223, -40, -72, 49, 196, 347, 42, 17, -40, 190, 396, -78, -223, -100, -5, 32, -81, -149, -208, 124, 262, 171, -161, -62, 148, 365, 242, -102, -274, -66, 270, 62, -282, -372, -162, 25, 198, 19, 33, -125, 124, 205, 245, 124, -47, -8, 64, -143, -81]
3538h1j0O5k0Q5q8k65J31N12j01k39K2n0J78J37j13k51k31J49R5n6O0o7K29J03
3562A94n2k84j8M09K60m24p9k82L36K94k4n40k14L30K94l13j03K78j12J63J93
3583C06l81J2J55M67m91j08j04J42j35M47k25m32J91J06K05j04K07k39k93M57
3603A83M5k14M8N2j48M1K81k85m57M18K45l23k3K2n7N07O2m68l68M62N65m30j50
3626Hj81J79J97k9k15n19M15N95o22j13J49J84K04j2k17m94N14N27l76m65J10
3647a61R8J22j74n0k89M68K67m27j52L91K50l41NJ69l09J29K33o9k62M48m29l37
3669d20K2N05k8j64r1J9K78K07n7m20j86P40o1l20l64L03L1J03k13l44J52P08
3691D00k72l67J54P5L57l6k00m82M27L30j68o08m8M64ol1J1p7k3M63j50l10l4
$$ y = [-81, -91, -26, -46, 39, -49, -314, -183, 329, 228, -11, 11, -39, 139, 276, 163, -88, -319, -170, -75, -131, -71, -138, 91, 194, 142, -142, -160, 249, 509, 85, 6, -276, 60, 354, 330, -210, -424, -94, 200, -113, -216, 62, -50, 113, 306, -75, -63, 92, 559, 68, -40, -144, -2, -137, 310, 85, -347, -156, -50, 155, 51, 258, 19, -274, 183, 228, 14, 62, 114, -34, 7, 288, 3, -454, -36, 209, -114, -137, -115, -172, 335, 397, -71, -439, 23, 588, 158, 8, -173, 6, 203, 174, -41, -560, -145, 450, -172, -285, -136, 48, 252, 240, 23, -471, 43, 570, 194, -271, -161, -63, 59, -115, -165, -454, 14, 281, -146, -298, 93, 343, 2, 7, 176, -133, -4, 229, 160, -102, 346, -83, -420, -398, 107, 79, -85, -176, -157, 121, 328, 271, -149, -335, 405, 344, 24, -340, -37, -6, 97, -116, -460, -308, 400, 128, -239, -85, -10, 347, 311, 111, -371, 56, 386, 218, -390, -438, 26, 20, -11, 0, -77, -100, 363, 213, -97, -131]
3714a31K68m2j02J8M3J19j0m20p1K90L52k26l58J98L90k08j81kL2J30J78l58r1
3737a82K4N11k38l17k03K79L31k06k23R1R8J76k71j6J40L38k5k26k12J8K08J41
3759B36n35j77K10L30n8j09n1K54J87j38o2j14K25N7j24l22q6L94k2k33n4K16
3781B4L1J02q5j93J21J79j6k23k8L71j78j85j15J7K76J81k41m22J94L05Pk00q1
3804a59K59O2J79j46k19o7L66J0m50K5K06r6M8o8k48L07M15l56k72J28L37j14
3826A47j99m2J89j34k3j99J5K32Q4m01R9Q4J60K5n8l20M47J30l3j00k05K47q0
3849F5k6k02J00P3J53k47kp9K90L59l85j24N6J02N8k6m08Q6L14j47k24J2J56O0
3873A4K9n2M1j06K06J16k47j78K30J12j40Ok49Q0K76k21l23L65J35Kk35N8M82
$$ y = [-131, 137, 95, -7, 11, 54, 173, 163, -257, -328, -38, 314, 88, -270, -72, 318, 110, -71, -73, -41, 89, 267, -91, -182, -158, 353, 115, -202, -405, -126, 205, -1, -224, -133, -35, 141, -130, -146, -6, 332, 307, 81, -131, -113, 95, 236, -299, -476, -266, 64, 6, -103, -154, 100, 287, 149, 87, -27, 198, 255, 131, -191, -277, 117, 95, -138, -192, 24, 55, 157, 72, -121, 0, 179, 163, -60, -88, 283, 105, -80, -195, -178, 98, 279, 38, -384, -190, 115, 122, -78, -159, 100, 162, 341, 195, -24, -91, 275, 285, -165, -140, 66, -30, 18, -50, -298, 9, 424, 68, -204, -76, 261, 147, -52, -94, 95, -39, -62, -261, -246, -14, 70, -331, -232, -148, 12, 37, -21, -341, 106, 236, 203, 103, -102, 145, 65, 39, -163, -63, 10, 163, -84, -86, -165, 125, 484, 99, -25, 31, 133, 191, 165, -243, -157, 157, 10, -214, -202, -46, 14, 43, -9, 32, -74, 132, 248, 1, -177, 53, 165, 25, 31, -218, -138, 138, -83, -406, -41, 94, 96, -139, -81, 401]
3896D01k87J05K4j19p1K07l90L1J39k7m7j95J10J79J13j73p0j82L49J52L1l20
3918d0P1nK7o3k12J05K78j57m3k59J45N0J00J34m7k6O8R6k47q9K52j15j36n8J19
3943e2L3NJ26j47k29L66N3k46M7J51L0O2M5l86J39J28k27j58KL87n9k82K58pj78
3968a39J27L00n00K55J04n1o0j35J89OJ4k59j58J31J66K50k00j06r3J27o6K21
3990A23o8k3o3O7k10K13K5j27j31J44q0j7J31Q2m0j4n7J52j44J09O2j22q0k3k5
4015a16R7k0j18J86k20K00r3J05j3N1R9N4j63k28L34j30rr8q1k2J90O7R4m19M0
4040b13J58J97j82J55k59K34m2r3M5m2m7J96nl60K99R1k68M8MkJ31J15J70q4l04
4065e8L39k83L6J13j99p8N7J63l06m9K19J74j26j28J56j54R8J74j13n8k3P3j23
$$ y = [401, 114, 219, 243, 124, 53, 260, -130, -99, 40, 13, -34, -229, -119, 60, 173, 0, -70, -252, 97, 249, 280, -40, 31, 26, 53, -10, -222, -117, 161, 4, -39, -298, -153, -103, -3, 131, 84, 58, 126, 222, -25, -114, 138, 23, -113, -171, -52, -19, -14, 112, -35, -264, 102, 155, -91, -44, 107, 137, 199, 244, -142, -3, 125, -102, -260, -258, 129, 70, -212, 46, 39, -139, -12, 288, -212, 43, 147, 96, 36, -99, 90, 96, 110, -149, -307, -176, -10, 240, 40, -66, -159, -32, -98, 123, 55, 32, -31, 36, -174, 39, 64, -63, -194, -50, -130, -147, -16, 66, 26, 12, -45, 107, -37, 72, 134, 12, -68, -91, -116, -19, -39, -157, 29, -191, 9, -84, 21, 8, 59, 158, 212, 49, -179, 155, 25, 16, -82, -163, -185, 5, 72, 166, -253, -213, -55, 142, -40, 115, -144, 90, 48, -45, 0, -42, -89, 107, 102, -258, 41, 132, -136, -88, -84, -86, 45, 160, 330, 246, -58, 281, -2, 34, 147, -52, -130, -73, 90, -216, -265, -46, 128, 2, -126, 30, -124, -26, 148, 35, -23, -46, 27, -96]
4088i6J93o2j01r5K32k09Q1NR9p9J23Mm30L31j51L74k13k20J19L1l7K31jk60M7
4113h4L19r2K4j02k45M11j20j14j47K12R5k44O3K9j53J10K54j58k04J40P0M0N0
4136A54r9j13J48J25j41j88K03j9j43J98J9k80L05j45J90j99P3Q7j15L2J71j91
4158G2k68K12P3k01J67j39n1LJ99o2k71K57J98j66p5o2J35J17K05m80K8j35J72
4181g2NP4l9p3M7J61l6j93J69Q6M5q2j3k41J06J70o0k99K46n5Q7k7m0o0P3kJ32
4208A09j52LJ32j45J14P7j89l4n6J37rj30Q3n5R5M1J51l90J00J67J22q8m3j40
4232a00P5K13r7k42j6J16J61p3j29L5R6P4p6L8j76K11J13k55r1N2l9MM5J0K9J46
4258A24J7q8r2K03j69P7j1m2m0J04Qj56M8M7q7n7Q8L9j10Q9j1j17Q2J67j81J86
$$ y = [-96, 97, 35, -66, -161, 71, -138, -57, -52, 47, -32, 91, 95, -335, -4, -155, 219, 6, -214, -95, -64, -101, 130, 129, -131, -84, 235, 143, 167, 65, -180, 231, 111, -3, -150, 62, 157, -87, -24, 5, -148, -38, 216, 58, -146, -6, 64, 104, 154, 55, -58, 90, 215, 74, -114, 89, 70, -73, 125, 144, -136, 169, 24, 214, 15, 88, 175, 60, 92, 263, 72, -196, 16, 89, -112, 55, -84, -135, -132, 67, 5, -266, -9, 189, 23, -52, -114, 21, 138, 343, -137, -109, -244, -72, -67, 7, -32, -105, -58, 103, 67, -126, 43, 129, 174, 92, 79, -162, -56, 114, 54, -245, 1, -54, 33, 6, -34, -94, -21, -23, 109, -43, -40, 92, -53, 61, 138, -51, -85, -141, -4, -13, -143, -60, -115, -20, 21, 172, -218, -118, 49, 171, 83, 40, -100, -25, 188, 91, -151, -167, -51, 110, 37, -92, -57, 39, 113, 37, 75, -101, 110, 223, -32, -123, -71, -110, -106, -61, -51, -22, 124, 141, 53, -39, 164, -5, 72, 61, 19, -21, 83, 91, -65, -17, 30, -57, -114, -26, 13, -97, -8, -19, -136, -54, 113, -68, 118]
4284A18r5j24J21P5k8q1N0J04k47k13L69J35n8k37j10K51J25k0j19p2J33J43j38
4307H2N8j69j28K01K8J8k65K22N8l5j07j36J19J33j4m4j99K26J3n2j46K13k01
4330a25J94j57LJ70P3j25M5J5j1L6o4q7J12l5J19j29m3M6r5j05J95k10J66J23
4354A11q5J19j63J02j69j1Q9N5q7J76k69j50K65m6J57j26q7M7P0Q6q7J00m6J25
4378A76q2O7j59L9m4j21O3p5JJ49k3Q6k2P8m4pPN7j44n5j83J96P5J67k01l33K04
4405a28K82k13J20m9l9j5K43j59j71L45k26o4PK37j06o1q7N3lp2J25j83J70P1
4429G7o1P7P2j45j04Q4J8o2j57%P1J44k5N0p8j4R4MqJ24r3m7RJ6oL0j47J5p6K52
4459A14j48J05Qk1k02J11J99O6j73q9%o9K08k00J03r0M8l3o7K15j8n9l7J68o1
$$ y = [118, 23, -101, 20, 95, 67, -14, 36, 140, -107, -320, 49, 184, 126, -111, -221, 30, 155, 135, 16, -56, 77, 220, 82, 140, -29, -157, 44, 72, 90, -175, 47, 105, 70, -37, -173, -54, 79, 65, 21, -178, 48, 61, 9, -137, 76, -125, 69, -88, -85, 85, 158, 33, 78, 93, 82, 118, 54, -33, 79, 44, 163, 34, -9, 37, -58, -163, 32, -178, -12, 111, 26, 145, -18, 84, -85, -96, -7, 48, -39, 137, -132, -282, -17, -63, 94, -32, -119, -72, -2, 84, -3, 97, 51, 176, 94, 161, 2, 41, -3, -124, -61, -136, -135, 14, -9, 77, 55, 133, 89, 82, 89, 146, 2, -53, -236, -40, 35, 202, 1, -332, -128, 154, -59, 61, 12, -27, -42, 201, 42, -129, 216, -10, -74, -67, 170, 64, 3, -84, -31, -34, -106, 19, -164, 6, 77, 16, 93, 165, 20, -84, 0, 18, -44, -201, -201, -130, 14, -11, 39, -39, -53, 41, 45, 37, 161, 68, 21, 30, 46, 40, 70, -77, -62, -138, 114, -34, 71, 79, 58, -144, -33, 166, 232, 59, -30, -30, -99, 109, -91, 12, -78, -30, -63, -130, 85, 67, 8, -29, 139, 78]
4484G8nP6K5j73J3J2j39J59M0j53K9J04kN7p8j42R1J34k8k43J25L63r7k37q1J31
4510E9o3K8l5k6L9O2J33l24J32M6J6q7J98j83k9P2L4M3k01J82k58J20J05j34o
4535g7J34j06Jm1K11K6q8l02K74k9j9J57l2j14Jj11K2J79j48M0P6p0J42j16R8
4560A08o1p4M8L0j26P4o7m5MQP8j2J76j33m9j15K34J00k57plp7J67j35J6R8p4
4587i4L6o6L32j11L0j77J80P2k74O8J16j47J44j22k1L8j22Q6m1L5j7J31k79L03
4611A00j14l3m4K16J02l11P2N0jm3O8j27O8l7J63P1k08j6Q5o3P9n6m6J29J4j56
4637c8kl4j40K46o0r0J01k5J16J20k11r1J34R5Qj30j94K33o2N0r6N0J01M6j16
4662A1j89N2K14j10N4j61K20l52K58o6RJ4q5J35q3K96l57Q3n8J7K15o8k44J97
$$ y = [78, 73, 149, 174, 1, 14, 26, -113, 46, 86, -67, -38, 66, 64, 121, 43, -99, -8, 126, 98, -145, -20, 343, 246, 9, -72, 59, -4, 24, -11, -37, 2, 64, 197, -127, 5, 51, 67, -20, 178, -5, -34, 38, 72, 115, -86, 96, -162, -42, 63, -71, -77, 57, -49, -48, -89, 122, 148, 60, -242, 32, 3, -16, 141, 109, -5, -4, -115, -93, 86, -62, -22, 54, -16, 126, 10, 108, 47, -27, 21, 51, -75, -1, -68, -113, -109, -101, -23, -35, 141, 8, -41, -156, 78, 178, -79, -86, -89, -166, 1, -134, -118, -20, -94, -58, -124, 208, 97, 127, -50, 130, 202, -72, -4, 112, -35, 109, -13, -34, 4, -118, -32, -73, -38, -55, 76, -203, 100, -14, -47, -91, 125, 227, -84, -12, 38, 37, -6, 62, -65, 3, -34, 129, 200, -8, -24, 61, -2, 77, 21, -25, 104, 118, -38, -40, -74, -214, 32, -28, -118, -17, -42, 74, 194, -17, -108, 26, 121, 129, -1, -195, 38, -24, 26, -70, -20, 81, 127, 11, -178, -126, 88, -22, 32, -129, 91, -261, -3, -69, -60, -46, -131, 4, -79, 217, -140, -57, -115, -98, 117, 49, -195, 2]
4686BJ57j58Q9j95J33j31K91j38j60rj56K64n3K17k7j56o4K89k38P6j47O9M7K
4710Do9R3p9M4j2j50P4N8j1q2K85k7j43J13k9j92J22j0o7k8P6m4J49l2n5Lm4O6
4738A3j34L36k00J3p4K42o6k01O6r2K27r0nj22K2J68n7k00K9K73j13J38qk65K9
4763g1q3K66k67J48K8K6j33J20j04J40PJ3j25K47n0k52l8K57m2j85K0R0j45Q6
4787d7pO2Jj9J6J5j00K39q5k6Q7j08M5j51J78k45R3l4J88K8j91J45k1q0Q3k8q7
4814d9J01%M8j65J93j67RJ34j71j01N7J36j49R3l6P0j00J69p0j6j09J67M0J22
4838B06j11j75J61j15n9J26J81p2j18j0R2r3k%J0o4M5j00kJ88j71M7k3NL3j3J74
4865A40j55J13J07l89K39Jp4L8R8j66OJ06k9J51r7k13K2O1M5r6K23r0O2K3L6j26
$$ y = [2, 159, 1, 90, -105, 28, -103, 188, 50, -110, -119, -275, -11, -64, 153, 126, -30, -94, 195, -43, 33, -114, -45, 2, 4, -65, 28, -51, -7, -19, -169, -95, -37, -48, -130, 155, 128, -15, 98, 69, -123, -1, -11, -78, -106, -30, -74, 75, 43, -12, -9, -53, 13, -121, 215, 15, 28, -46, 196, 130, -71, -5, -97, 130, 40, 35, -87, -65, 103, 46, -154, -125, 148, 35, 173, 165, -100, -71, -154, 112, -155, -7, 21, 47, -86, 34, -70, 70, 77, 90, -35, 212, 162, -90, -128, 129, 87, -98, -78, 12, -133, -47, -54, 8, 9, -10, 6, 21, -79, 160, 75, 49, 136, 28, 73, -78, 100, -145, -52, -86, 102, 130, -61, 84, 63, -17, 66, 38, -49, 52, 52, 100, -65, 128, -39, -30, 104, -67, -168, -111, 25, -124, -31, -67, 3, -97, 72, 2, -14, -123, 44, 84, 206, 95, -80, 81, -34, -93, 33, 214, 142, 24, 14, 106, 13, 11, 11, 21, -43, 2, -98, -100, 88, -83, -36, -59, -54, -21, -34, 140, -15, 98, 205, -184, 55, 56, -18, 20, 118, -48, -42, 64, 35, 186, 89, -124, -102, -41, 4, -92, 131, 41, 103, 126, 162, 36]
4891C6Kqj07J65j47nR9n4J01j8j80J53n4j43M29k57M5o2j13K40j61j5N6L3K4l0
4917B9j58K17r3k11J64j32Q5J27lj1P5M7k39O7J62L6j28O4k9N3K4k96J93J36j80
4942aR8m6m0p4J1J8R3o2q8P4J8J3r7N8j07K55j11j2J21j91mPKK16k71q5J41Mj2
4971g2q9J04J01m9j36n5K01O9J09k19J21j3j19K7p0J20m0j0O6L2m0l7NJ03j3J9
4997A15n6L7k8k4l3o5K38k65P9l8q0L1K47j25J69l01q0Q3K04k11K25k25K5J32
5021E4j3m9j82K39J33j68k68L53p3K6j09J2J38j90J84j27Lo6mJ85q2L6j09P6N2
5046E1o8N3R2j42r2J5J88o7j25L29k70N3p8J39j17q5J49n7N7n5j77J71J33J7k8
5071H6j83J13j6k2J6R2M5j24r2J93k31J19K3k29K20jNo5P0j35J41N5l4j11l8J56
$$ y = [36, 38, 30, -77, 88, -59, -64, 35, -19, 82, 64, -116, 37, -17, -160, 269, 12, 57, -5, -118, 122, -39, -54, 2, 35, 59, 29, -129, 88, -5, -216, -52, -184, -99, 28, 25, 14, 89, 136, -103, -36, 126, 162, 34, 98, 69, 122, 146, -150, 43, 179, -1, 97, 51, 11, -63, -52, -34, 59, -3, -91, -17, 1, 14, -83, -25, -132, 123, 12, 0, 121, -70, -74, -67, -65, 151, -120, -205, -64, -60, -72, -161, -57, 44, -5, -141, -196, 5, 74, 183, -36, 85, 72, -47, -20, -90, 30, -10, -20, 46, 78, 38, 1, 6, 109, 96, 115, 59, 96, 68, 44, 11, -54, 184, -81, -2, -40, -120, -89, 158, 33, 202, -99, -179, -96, 108, -103, 122, -103, -78, 54, 41, -8, -190, 49, 182, 14, -254, 99, 26, 52, -57, -45, 93, -97, 87, -40, -37, -103, -107, 78, -4, 32, -77, -1, 51, -17, 36, 128, -14, -106, -91, 97, 30, -95, 234, -36, 17, -61, 78, -39, -124, 25, -32, 25, -30, -207, -36, 97, 114, 86, -97, 16, 0, -22, -6, 86, 131, 7, -85, 108, -123, -4, 19, -210, 10, 9, 14, -51, 19, -116, 25, 80, 46, -65, -103, 53]
5097E3j32J37j1j68J86q4p6P6KJ53r6j69K15j05J55n0m1j00R5j74M9N7k2J90j77
5122c7L8J31j01oN3r7j53J31J76k5j73J32j2r2O5o0J27Jl1J6Q8q3j23J50l5o2
5148A8p1P5j36J88k00J28L5Q4k49O6J42L2k8j56P7l6n1J67j14k9l6J37j90J82
5172C5j7o0P0K0k51J44L8N7j49L8J34J16j21o1J14o3p9K7P8j49K16k72L17k72
5196i0O6J13k3J68k09j71K68j99J09j39N8Q8K3m3r2J35p4L5n6N1j25J65m0R1J06
5221B15m19K74n6l2k4Q9k1j8L3n6lJ1R1p3n2J15m8q8Lm5j9J97j74K13j84Q3J12
5248A24j95N9O9K7q9n0L8J95n3j44J24j21N5n5R2j13n4Q1j09P6M4n1K90k89jK05
5274A55r0p2L3J53k68J85q0N5j45J02o0K3L9p9P8R8l3l5N2j97J55p2n6m2J88k51
$$ y = [53, -79, 58, 47, -121, 65, -19, -95, -19, -17, 136, 40, -129, 86, -19, 136, 86, 45, -55, 40, -134, -85, -28, -50, 140, -37, 1, 132, 31, 25, 78, -19, -172, -41, 135, 110, -63, 69, 57, -35, 30, -30, 97, 98, 67, 83, 171, 88, -35, 115, 80, 18, -53, 22, -114, 74, -126, 2, 37, 121, -128, -62, 80, 112, 84, -72, 5, -31, -82, 85, -29, -58, -94, 43, -147, 35, 18, -42, 28, 48, -203, -59, -21, 36, -113, -75, 59, 175, 54, -7, 107, 44, -35, -8, 70, -79, 137, -135, 182, -90, -24, 89, 66, 234, 25, -146, 122, -77, 32, -107, -49, 39, 62, 19, -73, 62, -12, 23, -33, 18, -107, 58, 18, 109, 215, -204, 70, 14, -18, -42, 47, 26, 8, 41, -15, -18, -7, 84, 11, -41, 74, 26, -62, -59, -104, -123, 74, -100, 113, -71, 12, 124, -71, -12, 57, 84, -5, -55, -17, 178, 125, -19, 105, -16, 39, -16, 76, -37, -91, -10, -119, -43, 1, -50, 240, -49, -50, 155, 65, -7, 26, 179, -89, 96, 16, 71, -74, 28, -32, -9, 30, -49, 29, 127, 94, 59, 111, -86, 69, -3, -59, -101, 87, -164]
5300a64J9K82k29N2J28k49K19j63J58MK3k78J69K0j76J36NJ02q9J06r5N2r0Nj81
5325b34J29J10k23J63p7J08J2J88j50j33K78l47L33k06R2J7J2j03P2j26J08j59
5347a36j6M1n0J26j03J50P4m7r4J02j60J12j07J66k72K98j20J11q2O0R0j18P1
5370I6j1P5l14l0K75j54Q5j78K50N7k39L01k14P1J33k50N4q5j81K46O5j50R3r5
5394a00J04j6N2R1m6m8j06rJ64j50l0K82k13OrK30k26K2m1p6L34k68J83K01k46
5419H5m2j11P5O6o7o1O9Lo3O2K2L3q9M1P4l7p7O0j52K16k28J72j11J15o4j04J07
5446fq0NJ9J14o7R0p5L7mJ72l62J22n2R7j27R0j25J46j99J27J40%k19K70k5j18
5472c0L20l11L8L8lj10L7pm7Q6n8N1j76K11r5M2m1LJ61k04Q1o0m6K40j97O4K1
$$ y = [-164, -145, 137, -92, -40, 88, -161, 58, -105, 53, 57, 80, -198, -29, -9, -185, -49, -44, 58, -31, 75, -20, 32, -58, -53, -234, -105, 5, -218, -55, -132, -24, -12, 176, 26, -107, 171, -176, 157, -49, 43, 60, 72, -31, 41, -85, 23, -136, -152, -111, -161, -35, -138, 12, 86, 39, -55, 47, -113, -1, -108, 58, -214, 84, -36, 75, -7, 53, 143, 25, 96, 85, 160, -154, -184, 91, -63, 22, -156, 94, 151, -88, 213, -1, 70, 203, -47, 7, -78, -259, -13, 52, -98, -5, -100, 4, -12, 40, 131, 85, 37, -69, -78, 86, -64, -94, 188, -25, -19, -28, 202, -24, -2, -43, -119, 215, -53, 130, 331, 85, 43, -68, 7, 73, 6, -55, 14, 17, -46, 16, 38, 71, -18, 23, 97, 60, -17, 43, -109, 107, -121, 51, -60, 55, -9, -113, -6, -86, -81, -62, 52, -15, 75, 0, 37, 33, 205, -157, -35, -87, 10, -117, -27, -152, -6, -205, -78, 62, 62, -157, 113, 88, -30, 290, -21, 17, 55, 52, -58, -21, -28, -75, 11, -47, 4, -172, 39, -56, -14, -55, -52, 109, -95, -14, -74, -120, 120, -77, -13, 8]
5499Hj64K58l6Okj44J35J41j87j10J65n9j3K5l2k9j23P9K05k28p8L80l24K43j92
5524g6R3o2L0j00J81m5J31m5o2j40n7J37j43L01o8k1p0J9n2Q4m6N5kj07Jn8J31
5551IK8J7j90K1J54J12k71nJ74j20P7MJ29l08J12M2R5j45J20Pk62K19%k6j12J12
5577gJ98j26j63J36q8J36n9Rj99Q0K48j72NQ8j57p5J62L5j08n6J10K6j38p1K0
5602a66J59rJ31j99Q4R9l4r1J5R9j73K44p0o5j96J30p3J59Rl8p5l7L1N6j47K80
5628A23j71l4R9k2l2jJ69j46J7n5J9l5J03j81J45JJ12j01J04j68j01K17Kj27P8
5653A5Kj99K09O4o2j54K22O3j12p4l5J64m6n3k2M8L8K1k2J51k11K3ln6o7J05J17
5680A26k30J53q4P5j07j07R0L4o6K12q2NN7r5OL2m9j93K12l5J1K35j89J6No5K4
$$ y = [8, -156, 102, 66, 72, 70, -74, 61, 202, 15, -95, 70, 11, -2, 23, -9, -38, -161, -82, 123, -105, -183, 197, -127, 116, -76, 17, -45, -15, -115, 66, 21, 152, 107, 45, -95, -152, -15, -158, 143, 75, 54, -16, 3, -49, 35, -11, 44, 42, -65, -64, -122, 9, 37, 54, -136, -115, 39, 151, -120, -125, 49, -71, 6, 10, 139, -169, -57, -15, 80, -65, 55, 62, -200, 19, 19, -7, -119, -7, 191, 65, -98, 38, -50, 86, 27, 36, -163, -83, 165, -7, -2, 86, -71, -146, 16, 51, -57, -113, -3, 23, -115, -186, -166, -7, -16, 115, -84, 0, 99, 65, -26, -11, 88, -85, 159, 89, 24, -172, -42, -115, 44, 53, 15, -60, -97, -66, -10, -157, 123, -48, -82, 17, -5, -37, -38, 131, -15, 2, -53, -34, -69, 34, -147, -2, -1, 111, 10, 114, -54, -155, 62, 64, -63, 15, 17, -182, 27, 91, 29, -125, 97, 160, 48, -26, -61, 103, 57, 4, -18, 30, 68, 89, 67, 218, 7, 30, 27, -29, -96, 9, 126, -104, 49, -35, 40, -67, -174, -84, -50, -116, 96, 14, 19, 76, -19, -13, 19, -30, -223, -11, -46, -35, 200, 11, 27, 32, -33, -9]
5707iP5J60J2k81J25j03J23j75K6l2Rl2M9n6J18q5J57K1j76L8j7J29j34nM5pJ93
5734A68m03J27K98l06K9L57l22JJ4R2j32K11m1m6j02o9J39N0pk3q5j78K41j12
5758i9K80k18l3J95k77rJ56J04jl5j44J16k68J14k6O9J48j62o6L25j03q1l0n2
5782i7l0J54m0R0O2j64Kj56K44ok30K81n4j13Q9p3K69p2j52M6m3K4j30J2J40K9
5808H2j28J55r9j85L18j09l4k8K2J25l7j05rP3n2N4N9r5J5n5N0J06j56P7N0n1
5834D3p0K47j92j54J05J95r4M2k13J57j56J18N9M3j80j9J93j06j26J29N9J24l29
5857a25J67o5m1J20K01j94j29J16r3K3J94l1p2m1o2k6J48K4j42J28j7M9k11R4
5881A5p1Q7j25j3K12j23Q1J7j6j1k6o0k9K2MQ6k23K31Po5K54j82o5K06l6j01r6
$$ y = [-9, 66, 226, 238, -43, 82, -21, 102, -73, -47, -79, -70, -102, -53, -109, 9, -76, 81, 102, -74, -36, -53, 76, -58, -63, -18, -25, 168, -235, -108, 190, -116, -87, 270, -52, -51, -37, 55, -77, 134, 93, 47, -55, -124, 15, 65, 58, 35, -50, -228, 13, -99, 181, -37, -70, 125, -152, -161, -5, 99, 98, 63, -81, 35, -233, -119, -145, -76, 72, -90, -156, 169, 66, -15, -45, -97, -127, 27, -13, 77, 139, -25, -23, -179, 65, 59, -171, 110, 56, -57, 32, -41, 228, 156, 4, 50, 7, 31, -99, -87, 53, 82, -46, 109, 10, -175, 143, 34, 0, -28, -6, 119, 82, -23, -32, 41, -11, 43, 102, 7, 22, -33, 17, 123, -33, 44, 94, 43, -27, 220, 28, -126, -21, 174, 80, 122, -91, 66, -90, 28, 87, 130, -50, -69, 124, 18, -108, 21, 80, 204, -125, 42, -23, -64, 56, 257, 63, -66, 50, -43, -20, 174, 143, 71, 30, -32, -58, 90, 114, -28, 100, 83, 132, -79, 15, -56, 31, -94, -107, 105, -18, 63, 80, 64, 53, 27, -33, -62, -40, -36, 50, -173, 58, 65, 0, 254, 72, 7, 213, 177, 76, -20]
5908b0K6j08J8J55n8p3L4J32o9k06R9K4J55k82L03k61O8P6QJ1J8m9j31m8L28j92
5934d2l8M0n0J21J63p6k02J98j83K09j89J05q1Nl8j34J66M2j71J84q5R7j04r6
5958a59L15l11J03k6J72j91K14Q9j68l5J94j94l5O7lJ5N7j52k1N2J3p2Q1j13J00
5983hJ5J15k35R0j0j00K00j55N6Q1j9Qj59J32j45K27J8l20L28l2p1k6j61J63N6
6008D8r0m3m1J27j7k3n4J67k37J61n5L0N4K6q5N5N8j18J2L8J68j61oj95L65j71
6034A3k8j19K71o8j8n5k55L39P4p1o5Q1k50J25m3Q8j09MK46k18O5q8L9p7J50o7
6060c6K0L3K0k14K31j44J53o8j15J00J24j30J45p2m7moM8J1n6j09J63j53R9P3
6085F6N4Kr7j23J70j36J7J03o7R0M1%j2j23R8k04Q5P5j15M5J00k19L16j12j12
$$ y = [-20, 6, -102, -84, 71, 13, -60, -26, 106, 37, -169, -70, -46, 109, -173, 130, -131, -63, 13, 21, 32, 50, 1, -130, -178, 150, -42, -80, -40, -90, 31, 194, 118, -84, 114, -69, 140, -49, 56, -25, -20, -58, -192, -26, 16, -155, 29, -56, 41, -63, -159, 156, -155, -52, -78, 94, -97, 117, 206, 38, 3, 197, 3, -32, 35, 32, 47, 104, -48, -69, -17, -4, -76, 5, -108, -8, 7, 122, -113, -23, -33, -133, 67, -88, -32, 49, 30, 38, -121, 11, -134, 93, 111, -209, 119, 87, 16, -10, -171, -8, 48, -42, -85, -126, 1, -16, -39, -93, 74, -163, -2, -57, -27, 27, 53, -32, 23, 81, -37, -25, 13, 181, 20, 14, -181, 184, 13, -15, -134, 137, 69, 51, -4, -259, 80, 154, 83, 18, 99, -151, -26, -69, 19, -90, -86, 160, -58, 7, -81, -42, -119, 31, -36, -16, 17, 37, -177, 54, -90, 63, -5, -120, -20, 104, -26, 119, 47, 0, -4, -10, 38, 49, -7, -116, 47, -106, -7, 66, 120, 122, 25, -98, 72, -64, -47, 56, -11, 79, 120, 120, 108, -15, 83, -121, -36, 39, -76, -31, 69, -150, 166, 54, -58]
6110e8M2n3J79k62K60jj00NJ54k72K14j65N0R4j32N6K2R6j35M4M0Q4j82J5l4K5
6136a4m6J4k20J97J63j98O6J69q6P0p3N2j23J28j6O3k4j63J68k21k1K87j89m1
6160e8r2K13j97K4j4J48j7J41j24k04K09j00m8M1N2j59J61n6J82l14J83J19j35
6183d5j1J49k34R0P2p3P1km5j6j35L36j95j5P8J08j51lK3j02J21k2J42n8Lo1p0
6210d5o2j7J53j03K6K9j26J27j08k3J54M1j10j1J15m2j71L51j15n1l0M7j87L10
6234A52j73L6R0k55K96o0M9j18Q4j13J00J5j10o0Q5q4N3M1L3J3o1l9j24J38J95
6259A83J5k05oN1l6j3K3Kj05l1j1L44j31L1j82O2J22n8R6j68q0K31j05N7np1l9
6286b9p1K20k37O1k8O9j03Q8J68k25Q2pj5J94k12l9K2J20rnj19J45J29j09j33
$$ y = [-58, -16, -69, 110, -152, 108, 107, 7, 12, 166, -106, 108, -57, -7, 87, -45, 11, 33, 129, -6, 38, 78, 162, -20, -5, -39, -14, -60, -46, -266, -69, 94, -104, -38, 131, 45, 115, 42, 94, -29, 99, 83, 146, 122, -41, 127, -94, -115, 172, -17, -58, -150, 63, -134, -110, -124, 24, 7, 148, 24, -180, 29, -71, -119, -78, -26, -185, -24, -80, 102, -212, -29, 90, -45, -56, 93, -141, -51, 21, -52, 19, 17, -28, -44, -179, 157, -38, -53, 25, 133, -18, -21, 2, -100, 21, -1, 141, 83, 86, 25, -45, -107, -124, 29, -74, -48, -19, -145, -18, -126, -149, 5, 46, -64, -75, 40, -2, -173, 178, 63, 12, -18, 29, -158, 152, -21, 15, 105, -150, 146, 86, 135, 17, 101, -12, 88, 103, -7, -67, 18, -66, -13, 28, 61, 74, 13, -26, -150, -12, 183, 198, -7, -13, 38, 2, -11, 12, 14, -91, -122, -133, 211, 80, 111, -71, -9, 113, 55, 151, -17, -97, 134, 29, 86, 81, 10, -29, -100, 120, -117, -56, -84, -15, -118, -30, 138, -87, -5, -12, -27, 167, -45, -84, -62, 58, 49, 44, -75, 70, 199, 90, -43]
6311d3M9M7N3j00lj17K34j39o5p4J95P0r1l6J31M8j89J28M2j28J29q9L5j29J18
6336G6j60N8N2r7O6j02K43k16N0R9o9m9n7kJ81R0k03m5L19l54RM7n2J55j18R0
6362A1pJ14l12K25o5m6J52n6m5j32J15M2K2j07mo5K33j29J66q0K3N9j21L5M7M0
6388A15j9l7l4N6K4k27k9J38lq0M7J80n0j54J77L1o5q5k2K1K4M4j48po1J33K31
6415B00k40O9Q2k24J18l2N0J54q8j72j0J42oq3J26J8k37J37O2o8Q5j19j1P7p5
6440d5l3j67L42j41J53j48J5p6l5J22p5J64k06J32k5j38J03m1J59q0m1K4m8J45
6464F0j55K4J56p6j30J45m1L5l1J09j49O4J69k14J15j2M7j73J12r1qj20R2q5M3
6489a14N2N8L7j09jO9M4k0j71J30J97o9r2O8n2L5J2j70J49j83K15r8j44K44q3
$$ y = [-43, 6, 53, 106, 6, 3, -114, 120, -19, -84, -158, 37, 107, 16, -20, 111, 159, -30, 98, 140, 12, 141, 52, 87, -42, 76, -84, -26, 26, -71, -5, -107, 136, -80, -30, 69, 0, -49, -106, -108, 73, 163, -40, -85, 234, -120, -111, -64, -116, 39, -79, 11, 4, 118, -194, 31, -34, -80, 72, 16, -29, -161, -46, -4, 18, -89, -93, -158, 75, -54, 112, 32, 55, 114, -7, 28, 75, 115, 96, 59, 25, 81, 105, -122, -151, -13, -16, -96, -49, 131, 81, -73, 104, 135, 70, -15, -37, -16, 8, 52, -96, -103, -164, -31, 200, -40, 29, 111, -113, 5, -27, 23, 177, 89, -83, -93, 49, 43, -40, 86, 104, -133, 4, 66, -2, 83, -36, -47, 30, -45, -78, -245, 97, -44, 109, -39, -24, -100, -135, -13, -88, 76, -130, 2, -23, -161, -58, -99, 60, -20, -61, -37, -85, 60, -95, -71, 85, 9, -121, 24, -17, 18, -13, 96, -53, 11, 180, -34, 81, 69, 116, -57, 55, -36, -44, -164, -72, -157, -114, -62, -4, 33, -76, -77, -8, 36, 16, -155, -25, 172, 103, 11, 79, 27, 62, 74, -96, 53, -130, 85, -13, -157, 87, 4]
6514Dr0O4p5M8K13l9j18N4j00J37J8j05RJ35k01Q6o2N8K8j20J11q2J0k13J52J57
6540G9j27j68P8J91j16n5L8O0k2m8Jk5J79j58J21R0j75J26j33J63j78O4rK8l7
6565c3j27J95mk0P3j24l9Q3k5l3J12j4kL1M4j99R1l2O6n3Q5R5M0k04r2J14o6l6
6593g4J45o8L5J7p9J1p1J17k7O8n2p4o2J52j20N0J01j51J18j69L12k19Oj1k6J67
6619I6l6p2k20M5L17j05J26j46L0l3J08j36J3j13J32R8l10J4J22J29jm5j23J72
6643F2j72J04m2N4lR7n4q7n7m0rK70j32qN4N4l9J7o6k5J05m6k8j24J49J21j60
6670eq8J30m0j3P1j42n4K18J1J9N4j68R2j09N9L2q2J26j25r2o3J67J2k28L03j73
6696h8J23l0Q3m2l4L9j16j5k8J11r1JL4k05J82J00J06j43J07j67J77n1J25p9l4
$$ y = [4, -86, -22, -97, -49, 164, 125, 7, 61, -39, 98, 116, 11, 20, 155, -46, 40, -22, 36, 64, -56, 55, -27, -17, -230, -78, 79, -48, -216, -138, 53, -63, -118, -80, -20, -42, -90, -89, -114, 65, -93, 28, 118, -57, 69, -64, 99, -79, -15, -24, 4, -33, -160, 35, 31, 11, 84, -40, -79, 4, -21, -54, 58, 44, 42, 73, 117, -82, 9, -23, 43, -10, 75, 170, 210, 6, -86, 28, -38, -74, 71, 3, 38, 55, -24, -13, -84, 33, 6, 74, 22, -52, -114, 38, -82, -32, 69, -82, 36, -133, 179, -40, -34, -45, -71, 96, 60, -12, -232, -187, 130, 25, 151, 5, 35, 2, 110, -26, -13, -126, 6, 104, -206, -192, -70, 59, 58, 13, -110, 62, -110, -6, -48, 6, 3, 100, 46, -41, -98, -138, -147, 123, -9, -17, 37, 91, 52, 69, 3, -22, 83, 37, 9, -115, 34, 155, -5, -93, 37, -3, -16, 55, -87, -141, 77, 88, 107, 161, -7, 85, -24, 35, 67, -15, 111, -14, -106, -169, -2, 10, -218, 85, -88, 35, 5, 88, 46, 12, 51, -65, -80, -108, 3, -88, -87, -53, -258, -76, 24, 130, -13, 94, -73, 104, 53, 178, 99, 65]
6721F5K7m0nj19K6QJ08j0p6P7m2j02J18m8rR1M6r7nr8J84j49JJ7lj29J78o3M2
6750gM6n0P9q9J39k60N4P0NN3m3O0JJ7j0p7K1o0J35p1L6jO5r3J52j79N6q2P4k1
6780B0K3r3j6q9K34M5j30j26K71n2p6k85L85k58J48r4K2O1J62j44N2j84R8J60
6804A34k9nk9l7jRK4p8o3M7j89K01N5j10K02k18N8K1R5n0Lj48K0j5O3J94q5j26
6832e7J21k31J39j5L0l8JJ09n5l0p3jl9N8K31%j37j36J41M0J50l49M2J07r3Q3
6858bK1k1N6L0o3m%qk6k05J33J19j52J70%j8n3J96N0k85k1M1O0o4J38M0p1n4m2
6887c5P1j77L8J55j81K13k17K8k1K34o1j15J95j16knn6K21p8j59J10m9K24l22
6911a05%J20m9J47j40m7J59P3K9l34J81j39mJ82j83J96k14K35j85J72j85K44o4
$$ y = [65, 92, 52, 47, -72, -46, -38, 70, 60, -16, 61, 19, -83, 35, -13, -22, 69, 115, 18, 13, -85, 99, -50, -49, -32, -35, -164, 14, -49, -7, 39, -11, 68, -21, 118, -142, -88, -18, -13, 40, -3, 57, 58, 75, 65, -12, 9, -51, 84, 13, 49, 48, 113, 20, 172, -7, 49, -33, 41, 20, 43, -50, -66, -155, 79, 124, -6, -132, 139, 87, 11, -274, 111, -147, 1, -93, -71, -10, 152, 8, 60, -124, -26, 134, 105, 100, 71, 34, 33, 42, 66, -12, -75, -28, -217, -16, 39, -71, 131, -87, -29, -8, 87, 37, 40, -108, -88, -103, -40, 154, 69, -57, 64, -167, -28, -43, -13, -51, -50, 59, 4, -26, -99, -100, -139, -81, 150, 150, 13, -123, 18, 58, 208, -141, -99, 8, -85, -2, 19, -2, 54, 84, 21, 17, 17, 9, -17, -222, -89, 30, -122, 48, 48, 30, -23, 173, 223, -62, -83, -42, 18, -46, 92, 132, 61, 7, -35, 36, -141, -103, 52, -129, 84, -133, -105, -126, 108, 47, -68, 127, 11, 9, 4, -52, 169, 91, -68, 42, -7, 217, -105, -105, 15, -34, 113, -27, -74, 85, 158, 187, -147, 34, -105, -109, 73, -110, 86, -128, 107, -78, 94, -91, 153, 89]
6934H9p6J66j93m2P7J55k62J70j06r7Q3J68k36M0P1r3L3J62q7m1J4O3j20J64j05
6959cJ51M9k90J28k1j33R4J58m7j58jJ13Rrq0J32j2m1j63J06J50k45j11K77m6
6984Gj03L3K0j1R3n0J34l8m0N6k37J13J78j53N4j12J86j56j14O1P4J29j95J32
7008F1oP4k02J22N6k01O4NK6r2J82j75J24q4K31k12k5L5Q6O8j55j3J4j1j59J40
7034d7r9J59j8Kk8J41n2j83J76p1P6Qq0L9n0K1j14N9M4j2R3j54j19M21n6j87J12
7061H1q5Rn3J19m8j7J31j19j94K21j04r4K34j11P3j46J78K9j95o1J95n8J14j23
7085b4J66j39R3r1J1M7j62J59j36PJ95j13nJ10k33K11j59N7J91p4k75k0J76M1
7109C3ln3k1N4m6j13j8J14J09J07N1j77j28NK78j55n4o0R7j04L2r3N7M7j23J30
$$ y = [89, 13, 179, -14, -56, 21, 176, -86, 84, -22, -119, -36, 132, -104, -64, 7, -86, -53, 109, 22, -19, -5, 58, -62, 102, -3, 148, 197, -93, 35, 14, -119, -25, 133, 86, -72, -73, 40, 49, 40, -40, 92, 80, 39, -124, -18, 132, -113, -224, 53, 7, -96, -63, -43, -54, 39, -11, 123, 85, 45, 101, -136, -23, 155, 2, 56, -56, 130, -26, -140, -79, -5, 124, -71, 61, 55, 129, -73, 49, 105, -96, -32, -27, -1, -93, 89, -86, 38, -46, 185, -27, -52, -17, 69, 137, -18, -31, -17, -28, -187, -47, -146, 13, -5, -3, -31, 110, 58, -125, 51, -20, 56, 64, -16, 23, -27, -6, -120, -61, -17, -29, 64, -90, -209, 212, 156, -31, 81, -4, 5, -48, 71, 23, 6, 137, 18, -176, 45, -59, -153, 81, -30, 43, -103, 75, 104, -91, -152, 43, -15, 99, -24, 142, 3, 96, 5, 16, 63, -99, 60, -76, -69, 126, 13, 8, 118, -115, 96, -63, -6, 185, 111, -164, -184, -8, 33, 30, -23, -44, 10, -36, -149, -167, -53, 56, 163, 214, 37, -91, -86, 192, 37, -17, -77, 20, -84, -52, -145, -88, -41, -164, -34]
7135c4k2n9R6O9q0L2Q3p4Jn3J19k53K69j21N9o1J06QK4r1p0J19j17Q7J56j13J6
7162I6k21J94K3j56L7l2J61j06Q2lk1P1j74l1J34K0k6j81J93j74K01r5Q4o6j2
7187brJ19j41J91k09J10j61R9N2j61K67k22J63r5J52j73K3o2J2P6o9J54j26k12
7211b24J69J17j50J07n0J4n2J47r4L7l7O5Om4pJ41p4r9j8J07R7j60J04L2r5M7
7237H6j03M1J02k29Q8N7N9j05P3j91J75J6jj59R5Pj36J67l3%l3M6Q5j87J64J0
7263I4j57M2N5l8L9Q2k97J67k2K1j74K73q5j94K39m5om5n6O8J1N9J00j12o9J68
7289A18J5k35J22m3P6N2j63P2M9m5Q5Kk31L7P5PJ45k6n1L2m7o6M1P8j51OO4j53
7317a35K78j00N3l11J92K4o3J67L0k23Q0O3J15j92O7J03j71j92K37N4p4k4K36
$$ y = [-34, -56, -115, -19, 50, -30, 2, 85, 11, 12, -41, 78, -175, 94, -27, 32, -29, 77, 85, 109, 18, -52, 67, -50, 37, 193, 80, 96, -125, 69, 92, -64, -27, -59, 102, -4, 78, 75, 54, 125, -49, -80, 54, 74, 48, -133, 60, -114, 87, -8, 76, 10, -2, -11, 108, -33, 158, -51, 59, -102, -3, 49, -112, 155, -67, 96, 1, 153, -20, 3, -59, -47, 29, -40, 114, -12, -224, -55, 62, -88, 19, -31, -17, -69, 78, -16, 21, -16, 49, 55, 11, 4, 145, 71, -28, -46, 61, 158, -2, 102, 134, 39, 86, -17, 24, 126, -103, -15, 42, 101, -4, 69, -122, 53, 69, 68, -91, 4, 11, -125, 42, 9, 9, -24, 22, 107, -80, 84, 94, -63, -21, 34, -4, 35, 117, -180, -13, -35, -14, -188, 85, 0, -194, 45, 0, -6, -51, -107, -39, -28, 31, 131, 19, -50, 118, 133, -102, 20, -23, 53, 105, -58, 14, 63, 18, 103, 105, -126, -89, -14, -7, 138, 112, 61, 93, 46, -20, 21, 99, -52, -46, 18, -135, 143, 43, 96, -215, -23, 1, -62, 105, 135, -88, -8, 55, 170, -22, 45, 148, -23, -215, 22, 76, 2, -22, 214]
7340B14k49Q3R3r3j19L4Ln5O0j6j45J59K8lj67K60kO5j25J2K06l22J42j23R0o0
7366c0J1n0K81k11N9J5p1N7n1J07p4m1O3Oj65n9K10k93K23j41J52J6o5P3M8j78
7392a08Q4p5R0N4k01R3p7J19j0o2Q3m3J30k18M32l53K6J68j28M0j23O3O2j51J54
7417D9J06k20J0R0j21K21k09J35j14J00Q9N4j24JK8j70J09J26j69J80j57Kk2J97
7441A91j89m0L6o2KQ3NK8J29j71P0p0R7k90J47np9M7m4o3O2J55K6q8J07m0j36
7468i2R1L4RQ1k03J37k43m6L74j77M3J78q3k07L00j38k1J48k80K8J35j04N5N2
7492G1k65K5n9J51J2j7K40p2N2j61J78n5o9P6j1j09RO6q1l6rj94L26j68J85Nj14
7519b4mJ3k3LPJ26k16Q7J05K9l2k50K34j94J91K3j82R7O7q3J8j64J38O7K38k52
$$ y = [214, -35, 48, 141, 48, -71, -37, -34, -89, -29, -45, -190, -31, -3, -6, -173, 87, 85, 150, 25, 37, 243, -79, 63, -60, 30, -30, -19, -69, 212, 1, 60, 75, 4, 61, 10, 117, 43, 2, 65, 71, -94, -153, 57, -236, -13, -154, -2, 14, -51, 22, 70, -108, -24, -99, -9, 45, -156, -63, -140, -21, -31, -93, -10, -53, 77, -141, 291, -62, -36, 132, 4, 44, -79, -16, 46, -105, 49, 155, -65, -55, 35, -86, 135, -74, 61, -53, 47, 136, 190, 66, 67, 95, -75, 34, 160, -9, 171, 14, 16, -6, 191, 2, -38, -2, -64, -62, 21, 26, 54, 183, 12, 82, 12, 109, -181, -34, -39, -118, -71, -115, -178, -116, 39, 65, -23, 84, 44, -92, -1, 33, 42, 123, -80, 57, -186, -232, 142, -35, 8, 186, 103, -104, 196, 58, 37, 185, -95, -67, 68, -36, 19, 71, -194, -169, -228, -77, -65, -82, 158, 86, 138, -23, 155, 100, 31, 107, 96, -13, -4, 62, -19, -55, -64, -258, 68, -100, 85, 90, -24, -28, -15, -38, -35, -28, 98, -118, -31, 74, 103, 71, -179, 55, -139, 52, 75, -107, -10, 57, -26, -8, -172, -34, 33, 271, 19]
7545A9P2n3q6J00J40l34J0R2L7j5j4Q6p5J61k02Ll5P5Q2q9J6j29R4J21j14M3O
7572A1q4MJ39%MJ58k95j00Q3K42j91j8K14j93k1j9M7J44j52L4k2R0Ro9k13K11
7598A3j0j47L40k30o0l2J46j01J19j2q3p4J50K7kJ42n9j15k6k4J07p7P0m3r3J38
7624F4j83N5m4K53k64J38p2J19p8J1Nj35J79N3j44k7R9r8J58l1q8P6P4j28q2K30
7650A40q9J6j19J38N7k65K43k25R1J1q7R9j23J64q9m2J23j12O3NM8L4j07J99k06
7675c3J31j26m5Q4O0n3j57K66l8j60q7K08L5p8o0J05j11j1Q1j8N2j8j34J62j45
7700i0K00l2o3K7L8p9o0K4p7N9JoL8%M8K3p7j9k3N4J4Q1P4j82M6Q0k10J96j69
7729h4L01k27j38J86m4LJ3pN5Q6n9j74J16l4J16M6l28J38K2K4l5N8m6kJ0nLOJ45
$$ y = [19, 91, 38, -48, 52, 192, -142, -132, -40, -3, -18, -32, 54, -21, 140, -62, -59, -94, -19, 63, -26, -10, -139, -45, 76, -38, 5, 11, -73, -69, 70, 70, 74, 232, -63, -163, -80, 162, -29, -47, 167, -26, -47, -66, -19, 125, -27, 7, -15, 75, 84, 15, -198, 13, 3, -144, 196, -34, -94, -126, 20, -81, 38, 26, -57, -131, 19, 46, 44, 186, 127, 12, -14, -38, 69, -8, 62, 19, -74, 64, -119, -64, -108, 145, -119, 19, -53, 66, -12, -1, 4, -131, 48, 101, -43, -70, 29, -69, 89, 58, -30, 46, 120, -8, -90, 140, 51, 67, -52, 86, 143, -122, 121, -104, -13, -2, -89, 10, -113, 51, -38, -80, 43, -69, -6, -1, 47, 81, -26, 173, -33, 98, -28, -73, 11, 71, 18, -139, 127, 89, -71, -158, 50, 85, 7, -53, 52, -59, -70, 11, -7, 45, 27, -107, 55, -90, 110, 78, 15, 42, 80, 1, -59, -35, -112, -53, -52, -58, -20, -20, 28, 51, -26, -45, -68, -14, 0, 81, 155, -27, 19, 99, -111, 85, -84, 217, -10, -148, 38, -6, -3, 10, 3, 58, 144, 85, -89, 27, -7, 109, 155, -173, -35, -13, 11, -24, 34, -12, -14, -4, -9, -6, 0, 145]
7758A45q0j05K06k91K49k62O3J48j73M0Q7qj49J39m9q3J64k38K58Q3j22l2p6J47
7782F1r3n5K36p3j20J93j11n7J15k27l1L34j04q0l3J7j03K70j99J10q9j34J58
7805a5k4O8j40J79j92R1JL4M2j12K51L3p2n1qk01J96j29o2J87o5j07M4k5N7NJ51
7832A36R1j72j24J11K0j90j2M7J31j40K60k5j92l3J30J7Q5j41m0L7J63o6Q7j09
7856G1n2p6J27j18q0J02P3j18l1Q7k2J63J2j19J3M9Nj5k2j29lJ20J0Rj70K36J4
7883A36j78j87K15P5r9Q4J80k99KP8N3l4rn1j75J53L0M8k6k3K5Q0j3L7n5K7L6
7910A10j69J8N3J27j87n7K40j04Lr6J38l7M0M0j24j6r5J99J39r0j77j2M6n1j57
7935b19L00k7j85K70k34j5J49P6j45o5N1R0l7%j30p0L09k26l4J48k8p3m0K18J4
$$ y = [145, 65, -40, 166, -125, 124, -138, -75, 73, -100, -60, 27, 19, -130, 9, -40, -123, 41, -197, 61, 144, 22, -10, -86, 61, -32, -87, 149, 76, -44, 149, 38, -19, 96, -131, -162, 172, 68, -12, -45, -28, -131, 139, -60, 50, -39, -173, -15, -39, 29, -111, 68, -124, -33, -32, 2, 44, -68, 183, 216, 144, 93, 85, -116, 80, -49, -111, 76, 11, -96, -52, -77, -20, -15, 136, 227, 55, -69, 42, 62, -128, -140, -93, 38, -102, 158, 133, -59, -92, 38, 55, 140, -1, -41, -4, 159, 93, 180, 71, 19, -57, 70, -48, -128, -26, 47, -71, -102, -15, -37, 126, 138, 19, 32, 81, 86, 71, 49, -80, -83, 37, 47, 56, -114, 122, 136, -42, -229, -14, 61, -38, 46, 226, -73, -71, 7, 60, 26, 17, -34, -209, -56, -26, 22, -4, -27, -2, 78, 65, 102, 47, 74, 110, -59, -41, 12, 139, -48, -105, 135, 31, 34, -62, 76, 39, 79, 119, -5, -21, -116, 83, 222, 132, -45, -57, -11, -62, -219, 81, 54, -131, 139, -95, -110, 39, 115, -30, -95, -44, 46, 9, 9, -121, -191, 118, -108, -142, 6, -22, -95, -135, 83, 97]
7960I7o2j52K00j45J3J5K30l12J60J83j41k11J72l4J13j14j4j15K03r1J3M5j37
7983h4O1Jm8j12O2K48r7o3l2P0j41K84l17J23rJ43J56k14m1J93k44L1J36j05J8
8008A9j15J53k21J29r8Q7O8J06j52J28m6p4k4j16J06J72k68P6M5O7M7J0k35J73
8032C7k7l4j0R8L4j30NK43j93o8R7m6k5Kj4J75k15J05k0k1K28j31k74P1J47j6
8058A8k81K71K15k82l0O4K08j97L8R8j82J57j29J2OK4j06j15K42r7J83m7l6k0
8082A4j9p8l0O2R1k6p7Q2N5l6j50J81P5j41N7p4J7o7n3J40L7K19k51j64J95m4
8108A5j88L18p7N9j59M0P3p0J9K6k8N5N1Jk81L08m2M1k26J82o9K3K1j50R5n8Q9
8135F8nL5k59K09J09j98o5m0J57k6J7P7j21J07j10J98j00n7Q0n8r5q4J32L7j57
$$ y = [97, 35, -117, 83, -62, -49, -34, 196, -116, 44, 227, 86, -125, 47, 13, 126, 12, -2, -117, 86, -5, 8, 53, -84, -23, -22, -70, -182, -120, 128, 31, -32, -64, 6, -135, 149, -168, -45, -54, 89, 245, 31, -10, 183, -61, -30, 106, 1, 19, -96, 57, -164, -35, -133, -46, 22, 128, -24, 104, 58, -16, -40, -156, -50, 122, -146, -70, -25, 42, 89, 99, -136, 37, 10, -24, -34, 64, 98, -32, -27, 216, 23, -45, 52, 6, -19, -17, -31, 144, -71, 34, 14, -7, 221, 90, -184, -113, 34, 18, -263, 8, 223, -59, -89, -25, 183, -14, 24, 122, -60, 97, -32, -20, -14, 10, -96, -211, 31, -66, 117, 70, 34, 14, -5, -83, -113, -51, 40, 14, -63, 19, 74, 38, -112, 69, 144, 3, 60, -14, 3, -64, -117, 23, 60, 279, 28, -136, 59, 15, -173, 145, 68, 127, -32, 8, 81, 11, 30, 56, 28, 83, 134, 135, -146, 162, 120, 161, -65, 117, 48, 71, 92, -58, 37, -21, 68, 63, 98, -161, 48, 157, -41, -106, -146, 11, -15, 2, 79, -42, 65, -45, 153, 53, -4, 76, 18, -77, -161, -29, 8, -149]
8160a49K89j88J0J2j8R6j33Q9j71O7O8Qk6J18K4k02J05p6K1L2J84m4k68K95j3
8185A30k49R3J27j46j90J20K58j53pj39MJ98Q3j98J12O4k9nj89J59q7J60k76m1
8209b01R3N2K9j20J32r3Q4j05L19k96j9J78M5q5Q5j02k22K00J62j55P7n4k7J9
8233dL1M4j0qR4j89n4J08J58j19N8j71J07k03J22J52k26M0N8J60j14Q7k16O3J04
8258G2l5Q8k09J91k20O0L7k1pJ33j22l2M4J80j81K1O6j5N7j47J64j25K6l3j33
8283a41J28J14k34K01Q8k04m6L23l44R0Q6J57j42mq4M4k1J8p8N5j35J49Mm8R4
8308G0q9P0O%Pj31k1K11l01K11p4L6k09J74J13o8j44J03N0N5j00R6J37J8j83n5
8334a8j9N7p1k7OKQ5j02J59p9J7q5J07l5p8J34j0j7L8r5l9p0K15k9j5L3p4lqK2
$$ y = [-149, 140, -48, -38, -26, -44, 52, -81, 8, -163, -96, -28, -20, -46, 72, 96, -106, -1, -77, -56, -24, 160, 116, -152, 143, 130, -119, -26, 101, -45, -235, -115, 143, -10, -17, -156, -152, 46, 129, -69, 43, 107, 78, 73, -116, 43, -44, 116, -160, -201, -108, -56, -27, -147, -15, -108, -24, -129, 190, -106, -125, 53, 98, 13, 98, -4, -226, -26, 136, -19, 58, 4, -23, -4, 27, 71, 61, 53, 147, -42, -96, 12, 170, 51, 109, -62, 45, -158, -36, 116, -110, -70, -12, 148, 34, 121, -95, -32, 72, 37, 125, -84, 107, -113, -53, -16, -37, -44, 89, -33, -65, -21, 159, -22, -1, 65, 50, 107, -40, 124, -1, 25, -8, -141, -13, 101, -133, 68, 156, -48, -94, 229, -115, -25, 61, 218, 76, 72, -12, 32, 11, 29, -49, 6, -129, 20, 24, -24, 70, -19, 51, 57, 57, 64, -67, -88, 123, -178, 33, -41, -5, -214, -40, 73, 5, -139, -36, 14, 69, -31, 65, 202, 220, 37, -18, -37, 20, -51, -78, -72, -70, 15, -87, 72, -7, 10, -75, 32, -3, -81, 53, 43, 26, 64, -31, -70, -140, 75, 46, 31, 64, -10, -13, -21, 1]
8364Ak07K79k3o8l6J0j8o7K21l39J6J99m8P7nJ07p0Q4j34K8q9J04j33J69J14j06
8390F6J1o8l7M6M0m0j47J26K5N5k2j66J04M4J3P3p0L0Q6j57j61jM3m8R3l5R3p4
8418g8O7L1J20k39J15m2j23J74j5o0P4k24J95J6J4O8n5J60k84J55j17R5l0J66
8442A83k43J73l0j77J9k7r9K41j6M6j09M2qJ50j07nm8k7rol0o7K01l3j86OM2O0
8470f4J78j7j7j65O3J5K20r9N5j72k12J86m0j06J39J98j42%j31oJ18P1j3J03j19
8495D3%P5j43j1M1k9Lr0j1k7q5K07P6j1l3M0n4P0j67J19j26P4k5r1J32K2J34k13
8523h0P1n8Qq0N6n0J81R5m7j68Q1m3J46j13J51r0j1N3j24j28K09k67J97J46j71
8548c6m5L2L2k3J82j25n8J55k2j32J47j49J39m9n0M6m7k4j1J67p9N0l8O6KJ45
$$ y = [1, -206, 73, 50, -18, -54, -44, -62, -129, 92, -247, -231, -32, -80, -3, -8, 99, 29, 113, -21, 7, -82, 22, -111, 58, 172, 66, 77, 9, -28, 18, 58, 18, -129, -3, 22, 77, 55, -111, -7, 37, 50, 123, 53, 83, 169, 12, -149, -150, -107, -155, -62, -97, -4, -78, -11, 20, 140, -99, 16, -26, -149, 25, 10, -50, 24, -200, -5, 11, 25, 93, 38, 198, -86, 69, -48, 47, 17, 183, -60, 113, 83, -94, -75, -102, -201, 40, 24, 70, -39, 3, -5, 145, 38, 33, -15, -42, -51, -57, -87, -154, 47, 14, -172, -166, -124, -64, 114, 97, 80, -85, -22, -7, 213, 114, 169, -3, -215, -29, -69, -175, -36, 162, 20, 20, -111, -117, 1, 72, 59, 162, 43, 43, 118, -25, -36, 5, -24, -21, -111, -122, -149, -234, -27, 49, 38, 5, 45, -9, 61, -106, 13, -113, -39, -64, -155, -23, -1, 133, -80, -9, -67, -59, -139, -83, -133, 48, 143, 96, -72, 9, -34, 112, -1, 150, 60, 49, 102, -22, -150, 59, -208, -11, 135, -36, -81, -49, -17, -40, 142, 17, -41, 114, 92, -40, 107, -42, 97, 48, -2, 44, -3, -27, -38, 129, 50, 100, 62, 128, 130, 275]
8574B75k19n7Kj00oj14K95k10J93K6m5P2l05K34j03n9K92j45L3j17R4k72J96k6
8598f6O8L8j68m2J47O4r4J58q5N3K3j46K58k85M0J04M7l10K29l9OJ05N2q7j14
8623d4N1Q9k83K24m0k02K01M1j4K1j53N4QK17k43L3J37j01J35k32J18J40k26J24
8647E5j18j4M6K9j6k3J36j18N7k65L11mj71L3K1J82j54r5J71J3r3r1J31J79k88
8672h6J39r5O9o2j0J38N6j82L4J63k08K1k9M5j85L30r3l0J4J00j75Q9q3O4K4j08
8698f0J99m4j09L5p4J04j36J6N4nK4j32j9J14O0O8j32R6k9K7Nr5Rj38J03K71l06
8725i4K7j2j24K86k7km1jO0j49J43pl4j15P0K5J64n1j83O7J7%lj07M0N6N8j36
8753g3K44k60J45j29j5K65k4j81pjm4R6J05r2Qn7J17N2j79J5M8K20l27J04Q1l45
$$ y = [275, 56, -1, 1, -99, -105, -219, 76, -134, 59, 85, 40, 112, -193, 41, -62, -121, 171, 26, 59, -58, 36, -236, -40, -66, 2, 40, -128, -170, -23, 41, -53, 105, 20, 73, 96, -50, 208, -77, -37, 67, 114, -196, 33, -6, 0, 105, 157, 70, -44, 7, 96, -187, 37, -3, -205, -4, 37, 23, 44, -109, -55, -47, 170, -73, -40, 97, -4, 131, -101, 17, 157, -69, 55, -63, -77, -31, -2, -18, -41, 95, -23, 34, -231, 80, 76, -95, -62, -41, 141, -13, -108, 63, 76, -17, -108, 23, 202, -86, 53, -42, 27, -35, -45, 93, 149, -33, 1, 164, -44, -23, -52, -7, -192, 138, 45, 15, 29, 129, -46, 43, -40, 24, 48, -60, 139, 95, -14, 21, -53, 51, -85, -69, -15, -20, 4, -128, -147, -33, 27, 95, -37, 59, 30, 57, 62, -33, -24, -162, -59, 212, -94, -67, -79, -203, 83, 56, 54, 13, 12, 72, -77, 66, 59, 25, -90, -20, 5, 169, 118, -65, 2, 19, 19, 16, -91, -51, 5, 63, -73, 171, -89, 56, -73, -88, 177, 153, -28, -35, -36, -80, 16, 121, 29, 37, -20, 97, 149, -30, -15, 33, 253, -74, 30, 111, -234]
8779b34L27j65M8K8oQ8m3r6L6q7O5R9J13k79L6P3r3o3K16n1N5o5O6m5k3N1J81
8806B32j98l4P3m6k4L5j78P4%Q6o4j19L35n9j7j25M9k17M08k2j01J9j30JL9NJ20
8833A42j89J31l9L9j82J50l8k0L2J9J1j23K19r3k11K71N5l76J55N7p5N6Q6k79
8857b02K33pJ08k55J51OP9j85Qj1L0j55J70k1k4K4P4j7P8j44j06P7O4n1J10mP0
8884A00p6pNN3j46N4J97k13Q9q1N4j52N7o7J28K8j01J58j47K62j36L0k58K05n8
8909b2O4j25p1J61J00op6j10N6K3K0n8J21j51K0p3J39o1Q2K9l6o8N4J13P2k26
8935b9J17k39J28j79J34NK8l3M4Rm3J47k84K36j04M8Q1j0j19O3M8k1m3k39K20
8960c5Pn1l8R0J53Jj81P4q8K06k89L05j56m1qJ01j32j15J79J5j08J0J07N7nk16
$$ y = [-234, 93, -72, -24, 4, -2, 86, 43, -53, -17, -104, -39, 60, 173, -106, -70, 3, -90, -153, 63, 12, 67, 2, 68, 23, 0, 51, 232, 34, 0, 73, 27, 3, 38, -140, -66, -66, 20, -44, -163, 172, 113, 96, -29, 20, -197, 211, 189, 88, 107, -23, -22, 17, 22, 142, -47, 84, 45, 84, -98, 52, 14, -6, 26, 45, 56, -67, 152, 59, -152, 119, 174, -202, -47, 10, -65, -9, 77, -202, 31, 24, 132, -123, 28, 34, 113, -72, -64, -75, -45, -200, -30, -51, -75, -51, 23, 6, 84, -60, -166, -89, -25, -76, 34, 30, 100, 24, 17, 22, 75, -71, -17, 180, -33, 56, -25, 29, -123, -66, -133, -5, 23, -78, 80, -67, 195, 59, 89, -169, 36, -22, 42, -83, -154, 7, 107, 101, 25, -85, -29, -6, 14, -44, 77, -74, -54, -127, 12, -49, 33, 62, 26, -42, 12, 125, 197, -29, 88, -151, -23, -202, -68, -63, -35, -68, -24, -15, -58, 89, -195, 41, -63, -15, 66, 56, -63, 0, 48, 27, -16, -255, -35, -28, -79, -117, -27, 126, 127, -54, 20, -68, 138, -151, 154, -2, -43, -51, 50, -82, -197, -18, -3, -111, -101, 6, 63, 58, -158]
8986a58K61qJ61k65N0M8j48K9J28j75K1J77l2k8j47q5L25j47r6l2J10K22k22K02
9010A91r4j34J60k03J16J4j44J38j99M2J6J4pM1Q0nN0p0P3n6m9P3Lj38%K7P3j6
9038dj8J26j20J36r8rQ2j2r3R7r0N1r1j5j47K74k08J82r3K49j54q2Q9l2n8J50
9064A12p9J2J13o2r8k78L07o7n4J58Qj00m0K1J60O2k72K09j54J04l2K6P9j49O8
9089E4J83k99l3K30j86J31M9k99K88j06K31j88r7M2Q7l8j54J30n0r1R0l7J14j6
9113C5k30R4K22j17J7J03n4j23R3J21j85Q4j55Q7j78L4K75pm2k39J25O8oNp8m7
9139i8O2K7Nj92J51O1j47Q8J24j6j03L07j10j38l7P3J2o1N0j6j62K42J7j83k14
9164b58L24r2j25K76j62N1N9r0l7K11k17k0J83r4l3L5j31K09j87KJ36r2j43J97
$$ y = [-158, 103, 95, 256, -9, 41, 89, -59, -30, 98, -77, -56, 121, 89, 61, -86, -171, 154, 7, -89, -121, -11, 211, -11, 191, 97, -37, 123, -80, 36, 50, -94, 44, -155, -113, -97, -83, -90, -49, 31, 26, 76, 6, 79, 23, -26, 47, 50, -88, -88, -61, 12, -4, -22, 104, -16, 120, 22, 13, 95, 83, -10, 87, -3, 48, -43, -58, -205, 69, -139, 43, -50, 199, 45, -37, 52, 20, -38, 112, 33, 45, 158, 96, -2, -280, 27, -40, -94, 64, 72, -28, -68, -47, 113, 175, -97, 112, -42, 62, 30, 56, 135, -14, 54, 237, -62, -95, 135, -51, 80, 129, -170, 118, 12, 243, 55, -42, 0, 87, 49, -105, 25, -25, -116, -26, -63, 51, 35, -195, -101, 121, 4, 21, 124, 70, -53, 40, 161, -24, 60, -95, -8, -186, -152, 123, 116, 74, -165, -40, 28, 22, 27, -51, -98, -36, -9, -4, -196, -45, 16, -131, -43, 81, 65, -38, 269, 159, 21, -16, 57, 69, 8, 58, 42, -120, 122, 139, -44, -258, 66, -26, -151, 125, -37, 14, 73, -17, -54, 157, -60, -80, 103, 9, -24, 11, -120, 89, -98, -96, 40, -52, -195, 2]
9188BJ00J4j13N0j21L5q9R5j2k9JR9k59K20K3k13K31m7r6rJ65j93J37J7p2L5j2
9215d1j77J86L4K9m3j07J21L2jP8j85n7K50n3o1j19J05r3Q8pQ3n9n4J29%m7J40
9242A71j12l8j8J92j39l5k8l0Qm6N1j9m0L6K7J38j48LJ31j14N3J8p0o5Q3J32j95
9269e4J23lj00Jj06M0NK40j00j58K90j26j30NP8N6j7j45m5J35P2q6Q8k33J48N1
9295B9q8O2j14Q3J81j23J53j22j66O3J43j20o0J58N9j47j43N2K30k5o7L7r0k1
9319c6MJ67O5r1k84K86j84j27K41j41J2L1J10m1K7lp2O5J4j8J7j01J19k0j08K06
9345A38k18j31J20J02N9j05j1N7p7N1J30k0k0k01N4N4J70k91K06M1m4l72M30m5
9369G7j22J32j40N6M1J4m7R7rn3kp6J0N8k43K03%k40J81J58kk2q2J11j30K1J85
$$ y = [2, 102, 116, 3, 53, -68, -33, -122, -27, -39, -68, -67, 32, -227, -7, 16, -197, 34, -13, -109, -118, 47, -146, -9, 8, -64, -29, -41, -218, -32, 2, 31, -12, -119, 2, 34, 33, 111, -74, -131, 119, 66, 5, -114, -9, -102, -14, -21, 62, 3, -51, 78, 78, 31, 171, 59, 21, 3, 195, 56, 21, -7, -37, -29, -75, -24, -43, -83, -47, -20, 118, -30, -27, 104, -10, 43, 61, -9, -74, 9, 141, -54, 69, 66, -34, -33, -139, -99, -94, 146, 46, -112, 178, 52, -78, -73, 5, 61, 44, -101, -146, -11, 61, -25, 63, -170, -22, 29, -59, 3, -111, -28, 153, 30, 183, 61, -105, -42, 101, -19, -79, 79, 138, -9, -152, -100, 130, 105, 38, 75, -15, -36, -32, 135, 200, 109, -175, 111, -73, -200, 41, -100, -88, -57, 53, 12, 39, 36, -36, 29, 43, 25, 42, -59, 60, 40, -68, 138, -80, -211, -91, 11, 70, -35, -46, 11, -66, -15, 115, 95, 75, -126, -72, -18, 152, -139, 67, 108, 64, -308, 122, 77, -45, 87, -53, 3, 44, 58, 11, 108, 99, 46, 44, -32, -22, 36, -207, -4, -4, -244, -63, 95, 93, 71, -11, 100, -30, -9, 176]
9396A76k03L9J02j29o4J0O3J40j88J79q8l1j4l8R5j8J78l08P3K10l26J56n7J02
9420E9l22J28K06j51%J36j09J64p1N5P2j52j6j12P2l2J65k21J39r7Q4N9lJ17j58
9445A2J05j33K56j51p7n7J34j0o7j8J74r1p1k25K05r6J7J02L4j18K4J06j31M8
9469b8Q8j64k8J64j35O2j16J80K1j36k8K43l6j65K7l1K36j6k43O6k1LJ49n4j12
9494g4j20K80r0J51n4p9J07j61L4r3M9N3k8o1%R7kN3N7m2k19K54j4jn6r0R1Rr5
9523d4k8J48n2P3K7j98j3N9PQ5N0M1r0Q8j06J9r4Q0j5P0J7k50R2J52n4o5J2j9
9551hk3m6J15l7Pk76J82j8J03K1k1L0j04M9J43j23j84J32R8j77J74p9J05K9j79
9576h7M0R5n7J94k30j4Q2p4m5J88o3p9k1O0J15Pqj57n4J91Nll7n5J7j63R2O7o8
$$ y = [176, -27, 12, 114, -15, -79, -69, -6, 134, -54, 125, 37, 6, -8, -46, 49, 31, 209, -99, -26, 184, -142, 14, -43, 59, -263, -135, 71, -80, -80, 56, -53, 111, 40, 95, 167, 15, -1, -113, -41, -73, 92, -129, 10, -87, -3, 56, 53, 170, 12, 117, -16, 240, 89, 12, -45, 89, 79, 12, -6, 168, 77, 6, -219, -14, -110, -93, 9, 43, -75, -51, 55, -76, -28, 60, -104, -132, 32, -103, -41, -157, 23, 44, -92, -120, 123, 87, -78, -51, -82, 154, 138, -105, -39, -60, -57, 92, 38, -74, -194, 86, -4, 147, 93, 14, 121, -40, -6, -99, -50, 3, -25, -86, -86, 11, 9, 62, 119, 77, -142, 112, 98, 97, 41, -49, 42, 51, -44, -72, 76, 24, 97, 124, -74, -87, -28, -21, 64, 114, 155, 65, 153, 47, 66, -28, 52, 37, 107, 124, -126, -34, 118, 64, -1, 11, -8, -31, -77, 38, 1, 8, -268, -86, -104, -1, 20, -1, 29, -75, -26, 117, -6, -190, -58, 40, -137, 37, -42, 63, 92, -87, -47, 48, -9, 185, -45, -59, 23, -51, -96, 92, 29, -50, -71, -11, 104, 111, 103, -54, -108, 83, 88, 85, 48, -7, 10, -153, -61, 6, -62]
9605f2J40J14r3r2o6J61q7J7K3M3j66ROJ37j80K04j46P8j27L2l6OJ40j50J64o6
9631Ck4J70j09Pp5p9N0N1Q1j07K6r3J07j9J69j29j15n2K8J71K5r3P3p9j15J00
9657b8j62K06l1JK7K4M1J05p7j13R1r8O7m7J59j17M4j53J04K5n1N8j05Qo4K68
9683A82j46j00K39n6l6J4k56L01Qk20nn5P4J21n4jQ6o2m6K3J1l2l6L1K2n5J6J38
9711A06n1j49J4K69k21l5J22n1JO8m4J49l32J96j49P4K1j4J2J27j20q2J97K6k59
9736a25K22L3q8o8J48j32J07lj11l7J6M5k2J01M4ol2k30m5J93j20J29q1P7M6m0
9762B1K4o0Q1j22J10k4j17J02j03Q3L2N8l5p1J03J91q4j53m6j4mO1K5j41N8l0
9788e5J68Op4l6j42Q0K2m1J16l4N4p1k34K28l0L0N7n9J9j23M1P7m5J76k30P1K4
$$ y = [-62, 78, 192, 99, 7, -59, 102, 15, 32, 55, 98, -68, -59, -53, 84, -96, 108, -38, 40, -87, -55, -91, -85, 55, -95, 69, 3, -21, 149, 40, 47, -28, -107, -57, -6, 75, -32, -6, -99, 8, -11, 158, 29, -86, -138, -110, 61, 86, -7, 66, -13, -128, -28, -190, 16, -15, -14, 13, 37, 78, 183, 106, -7, 84, -14, 53, 6, 165, 48, 92, -61, 43, 68, 17, 75, -30, -22, -86, 182, 36, -64, 175, 119, 83, 97, -159, 142, 150, -70, -75, -130, -56, 65, 11, 10, 96, 34, -12, 11, 22, -10, -46, -15, 7, -48, -32, 106, 55, -94, -80, 189, -32, -67, 55, 4, 5, 73, 29, 178, -154, 42, -107, -33, -12, -26, -14, 113, -7, -89, 108, 134, -125, 97, 130, 42, -26, 122, -10, 97, 94, -17, -54, -38, 7, -15, 86, 130, 124, 92, -138, -183, 10, -110, 19, -62, 15, 61, 21, 45, -15, 66, -56, 54, 30, -87, 15, -88, -5, 27, 85, 50, -21, 82, 273, 189, 36, -10, -24, -28, 33, 58, -83, -25, -55, 113, 119, 45, 9, -133, -53, -31, -72, 44, 10, 64, -7, -241, -13, -43, -13, 44, -15, 4, -119, -78, -1, -46, 130, -100, -29, -5]
9815eK1j19J48q7q2J75j52J37j03J82n8N8k08K61j60L2j75K55o1m4k3j07K35j54
9839c4J31k8k1M0j2k21K28j07j53J54J37k98J68M3On8J43k18O5p5J29nj04J57
9863F7j29QK06j92J30j11N0J20k03J93r2q4Oj0K01k91K08k3r5m2r9K52J08o8j44
9888c4J41j0j41J42p9n2M6j14J2J07j03J34PO2j32o7J85p3j15J22p8o9k0OJ09
9913a4J39j73J25k7j56K08M9j63j02K56l54K88j16kl8J08o5R4L8n9p0k9ro5K53
9938A16l7o5J1m6K9m0q2J46l4M4K4j24PN3j2k58R7K65O0J9k26l7k3K09j07p9Q5
9965eP7j0q8J8PL6P8M3n0j88M2j07J92j2k7j0j16J17k4n0J48j34N7K8M4j01q1
9992a16K54k31M5K2N8Pr5Jj55K14J50j66j99K61pj91L86j99k27K38r7J0O3j83
$$ y = [-5, 16, -103, 45, -42, -124, 51, -101, 36, -67, 115, 57, 115, -93, 168, 8, 40, -135, 120, 59, 15, -8, -115, 120, -34, 97, 69, 48, 88, 76, -145, 83, -24, -177, -23, 114, -184, -16, 27, 33, -25, 118, -100, -35, -110, 19, 14, -90, 67, -62, -54, 152, -40, 90, -21, 29, 149, -54, 139, 47, -37, -31, -41, 160, -131, 77, 54, -41, -83, -182, 70, 178, 110, -34, 107, 97, -44, 98, 19, -33, 13, -101, -89, 18, -85, 49, 56, 118, -14, -81, 104, 31, -84, 38, -40, -109, -129, -123, -14, 125, -48, 77, 50, -106, 102, 151, -12, -114, 142, -212, 76, -40, -42, -80, 28, -37, 57, 95, 36, -34, -63, -72, -137, 116, 79, 14, 25, -21, 8, -32, -114, 32, -2, 42, 66, -58, -51, 2, -10, -268, -171, 94, 154, 173, -53, -90, -113, 96, -11, -90, -5, 72, 62, -26, -8, -1, 35, 113, 156, 106, -82, -40, -147, 45, 33, 6, -4, -120, -3, -27, -77, 71, -63, -6, 22, 66, -35, -116, 138, -93, -48, -26, 32, 39, -56, -55, -210, 4, 154, -12, -211, 50, 43, -148, 238, 39, -188, 50, -47, -37, 26, -157]
10016a57J13L0j5mQ6o0q1n0N9K53j38r8J08r9n2j12L57o4O0j08J4K9r4m8K60k03
10042a4J42k58k7K00j48J31Q4n2n7J3j43K05j25M7J5L9j37j8O9J9l0n6J7l0K84
10067A70k68L2J04k00K40j15J87k38J49k37K51j6j16J28j17P0m1M8o8Q2n4r8Q0
10090b7j65K25j85J58j2J2o9Q5K6j37P8j47L06j39L2kM5j88j8J21q5R5n9J42j37
10115d5k9m6J38Lr5N2N6%l2m9J03p5j05J45m4L2Qr9J93l3m2j48MJ54j65J73l4
10142B0M1J16j20k2j13J96K1l7k02M04j97N7j63J17j68j2L2J4J15K7r1L3j38M3
10166b7J17L0j05N7k3j82M8K5j5j00J99L9q1P6L2p7n8J15j34O9n1J24k4j47J31
10191C8q5l3K01j18J4J25j22j7r8J6Q4J8M3p0n8l4J08j20l0J50j42J62P0j46Q0
$$ y = [-157, -44, -14, -29, -33, 53, -7, -88, -138, -79, 174, 36, -62, 46, -53, -105, -217, 140, 76, 136, 28, 42, 71, -23, -71, 189, -14, 128, -130, -157, 43, -105, 26, 110, 58, 1, 14, -129, 76, -49, -2, 13, 52, -85, -103, -34, -15, -45, -101, -84, -114, 170, -98, -66, 38, -162, 78, -37, 150, -88, 61, -176, 75, 59, -57, 71, -46, 24, -17, 31, -37, 45, -9, -107, -27, -192, 33, -152, 6, -6, 6, -63, 22, 48, -89, -11, -158, 148, 9, 41, 39, 84, -104, -122, -1, -86, 9, -50, 92, -45, -74, -120, 18, 21, -74, -22, 34, 34, 2, -47, 56, -19, -124, 21, -23, 9, 17, -82, 111, 78, 36, -112, -108, 46, -119, 54, 20, 61, 177, 57, 35, -78, 118, 139, 102, -100, 304, 107, 164, 1, 118, -50, -62, -30, -16, 99, 126, 35, 68, -70, -27, 90, 120, 15, 72, 49, -133, -85, -60, -75, -175, 24, 63, -18, 58, 90, 13, -45, 70, -64, 5, -46, 78, 54, -93, 38, -47, -80, 121, 3, 17, 142, 20, 3, -95, -79, 5, 23, 66, -4, -62, -96, 12, -108, -138, 12, -130, 32, 102, -44, 36]
10216C6k3K2L2k25J40J19j18P4j19J62j21M8j6M5J73l13J85q6pj8j1J97j72M6
10240E0r8J0L4j03L30l33N8m5J44J1j14J85j97J83N2P1j53j14K22j60m4K4k9K8
10264A2J37j18l9P5j6l5Q1r6pn6J34P2j16l6pJ50mk81N4m9j0J77O2K7o9L8j3m2
10292B5o2N7j33J14J52k05l7LK44j26j43Q9M3o3J00j55R1j03K42n0j7o0J18j45
10316b1k21J13J36Kq1J14m6j3K37j28Q8j16p4k28J85J54j26p5L17k39j21J75j05
10339g3l8RJ9J81j3j44O9l9Q8j38P1l4m3O5J4o6K4p7Q9Q2n1j00L19l03K16o7k2
10366C8q3q2%P4J08m0r8J0Q7k5K2m7jQ4n5J20j3q6n6O2J6k58J92J09r5l9%J18
10394F2n4P6J09k80P1r4P8J81Mj35O1m3J55p8r0p2J36k0L4k22J82n0p1R6j58J07
$$ y = [36, 13, 35, 67, -158, -18, 101, -17, 57, -62, 100, -21, 27, 11, 56, 229, -84, 101, 15, 8, -10, -21, 176, 4, 50, -48, -38, -4, -107, 223, -110, -52, -97, 47, 58, -56, 129, -68, 115, 167, 238, 85, -29, 193, 33, -11, 13, -16, 12, 149, 31, -8, 67, 51, 16, 97, 1, -6, -62, 72, 144, 28, -8, -15, 135, 131, -150, -96, -145, -155, 22, 84, 111, 42, 80, 67, 25, -37, 20, -113, 1, 153, -52, -89, -86, 158, 32, -111, -22, 21, -42, 58, -97, -6, -109, 133, 83, 66, 6, 124, -21, -242, -129, 7, 9, -72, 42, -4, -17, 220, 92, 180, 64, -10, -238, -53, 101, -25, -100, 217, -22, -143, 32, -73, -111, -102, -83, 98, 85, -59, 10, -29, 59, -79, -8, -42, -85, -20, -6, -72, -48, -125, -36, 46, -5, -105, 214, -89, 127, 60, 38, -45, -127, -127, -53, 55, 15, -83, -73, 14, -11, 11, -36, -37, 47, -8, 112, 99, 13, -43, 19, 35, -223, -31, 78, -17, -56, -56, 62, 8, 84, 193, -87, -16, -110, -32, 149, 153, 18, 79, 36, 191, 113, 23, -49, 87, 67, 101, -121, 61, 11, -60, 36, -122, -15]
10420a5n4O6J40Mj72K9m2J6P8j06j9R4j76J61n0R9j56K05j9j7r0K15j33K18k60
10445A6J8K1o1J31j7k08R8j53K37j3R8j57n4N0l9P6j35N7N4M9j8j28K9O0q8M2
10471c5n9L5J42j69O5K6Kj3J36Lj83k13J40J4K50k78R4R2k13J58P2R7m8j48J56
10496A23j52qJ9M5Q3j67N0L6q2J01j27k4N4M7l5J70k30Q9J25p4m3J07p8j31J89
10521H7r5Q6k36J87l7J21j1p3L4k5m0j7J04Rn4N0p8n8kk3K2l8kK00o1l0M3n7%
10550Fop8J32j3J12m2j36rq0jL2O2p4M1K7N0m4J57l19L39j39j9j8J05p1p7M1N9
10578C7L6j37p1L0J31m9M4l6R0j36M4N6L5n4n9p2K23p2K9R6j28J11j70R1J45k37
10604b3j07J5J79j20j45K75J4j03J06j32l4N2N6j08L0R2k3n9rK64j88j34K26q0
$$ y = [-15, -69, -3, 137, 141, -31, -2, -44, -28, 50, -56, -75, 19, -157, 4, -46, 53, -103, 102, 83, 66, -24, 191, 58, 276, 16, 34, 55, -6, 125, 108, -100, -2, -155, 82, 69, 167, 10, -44, 6, -33, 43, -92, -35, 19, 68, 50, -78, -49, 11, -77, -35, -94, -59, 83, -86, -21, 5, 7, -6, 130, 133, -50, -263, -123, -109, 141, -137, -43, 49, -164, -6, 66, 163, 115, -33, 123, -29, -37, -18, 27, 110, -57, -7, 29, -53, 48, -79, -103, -49, -2, -37, 133, -97, -8, 117, 43, 0, 107, 29, -102, 87, -8, 78, -158, 29, -8, 113, 102, 29, 63, 38, -2, -19, 85, 94, 40, 90, 12, -46, -48, -71, -49, -87, -89, 111, 50, 20, 63, 6, 6, 0, -78, 54, 41, 153, 111, -25, -34, -114, -115, -83, -21, -95, -54, -27, 23, -21, 136, -183, 156, 17, -2, -20, 85, 14, -63, -22, 37, 73, -64, -135, -105, 26, -23, 21, -15, 75, -61, -17, 39, 74, 20, -39, -111, 112, 40, 69, 165, 37, 148, -22, 69, 214, -23, -130, -115, 64, -56, -201, 74, 88, -15, 91, -41, -75, -23, 33, -75, -45, 47, 24, -35, -44, 220, 32, -102, 124, 44]
10628D4n3j04J03j3q9K33q6j4p6P6K9j08N4j11l6K98q3j2j63J22j08J47N3j43
10652d0k0n8K87k77K8J10J51k21n8K19r8m3J28k18J91j79K94k27q8Q5J61k58J22
10675imP6m1M1m7p0J10q9m2J9o5P4j5O8J07j88Q8j8k12K34K7n6L55m08J08r0j45
10702a92R8K92j90j3l8J58Lj22j52K58j88K56j16j37K03n7L3j00N2k16O0qJ90
10725G4J5k6K6j05J5M0P3j29J88k45Q9J08j5j04J0O3k4q3j84L13n3q9J58j33j8
10750c6o1L2Jr1J57j72K90j55n2P0j62K40J7p3J7N7j24OO5l9J24m9N2j16J48j91
10776d5J30j23p5J42j8J32lj89J57j45j53J82l3P4pp7p4J21J02j37J31j75M0k4
10800f7M9o2J45m6n3J05J34l38J47J28k18L8J47j85m6N3r3M4J25J62j42j3Q2l8
$$ y = [44, -9, -113, -10, -23, -112, 121, 35, 21, -55, 21, 50, -58, -4, -115, -151, 147, 64, 52, -111, 11, -97, 50, 103, -40, -60, -118, 169, -108, -80, 30, 181, -40, -98, 121, 23, -20, 108, -110, 81, -98, 196, -31, -119, -34, 127, -131, -9, -13, 63, 22, 63, 16, -54, 56, -33, -75, -56, -121, -47, -62, 6, 113, -75, 13, -5, -217, 17, 44, -12, 343, -65, 43, -47, -192, -94, 198, 8, -5, -43, 115, 118, -4, -156, 102, -86, 170, 54, -83, 120, 63, 96, -4, 48, -168, -108, -116, 74, 89, 63, 89, -16, -1, 39, 112, -17, 171, -74, 15, 123, 108, 4, 14, 77, 53, -30, -214, 99, 46, -43, 115, -18, -36, -97, -65, -64, -155, 2, -170, 120, -35, -87, -17, -179, 61, 78, 5, 22, 79, -45, -39, 26, -13, 111, 62, 114, -2, 146, -45, 85, -38, -113, 29, 11, 143, 140, -49, 108, -37, -190, -8, -41, 33, 26, -51, -125, -4, 98, -39, 92, -83, -43, -67, -18, -80, 65, 19, -34, 71, 205, -133, 14, 142, -76, -38, 109, -76, -122, -69, -162, -118, 7, 169, 27, 14, 96, 58]
10824E8m0n8k2J24p3q8J49J31p6j74L2L1L2P8J38j43j40J44j18o0J6JJ96Mo0Q3
10850A65j27N1m4p5l6K7k5n1J43k67Q4J40q3l8J73ll6p6kK42l7j69J7K8k8R0k5
10877C8N6Ll8Ljj95K40J51k28K4l1K2O6k01R3O3O2j55J9j14J47n1J08k55K03M1
10903G0j32O6j85J58RR2l0j87mK41j53k9O1J59q9j88J26N3j54J54pq9N2O7n5l7
10929c1M5j10J76L5l13K71l13J82J14J45l28J97k6R1j21j19J78j02k1j39K21j37
10951a05K44m0l7j83J85j94m8J25Q0q0J83L5j05j12J2J73j07M5n0L4j45J52o2
10974@j12l5L88k47P0l9l7j2J71j64l8K46j52q6K50j57j43N6J55j75J45j49J08
10997D3j40j70K98j79J56pK4L7j4L6p3j22n6J79p1Q2M4k75K58r9M3m6J36l9j66
$$ y = [58, 18, -40, -62, 62, -11, -99, 50, 181, 105, -69, -37, -6, 26, 104, 242, 99, -41, 103, -15, -75, -59, -58, 138, 142, 82, 165, 38, 89, 45, -30, -66, -39, -64, -115, 28, -239, -155, -15, -98, -136, 37, 34, -2, -78, -80, 162, 125, -44, -27, 1, -27, 63, 38, 94, 97, 59, 62, 61, -134, 106, 257, 29, 53, 22, 44, 110, -91, 2, 65, 127, -28, -9, -123, 24, -27, 81, -174, 29, 70, -62, 4, -181, -23, -14, 78, 48, -139, -143, 98, -55, -84, -23, 136, 47, -141, -15, 38, -116, 38, 31, -58, -6, 61, 6, -31, 14, -96, 80, 115, -198, 73, -240, -58, 56, 201, -127, 70, 44, 135, 14, -105, 73, -29, -50, -189, 32, -105, 139, 99, 62, -121, 64, -130, -178, -53, 27, -53, 130, 165, 60, -52, -40, 133, 26, 71, 21, 55, -90, 62, 0, -112, -147, 241, -6, 64, 25, -12, -24, 147, -17, -55, 191, 39, -47, 203, 46, -97, -41, 114, -61, 84, -65, 43, -97, -267, 31, -148, 8, 1, 25, 62, 48, 84, 11, -111, -167, 12, -59, 23, 67, -208, 50, -49, -6, -52, 84, 45, -121]
11022a21J83j63k8J33k8k0J1M8O7m7N9j42j6n2J20j73K01j8J13j46l5p2L0oJ63
11047F1j73K27j12k7J82r5o3Q3N1k09%j29K34n2L6n5j27J28O5N0j62K96k35K3
11071cM0J08o4j54n1J86j23J80Qq8j47J93j14J39j7j21j6J4J9k8L7O3k58J40j54
11096b11K19k6J7RRP5j77J15K2O2j28M4M2k40J37j8j7J0J4n3J26j04j0J95j66
11121e4Qk5Q4m6P5j0j23J08q1j02K15P6j05N3p7J43L2l14N6q4K14P6q5j04o6N4
11147h2Q6O5k37K34p8j40J56l1Q3J7%r2n7M4m4L7j66J69Q6J05j57j71L00n6J17
11172A88j41l8q5J57k21LP4J35o3O2j57R7J41k15J89J4K0j30m7N6L6L8k04p6J75
11197HO9j72J1O4M3j04K0J98k48J04j8O8l3J48k92J17K27j34l7K17n7k86O3J77
$$ y = [-121, 62, -101, -129, 4, -24, -44, -33, 15, 82, 35, 94, -48, -64, -116, 4, -169, 32, 14, 127, -19, -54, -126, -96, -102, 61, -112, 115, 3, -24, 158, 63, 0, 83, 134, -75, -75, -204, 30, -22, 14, -41, -168, -40, 25, 75, -87, 209, -26, -3, 37, 145, 81, -73, -124, 62, -61, 119, 127, 39, -108, 85, -29, 110, 93, -28, -44, -30, -11, -39, -2, 61, -197, -57, -211, 8, -18, -1, 8, 17, 92, -85, 30, 52, 114, -14, 30, 72, -168, -31, -49, -66, -56, -42, -95, 31, -73, -83, 112, -54, -46, -71, 13, -33, 42, 32, -91, 17, -64, -166, 49, 125, 20, 73, -4, 139, 171, -143, -87, -171, 43, 119, 34, -70, -136, -82, 4, 69, -168, 66, -12, -152, 4, -27, 56, 73, 73, -19, -76, -32, -76, -39, -205, -36, 50, 155, -2, -173, 127, 71, 188, 47, 9, -76, 81, -140, -137, -63, 72, 9, 71, -86, 11, 152, -63, 126, 140, 160, 30, -17, 39, 75, 113, -91, -167, 8, 77, -95, -84, -20, 23, -81, -61, 137, -111, -7, -25, 43, 10, 158, -134, -17, 210, 76, 39, 256, 199, -87, -24, 153]
11221A53j06O6R1j85O1j35P2M6j07J19k5J5j4j52Q0k2l4J5Pk1j3o6J91P8K4j72
11247c4M0j2o3Rj8J26K7j76k5K30o3L3j4K0M2k13J86k59J16J21qj84K10j25m7
11272h1Kn5N2j55K38K8n4J66n3j65J47o3N4n6M1j15J07p7j51J51R1j14J68j16
11296a0O7J63k84j3M9K5N7j07J11O4j76J60j7oj90j11J53J48pm6j3L4O8j83QN9
11322CL4j77N7J71j17j2Q1L8Mk02n9J18Ll0J89j50k0J66r7Qj44J23n6N9Q1k1j58
11349a08K12j9r4L2p3J29j89M3K19k6J51k83k19J86lLK9K7J06j59Q2k1q3N4o2
11374f6M5J14k24O8L01k92j01K8J24k7Q6k25J32J61j50N3P6n4J3j05O6K07k25
11397Ej49J23J3n7j3l7O3J62j26qP8r1j1j57K37J69j84o6l1K7L7K7j4J39j71R8
$$ y = [153, 47, 113, 204, 19, 80, -55, 17, 63, -44, 75, 50, 65, 51, -101, -21, -43, -77, -62, -55, -76, -89, -155, 36, 114, 138, -34, 6, -6, -69, -60, -78, 48, 75, -101, -126, 104, 41, 74, 60, 80, 122, -91, 95, -164, -48, 73, 65, -119, 91, -34, -81, -79, -134, -82, -237, 1, 29, -25, 141, 88, -77, 70, 7, 61, 5, 46, -69, 38, -39, -190, -39, 52, -62, 106, -10, 57, 220, -64, -77, -28, -3, 54, -53, 58, 122, -54, 106, 89, 83, -107, -218, -65, 83, 76, 30, 17, 51, 119, -64, -56, 3, 37, -140, -83, 88, -29, -41, 40, 78, 82, -120, -179, -61, -58, -88, 101, -49, -69, 97, 0, 8, -136, -13, -69, -10, 71, 50, -108, 104, 85, -9, 23, -50, 79, -110, -67, 152, 126, 277, -6, -225, -39, -42, -39, -10, 17, 123, -36, 46, 25, -58, -4, -66, -21, 93, -131, -63, 238, -54, -155, -127, -3, -30, 56, -169, -37, 124, -26, 27, 103, 49, 62, -43, 23, 230, 5, -144, -21, -8, -65, -78, -115, -52, 110, -16, -24, 54, -37, -48, -205, 32, 201, 17, -49, -80, -53, -16, 11, -3, 136, -35, 63]
11423F3j35J7p3K33j83O3j17K12L9k12ok4K96k33L5K67k67Q7n6K7j05R9L1p4J09
11448I3k15J38O3m5l3L4J44k41M3n8J27j66J05j05P3j0K5J52j19Q6Ln5j64J72
11472D7O0m9o4r1J03n4j24J72L5NL0j16j7M8NJ2k7J32j92P3j11K07O4j80J15q1
11498BO0j37J71j13k0L1j49K38k60J11R9K8q8N9N2k03K51j57P4k9L0j47J2N3r8
11523a30k3R3J32j23q7M7OK19l38J60k6K3P5M9r5Q1kn1R7n7n9j53K21r5Q6q1j6
11550d7k5L7q0O8N1k7j32K16N7J7n2n3J26o3r9o7J48j40J53lk05MK53j78J2N2
11576B3P9o6J46k36n1J35j48K2l1J13l9j29J68R6k44J45n7m3O6J26q0J65j56L1
11600C5r3P9k8j33J42R7k37J82q8M3J3J47j41r0J78O0k87O7p6O7p1J11J72m0j42
$$ y = [63, -72, -55, -128, 105, -78, -15, -132, 80, 119, -93, -99, -123, 173, -60, -25, 242, -25, 62, 6, 33, -72, 27, 58, -16, 93, -122, 16, 79, 34, 1, 35, 179, -62, -19, -77, 50, -116, -11, -116, -43, -53, -28, 124, 5, 91, 94, 39, -125, 47, 107, 58, -6, -97, 6, -48, -172, 0, 35, 40, 70, -46, -63, -15, -10, 2, -25, 107, -85, -12, -123, 84, 148, -32, 83, 2, 62, -75, 96, -17, -37, -6, -155, 83, -177, -66, 33, 61, -27, 32, 84, -119, 132, -25, 49, 20, 50, -97, -85, -32, -130, -153, -60, 72, -51, -138, -91, -85, 134, -204, -44, -70, -47, 28, 77, -18, 63, 61, 10, 107, 50, -9, -162, 59, -36, 50, -31, -47, -72, -35, -115, -47, 4, -23, -155, 61, 118, 135, 83, 30, 156, 93, -6, -73, 75, -65, 88, 85, -120, -116, 137, -41, -29, 23, 102, 36, 182, -54, -105, 30, -118, -96, -127, -14, -53, -182, -14, 82, -162, -17, -74, -117, -51, 75, -5, 160, 4, 35, -58, 21, -7, -140, 2, 99, -138, 44, -44, -1, 12, 159, 18, -72, 106, 166, -121, -54, -130, -63, -134, -23, 149, 109, -33]
11625c3m0J25j1L8q1M7ml4m4j42K59j14o9m4N2K01j23J20P1N4j15j55R1K6q2L4
11651B7j9q9j1O1K2K1k2j3J04j60J04j6L6k0J92k38j83J00K21r1R4j22j4J5j21
11676a22J08kk0L0l2P0p7k7K53j78nL1o6K9N7j94J70N1l0o5p8J40j13J0K09p5
11702G4Rn4M2j8K4n5J66l03K3Q3n5J99j57j32J28M9j6j08Q7J21j59J14J37j70
11726B9j23P0K7n0nJ67o3Q7j73J60j27Rp3n0J8K5J93j59N3p8M3Qj38Q9k3Q0J17
11753A13j51J87j24k4p7J12L3j70j01L1J09J1J9k18K15j0L6%kJ92j97O3J2M2j0
11778I1j48J34j04L0n1R2q2k23J15J71j43N2l5J03j27M4N2j19J05J7p3J61J20
11801A82MKk91J06kj1J08k17J09J69j58j44J44L7q9l3J62j70j28P6L10k10o9K7
$$ y = [-33, -73, 52, 41, 79, -2, 45, 41, 7, -37, -179, 80, -34, -103, -147, -95, 106, -17, 103, 174, 228, 113, -42, 49, 75, -7, 27, 8, -81, -92, -31, -9, 12, -10, -23, 81, -79, 25, 9, 45, 25, 217, -21, -204, -104, 117, 26, 120, -2, -16, -1, -122, -14, -16, -36, -6, -38, 32, -45, -72, 181, 3, -2, 29, -37, -8, 49, -145, 25, 76, 46, -19, -97, 43, -70, -60, 149, 74, 83, 29, 71, 53, 77, 22, 188, -115, -92, -9, -64, 135, -22, -154, -26, 23, 7, -101, -14, 107, -52, 62, 199, 29, -94, -24, 3, -47, -52, 115, 52, 139, -34, 126, -1, 8, -65, -115, -97, -72, 121, -38, 15, -63, -20, -12, -150, -61, -84, -4, 113, -38, 149, 25, 1, -76, 36, 69, -101, -202, -171, -62, -51, -32, -250, -35, -45, -9, -9, -11, 181, -16, 47, 59, 101, 91, -57, 77, -27, 3, -48, 44, -38, -261, -146, 25, -118, -66, -101, 2, -125, -81, -29, -148, -43, -26, -99, 62, 182, 186, 188, -103, 3, 1, -10, 98, -119, -10, 159, 1, -143, 1, 38, -51, -84, 78, -92, -220, -144, 166, -44, -113, -86]
11825h6q8K27o9k0J62j71l4L8J3K04j38J8N7j35K9N3j51RP5O2j66J87n7n0K17
11850A86q5j0j10K2J06j11j53K60r4M9j59J13P3n3J00j48L0NJ29j4j52m7J31p1
11874cJ09j69J21k9M3J8j79K31p3r5OK2o5J43j05N7n5R2n6j22J37O4j74k3K64
11899A59k23M3Mn8J64k2j73J16j11k9L40p3r0k03J95j73J29m0J44k5j38j00J86
11922B2o4J35o3m8NL9J04o0j35p0J42j13K50j31L5j27n8k9J42J42k6lk16K71p6
11947F8k33M7O7P1k10P2J94j56Q1M9L8oM5k25r5L17r0L1Q8j63J30k33J71j98N5
11972h5K7J87q4m7J05o5n2R8j9N5j14j13J27Q8j79J11j64J79r8n4K3J9N0j8M0
11997A7k27J04J42L6j47rJ17M8M3o8j81R4J9N4k8K7p2J14j18L8lO3o5L5Q8m7J
$$ y = [-86, -174, 53, -16, -36, 126, -45, -79, -41, -28, 176, 38, 56, 113, -22, 7, 60, -91, -82, -7, 55, -111, 76, 19, -31, 186, 101, 91, -19, 3, 109, -2, -155, 105, 11, 60, -99, 14, 87, 34, 134, -14, 16, 21, 150, 136, -16, -63, 68, -3, 106, -63, 58, 29, 72, 90, -89, 142, 69, -26, -20, 2, -63, 80, -25, 32, -23, 69, 13, -109, 28, 92, -82, -105, 159, -64, -21, -17, -75, 89, 67, -106, 10, -101, -130, 210, 137, 47, -156, 39, -134, -5, -45, 99, 74, -64, -164, 22, -42, 93, 30, -18, -13, 26, 130, 70, -65, -135, 7, -106, 144, 13, 48, -79, -137, -166, -24, 118, 92, 89, -127, 144, 68, -165, -118, -51, 20, -190, -118, 76, -80, 1, 50, 88, 82, 127, -98, -193, 124, 34, 65, 153, -10, 120, -113, 58, -140, -85, -58, 129, 45, -2, 103, 38, -14, 84, 65, 120, 6, -107, 20, 108, -71, 40, -124, 55, -43, -97, -74, -55, -5, -23, 17, -210, -106, 36, 72, -75, -84, 33, 81, 124, 56, -125, -31, -12, 42, 14, 41, -31, 83, -35, 3, 0, 63, -2, 33, 121, 74, 75]
12024G5j12Rl2J77j08j33N6R9J45r7j68L5j0j77J76P5j2j60RJ75J66k82K0O6j01
12049a09J80j23oJ9K8r6J75o9J87j96J8p2m9j7Q2M4pJ06k06J06j30R3K73k45Q5
12074G1n9J9k2j46J44k0n4j15K02j84J36o8J2Q9Q4Nj30r1K10k50J62J7j12J1J28
12099C9n3L3Ml8p2N7J81j75M4n1n9M0m9K4K9L4l7j3J1Q4Pj23K4Q0q8R4j54K88
12127A61j30P2k9J0r8k06K64j22R1q7O8Q4j21J26L2q8p9L3J24l5j35J38j93m3
12151a63J81n3J25k49K59J24J1l03j03R2R9N0l4K4j73OJ91n1J22j30j09K25k3
12174A18J1o2L9p8r6n9N3K07j38l0K3J8l5Qj73K45q2O2o8O0j73PL37l04R1J9Q
12201Hj23O4J34o2j36K32j74J81o0j07R5L8j16J8J58n5r8M0nN4j31J41j75n1K8
$$ y = [75, -37, -28, -60, 117, 9, -124, -68, 31, 176, 79, -89, -54, -64, -241, -65, 10, -2, -162, -153, 22, 188, -94, -74, -8, -109, 71, -52, -58, -39, -11, -107, 68, -1, 186, -10, 8, -64, -113, -130, -48, -4, -11, 95, -111, -5, -135, -42, 231, -14, 71, 12, 31, 9, -137, 7, -13, -67, -182, 20, -164, -28, -96, -84, 5, 89, 94, -36, -127, 83, -167, -5, 12, -100, -89, 39, -14, 19, 23, -15, -87, -30, 151, -24, 20, -31, -90, -50, -99, -75, -46, -12, -49, -62, -51, 33, 40, -83, -59, 21, -67, 27, -127, 161, 31, 103, 74, 84, -14, -220, 44, -78, 13, -74, -6, 78, -43, 83, 115, 27, -52, -19, 105, 70, -65, 73, -120, -163, 18, -35, 90, -159, 100, 224, 235, -68, -171, -79, 20, 70, 36, 60, -113, -107, 84, 33, 155, 25, -84, 141, 118, 129, 67, 106, 28, -68, -127, -74, 133, -5, -35, -12, 6, -29, -21, -194, 51, -31, 31, -37, 23, -150, -143, 194, -110, -19, 0, 8, -115, -51, 83, 21, -115, 117, -57, 124, 64, -43, 52, 90, -26, -8, 150, 95, -3, 37, 32, 86, -45, 96, -79, -130, -102]
12226a02K44j31K6o8Q9l9j58L7M9J28j03k8J46o4J4j50J84j54J47j27Q9n1j6R4
12250E6K8n1q8J06j20J8J29j98J37Q1j45O1p3J69j32q7J14j0mm6k1J36kj67K49
12275A40j71pm6l2J13J41n5j7j90J20k8O8p1P2P9r0j6q7K29j14j56J60K08l69
12299a19J19o8lK23o3j43R4Qpj77J96j35K0J96Lj94j01J65qm4O6p1PJ37j37j05
12325a41J02n3K53j12Jj45J76j17L9L3k98M30j21L3j9n7J03j89J28R3j51k03K10
12348ej03J06N3j05r5J81J19k32Q1Q3r4J06J08k70K03j16r4J73k2j32N1p3JJ33
12372E7j84K60j62K21n5Op6j14N2o4J05n3j78K03k7p9L7M0J01j47j24L27k42J29
12396C3%P0j53j6J93r5k5r3J52j25J26j3n2O0k66K62j20K07q0l1J38j64J7pk2
$$ y = [-102, 142, 11, 37, -31, 58, 19, -139, -102, -53, 75, -28, -56, 90, 26, 40, -110, 74, -80, 67, -60, 29, -22, -38, 56, 84, 33, -55, 51, -69, -51, 78, -120, 17, 98, -47, 14, -59, 110, -22, -109, 5, -5, -9, -55, -76, 60, 58, -109, 140, -31, -38, -84, -116, -3, 138, 83, 66, -124, -4, -32, 36, -35, 37, 116, 26, 10, -77, 152, 38, -118, 42, 250, -119, 0, -68, -71, 152, 89, -54, 40, 48, 41, -136, 60, -75, -55, 141, 144, -50, -151, 14, 6, -38, 28, -43, -36, 101, -36, -141, -39, -92, 161, 49, 50, -95, 81, -36, 3, 36, -262, 168, 47, 80, 61, 4, 107, -82, 46, 139, -12, -215, -5, -108, -2, 51, -54, -149, 32, 151, -81, 0, 83, -11, 95, 203, -67, 136, 20, -74, 99, 77, -55, -4, -77, -76, 57, -127, 133, -29, 192, 137, 143, 67, -47, 5, -59, 46, -7, -185, 18, -9, -88, -51, -11, 90, -57, -181, 146, -96, 33, 33, 103, -50, -66, 127, 32, 7, -86, 66, -59, 67, 54, 2, 62, -204, 58, -62, 145, 65, 34, 172, 8, 25, 18, -4]
12421dq7O8J22p9J37k29J02K5L0lm6qq6J47j59k4M6J09k89J38M2J19m0j3pO4n3
12448B2J33j90J32p6j13Q9J10j29J29j08P4j08R7j44K85j24p2Q1p3j42j6K81j18
$$ y = [-4, -91, -23, 99, 20, 157, -72, 30, 55, 85, 82, 36, 28, -58, 89, -70, -94, -48, 61, -228, -90, -48, 71, 31, 18, 11, 75, 22, 155, -35, 97, 21, -92, -3, 107, -22, 107, -1, 73, -35, 62, -82, 203, 79, 7, 88, 15, -127, -143, 138, 20]
$$ [...]
16383a5
##END NTUPLES=NMR FID
##END=
