##TITLE=abcd
##JCAMPDX= 6.0         $$ Bruker NMR JCAMP-DX V2.0
##DATA TYPE= NMR FID
##DATA CLASS= NTUPLES
##ORIGIN= UXNMR, Bruker Analytische Messtechnik GmbH
##OWNER= root
$$ XWIN-NMR		Version 3.5
$$ Sun Jul 13 15:01:56 2025 Russian Standard Time (UT+4h)  servis@DPX200
##.OBSERVE FREQUENCY= 200.131235884673
##.OBSERVE NUCLEUS= ^1H
##.DELAY= (6, 6)
##.ACQUISITION MODE= SIMULTANEOUS
##.ACQUISITION SCHEME= undefined
##.AVERAGES= 32
##.DIGITISER RES= 18
##SPECTROMETER/DATA SYSTEM= spect
##.PULSE SEQUENCE= zg
##.SOLVENT NAME= CDCl3
##.SHIFT REFERENCE= (INTERNAL, CDCl3, 0, 16.5164)
##AUDIT TRAIL= $$ (NUMBER, WHEN, WHO, WHERE, WHAT)
$$ ##TITLE= Audit trail, XWIN-NMR		Version 3.5
$$ ##JCAMPDX= 5.01
$$ ##ORIGIN= Bruker BioSpin GmbH
$$ ##OWNER= servis
$$ F:\spectra/data/av/nmr/H1/1/audita.txt
$$ ##AUDIT TRAIL=  $$ (NUMBER, WHEN, WHO, WHERE, WHAT)
(   1,<2025-07-13 14:59:34.96 +0400>,<servis>,<DPX200>,
      <created by zg, POWCHK disabled, PULCHK disabled
       configuration hash MD5:
       00 E9 B6 7A A2 85 ED C7 34 08 36 98 17 FE 4E 26
       data hash MD5: 32K
       96 23 FC CA 74 24 B8 7C E1 A7 EF A1 24 F3 3B 54>)
$$ ##END=
$$ 
$$ hash MD5
$$ 45 DF 62 9C E6 0B 33 34 02 6A 8B 41 15 64 69 E3
##$RELAX= 
##$RELAX= 
##$RELAX= 
##$RELAX= 
##$RELAX= 
##$RELAX= 
##$RELAX= 
##$RELAX= 
$$ Bruker specific parameters
$$ --------------------------
##$DU= <F:\spectra>
##$EXPNO= 1
##$NAME= <H1>
##$PROCNO= 1
##$TYPE= <nmr>
##$USER= <av>
##$AMP= (0..31)
100 100 100 100 100 100 100 100 100 100 100 100 100 100 100 100 100 100 
100 100 100 100 100 100 100 100 100 100 100 100 100 100 
##$AQSEQ= 0
##$AQ_mod= 1
##$AUNM= <au_zg>
##$AUTOPOS= <>
##$BF1= 200.13
##$BF2= 200.13
##$BF3= 200.13
##$BF4= 200.13
##$BF5= 500.13
##$BF6= 500.13
##$BF7= 500.13
##$BF8= 500.13
##$BYTORDA= 1
##$CFDGTYP= 0
##$CFRGTYP= 5
##$CHEMSTR= <none>
##$CNST= (0..31)
1 1 145 1 1 1 1 1 1 1 1 1 1 1 1 1 1 1 1 1 1 1 1 1 1 1 1 1 1 1 1 1 
##$CPDPRG= <>
##$CPDPRG1= <>
##$CPDPRG2= <>
##$CPDPRG3= <>
##$CPDPRG4= <mlev>
##$CPDPRG5= <mlev>
##$CPDPRG6= <mlev>
##$CPDPRG7= <mlev>
##$CPDPRG8= <mlev>
##$CPDPRGB= <>
##$CPDPRGT= <>
##$D= (0..31)
0 2 0 0 0 0 0 0 0 0.06 0 0 0 0 0 0 0.0002 0 0 0 0 0 0 0 0 0 0 0 0 0 0 
0 
##$DATE= 1752404374
##$DBL= (0..7)
120 120 120 120 120 120 120 120 
##$DBP= (0..7)
150 150 150 150 150 150 150 150 
##$DBP07= 0
##$DBPNAM0= <>
##$DBPNAM1= <>
##$DBPNAM2= <>
##$DBPNAM3= <>
##$DBPNAM4= <>
##$DBPNAM5= <>
##$DBPNAM6= <>
##$DBPNAM7= <>
##$DBPOAL= (0..7)
0.5 0.5 0.5 0.5 0.5 0.5 0.5 0.5 
##$DBPOFFS= (0..7)
0 0 0 0 0 0 0 0 
##$DE= 6
##$DECBNUC= <off>
##$DECIM= 32
##$DECNUC= <off>
##$DECSTAT= 4
##$DIGMOD= 1
##$DIGTYP= 9
##$DL= (0..7)
0 120 120 120 120 120 120 120 
##$DP= (0..7)
150 150 150 150 150 150 150 150 
##$DP07= 0
##$DPNAME0= <>
##$DPNAME1= <>
##$DPNAME2= <>
##$DPNAME3= <>
##$DPNAME4= <>
##$DPNAME5= <>
##$DPNAME6= <>
##$DPNAME7= <>
##$DPOAL= (0..7)
0.5 0.5 0.5 0.5 0.5 0.5 0.5 0.5 
##$DPOFFS= (0..7)
0 0 0 0 0 0 0 0 
##$DQDMODE= 0
##$DR= 18
##$DS= 0
##$DSLIST= <SSSSSSSSSSSSSSS>
##$DSPFIRM= 0
$$ [...]
##$SUBNAM0= <"">
##$SUBNAM1= <"">
##$SUBNAM2= <"">
##$SUBNAM3= <"">
##$SUBNAM4= <"">
##$SUBNAM5= <"">
##$SUBNAM6= <"">
##$SUBNAM7= <"">
##$SUBNAM8= <"">
##$SUBNAM9= <"">
##$SW= 20.6817932712277
##$SWIBOX= (0..15)
0 0 3 0 0 0 0 0 0 0 0 0 0 0 0 0 
##$SW_h= 4139.07284768212
##$TD= 32768
##$TD0= 1
##$TE= 0
##$TE2= 300
##$TE3= 300
##$TEG= 300
##$TL= (0..7)
0 120 120 120 120 120 120 120 
##$TP= (0..7)
150 150 150 150 150 150 150 150 
##$TP07= 0
##$TPNAME0= <>
##$TPNAME1= <>
##$TPNAME2= <>
##$TPNAME3= <>
##$TPNAME4= <>
##$TPNAME5= <>
##$TPNAME6= <>
##$TPNAME7= <>
##$TPOAL= (0..7)
0.5 0.5 0.5 0.5 0.5 0.5 0.5 0.5 
##$TPOFFS= (0..7)
0 0 0 0 0 0 0 0 
##$TUNHIN= 0
##$TUNHOUT= 0
##$TUNXOUT= 0
##$USERA1= <user>
##$USERA2= <user>
##$USERA3= <user>
##$USERA4= <user>
##$USERA5= <user>
##$V9= 5
##$VALIST= <valist>
##$VCLIST= <CCCCCCCCCCCCCCC>
##$VD= 0
##$VDLIST= <DDDDDDDDDDDDDDD>
##$VPLIST= <PPPPPPPPPPPPPPP>
##$VTLIST= <TTTTTTTTTTTTTTT>
##$WBST= 1024
##$WBSW= 30
##$XGAIN= (0..3)
0 0 0 0 
##$XL= 0
##$YL= 0
##$YMAX_a= 899133
##$YMIN_a= -623484
##$ZGOPTNS= <>
##$ZL1= 120
##$ZL2= 120
##$ZL3= 120
##$ZL4= 120
##$ABSF1= 10
##$ABSF2= 0
##$ABSG= 5
##$ABSL= 3
##$ALPHA= 0
##$AQORDER= 0
##$ASSFAC= 0
##$ASSFACI= 0
##$ASSFACX= 0
##$ASSWID= 0
##$AUNMP= <proc_1d>
##$AZFE= 0.1
##$AZFW= 0.1
##$BCFW= 1
##$BC_mod= 2
##$BYTORDP= 0
##$COROFFS= 0
##$CY= 19
##$DATMOD= 1
##$DC= 2
##$DFILT= <>
##$DTYPP= 0
##$F1P= 11.0000007629395
##$F2P= -0.999999237060547
##$FCOR= 0.5
##$FTSIZE= 0
##$FT_mod= 4
##$GAMMA= 1
##$GB= 1
##$INTBC= 1
##$INTSCL= 1
##$ISEN= 128
##$LB= 0.05
##$LEV0= 0
##$LPBIN= 0
##$MAXI= 10000
##$MC2= 0
##$MEAN= 0
##$ME_mod= 0
##$MI= 0
##$NCOEF= 0
##$NC_proc= 0
##$NLEV= 6
##$NOISF1= 0
##$NOISF2= 0
##$NSP= 1
##$NTH_PI= 0
##$NZP= 0
##$OFFSET= 16.51637
##$PC= 1
##$PHC0= -263.5186
##$PHC1= -9.498461
##$PH_mod= 0
##$PKNL= yes
##$PPARMOD= 0
##$PSCAL= 4
##$PSIGN= 0
##$REVERSE= no
##$SF= 200.13
##$SI= 16384
##$SIGF1= 0
##$SIGF2= 0
##$SINO= 400
##$SIOLD= 16384
##$SREGLST= <1H.CDCl3>
##$SSB= 0
##$STSI= 0
##$STSR= 0
##$SW_p= 4139.07284768211
##$SYMM= 0
##$S_DEV= 0
##$TDeff= 0
##$TDoff= 0
##$TI= <>
##$TILT= no
##$TM1= 0
##$TM2= 0
##$TOPLEV= 0
##$USERP1= <user>
##$USERP2= <user>
##$USERP3= <user>
##$USERP4= <user>
##$USERP5= <user>
##$WDW= 1
##$XDIM= 8192
##$YMAX_p= 0
##$YMIN_p= 0
$$ End of Bruker specific parameters
$$ ---------------------------------
##NTUPLES= NMR FID
##VAR_NAME=  TIME,          FID/REAL,        FID/IMAG
##SYMBOL=    X,             R,               I
##VAR_TYPE=  INDEPENDENT,   DEPENDENT,       DEPENDENT
##VAR_FORM=  AFFN,          ASDF,            ASDF
##VAR_DIM=   16384,         16384,           16384
##UNITS=     SECONDS,       ARBITRARY UNITS, ARBITRARY UNITS
##FACTOR=    0.0002416,     1,               1
##FIRST=     0,             0,               0
##LAST=      3.9581328,     0,               0
##MIN=       0,             -623484,         0
##MAX=       3.9581328,     899133,          0
$$ Real data points
##PAGE= N=1
##DATA TABLE= (X++(R..R)), XYDATA
$$ [...]
$$ plain form
9835 6 -215 90 122 92 120 323 -8 -8 -4 -45 78 52 -67 -187 -35 -149 -18 245 155 37 164 -45 -101 -161 109
9860 109 -194 134 48 262 -110 -102 108 -122 241 126 -3 -229 -35 52 -98 46 85 -40 -23 15 -101 -160 -111
9883 -111 90 -101 92 223 -83 76 29 173 -160 159 -99 -104 212 -192 -145 -37 222 -71 190 146 74 -89
9905 -89 -121 95 -19 54 37 -114 113 69 69 272 214 -92 14 58 49 45 43 33 151 115 -120 82 225 10 86 42
9931 42 120 -64 -170 -36 184 -38 -7 169 177 -85 -94 15 91 -203 -145 194 -104 149 51 -34 62 -76 0 -114
9955 -114 -4 15 -47 -146 -108 432 -84 13 110 111 -17 -235 -177 68 147 -133 19 271 39 -146 196 16 247
9978 247 -66 -62 -25 64 406 87 -317 9 140 -122 -225 206 145 170 102 -87 116 -27 44 22 188 134 186 -101
10002 -101 -26 -99 -188 -65 -316 291 -112 -145 163 7 82 -175 149 -33 -21 15 114 198 -156 -78 225 236 80
$$ packed form
9835Fk21L05L2l0K8K03l31%Mm1J23k6j19j20J52j14J31K63r0j18J27k09n6o0K70
9860A09l03L28q6K14l72QK10k30L63j15j29k26J94Q7j50J44L9j25J7L8j16n9M9
9883a11K01j91J93J31l06J59m7J44l33L19k58nL16m04M7J08K59k93K61m4p2j63
9905h9l2K16j14P3j7j51K27m4%K03n8l06J06M4rmkj0J18l6k35K02J43k15P6m4
9931D2P8j84j06J34K20k22L1J76Qk62rJ09P6k94N8L39k98K53r8q5R6j38P6j14
9955a14J10J9o2r9L8N40n16R7R7Jj28k18N8K45P9k80J52K52k32j85L42j80K31
9978B47l13ML7Q9L42l19m04L26J31k62j03M31o1K5o8j89K03j43P1k2J66n4N2k87
10002a01P5p3q9J23k51O07m03l3L08j56P5k57L24j82J2L6R9Q4l54P8L03J1j56
$$ plain form
10025 80 -116 105 264 53 -197 1 145 -215 -87 -128 -31 161 50 0 -221 -59 13 338 124 207 347 -195
10047 -195 103 110 -236 -69 -50 -27 333 -44 -47 100 7 -71 -210 -30 119 -330 -175 195 152 -32 -113 248 126
10070 126 -394 -84 -137 -18 180 -172 -91 85 157 -265 -195 84 68 -37 -109 53 123 74 -166 198 173 -78 -58
10093 -58 -94 -88 47 -210 -108 348 -136 -105 -22 192 -194 194 -174 -238 83 -80 -176 -112 140 155 -181 225 -81
10116 -81 63 -75 117 57 -255 -455 -1 412 123 -36 -134 4 390 -89 -131 -222 -66 -39 -218 -41 210 4
10138 4 -50 -61 49 53 -195 -215 73 146 128 46 209 73 -153 -359 87 -23 -105 42 210 320 137 30 76 186
10162 186 -97 -57 0 162 28 -94 -132 34 144 -121 13 -151 94 4 -179 299 172 256 -145 133 264
10183 264 -6 -244 212 -90 -6 30 -205 120 178 -62 -24 200 -88 -153 -153 -111 151 -212 -81 13 37 -203 -87
$$ packed form
10025H0j96K21J59k11k50J98J44l60J28m1R7J92j11n0k21J62P2L25k14Q3J40n42
10047a95K98Pl46J67J9K3L60l77lJ47r3p8j39J80J49m49J55L70m3j84q1L61j22
10070A26n20L10n3J19J98l52Q1J76P2m22P0K79j6j05p2J62P0m9k40L64k5k51K0
10093e8l6OJ35k57J02M56m84L1Q3K14l86L88l68o4L21j63r6O4K52J5l36M06l06
10116h1J44j38J92o0l12k00M54M13k89j59r8J38L86m79m2r1J56K7j79J77K51k06
10138Dn4j1J10Mk48k0K88P3j8q2J63j36k26k06M46j10q2J47J68J10j83j07M6J10
10162A86k83M0N7J62j34j22l8J66J10k65J34j64K45r0j83M78j27Q4m01K78J31
10183B64k70k38M56l02Q4L6k35L25N8k40L8K24k88o5%M2K62l63J31R4K4k40J16
$$ plain form
10206 -87 -76 298 221 -292 -29 186 -110 -168 -73 100 -307 -120 -312 205 -36 4 -15 104 160 -155 -20 158
10228 158 210 -44 198 144 28 -109 -344 313 46 57 83 -28 -147 -2 53 35 100 166 -141 -114 226 139 -16
10251 -16 -19 6 74 148 79 205 -81 30 -193 -132 -3 40 -181 42 277 88 101 -92 -249 115 123 -194 -84 79
10275 79 -188 -73 -217 -111 -284 0 43 108 -91 -129 -138 118 201 72 -33 88 226 -62 11 -146 -108 61 -143
10298 -143 -9 59 40 207 231 79 -87 30 194 133 86 25 -11 104 43 -14 18 -125 128 203 -131 192 3
10321 3 157 -79 -101 258 168 69 -164 217 145 13 93 82 -6 61 176 144 -31 -24 -42 -20 118 220 291 98 -165
10346 -165 -32 -25 -39 -81 -4 45 -116 102 -97 -112 55 225 -62 -117 -99 -130 169 47 -95 234 82 46 -146
10369 -146 -117 157 -105 -241 214 -5 239 -133 40 179 -105 50 -15 219 52 3 -107 -78 -101 -243 4
$$ packed form
10206h7J1L74p7n13K63K15k96n8R5J73m07J87j92N17k41M0j9J19N6l15J35J78
10228A58N2k54K42n4j16j37k35O57k67J1K6j11j19J45N5j8O5O6l07K7L40q7j55
10251a6lK5O8P4o9J26k86J11k23O1J29M3k21K23K35j89J3j93j57L64Ql17J10J63
10275G9k67J15j44J06j73K84M3O5j99l8rK56Q3j29j05J21J38k88P3j57L8J69k04
10298a43J34O8j9J67K4j52j66J17J64o1m7o1l6J15o1n7L2j43K53P5l34L23j89
10321CJ54k36k2L59r0r9k33L81p2j32Q0j1q8O7J15l2j75Pj8K2J38J02P1j93k63
10346a65J33Pj4m2P7M9j61K18j99j5J67J70k87n5J8l1K99j22j42L29j52l6j92
10369a46K9K74k62j36M55k19K44l72J73J39k84J55o5K34j67m9j10K9k3j42K47
$$ plain form
10390 4 5 8 -31 -131 116 -22 10 -134 -170 36 40 -87 87 -31 -8 -156 -70 -116 -91 197 -24 135 118 8 -25
10415 -25 27 -147 116 -6 -273 113 111 -176 -123 67 112 210 31 106 -26 -162 -210 -42 -56 -162 -158 17 4 -57
10439 -57 -101 -32 -67 7 -154 215 14 -278 -244 -177 38 29 61 286 390 43 -125 -7 -44 -215 -1 -41 47 59
10463 59 15 137 -50 -17 -31 73 257 181 -103 -41 -58 134 -168 -30 -161 81 -2 -99 34 -316 -24 72 -45
10486 -45 65 -34 -170 -101 421 189 -126 84 18 -17 -9 13 22 -144 -99 -81 180 85 31 104 107 -257 198 -50 128
10511 128 -51 -157 -12 -128 -245 -41 -19 134 40 220 67 33 183 111 70 -153 -50 79 69 156 -127 -15
10533 -15 -21 -41 -10 40 91 -63 22 -158 187 -181 -7 128 -62 -40 126 -14 79 -97 261 141 124 51 -72 64
10557 64 -6 -47 -79 -158 -58 43 -160 76 -265 -181 -27 98 -343 223 -65 -6 195 0 -28 97 53 -254 82
$$ packed form
10390DJLl9j00K47j38L2j44l6K06Mj27J74j18K3j48Q6m6K5K88k21J59j7j10l3
10415b5N2j74K63j22k67L86kk87N3J90M5R8j79P5j32j36m8J68j4j06MJ75j3o1
10439e7m4O9l5P4j61L69k01k92L4O7K15rL2K25J04l47j68J18l7j71K14m0Q8J2
10463E9m4J22j87L3j4J04J84p6k84O2j7J92l02J38j31K42q3r7J33l50K92R6j17
10486d5J10r9j36O9N22k32l15K10o6l5QK2Rj66M5J8K61r5n4P3Ll64M55k48J78
10511A28j79j06J45j16j17K04K2J53r4J80j53l4J50p2m1k23J03J29j0Q7k83J12
10533a5ok0L1N0N1j54Q5j80L45l68J74J35j90K2J66j40R3j76L58j20j7p3j23J36
10557F4p0m1l2p9J00J01k03K36l41Q4J54J25m41N66k88N9K01j95k8J25m4l07L36
$$ plain form
10580 82 228 98 126 -136 -120 11 29 -41 -88 204 245 24 -88 283 -42 45 19 7 86 -270 -38 175 59
10603 59 171 96 -88 160 -158 -147 62 -79 2 78 -285 57 76 -150 -177 125 -141 -111 35 54 155 54 -107
10626 -107 -110 -11 119 36 -50 -120 -10 -94 103 35 33 -36 131 30 -102 -15 -161 81 -214 164 -140 -5 -167 -298
10650 -298 -292 60 64 58 -45 -142 234 195 83 157 192 -54 170 -33 -49 7 115 72 141 124 56 218 -4 15 -170
10675 -170 93 -165 151 54 -92 13 -91 3 8 121 29 187 -186 35 106 -25 -7 -219 166 85 -1 -322 98
10698 98 213 -98 148 156 145 77 -103 -224 58 84 18 -169 -226 165 -83 -162 -141 -111 8 1 -34 261 21 -156
10722 -156 55 137 106 -178 -78 85 -18 212 -73 24 220 -259 -77 -95 187 -135 -114 80 -175 43 12 135
10744 135 0 80 -191 38 59 -73 1 14 163 -68 -226 120 -56 69 -68 -159 359 -188 124 337 -37
$$ packed form
10580H2J46j30K8k62J6J31J8p0m7K92M1k21j12L71l25Q7k6j2P9l56K32K13j16
10603E9J12p5j84K48l18J1K09j41Q1P6l63L42J9k26k7L02k66L0J46J9J01j01j61
10626a07lR9J30q3q6p0J10q4J97o8ko9J67j01j32Q7j46K42k95L78l04J35j62j31
10650b98OL52Moj03r7L76l9j12P4L5k46K24k03j6N6J08m3O9j7o8J62k22J9j85
10675a70K63k58L16r7j46J05j04R4NJ13r2J58l73K21P1j31J8k12L85q1q6l21M20
10698I8J15l11K46Qj1o8j80j21K82K6o6j87n7L91k48p9K1L0J19pl5K95k40j77
10722a56K11Q2l1k84J00J63j03K30k85R7J96m79J82j8K82l22K1J94k55K18l1J23
10744A35j35Q0k71K29K1j32P4J3J49k31j58L46j76J25j37r1N18n47L12K13l74
$$ plain form
10765 -37 44 -114 -340 145 111 -21 -60 20 207 -16 -59 18 251 -85 -312 -103 -22 118 -94 -259 17 6 -200
10788 -200 -130 140 128 34 -306 -23 194 71 -15 49 115 -92 -12 -50 269 -77 -275 -267 -138 205 -79 -219 63
10811 63 210 48 -4 142 249 29 -35 -29 41 -50 -60 -112 -125 -128 -95 -54 206 86 -266 -187 166 39 -106 -51 -31
10836 -31 335 123 -31 140 186 43 -164 216 145 137 5 118 123 -82 -332 -192 -120 -29 105 -274 48 83 7
10859 7 159 107 -99 38 -18 71 16 -7 -11 112 -21 199 16 -153 145 -13 -217 43 186 190 -80 -19 72 105
10883 105 -101 27 -46 193 -114 25 -129 102 -207 87 17 7 -9 35 -97 -57 9 -191 -142 129 -96 -43 -101
10906 -101 67 220 -61 -39 23 345 -79 -25 -33 -89 -108 62 187 71 222 -35 49 -211 140 238 -283 51 30
10929 30 251 160 12 147 -119 56 229 10 124 -164 50 292 -210 -70 -28 175 123 -372 -12 71 272
$$ packed form
10765c7Q1j58k26M85l4j32l9Q0J87k23m3P7K33l36k27K09Q1J40k12j65K76j1k06
10788b00P0K70j2r4l40K83K17j23q6O4O6k07Q0l8L19l46j98QJ29L43k84j40K82
10811F3J47j62n2J46J07k20o4OP0r1j0n2j3lL3M1K60j20l52P9L53j27j45N5K0
10836c1L66k12j54J71M6j43k07L80p1qj32J13Nk05k50J40P2R1J34l79L22L5p6
10859GJ52n2k06J37n6Q9n5k3mJ23j33K20j83j69K98j58k04K60J43Mk70O1R1L3
10883A05k06J28p3K39l07J39j54K31l09K94p0j0j6M4j32M0O6k00M9K71k25N3n8
10906a01J68J53k81K2O2L22m24N4qn6j9J70J25j16J51k57Q4k60L51R8n21L34k1
10929C0K21r1j48J35k66J75J73k19J14k88K14K42n02J40M2K03n2m95L60Q3K01
$$ plain form
10950 272 -33 -213 70 -33 64 -69 -50 -65 141 -221 -192 55 78 125 -36 192 138 -37 112 66 63 31 -46 147
10974 147 114 11 -73 132 34 -133 -210 -53 12 68 41 148 56 131 -53 168 155 2 41 77 114 256 -61 -139
10998 -139 -72 160 201 39 39 -196 222 31 -368 202 17 0 -153 186 -100 103 75 58 226 -11 -52 -110 199
11021 199 -7 -198 -4 260 -27 -161 173 130 -74 105 -196 87 -75 -106 124 136 16 -176 37 -204 -21
11042 -21 -107 33 206 -51 128 23 21 -59 -103 -180 -189 3 -128 210 -98 -82 134 -71 124 205 186 21 133 54
11066 54 186 204 22 -63 -21 -30 172 -127 90 -259 -81 17 3 -134 235 -101 -150 8 57 -117 -208 200 -125
11089 -125 -51 -72 49 40 -72 339 125 80 176 61 -70 -12 -94 63 -134 0 16 -33 -118 -17 69 -253 155 -314
11113 -314 -229 176 69 6 56 -218 24 88 16 -4 158 142 134 211 -107 11 6 89 -55 -164 -149 56 -123 105
$$ packed form
10950B72l05j80K83j03R7j33J9j5K06l62K9K47K3M7j61K28n4j75J49m6ll2p7J93
10974A47l3j03q4K05r8j67p7J57O5N6k7J07r2P5j84K21j3j53L9L6L7J42l17p8
10998a39O7K32M1j62%k35M18j91l99N70j85j7j53L39k86K03k8j7J68k37m1n8L09
11021A99k06j91J94K64k87j34L34m3k04J79l01K83j62l1K30J2j20j92K13k41J83
11042b1q6J40J73k57J79j05kq0m4p7rJ92j31L38l08J6K16k05J95Q1j9j65J12p9
11066E4J32J8j82q5M2rK02k99K17l49J78R8j4j37L69l36m9J58M9j74r1M08l25
11089a25P4k1J21rj12M11k14m5R6j15j31N8q2J57j97J34J6m9q5J01Q6l22M08m69
11113c14Q5M05j07o3N0k74K42O4p2k0J62j6qP7l18J18nQ3j44j09J5K05j79K28
$$ plain form
11137 105 -71 -52 62 45 58 -73 67 -95 68 -95 -27 -90 -67 -120 -141 65 160 -199 1 -105 255 122 -132
11160 -132 -113 -2 -145 -51 -50 86 52 112 -38 283 74 -167 -22 134 31 -86 202 -242 -29 -265 145 -22
11182 -22 56 131 90 138 66 -60 -65 -32 78 68 61 140 -29 -102 78 -272 3 376 -204 -195 170 -103 -114 35 45 -1
11208 -1 77 -129 95 -194 -38 64 -82 26 -234 -17 83 -50 238 48 49 117 158 -132 -61 109 -109 -34 164
11231 164 -53 -69 -225 -221 16 20 -69 24 61 193 80 61 125 -125 -239 98 -87 45 38 -17 -100 4 -33 118 13
11256 13 89 45 -118 0 -27 1 79 116 26 -83 93 -9 142 -109 -63 -129 -144 -42 -135 -69 -292 1 39 -7 -146
11281 -146 -34 -159 94 -277 -56 214 -44 229 66 -99 97 -144 -162 138 -90 179 28 -101 172 271
11301 271 39 70 182 -13 -112 16 149 129 98 52 55 0 312 34 -52 -106 153 -79 155 -42 -217 -13 64
$$ packed form
11137A05j76J9J14j7J3j31J40j62J63j63O8o3K3n3k1K06R5l59K00j06L60j33k54
11160a32J9J11j43R4JJ36l4O0j50L21k09k41J45J56j03j17K88m44K13k36M10j67
11182b2P8P5m1M8p2j26nL3J10j0pP9j69p3J80l50K75L73n80RL65k73j1J49J0m6
11208aP8k06K24k89J56J02j46J08k60K17J00j33K88j90JO8M1k90P1J70k18P5J98
11231A64k17j6j56MK37Mq9R3L7J32j13j9O4k50j14L37j85J32pn5q3J04l7J51j05
11256A3P6m4j63J18k7K8P8L7r0j09J76j02J51k51M6o6j5J02r3O6k23K93L8m6j39
11281a46J12j25K53l71K21K70k58K73j63j65J96k41j8L00k28K69j51j29K73R9
11301B71k32L1J12j95r9J28J33k0l1m6Ln5L12k78q6n4K59k32K34j97j75K04P7
$$ plain form
11324 64 52 -407 -24 113 20 -91 18 17 -177 -129 140 26 -56 -93 115 232 -53 -127 -44 54 -189 246 67
11347 67 151 -86 25 -68 40 -63 86 9 117 -82 88 -9 -79 213 -38 26 -121 12 181 -54 -108 -220
11369 -220 256 -96 87 -269 90 85 -234 -197 258 122 -279 236 -156 49 -121 178 -82 -65 -30 -330 30
11390 30 -212 -81 -46 95 271 -57 49 41 144 -25 -87 277 -82 -283 -52 59 139 40 48 69 -86 119 3
11413 3 -101 42 -44 -30 -232 270 25 208 161 -126 -149 -44 84 -69 -185 -22 169 -45 18 100 -2 -290
11435 -290 77 -106 -105 -220 -41 -254 -23 -203 -1 175 -175 3 -69 267 11 -110 57 183 9 -146 191
11456 191 103 -18 -89 -72 -202 -103 79 -120 -38 94 191 -105 -61 58 -73 98 -67 222 243 115 292 134
11478 134 154 -67 -281 -207 243 -20 -92 67 16 -113 -102 -36 -55 -52 227 -198 -37 -176 167 -245 30 17 186
$$ packed form
11324F4j2m59L83J37r3j11J09jj94M8K69j14q2l7K08J17k85p4Q3R8k43M35j79
11347F7Q4k37J11r3J08j03J49p7J08j99J70r7p0K92k51O4j47J33J69k35n4j12
11369b20M76l52J83l56L59nl19L7M55j36m01N15l92K05j70K99k60J7L5l00L60
11390C0k42J31L5J41J76l28J06qJ03j69o2L64l59k01K31J11Q0r9QK1j55K05j16
11413Cj04J43q6J4k02N02k45J83m7k87k3J05J28j53j16J63J91k14O3Q2j02k88
11435b90L67j83Jj15J79k13K31j80K02J76l50J78p2L36k56j21J67J26j74j55L37
11456A91q8j21p1J7j30R9J82j99Q2J32R7k96M4J19j31J71j65K89K1j28J77j58
11478A34K0k21k14P4M50k63p2J59n1j29J1O6j9LK79m25J61j39L43m12K75j3J69
$$ plain form
11501 186 386 158 -11 111 55 233 3 -161 -152 -31 93 -37 -63 116 -36 -17 -113 57 91 19 -135 -94 -29
11524 -29 -64 -22 262 29 247 -264 -1 -68 192 -49 17 94 78 -35 -54 -95 109 -51 -221 34 -11 -43 -242
11547 -242 76 -194 -57 -148 -46 -20 -32 74 94 77 14 -213 -39 165 -124 -59 81 -24 40 -74 -42 183 -173
11570 -173 -39 -175 -215 176 -43 100 191 215 40 14 -7 -10 304 -90 -200 -148 98 -53 58 -91 -209 -119 25
11593 25 -13 171 -60 -161 -136 -65 275 89 -73 133 173 -58 -191 -75 7 -353 3 -78 -75 45 145 -21 325
11616 325 198 -271 -341 56 16 36 55 62 0 58 -126 -227 -3 -29 82 189 -120 -164 -36 42 140 236 -333 73
11640 73 -45 180 62 -140 87 5 69 36 -133 -213 -197 39 -26 -3 -35 -112 -136 122 -2 152 91 107 103 -16 176
11665 176 128 72 -29 48 -138 208 -194 -62 141 92 209 -294 -145 -5 -105 -151 10 187 249 -121 37 126
$$ packed form
11501A86K00k28j69J22n6J78k30j64RJ21J24j30k6J79j52J9r6J70L4p2j54M1O5
11524b9l5M2K84k33K18n11K63o7K60k41O6P7j6j13j9m1K04j60j70K55m5l2j99
11547b42L18k70J37r1J02K6j2J06K0j7o3k27J74K04k89O5J40j05O4j14L2K25l56
11570a73J34j36m0L91k19J43R1K4j75k6k1lL14l94j10N2K46j51J11j49j18R0J44
11593B5l8J84k31j01K5P1L40j86j62K06M0k31j33J16Q2l60L56q1LJ20J00j66L46
11616C25j27m69p0L97m0K0J9Po2N8j84j01K24k6J11J07l09m4J28P8R8R6n69M06
11640G3j18K25j18k02K27q2O4l3j69q0J6K36o5K3l2p7k4K58j24J54o1J6mj19J92
11665A76m8n6j01P7j86L46m02J32K03m9J17n03J49J40j00m6J61J77O2l70J58Q9
$$ plain form
11687 126 -111 3 4 -15 6 -185 -48 299 103 56 -42 -74 -113 9 -114 102 -101 104 -86 126 125 -96 75
11710 75 -162 -103 -146 -12 -218 101 199 -213 -122 158 -5 -60 -99 47 77 120 165 -208 -19 66 -109 -68 -10 -69
11734 -69 -176 -105 -202 -29 15 99 -50 -116 -94 -301 -125 -63 -159 -100 43 -89 153 67 -194 -31 183 -62 96
11757 96 124 -40 -297 208 -28 -225 241 101 -67 -260 113 -205 53 -39 -85 -25 -186 26 -213 4 -37 -76
11779 -76 84 31 -2 -124 120 -4 -95 -278 62 -35 -50 -93 20 -108 228 153 143 99 91 208 150 -38 59 122 -68
11804 -68 -66 -184 -89 102 97 -192 290 162 162 31 -132 38 52 -31 -9 -6 47 -128 -268 -234 351 17 84 178 138 117
11830 117 -151 152 -71 -78 -338 -69 -171 -286 288 29 -67 -46 -36 -46 -152 -72 -36 189 23 -6 13 106 -43
11853 -43 230 -26 -2 20 -33 272 -196 33 24 287 -128 -168 208 27 102 -157 -110 -73 -99 -199 -133 0 -97 83
$$ packed form
11687A26k37J14Jj9K1j91J37L47j96m7r8l2l9J22j23K16k03K05j90K12jk21J71
11710G5k37N9m3J34k06L19R8m12R1K80j63n5l9J46L0M3M5l73J89Q5j75M1N8n9
11734f9j07P1r7J73M4Q4j49o6K2k07J76O2r6N9J43j32K42q6k61J63K14k45J58
11757I6K8j64k57N05k36j97M66j40j68j93L73l18K58r2m6O0j61K12k39K17m1l9
11779g6J60n3l3j22K44j24r1j83L40r7j5m3J13j28L36p5j0m4qJ17n8j88R7O3j90
11804f8Kj18R5J91nk89M82j28%j31j63J70J4q3K2LN3j75j40L4N85l34O7R4m0k1
11830A17k68L03k23pk60K69j02j15N74k59r6K1J0j0j06Q0L6K25j66k9J9R3j49
11853d3K73k56K4K2n3L05m68K29rK63m15m0L76j81P5k59M7L7k6j00O6J33r7J80
$$ plain form
11877 83 5 -93 16 -103 260 -38 -56 59 138 177 -2 -35 -39 -74 183 -65 -35 -193 -22 -81 -45 -84 183 146 235
11902 235 -108 32 -119 -289 -16 -151 -184 310 -33 -146 23 120 -54 -137 78 -300 107 -60 -119 39 194
11923 194 -69 -116 -256 -94 68 -116 264 103 53 21 17 -12 -14 38 22 -32 -266 236 -59 -146 116 -112 -115 -64 104
11948 104 -1 -92 -155 65 85 46 109 -131 -164 70 83 -34 -110 -98 -138 74 73 87 -15 -39 14 104 -52 -162 -23
11973 -23 -20 -224 -131 -31 66 116 -222 162 77 -179 -192 77 120 246 64 -239 57 -245 -48 -113 23 -82 -113
11996 -113 190 -281 271 -25 87 112 280 -174 -23 92 37 141 115 66 -73 -106 -133 -102 23 -12 -10 51 118 73
12020 73 -11 6 -243 235 -58 -205 -49 -39 -17 263 -123 -12 -39 -80 170 -31 67 39 24 19 -109 -8 -122 -52
12044 -52 -124 85 -52 27 79 0 -186 36 214 -122 -32 161 -8 31 -116 -78 105 -97 60 13 131 -68 85
$$ packed form
11877H3p8r8J09j19L63k98j8J15P9L9j79l3ml5K57k48L0j58J71n9L6l9K67l7Q9
11902B35l43J40j51j70K73j35l3M94l43j13J69R7j74q3K15l78M07j67n9J58J55
11923A94k63m7j40J62J62j84L80j61n0l2mk9kN2j6n4k34N02k95q7K62k28lN1J68
11948A04j05r1o3K20K0l9O3k40l3K34J3j17p6J2m0K12jJ4j02k4N3R0j56j10J39
11973b3Lk04R3J00R7N0l38L84q5k56j3K69M3J26j82l03K96l02J97o5J36j05l1
11996a13L03m71N52k96J12K5J68m54J51J15n5J04k6m9j39l3k7L1J25l5KO1O7m5
12020G3q4J7k49M78k93j47J56J0K2K80l86J11k7m1K50k01R8k8j5nj28J01j14P0
12044e2p2K09j37P9N2p9j86K22J78l36R0J93j69L9j47L8J83k02J57m7J18j99J53
$$ plain form
12067 85 24 -133 36 28 -76 -55 42 -47 48 121 68 -180 -96 44 67 100 53 -162 -24 313 95 -170 96 100 66
12092 66 37 168 105 -216 -148 37 125 -40 0 80 114 185 103 43 206 175 62 63 204 125 -128 -159 33 38 159 -35
12118 -35 51 -219 76 -272 -82 -161 55 -57 43 135 264 -98 232 -154 39 -47 -84 -152 -97 -150 89 139 139 185
12142 185 -30 -158 -90 152 -31 83 -51 -166 -73 -15 158 -64 143 5 -135 -15 -79 174 -395 31 -26
12163 -26 190 172 231 -49 45 93 105 209 -66 -171 172 -24 51 5 248 57 -140 -55 -22 -63 -10 230 -64 194
12187 194 -271 40 49 28 122 164 -76 20 152 -75 -77 -129 -4 54 -95 148 105 -34 98 -144 85 18 94 -44
12211 -44 -63 37 -165 -40 292 186 -203 -48 430 45 2 -230 261 -134 41 -132 -22 45 -93 -75 108
12232 108 -61 -45 82 119 171 134 167 104 63 -230 -110 -68 147 135 -8 33 108 309 -186 -1 -55 133 -112 -166
$$ packed form
12067H5o1j57J69qj04K1R7q9R5P3n3k48Q4J40K3L3m7k15J38L37k18k65K66Ml4
12092F6k9J31o3l21O8J85Q8j65M0Q0L4P1q2o0J63l1j13JJ41p9k53l1J92NJ21j94
12118c5Q6k70K95l48J90p9K16j12J00R2J29l62L30l86J93q6l7o8N5n3K39N0%M6
12142A85k15j28O8K42j83J14j34j15R3N8J73k22K07j38j40J20o4K53n69M26n7
12163b6K16j8N9k80R4M8J2J04k75j05L43j96P5m6K43j91j97Q5L3m1N3K40k94K58
12187A94m65L11Rk1R4M2k40R6J32k27kn2J25N8j49K43m3j39J32k42K29o7P6j38
12211d4j9J00k02J25L32j06l89J55M78l85m3k32M91l95J75j73J10O7j38J8J83
12232A08j69J6J27L7N2l7L3o3m1k93J20M2K15j2j43M1P5K01m95J85n4J88k45n4
$$ plain form
12256 -166 73 192 160 -30 220 -142 -351 16 -1 103 -68 -83 36 -115 129 74 -16 -151 -93 96 210 -26
12278 -26 -71 -20 27 -101 146 -161 73 174 -89 -96 -64 -27 104 254 -361 153 178 78 -34 -143 222 -126 -11
12301 -11 -174 309 -220 -55 32 109 -41 -85 35 -12 177 66 36 94 -31 92 24 25 21 -97 -228 185 197 -19
12325 -19 -131 6 -81 -130 -90 -163 142 -26 84 136 -31 79 116 -25 -37 113 -52 45 6 266 38 -27 12 -54
12349 -54 289 -204 -242 -409 7 176 73 -86 94 91 27 60 -20 133 259 -275 -24 89 87 -43 60 228 -58
12372 -58 57 -102 180 -71 77 172 -21 212 -35 103 -11 55 -47 16 10 -352 85 16 -5 -1 -37 90 308
12395 308 -76 0 -221 137 -179 -75 66 44 57 40 -72 15 91 -126 -130 30 74 -20 59 -32 -150 -201 10 247
12419 247 119 71 -205 -1 -1 -112 -223 -22 39 -2 -111 -188 99 -12 67 140 176 -154 -226 25 -139 70 -100
$$ packed form
12256a66K39J19l2j90K50l62k09L67j7J04j71j5J19j51K44n5r0j35N8J89J14k36
12278b6m5N1M7j28K47l07K34J01k63pL2L7J31J50o15N14K5j00j12j09L65l48J15
12301a1j63M83n29J65Q7P7j50m4J20m7J89j11l0N8j25J23o8Jmj18j31M13J2k16
12325a9j12J37q7m9M0p3L05j68J10N2j67J10L7j41j2J50j65R7l9K60k28o5L9o6
12349e4L43m93l8j67M16J69j03j59J80lo4L3q0J53J26n34K51J13kj30J03J68k86
12372e8J15j59K82k51J48R5j93K33k47J38j14O6j02O3ol62M37o9k1Ml6J27K18
12395C08l84P6k21L58l16J04J41k2J3j7j12Q7P6k17mJ60M4r4P9r1j18n1K11K37
12419B47j28m8k76K04%j11j11K01O1m1j09p7K87j11P9P3L6l30p2K51j64K09j70
$$ plain form
12442 -100 -58 -15 -53 102 7 51 -13 73 -215 -214 -29 -47 116 -51 9 33 81 63 98 244 -23 18 -160 -6 32
12467 32 -136 -166 168 73 199 132 -108 232 -54 34 49 -81 -229 -66 -57 194 -200 244 -9 -75 -162 11 63
12490 63 114 58 -147 -62 -121 159 187 140 -52 68 91 -57 238 -65 8 -171 89 203 -141 -9 29 75 -58
12513 -58 -51 93 -1 72 -6 -76 291 -78 -55 53 71 168 245 30 56 107 -66 46 134 -102 -60 196 23 95 132
12538 132 11 -52 -23 -46 121 323 -2 -122 202 65 -34 3 214 -170 -204 -37 -56 69 -34 -50 -285 -51
12560 -51 6 0 -124 -17 45 -182 102 -63 -149 99 -84 39 80 160 -72 -211 -138 -202 -25 119 -37 134 86
12583 86 -60 -4 -46 -118 -69 170 -30 28 -70 11 -6 -51 389 -149 -30 75 -196 -225 -75 87 -116 -28 17 147
12607 147 -184 82 84 37 42 -61 -68 -53 127 162 -50 19 -34 -43 297 -138 -50 184 18 -170 49 182 143 166 -47
$$ packed form
12442a00M2M3l8J55r5M4o4Q6k88JJ85j8J63j67O0K4M8j8L5J46k67M1j78J54L8
12467C2j68l0L34r5J26o7k40L40k86Q8J5j30j48J63RK51l94M44k53o6q7J73N2
12490F3N1n6k05Q5n9K80K8m7j92J20K3j48K95l03P3j79K60J14l44J32L8M6j33
12513e8PJ44r4P3p8p0L67l69K3J08J8R7P7k15K6N1j73J12Q8k36M2K56j73P2L7
12538A32j21o3K9k3J67K02l25j20L24j37r9L7K11l84l4J67j9J25j03j6k35K34
12560e1N7oj24J07O2k27K84j65q6K48j83J23M1Q0k32j39P3o4J77J44j56J71m8
12583H6j46N6m2p2M9K39k00N8r8Q1j7m5M40n38J19J05k71k9J50J62k03Q8M5J30
12607A47l31K66Km7Nj03pJ5J80L5k12O9n3rL40m35Q8K34j66j88K19J33l9K3k13
$$ plain form
12632 -47 -94 122 219 40 -27 67 225 123 65 39 -328 -34 29 -35 250 210 207 -158 -186 81 178 -173 141 91 -141
12657 -141 41 -167 11 -25 75 -287 -7 -173 -11 -79 -273 285 -100 17 122 -169 146 196 15 -195 26
12678 26 -135 -333 -59 -76 -33 -161 113 -161 -216 -59 183 -182 -21 22 51 -117 26 51 -117 -178 107 -177
12700 -177 67 249 -86 8 -249 120 63 -59 -140 -198 -243 -288 164 -46 18 84 32 53 -57 -1 -21 3 -21 -68 60
12725 60 103 11 -16 130 -177 14 82 -180 -13 -56 91 27 82 95 -156 -59 20 -78 -5 123 -35 -257 36 -168
12749 -168 -22 -10 -184 218 -276 -151 164 -31 -226 78 -85 -9 -129 104 37 106 30 116 -130 -37 -105 23
12771 23 -150 -200 -76 -125 102 168 128 196 -163 -39 131 59 -26 -75 168 -61 -142 -3 -124 -113 78 -10 -96 55
12795 55 -120 -227 -117 72 84 -194 -171 -19 1 -19 26 142 -215 -15 -37 86 38 28 15 -78 -169 -201 67 -103
$$ packed form
12632d7m7K16R7j79o7R4J58j02n8k6l67K94O3o4K85m0ll65k8K67R7l51L14n0k32
12657a41J82k08J78l6J00l62K80j66J62o8j94N58l85J17J05k91L15N0j81k10K21
12678B6j61j98K74j7M3j28K74k74n5J57K42l65J61M3K9j68J43K5j68o1K85k84
12700a77K44J82l35R4k57L69n7j22q1n8m5m5M52k10O4O6n2K1j10N6k0K4k4m7J28
12725F0M3r2k7J46l07J91O8k62J67m3J47o4N5J3k51R7P9r8P3J28j58k22K93k04
12749a68J46J2j74M02m94J25L15j95j95L04j63P6j20K33o7O9p6Q6k46R3o8J28
12771B3j73n0J24m9K27O6m0O8l59J24J70p2q5m9K43k29q1J39j21J1J91q8q6J51
12795E5j75j07J10J89J2k78K3J52K0k0M5J16l57K00k2J23m8j0j3r3r1l2K68j70
$$ plain form
12819 -103 -100 8 76 -58 86 166 -83 -5 6 -72 -274 22 -116 -257 17 -51 1 110 58 70 7 -89 -3 -72 -145
12844 -145 60 29 73 -221 85 157 -29 260 87 -86 111 126 173 44 -137 -41 -148 7 136 44 17 58 55
12867 55 44 -175 -237 -36 -66 -58 126 123 -76 27 263 146 -15 204 47 -27 -230 73 16 -19 39 -71 -2 -46
12891 -46 24 -277 -33 -67 -66 -250 -90 -95 90 36 -44 -35 -48 42 106 139 -80 -42 133 -1 51 -126 -71 13 -16 -197
12917 -197 -169 155 -74 -112 227 -127 -130 27 -72 44 5 185 41 -29 118 35 -92 163 107 37 200 -174 -151
12940 -151 -209 49 -50 262 261 -57 -41 -56 -204 38 169 -148 48 43 110 -108 143 -23 -114 -31 95 30 58 86
12964 86 -86 33 -26 48 -89 121 -18 3 -124 113 31 87 -23 119 98 34 -75 -138 43 40 -78 -25 176 -183
12988 -183 -114 -7 -14 32 56 -83 -21 -127 -107 -172 207 270 145 61 75 -23 17 53 270 189 126 -134 -218 74 -11 284
$$ packed form
12819a03LJ08O8j34J44Q0k49P8J1p8k02K96j38j41K74o8N2J09n2J2o3r6Q6o9p3
12844a45K05l1M4k94L06P2j86K89j73j73J97J5M7j29j81R6j07J55J29r2k7M1l
12867E5j1k19o2K01l0QJ84lj99J03K36j17j61K19j57p4k03L03n7l5N8j10O9m4
12891d6P0l01K44l4Jj84J60nJ85n4q0Rj3R0O4L3k19L8J75j34N2j77N5Q4k9j81
12917a97K8L24k29l8L39l54lJ57r9J16l9J80j44p0J47q3j27K55n6p0J63l74K3
12940a51n8K58r9L12jl18J6j5j48K42J31l17J96nO7k18K51j66r1Q3J26o5K8K8
12964H6j72J19n9P4j37K10j39K1j27K37q2N6j10J42k1o4j09o3J81lj18N3K01l59
12988a83O9J07pM6K4j39O2j06K0o5L79O3j25q4J4r8M0L6K17q1o3k60q4K92q5K95
$$ plain form
13014 284 -202 -136 3 -46 -109 -165 228 -54 55 -184 -205 31 -173 6 224 172 -167 138 -48 220 27 -60
13036 -60 108 8 172 6 -98 135 -36 -134 -6 124 90 133 -88 68 70 127 68 -101 206 -19 -297 174
13058 174 19 -7 -76 -87 -76 77 189 170 166 -89 -32 4 26 105 -37 -62 71 -127 -60 33 -153 47 76 -266 -88
13083 -88 -131 32 -73 -124 232 -61 -133 -73 12 -70 -198 160 -248 131 -167 -30 172 -25 -68 212 -67 -98 -98
13106 -98 50 37 -197 -162 -120 -159 248 -14 71 -47 -68 74 -116 -3 -145 -35 -166 -12 -132 -78 -156 -55 -43
13129 -43 -158 -88 -58 -92 17 9 114 -50 -206 11 -257 -26 38 -160 -237 -61 -6 17 189 -334 -62 18 -91
13152 -91 -5 -73 -94 -25 -268 -29 -79 -67 -28 -226 63 -64 -250 15 -96 222 6 -153 75 74 -22 -126 -122 -7
13176 -7 -325 -116 -69 -177 -151 -9 -292 -191 256 -72 45 -109 122 199 -122 -50 -197 -104 34 34 76 41 -254
$$ packed form
13014B84m86O6J39m9o3n6L93k82J09k39k1K36k04J79K18n2l39L05j86K68j93q7
13036f0J68j00J64j66j04K33j71r8J28J30l4M3k21J56KN7n9j69L07k25k78M71
13058A74j55k6o9j1J1J53J12j9mk55N7L6K2P9j42k5J33j98O7R3j86K00K9l42J78
13083h8m3J63j05n1L56k93p2O0Q5q2j28L58m08L79k98J37K02j97m3K80k79l1%
13106i8J48j3k34L5M2l9M07k62Q5j18k1J42j90J13j42J10j31J54j20N4p8J01J2
13129d3j15P0L0l4J09qJ05j64j56K17k68K31O4j98p7J76N5K3J72n23K72Q0j09
13152i1Q6o8k1O9k43K39n0J2L9j98K89j27j86K65j11L18k16j59K28jr6j04MJ15
13176gl18K09M7j08K6J42k83J01M47l28J17j54K31P7l21P2j47R3J38%M2l5k95
$$ plain form
13199 -254 176 -109 -36 104 167 -97 -141 127 -126 -86 144 10 110 5 4 -61 -124 -5 -80 -73 -277 6 166
13222 166 505 113 -82 94 52 121 42 94 42 198 129 -97 23 -39 -125 -13 -14 11 -129 208 -202 101 -21
13245 -21 -166 135 9 158 -79 -177 196 32 51 -289 -166 194 92 -58 -42 42 54 -185 -118 306 5 -109
13267 -109 41 -122 -110 61 -227 120 82 165 -189 63 28 -90 -47 90 -42 51 185 23 89 55 201 100
13289 100 104 -8 -149 62 -17 137 45 -37 -38 -11 270 -95 24 -179 90 220 193 152 -55 224 -160 106 -72
13312 -72 55 -72 73 -17 -51 221 79 23 58 -163 36 30 32 -163 39 37 -119 5 -32 32 42 -27 -52 -135 43
13337 43 -101 -240 -103 128 49 -88 112 -111 51 -124 -50 177 197 -123 239 230 72 68 -94 4 41 145 18
13360 18 -235 225 -35 120 -178 -187 -44 31 -157 111 45 -45 154 21 -85 -137 27 -187 11 151 -244 -5
$$ packed form
13199b54M30k85P3J40O3k64m4K68k53M0K30j34J00j05jo5o3J19p5Pk04K83J60
13222A66L39l92j95J76m2O9p9N2n2J56o9k26J20o2q6J12jK5j40L37m10L03j22
13245b1j45L01j26J49k37r8L73j64J9l40J23L60j02j50J6Q4J2k39O7M24l01j14
13267a09J50j63J2J71k88L47l8Q3l54K52l5j18M3J37j32R3J34j62O6l4J46j01
13289A00Mj12j41K11p9J54r2q2jK7K81l65J19k03K69J30k7m1k07K79l84K66j78
13312g2J27j27J45r0l4K72j42n6L5k21J99oKj95K02kj56J24l7O4J0o9k5q3J78
13337D3j44j39J37K31p9j37K00k23J62j75P4K27K0l20L62rj58mj62R8L7J04j27
13360A8k53M60k60J55k98rJ43P5j88K68o6r0J99j33j06n2J64k14J98J40l95K39
$$ plain form
13382 -5 -15 -57 121 -181 -47 -150 19 110 364 45 133 -119 -213 105 -248 -36 -20 229 50 -81 47 99 -285
13405 -285 185 -149 -49 -130 -60 35 -227 148 -75 -69 33 -186 107 70 -4 -78 -39 -121 176 57 104 -20 130
13428 130 74 82 -108 -163 -77 -145 280 116 70 -44 298 283 -143 61 -257 -38 -38 -152 -81 89 70 -226 -152 -76
13452 -76 -34 -237 41 133 -92 138 21 -30 89 -83 68 -2 -130 -165 28 -22 138 126 -130 90 14 143 37
13475 37 21 3 -238 -102 11 60 302 126 -239 93 53 23 -47 144 -48 8 183 11 189 1 134 -23
13497 -23 191 -112 212 64 -191 -172 -298 86 -115 -72 -23 -143 69 1 126 74 -168 79 22 35 186 43
13519 43 -149 119 -138 60 -138 114 154 345 -97 0 90 -111 147 95 -55 189 203 -53 -113 135 -46 10
13541 10 85 190 -96 67 -15 82 218 168 6 -136 140 76 65 -75 181 -63 186 -105 -18 -234 -282 -54 116
$$ packed form
13382ej0m2J78l02J34j03J69R1K54l19Q8k52r4L18l53K12J6K49j79j31J28N2l84
13405b85M70l34J00q1P0R5k62L75k23OJ02k19K93l7p4p4L9q2K97j19M7j24J50
13428A30n6Qj90n5Q6o8M25j64m6j14L42j5m26K04l18K19%j14P1J70j9k96P4P6
13452g6M2k03K78R2k25K30j17n1J19j72J51p0j28l5J93n0J60j2k56K20p6J29j06
13475C7j6j8k41J36J13M9K42j76l65L32m0l0p0J91j92N6J75j72J78j88J33j57
13497b3K14l03L24j48k55J9j26L84k01M3M9j20K12o8J25n2k42K47n7J3J51j43
13519D3j92K68k57J98j98K52M0J91m42R7R0k01K58n2j50K44J4k56o0K48j81N6
13541A0P5J05k86J63q2R7J36n0j62j42K76o4j1j40K56k44K49k91Q7k16m8K28J70
$$ plain form
13564 116 41 -28 -84 -104 46 9 81 19 0 -62 -246 327 -120 -156 -123 6 -12 144 42 -12 -38 -148 67 196
13588 196 86 -154 -173 44 -62 -65 -86 -78 114 49 -148 164 168 86 -92 -91 -139 0 79 -329 -216 -47 98 -90
13612 -90 1 104 -66 61 -84 -37 62 37 -140 -137 26 -122 84 -3 98 5 32 42 58 -211 -37 34 -213 105
13636 105 -122 -115 89 22 122 -183 51 51 -101 230 -111 75 193 -218 7 17 64 2 1 -32 -94 175 95 -40
13660 -40 85 -151 -146 0 -132 79 -163 122 80 -69 76 65 130 34 71 -22 44 43 -14 127 -149 253 44 -22
13684 -22 3 75 -5 46 128 -182 303 4 -40 84 146 29 -183 -113 81 -224 -15 68 187 -217 -171 -127 399 -75
13708 -75 -302 -90 247 53 52 -58 -109 86 -217 55 -216 89 -72 -78 111 159 88 298 123 -108 -118 -252 -93
13731 -93 -48 -95 -106 -145 -36 -24 20 -46 4 3 -153 -84 -59 111 52 -99 5 4 153 -53 -155 -454 253 229 183 -90
$$ packed form
13564A16p5o9n6k0J50l7P2o2j9o2j84N73m47l6L3J29j8J56j02n4k6j10K15J29
13588A96j10k40j9K17j06lk1QJ92o5j97L12Mq2j78Jm8J39P9m08J13J69J45j88
13612i0R1J03j70J27j45M7R9k5j77LJ63j48K06q7J01r3K7J0J6k69J74P1k47L18
13636A05k27PK04o7J00l05K34%j52L31l41J86J18m11K25J0M7o2jl3o2K69q0j35
13660d0J25k36NJ46j32K11k42K85m2j49J45j1O5r6L7r3O6jn7J41k76M02k09o6
13684b2K5P2q0N1Q2l10M85k99m4J24O2j17k12P0J94l05K09Q3J19m04M6M4N26m74
13708g5k27K12L37j94jj10n1J95l03K72k71L05j61oJ89M8p1K10j75k31j0j34J59
13731i3M5m7j1l9J09J2M4o6N0jj56O9K5J70n9j51J04jJ49k06j02k99P07k4m6k73
$$ plain form
13757 -90 125 162 78 -61 33 -125 -16 -319 -1 76 -32 -27 5 -15 -199 -18 80 -29 166 -93 -64 101 116 194
13781 194 347 2 -25 -17 340 -231 -125 200 -13 32 112 -320 234 -70 277 -176 -109 146 -178 -75 -24 -40
13803 -40 -13 99 98 205 53 -22 127 176 -37 22 64 17 -122 1 -186 113 -107 108 -280 116 61 59 -7 -98
13827 -98 187 -128 -53 -21 24 -297 38 -9 -306 41 -56 201 -20 -106 -111 5 -167 86 -73 -10 79 -37 -65 -58
13851 -58 184 -163 36 108 1 -160 93 -23 -159 212 -298 12 -204 -247 -156 -45 28 -132 201 -37 -91 150
13873 150 87 26 -107 -76 -26 -149 51 -32 21 -169 -305 288 -22 -107 141 148 -55 209 -14 63 18 -133 -179 -100
13897 -100 -175 -67 -9 -106 -167 19 -192 -154 93 28 51 26 -96 -83 -112 31 -161 66 6 -105 36 31 -142 -69
13921 -69 202 126 261 -113 37 -82 -124 -154 122 106 16 212 -220 -27 4 212 -148 -207 44 150 253 10
$$ packed form
13757i0K15L7q4j39R4j58J09l03L18P7j08NL2k0j84J81R8j09J95k59K9J65J5P8
13781A94J53l45k7QL57n71J06L25k13M5Q0m32N54l04L47m53O7K55l24J03N1j6
13803d0K7J12jJ07j52p5J49M9k13N9M2m7j39J23j87K99k20K15l88L96n5ko6r1
13827i8K85l15P5L2M5l21L35m7k97L47r7K57k21q6nJ16j72K53j59O3Q9j16k8P
13851e8K42l47J99P2j07j61K53j16j36L71n10L10k16m3R1J11P3j60L33k38n4K41
13873A50o3o1j33L1N0j23K00q3N3j90j36N93l10q5K48Pk03K64k23P7m5j51m6P9
13897a00p5J08N8r7o1J86k11L8K47o5K3k5j22J3k9J43j92K27o0j11J41nj73P3
13921f9K71p6J35l74J50j19m2l0K76j6r0J96m32J93L1K08l60n9K51J06J03k43
$$ plain form
13943 10 -172 121 -108 -25 85 54 67 -27 253 127 40 -231 35 136 39 149 140 48 121 68 65 162 96 -43 195
13968 195 -58 -127 26 72 66 -167 -47 86 54 7 65 -99 31 -81 -160 -35 165 -276 -97 89 -5 -9 49 -71
13992 -71 -139 -149 -18 34 -101 35 18 210 -195 -154 147 -91 -3 16 -201 -174 -19 124 52 -67 -10 157 -20
14015 -20 103 168 -46 -183 -49 -201 -59 294 47 183 88 331 166 81 251 70 9 118 -216 96 -192
14036 -192 -38 47 -181 -18 -187 -12 125 -33 -166 56 -15 -124 295 -117 -45 -80 52 73 241 95 -73
14057 -73 77 -236 155 140 244 141 77 -49 251 97 -125 -59 -190 -12 -222 -62 46 -154 -65 -7 43 239
14079 239 -100 31 13 -132 31 81 -9 -16 31 -9 -67 164 -292 -88 -37 28 124 -16 -81 -41 -45 109 -65 73 -129
14104 -129 148 -188 163 125 54 307 79 64 40 -223 111 152 74 1 275 73 21 74 250 -180 -126 -204 -221 211
$$ packed form
13943A0j82K93k29Q3J10l1J3r4K80j26q7k71K66J01r7J10rr2P3n3lR7o6j39K38
13968A95k53o9J53M6ok33J20J33l2m7N8j64J30j12p9J25K00m41J79J86r4mN8j20
13992g1o8j0J31N2j35J36j7J92m05M1L01k38Q8J9k17K7J55J43p2j19N7J67j77
14015b0J23O5k14j37J34j52J42L53k47J36r5K43j65q5J70j81o1J09l34L12k88
14036a92J54Q5k28J63j69J75J37j58j33K22p1j09M19m12P2l5J32K1J68j46j68
14057g3J50l13L91j5J04j03o4j26L00j54k22O6j31J78k10J60J08k00Q9N8N0J96
14079B39l39J31j8j45J63N0r0pM7m0n8K31m56K04N1O5R6j40o5M0mJ54j74J38k02
14104a29K77l36L51l8p1K53k28j5k4k63L34M1p8p3K74k02n2N3J76m30N4p8j7M32
$$ plain form
14128 211 207 -143 159 -41 -71 63 124 207 -65 47 51 -308 -1 -152 53 -21 -50 55 71 72 -141 -26 -105 -113 -11
14153 -11 119 116 88 -253 61 -89 -95 44 -76 167 -42 224 -11 42 303 151 -60 -75 180 26 -223 -86
14175 -86 93 -274 -342 -52 88 -17 88 -53 77 98 -56 59 -135 -61 -62 -5 -200 -41 -2 132 160 12 88
14198 88 -159 -83 -201 -349 -74 15 -25 -51 64 -105 -100 -83 -17 94 142 118 -59 -73 -38 -383 -7 -180 -71 89
14222 89 4 -250 -185 -250 38 121 -111 -188 79 -252 -144 3 -92 40 -4 -77 30 -117 8 159 12 98 -107
14245 -107 148 -214 -2 111 4 -61 -38 -86 -165 -142 48 174 -251 -62 112 36 -76 -232 123 -204 -7 105
14267 105 -147 -78 140 -241 149 265 200 -14 101 347 -177 47 -75 -187 -26 -60 -80 -186 -1 -236 139
14288 139 -9 -99 140 -8 20 -204 266 103 92 -23 228 -105 12 138 -112 211 -59 146 245 32 -246
$$ packed form
14128B11ml50L02k00l0J34O1Q3k72J12Ml59L07j51K05p4k9J05J6Jk13J15p9qJ02
14153a1J30lk8l41L14j50oJ39j20K43k09K66k35N3K61j52k11j5K55j54k49J37
14175h6J79l67o8K90J40j05J05j41J30K1j54J15j94P4jN7j95J59L9J34K8j48P6
14198H8k47P6j18j48K75Q9m0k6J15j69NJ7O6J11M8k4j77j4L5l45L76j73J09J60
14222H9q5k54O5o5K88Q3k32p7K67l31J08J47r5J32m4p3J07j47J25J51j47Q6k05
14245a07K55l62K12J13j07o5K3m8p9K3J90J26m25J89J74p6j12j56L55l27J97J12
14267A05k52O9K18l81L90J16o5k14J15K46n24K24j22j12J61l4k0j06J85k35L75
14288A39j48r0K39j48K8k24M70j63j1j15K51l33J17J26k50L23k70K05R9k13k78
$$ plain form
14309 -246 115 -50 -198 -265 -162 -118 -14 19 -38 82 -55 93 118 84 0 -233 -68 -154 -81 -106 -143 110 153 136
14333 136 30 -29 63 -129 -41 16 -307 15 146 132 -30 247 -344 -83 -16 -30 -122 40 110 -77 -117 9 -216
14356 -216 -49 35 56 -132 -13 266 36 190 144 -128 -113 -226 -335 -180 -131 -252 273 -219 -66 -60 -27 47 -357
14379 -357 65 -68 -88 101 -36 -126 -5 -76 26 65 182 -155 232 -56 -87 -102 -74 66 -99 -181 -240 -117 8
14402 8 -262 159 -54 -26 141 -79 73 -93 93 109 -137 -5 -70 28 194 -241 -174 233 158 -310 91 59 -166
14425 -166 66 -168 46 15 48 233 -7 -106 -204 -4 83 -4 -209 -256 62 -27 5 124 36 216 -109 23 -285
14448 -285 -21 -265 -45 -48 199 -273 -43 36 82 29 76 71 -217 98 35 33 -101 40 -71 28 94 94 5 190 37
14473 37 138 65 -67 50 -35 -19 -68 178 126 -340 -107 -107 -5 -63 -160 6 65 106 -94 -119 -114 165 16 -55 6
$$ packed form
14309b46L61j65j48o7J03M4J04L3n7J20j37J48K5l4q4k33J65q6P3k5l7K53M3j7
14333A36j06n9R2j92Q8N7l23L22J31j4j62K77n91K61O7j4r2J62P0j87m0J26k25
14356b16J67Q4K1j88J19K79k30J54m6k72J5j13j09J55M9j21N25m92J53OL3P4m04
14379c57M22j33k0J89j37r0J21p1J02L9J17l37L87k88l1j5K8J40j65q2n9J23J25
14402Hk70M21k13K8J67k20J52j66J86J6k46J32o5R8J66m35O7M07p5m68M01l2k25
14425a66K32k34K14l1L3J85k40r9r8K00Q7q7k05m7L18q9L2J19q8J80l25J32l08
14448b85K64k44K20lK47m72K30P9M6n3M7nk88L15o3kj34J41j11R9O6%q9J85j53
14473C7J01p3j32J17q5J6m9K46n2m66K33%J02n8r7J66N9M1k00k5NK79j49p1O1
$$ plain form
14498 6 -112 -25 58 73 56 -155 248 157 -140 69 65 132 36 -235 22 201 135 34 23 -67 -218 11 -75 24 93
14523 93 124 -148 -235 -231 20 42 -88 -188 -66 9 -46 53 -396 123 -117 65 160 94 114 90 75 -63 -109 144 -225
14548 -225 186 87 311 45 76 257 -38 -68 -42 38 35 78 -147 192 -333 -174 95 267 -45 -144 -276 -11 52
14571 52 -106 -166 -199 -19 -86 87 -133 150 67 9 7 194 94 94 137 -143 -190 11 158 78 109 162 -25 -15 89
14596 89 -166 -255 -162 118 83 100 -74 -57 -129 -7 48 89 107 223 -11 41 -134 201 99 -161 -207 -126 73 -39
14620 -39 -172 -25 -42 -61 -31 -129 159 -212 -30 148 -127 151 81 -55 108 -61 -60 205 -114 191 172 -167 -171
14643 -171 38 -150 241 279 97 -56 -1 46 68 -119 10 433 186 -83 26 173 110 11 212 -78 100 -103
14665 -103 -51 -38 120 49 146 93 -57 2 5 166 -25 121 -239 -14 -136 136 179 -97 -34 -54 -70 147 28 91
$$ packed form
14498Fj18Q7Q3J5j7k11M03r1k97K09mO7r6k71K57J79o6j01j1r0j51K29q6R9O9
14523I3L1k72q7MK51K2j30j00J22P5n5R9m49N19k40J82R5o6K0k4j5j38m6K53l69
14548b25M11r9K24k66L1J81k95l0K6Q0lM3k25L39n25J59K69J72l12r9j32K65O3
14571E2j58o0l3J80o7J73k20K83q3n8kJ87j00%M3k80m7K01J47q0L1N3j87J0J04
14596H9k55q9R3K80l5J7j74J7p2J22N5M1J8J16k34N2j75L35j02k60m6Q1J99j12
14620c9j33J47j7j9L0r8K88l71J82J78k75K78p0j36J63j69JK65l19L05j9l39m
14643a71K09j88L91L8j82j53N5M7K2j87J29M23k47k69J09J47o3r9K01k90J78k03
14665a03N2J3J58p1R7n3j50N9LJ61j91J46l60K25j22K72M3k76O3k0j6K17j19O3
$$ plain form
14689 91 -158 -14 129 -98 48 7 65 32 127 124 60 -111 -33 -172 144 71 -128 -323 -57 184 -161 -158 15 88
14713 88 -161 98 -252 -141 1 -72 80 -227 -113 89 -229 162 11 70 27 -65 -4 41 69 2 -104 -56 -31
14736 -31 -38 158 91 76 49 -43 149 143 -160 118 84 150 -127 -40 123 214 -1 11 55 233 -24 -57 37 -70 -66 127
14762 127 -139 -133 -197 -101 133 -150 -9 -82 61 106 126 41 30 -56 117 113 128 26 -73 -70 -94 -27 -158 106 -326 207
14788 207 -93 -3 -87 -177 230 -295 11 241 -80 -64 107 5 29 -71 -40 -43 77 -125 -67 -27 22 -44 -50 49 -9
14813 -9 -167 9 11 22 46 12 -117 -157 -129 -100 -144 -213 -24 83 51 -89 -58 62 -119 88 -58 54 -156 -292
14837 -292 -204 25 -3 115 139 147 64 -96 -126 53 34 5 -247 29 -42 -14 -5 84 133 -10 77 -54 24 -179 -116 -6
14863 -6 -54 10 115 -45 42 -121 154 111 -53 -176 -205 -49 -266 -109 18 63 -38 71 141 -22 14 -244 233
$$ packed form
14689I1k49J44J43k27J46m1N8l3R5lo4j71P8j39L16p3j99j95K66K41l45LJ73P3
14713H8k49K59l50J11J42p3J52l07J14K02l18L91j51N9m3r2O1M5K8o7j06M8K5
14736c1pJ96o7j5k7r2J92ol03K78l4O6k77Q7J63R1k15J2M4J78k57l3R4j07MJ93
14762A27k66Oo4R6K34k83J41p3J43M5K0q5j1q6J73mJ5j02r9Lk4O7j31K64m32N33
14788B07l00R0q4r0M07n25L06K30l21J6J71j02K4j00L1lJ20k02N8M0M9o6oR9n8
14813ij58J76KJ1K4l4j29m0K8K9m4o9J89J07l2j40L1J20j81K07j46J12k10j36
14837b92Q8K29k8J18K4Qq3j60l0J79j9k9k52K76p1K8RQ9M9j43Q7j31P8k03O3J10
14863fm8O4J05j60Q7j63K75m3j64j23k9J56k17J57J27M5j01J09P0j63L6k58M77
$$ plain form
14886 233 99 -140 88 -92 56 80 109 338 -3 -66 76 57 -55 -120 -3 82 77 -148 54 230 180 83 -73
14909 -73 -204 54 -194 -233 142 -53 154 108 95 -27 87 -24 41 113 -73 159 -37 -95 -149 -186 81 140 -110
14932 -110 154 102 256 105 68 -85 36 52 96 83 -218 -179 -71 -98 93 -11 -2 62 98 271 -25 -284 -16
14955 -16 -127 177 47 -74 -83 -46 -26 131 187 76 -158 -152 28 20 107 119 -11 54 118 -80 80 -37 -8 39 241
14980 241 21 -208 88 -15 -9 -324 -130 77 -152 138 43 -22 -29 68 270 -51 -66 -30 41 105 24 49 -300 101
15004 101 -153 95 33 -36 24 -104 18 64 122 139 217 26 191 39 131 -149 28 -46 92 257 140 -169 80
15027 80 63 72 124 17 -105 -68 -138 140 35 263 -104 89 63 -103 -15 -31 -205 -61 -185 -91 -78 136 15 11
15051 11 -92 -23 -108 157 -15 -102 -170 -39 133 53 141 62 -246 -119 -193 65 -128 58 54 132 274 145 159 48
$$ packed form
14886B33j34k39K28j80J48K4K9K29l41o3J42j9j12o5J17Q5nk25K02J76n0r7j56
14909g3j31K58k48l9L75j95K07m6j3j22J14j11O5P2j86K32j96n8n4l7K67N9k50
14932a10K64n2J54j51l7j53J21J6M4j3l01L9J08k7J91j04RO4L6J73k96k59K68
14955a6j11L04j30j21rL7K0J57N6j11k34OJ80qQ7J2j30O5O4j98J60j17K9M7K02
14980B41k20k29K96j03Ol15J94K07k29K90r5o5pR7K02l21j5L6P1O4q1K5l49M01
15004A01k54K48o2o9O0j28J22M6N8J7P8j91J65j52R2k80J77p4J38J65j17l09K49
15027H0j7RN2j07j22L7p0K78j05K28l67J93k6j66Q8j6j74J44j24R4J3K14j21m
15051A1j03O9q5K65j72q7o8J31J72q0Q8p9l08J27p4K58j93J86mP8J42j29J4j11
$$ plain form
15075 48 69 -60 -85 -247 79 -145 209 37 206 66 194 -180 118 166 46 -35 130 -32 -34 152 161 43 157
15098 157 -16 -71 -170 85 9 130 -61 135 -153 -94 155 14 -6 162 -78 81 74 -39 78 -389 17 -105
15120 -105 -4 -194 -83 86 117 -96 -1 -98 158 241 114 40 -110 -181 -86 59 120 139 130 -136 -75 81 -21 116
15144 116 -182 63 94 60 -349 137 -1 153 -20 -225 26 42 138 -117 -98 59 12 62 -11 -100 91 67 -63
15167 -63 25 -150 70 32 -76 -40 273 -58 -191 -45 -89 31 98 -14 114 120 219 221 -91 -104 70 -123 58 -1
15191 -1 -29 -114 -74 -17 -154 201 -121 -162 52 -39 94 43 -175 75 -136 -195 -83 -317 -123 139 8 43 -9 31
15215 31 -199 183 99 -45 94 -234 -51 35 172 10 -6 -220 112 7 21 -49 -1 47 108 -95 -140 -39 84
15238 84 193 -191 -63 -84 -127 -50 -75 -241 -52 114 -185 72 231 153 -94 8 -139 68 23 120 73 -72 -185
$$ packed form
15075D8K1j29k5j62L26k24L54j72J69j40J28l74K98M8j20q1J65j62kJ86Rj18J14
15098A57j73n5r9K55p6J21j91J96k88N9K49j41k0J68k40J59pj13J17m67M06j22
15120a05J01j90J11J69L1k13R5r7K56Q3j27p4j50p1R5J45O1J9rk66O1J56j02J37
15144A16k98K45L1l4m09M86j38J54j73k05K51J6R6k55J9J57m7N0p3q9J91k4j30
15167f3Q8j75K20l8j08L6L13l31j33J46m4J20O7j12J28OR9Kl12j3J74j93J81n9
15191ak8q5M0N7j37L55l22m1K14r1J33n1k18K50k11n9J12k34J94K62j31L5n2M0
15215C1k30L82q4j44J39l28J83Q6J37j62j6k14L32j05J4p0M8M8O1k03m5J01J23
15238H4J09l84J28k1m3P7k5j66J89J66k99K57J59p8k47J02j47K07m5R7m7j45j13
$$ plain form
15261 -185 -130 -71 -52 -74 86 -145 -102 -14 -51 0 -85 1 13 130 -123 14 89 -20 -111 -90 52 26 -142 218 18
15286 18 -58 -90 74 177 33 -68 83 56 -223 -11 50 72 54 -168 78 -48 103 -51 -186 -29 30 -17 -142
15309 -142 71 103 113 2 27 82 144 -33 -81 -43 -24 -34 -142 67 177 -180 -5 214 212 -217 89 113 93 -198
15333 -198 -156 -40 93 -35 46 -32 -61 123 111 -61 106 34 -100 240 -93 319 95 154 -7 168 -81 -2
15355 -2 -310 -161 183 223 -105 26 -2 -98 51 -31 -22 -76 354 -24 74 181 -79 23 22 -88 -18 -181 99 -82
15379 -82 -69 -132 18 65 -3 -115 77 61 48 104 -8 -287 163 50 111 -31 -27 -62 3 -178 -176 69 -43 -226 160
15404 160 44 92 122 -2 94 -66 56 -128 64 131 3 -67 253 23 32 129 -150 53 275 174 108 52 -56
15427 -56 214 -125 -19 -88 52 92 -236 114 117 -121 -75 -81 -263 96 -151 -105 -151 -224 -26 -107 -24 -66 32 -291 -113
$$ packed form
15261a85N5N9J9k2J60k31M3Q8l7N1q5Q6J2J17k53J37P5j09r1K1J42k6j68L60k00
15286A8p6l2J64J03j44j01J51k7k79K12O1K2j8k22K46j26J51j54j35J57N9m7j25
15309a42K13L2J0j11K5N5O2j77m8L8J9j0j08K09J10l57J75K19km29L06K4k0k91
15333a98M2J16J33j28Q1p8k9J84j2j72J67p2j34L40l33M12k24N9j61J75k49P9
15355bl08J49L44M0l28J31k8r6J49q2Rn4M30l78R8J07k60J02jj10P0j63K80j81
15379h2J3o3J50M7o8j12J92j6j3N6j12k79M50j13O1j42Ml5O5j81KK45j12j83L86
15404A60j16M8L0j24R6j60J22j84J92O7j28p0L20k30RR7k79K03K22j01o6n6j08
15427e6K70l39J06o9J40M0l28L50Lk38M6oj82L59k47M6m6p3J98q1Q3m2R8l23J78
$$ plain form
15452 -113 -7 -117 -112 27 -32 -150 -210 97 -108 -214 149 -40 -308 118 42 -66 194 -92 10 -29 15 49
15474 49 -178 -18 -120 -107 -67 47 301 -72 -44 75 62 -72 -86 88 123 -19 -392 31 -183 -11 -43 217
15496 217 103 -146 149 -107 -88 -126 61 163 -111 -2 11 236 35 -142 -233 -91 -23 -121 -69 65 -133 42
15518 42 256 148 76 -105 -199 -125 35 -5 -159 99 151 133 120 -49 -92 -18 -66 -161 129 0 -56 -39 -208 -98
15542 -98 -48 -79 -405 115 93 153 -81 55 155 -37 -29 151 -11 -137 122 -201 117 24 203 46 -269 134
15564 134 25 -166 87 94 44 86 -55 148 -71 -125 49 61 109 -13 68 91 -43 117 -196 -11 -51 77 60
15587 60 -172 -96 -13 -112 -177 213 -57 -88 -118 -9 -16 -29 -18 -109 -56 -51 -183 108 -417 -55 -152 -76 60 -124 101
15612 101 -100 107 176 114 -62 8 227 45 -113 155 -172 -169 183 -22 107 92 -416 23 203 -26 -146 -167
$$ packed form
15452a13J06j10NJ39n9j18o0L07k05j06L63j89k68M26p6j08K60k86J02l9M4L4
15474D9k27J60j02J3M0J14K54l73K8J19j3j34j4J74L5j42l73M23k14J72l2K60
15496B17j14k49K95k56J9l8J87J02k74J09J3K25k01j77r1J42O8r8N2J34j98J75
15518D2K14j08p2j81r4P4J60m0j54K58N2j8j3j69m3P4m8r5K90j29n6J7j69J10
15542i8N0l1l26N20k2O0k34J36J00j92QJ80j62j26K59l23L18r3J79j57l15M03
15564A34j09j91K53Pn0M2j41K03k19n4J74J2M8j22Q1K3j34J60l13J85m0J28j7
15587F0k32P6Q3r9o5L90k70l1l0J09pj3J1r1N3Nj32K91n25L62r7P6J36j84K25
15612A01k01K07O9o2j76P0K19j82j58K68l27LL52k05J29j5n08M39J80k29j20k1
$$ plain form
15634 -167 17 -83 88 144 35 -151 223 -117 197 201 4 276 -84 -119 36 -52 129 210 -23 162 -64 -101
15656 -101 -9 -100 -32 168 -114 -49 72 -180 200 -17 48 157 22 -142 -100 179 -206 5 49 108 -58 -181
15678 -181 99 -22 -222 -56 72 177 109 200 164 -87 -80 -207 160 -52 -160 -190 13 78 55 29 -188 -212 -145
15701 -145 -298 -25 -120 -367 87 60 55 -66 -36 14 32 100 218 -15 -32 97 63 -127 9 49 -177 132 75 28
15725 28 -157 62 -216 -175 -161 54 96 -3 -72 162 49 187 35 106 242 54 191 -34 53 -41 129 -34 -124
15748 -124 124 -29 -48 -36 -46 93 55 -156 -17 -104 90 -160 -52 -275 55 12 -52 28 130 -251 -40 -279
15770 -279 5 54 62 -216 -158 142 -96 122 51 6 114 203 -200 -71 148 87 54 204 -77 -61 -235 -33 37
15793 37 19 43 -104 -120 43 87 -201 -59 -75 199 142 -63 -65 -88 -195 -201 91 158 182 -19 -244 44 161 -22
$$ packed form
15634a67J84j00J71N6j09j86L74l40L14Mj97K72l60l5J55q8J81Q1k33J85k26l7
15656a01R2r1O8K00k82O5J21k52L80k17O5J09j35j64M2K79l85K11M4N9j66j23
15678a81K80j21k00J66J28J05o8R1l6k51Pj27L67k12j08l0K03O5k3k6k17k4O7
15701a45j53K73r5k47M54k7nj21L0N0J8O8J18k33j7J29l4j90J36M0k26L09n7m7
15725B8j85K19k78M1J4K15M2r9o9K34j13J38j52P1J36j88J37k25Q7r4J70j63r0
15748a24K48j53j9J2j0J39l8k11J39q7J94k50J08k23L30m3o4Q0J02l81K11k39
15770b79K84M9Qk78N8L00k38K18p1m5J08Q9m03J29K19o1l3J50k81J6j74K02P0
15793C7j8K4j47j6J63M4k88J42j6K74n7k05kk3j07oK92O7K4k01k25K88J17j83
$$ plain form
15817 -22 48 11 17 -138 94 131 24 -47 -177 210 -69 74 117 -150 -115 -115 -181 -55 -169 29 -19 -49 222 -208
15841 -208 29 -127 -107 -41 -44 -72 241 -102 -69 -140 151 47 -95 -183 -76 -5 97 48 -143 -107 -117 -126 179 130 -98
15866 -98 31 -89 24 29 23 -37 -94 49 80 159 53 -85 120 79 -126 -28 75 42 8 -158 30 161 11 -73
15890 -73 -22 -55 -66 -18 120 -94 -271 -206 -35 -35 -47 -6 78 135 68 81 -223 -86 129 -212 181 276 39 -270 125
15915 125 -81 17 50 177 72 -82 75 -278 -13 185 124 156 -52 42 54 77 -37 109 48 40 -7 135 109 -188
15939 -188 39 -34 72 225 -93 194 -228 -33 -157 59 -105 58 48 -19 57 -149 88 0 -17 101 2 -115
15961 -115 260 -61 -101 -137 214 -18 61 -96 5 -111 74 -367 28 137 -104 16 145 261 192 4 -266
15982 -266 -8 55 15 142 39 -51 -30 33 69 300 53 -53 -42 -89 133 -216 223 -132 109 -29 9 219 268
$$ packed form
15817b2P0l7Oj55K32L7j07p1j30L87k79J43M3k67L5%o6J26j14J98m8l0K71m30
15841b08K37j56K0O6lk8L13l43L3p1K91j04j42q8J07P1J02m9j91L6j0rL05m9k28
15866i8J29j20J13Noo0n7J43L1P9j06j38K05m1k05R8J03l3l4j66J88J31j50q4
15890g3N1l3j1M8J38k14j77O5J71%j2M1Q4N7o7J3l04J37K15l41L93R5k37l09L95
15915A25k06R8L3J27j05j54J57l53K65J98o1L2k08R4J2K3j14J46o1qm7J42k6k97
15939a88K27p3J06J53l18K87m22J95j24K16j64J63j0o7P6k06K37q8j7J18r9j17
15961a15L75l21m0l6L51k32P9j57J01j16J85m41L95J09k41J20J29J16o9j88k70
15982b66K58O3m0J27j03r0K1O3L6K31k47j06J1m7K22l49M39l55K41j38L8K10M9
$$ plain form
16005 268 -71 20 105 -13 56 63 143 12 -78 -165 -258 219 39 -188 42 44 172 30 2 80 -82 198 -37 52
16029 52 215 -13 -24 -67 34 209 -99 -201 133 284 -16 -169 29 87 159 127 260 42 -1 -142 -143 70 -93
16052 -93 53 -140 113 -205 321 -63 89 -10 -93 -159 216 60 -275 5 58 -67 98 133 -110 102 -216 -120
16074 -120 94 -156 -25 75 -95 17 -89 -120 -265 55 102 -31 -92 33 223 105 -131 -44 -107 120 -2
16095 -2 154 112 70 -59 -92 204 54 54 -63 -8 60 -31 -31 -87 -17 -5 -169 -159 -80 -146 -106 64 2 -89 201 199 59
16122 59 -69 -136 35 80 -44 -248 47 146 88 57 149 -129 281 -9 63 -123 44 219 -56 75 -15 -119 -61
16145 -61 -70 34 80 7 179 81 -60 -87 146 -17 -37 103 88 -46 -62 -155 -58 78 189 -46 -194 128 -173 -43
16169 -43 -64 -115 116 -73 1 160 -41 -65 24 97 5 197 -62 213 -11 -120 -82 231 -147 -129 44 -114 14
$$ packed form
16005B68l39R1Q5j18O9PQ0j31r0q7r3M77j80k27K30KJ28j42k8P8j62K80k35Q9
16029E2J63k28j1m3J01J75l08j02L34J51l00j53J98N8P2l2J33k18m3j41jK13j63
16052i3J46j93K53l18N26l84J52r9q3o6L75j56l35K80N3j25J65L5k43K12l18R6
16074a20K14k50J31J00j70J12j06l1j45L20M7j33o1J25J90j18k36Q7o3K27j22
16095bJ56m2m2j29l3K96j50%j17N5O8r1%n6P0J2j64J0P9o6M0J70o2r1K90kj40
16122E9j28o7J71M5j24k04K95R9n8l1R2k78M10k90P2j86J67J75k75J31r0j04N8
16145f1rJ04M6p3J72r8j41k7K33j63k0J40j5j34j6r3R7J36J11k35j48L22l01J30
16169d3k1n1K31j89P4J59k01k4Q9P3r2J92k59K75k24j09L8L13l78J8J73j58J28
$$ plain form
16192 14 69 -29 -122 -102 -22 105 -57 -225 -84 -2 40 148 -150 4 -91 4 -38 -21 35 -35 -186 116 -12 68 100
16217 100 44 141 -73 -123 26 23 -202 -127 -135 -9 136 -86 250 124 192 -218 85 -74 -44 82 -107 -159 72
16240 72 21 -241 -50 -33 99 -23 -62 -177 79 79 27 0 -199 182 -281 72 51 -122 150 -2 -191 155 166
16263 166 81 -128 29 164 -127 79 -94 203 -135 -79 -51 -251 -131 20 99 172 -41 204 66 -16 -134 75
16285 75 36 -175 66 302 -93 -143 99 -106 219 119 48 -99 71 248 -115 157 145 190 266 23 -2 131
16307 131 -66 -30 -19 -84 137 401 -79 167 -7 -158 -10 -16 262 2 -105 51 179 -14 -3 -85 -84 -43 4
16330 4 101 128 103 4 -44 -48 -170 60 114 -89 -218 62 -91 -28 -41 -229 -124 134 21 51 -56 35 -120 98
16354 98 -39 167 -386 124 136 -45 80 115 7 199 142 34 67 -136 110 -76 -138 -73 -214 38 -139 225
$$ packed form
16192A4N5r8r3K0Q0J27j62j68J41Q2M2J08k98J54r5R5m2J7N6p0j51L02j28Q0L2
16217A00n6R7k14n0J49lk25P5qJ26J45k22L36j26O8m10L03j59L0J26j89n2K31
16240G2n1k62J91J7J32j22l9j15K56%n2k7j99L81m63L53k1j73K72j52j89L46J1
16263A66q5k09J57J35k91K06j73K97l38N6K8k00J20J51P9P3k13K45j38q2j18K09
16285G5l9k11K41K36l95n0K42k05L25j00p1j47J70J77l63K72j2M5P6k43k5J33
16307A31j97L6J1o5K21K64m80K46j74j51J48oK78k60j07J56J28j93J1q2JM1M7
16330DR7K7k5r9m8mj22K30N4k03j29K80j53O3j3j88J05K58j13L0j07R1j55K18
16354I8j37K06n53N10J2j81J25L5j08J92n7j08L3k03K46j86o2O5j41K52j77L64
$$ plain form
16376 225 160 35 -42 212 -104 144 73
$$ packed form
16376B25o5j25p7K54l16K48p1
16383G3
$$ Imaginary data points
##PAGE= N=2
##DATA TABLE= (X++(I..I)), XYDATA
$$ plain form
0 0 0 0 0 0 0 0 0 0 0 0 0 32 -32 32 -32 32 -64 64 -96 96 -128 160 -161 193 -225 288 -321 384 -419 486 -577
31 -577 641 -737 833 -930 1058 -1186 1321 -1476 1655 -1837 2048 -2272 2509 -2778 3069 -3386
47 -3386 3733 -4112 4533 -4990 5501 -6066 6692 -7395 8187 -9092 10126 -11341 12763
60 12763 -14478 16582 -19240 22720 -27495 34469 -45690 66688 -119649 546359 668800
71 668800 -623484 -588642 18950 284392 -149171 -162701 228508 345259 -189427 -446577
81 -446577 -46274 393495 129801 -285793 -213025 136352 119281 -56197 12666 180552 10475
92 10475 -251948 -147155 229124 282857 -39668 -220806 -11047 135845 -41859 -178944
102 -178944 19541 178755 -4151 -203933 -50885 191042 122349 -123400 -130889 84586
$$ packed form
0@%%%%%%%%%%%L2o4O4o4O4r6J28j60J92k24K88l21L54m18N13o09P05q03R05j063
31e77J218j378J570j763J988k244K507k797L131l492L885m320M781n287N847o455
47c386P119p845Q645r523J0491j1567J2758j4087J5582j7279J9218k1467K4104
60A2763k7241L1060l5822M1960n0215O1964q0159J12378j86337O66008J22441
71F68800j292284L4842O07592K65442m33563j3530L91209J16751n34686k57150
81d46577M00303M39769k63694m15594P2768L49377j7071j75478O8863J67886j70077
92A0475k62423J04793L76279N3733l22525j81138K09759J46892j77704j37085
102a78944J98485J59214j82906j99782J53048K41927o8693k45749p489K15475
$$ plain form
112 84586 133751 -76961 -173457 27734 194137 53520 -146383 -90811 105035 154229 33194
123 33194 -91487 -121960 -66019 19086 67614 50487 1922 -18518 -5529 -28207 -99376 -85823
135 -85823 79663 195462 64976 -145025 -136888 55344 146682 37350 -87556 -53275 74241
146 74241 102410 -6150 -88184 -45337 15440 -12814 -66906 -42158 43804 80185 7812 -78237
158 -78237 -36030 86722 84512 -59382 -113000 17809 129018 61419 -53088 -38268 36389
169 36389 -5640 -114292 -63616 132265 168195 -52353 -210039 -87598 86686 67532 -13025
180 -13025 34472 93254 -7547 -136114 -63302 115786 109075 -68203 -99920 63706 99029
191 99029 -81081 -135895 66421 168765 -33098 -196502 -26188 202641 102331 -166796
$$ packed form
112H4586M9165k10712r6496K01191J66403j40617j99903N5572J95846M9194j21035
123C3194j24681l0473N5941Q5105M8528j7127m8565k0440J2989k2678p1169J3553
135h5823J65486J15799j30486k10001Q137J92232R1338j09332j24906L4281J27516
146G4241K8169j08560q2034M2847O0777k8254n4092K4748Q5962L6381p2373q6049
158g8237M2207J22752k210j43894n3618J30809J11209o7599j14507J4820P4657
169C6389m2029j08652N0676J95881L5930k20548j57686J22441J74284j9154q0557
180a3025M7497N8782j00801j28567P2812J79088o711j77278l1717J63626L5323
191I9029j80110n4814K02316J02344k01863j63404J70314K28829j00310k69127
$$ plain form
201 -166796 -163981 91126 155953 -59683 -144838 61819 177744 -18244 -185273 -44703 145412
212 145412 76486 -93407 -66297 81115 71717 -69465 -74751 68834 88297 -64523 -113603
223 -113603 26678 96823 -13413 -81479 4028 53041 -33106 -72739 46662 138057 28972
234 28972 -122849 -76783 77651 74585 -51536 -42242 83079 57471 -111560 -126596 55335
245 55335 138310 -1113 -120014 -35302 87280 38482 -74874 -34668 87862 57098 -76701
256 -76701 -61620 81983 91517 -54407 -104521 11271 79544 -7279 -80858 -6105 83438 20685
268 20685 -89562 -44345 86764 71364 -67298 -84529 46711 98675 -8752 -88927 -19570
279 -19570 69973 29880 -67058 -49536 60394 74294 -37875 -88841 2169 78283 23243 -54797
$$ packed form
201a66796K815K55107O4827k15636q5155K06657J15925j95988j67029J40570J90115
212A45412o8926j69893K7110J47412r398j41182n286J43585J9463j52820m9080
223a13603J40281P0145j10236o8066Q5507M9013q6147l9633J19401R1395j09085
234B8972j51821M6066J54434l066j26121R294J25321k5608j69031j5036J81931
245E5335Q2975j39423j18901Q4712J22582m8798j13356M0206J22530l0764j33799
256g6701J5081J43603R534j45924n0114J15792O8273q6823p3579P4753Q9543o2753
268B0685j10247M5217J31109j5400j38662j7231J31240N1964j07427q0175O9357
279a9570Q9543m0093r6938J7522J09930J3900j12169n0966R1010P6114n5040p8040
$$ plain form
291 -54797 -28402 49862 48599 -33887 -68778 2070 65382 16338 -58695 -32877 41154 34504
303 34504 -31344 -38041 24418 52878 945 -48610 -12224 50712 28970 -43752 -40485 28180
315 28180 35007 -26098 -39318 15986 36495 -13411 -45978 -1476 51491 22708 -40225 -26493
327 -26493 41328 38990 -28829 -35982 24899 35240 -23408 -43581 6591 39042 74 -43686
339 -43686 -18630 33582 25214 -22214 -16699 28838 21285 -24890 -17896 26252 21670 -20510 -22085
352 -22085 12458 15931 -17999 -26210 12046 30784 -10593 -39858 6421 49815 4627 -48431
364 -48431 -7583 53679 21240 -48015 -32702 39041 41863 -32153 -58368 11976 60932 -1116
376 -1116 -65925 -12287 66678 28794 -56036 -34603 51813 50805 -33004 -57670 14600 59478
$$ packed form
291e4797K6395P8264j263q2486l4891P0848O3312m9044p5033K5818P4031o650
303C4504o5848o697O2459K8460n1933m9555L6386O2936k1742p2722L267O8665
315B8180O827o1105j3220N5304K0509m9906l2567M4502N2967k8783o2933J3732
327b6493O7821k338o7819p153O0881J0341n8648k0173N0172L2451l8968m3760
339d3686K5056N2212q368m7428N515M5537p553m6175O994M4148m582m2180j575
352b2085L4543L473l3930q211L8256J8738m1377k9265M6279M3394m5188n3058
364d8431M0848O1262l2439o9255J5313P1743K822p4016k6215P0344M8956o2048
376a116o4809N3638P8965l7884q4830K1433Q6416j008q3809k4666P2270M4878
$$ plain form
388 59478 -823 -63708 -17849 56359 23975 -56757 -37909 47771 49045 -30894 -50279 19059
400 19059 57191 3348 -51204 -15228 48748 25813 -47743 -40311 36014 43966 -29592 -53413
412 -53413 10349 50272 5446 -43359 -15207 42560 32533 -29262 -35405 24965 42266 -17663
424 -17663 -47763 3109 41422 4600 -38194 -17971 25803 19937 -21381 -24698 19597 34258
436 34258 -7161 -28327 7576 29142 -3348 -26916 -1126 21745 1645 -21730 -8189 15247
448 15247 5861 -19818 -11840 21467 18561 -17870 -16709 23186 25017 -17673 -24930 14559 25912
461 25912 -12982 -31564 3149 31387 736 -37638 -11919 36558 19280 -35318 -23716 37200
473 37200 34866 -26224 -34549 23847 41860 -15425 -51602 -4163 47385 14677 -45311 -25116
$$ packed form
388E9478o0301o2885M5859P4208l2384q0732J8848Q5680J274p9939j9385O9338
400A9059L8132n3843n4552L5976O3976k2935p3556P432P6325P952p3558k3821
412e3413O3762L9923m4826m8805K8152N7767j0027o1795o143O0370J7301n9929
424a7663l0100N0872L8313l6822m2794K0223M3774n866m1318l317M4295J4661
436C4258m1419k1166L5903K1566l2490k3568K5790K2871k0100k3375J3541K3436
448A5247r386k5679P978L3307k906l6431J161L9895J831m2690p257L9489J1353
461B5912l8894j8582L4713K8238l0651l8374K5719M8477j7278n4598J1602O0916
473C7200k334o1090q325N8396J8013n7285l6177M7439N1548l2708n9988K0195
$$ plain form
485 -25116 39076 27893 -39258 -37538 33257 49166 -13347 -42654 6580 44811 5633 -43789
497 -43789 -18437 37707 24058 -37098 -35564 25933 38221 -18131 -41995 2134 37108 12183
509 12183 -22938 -11321 23906 21636 -16253 -26318 7703 24791 -2098 -24003 -9177 10791
521 10791 7430 -5570 -8552 1904 9851 158 -13438 -2048 21803 18365 -8833 -18978 -2191
534 -2191 12624 3232 -14741 -10499 14024 16128 -15436 -26796 7606 29174 729 -25244 -4777
547 -4777 24185 14699 -11794 -11442 10131 9854 -17084 -22323 10875 25394 -5186 -24042 1322
560 1322 17888 -5257 -18247 6340 24906 5673 -17605 -8030 15293 10834 -12938 -12570 8599
573 8599 3561 -20641 -9020 24231 14270 -23739 -17110 21652 19698 -19795 -21639 23118 37668
$$ packed form
485b5116O4192j1183o7151J720P0795J5909o2513k9307M9234L8231l9178m9422
497d3789K5352N6144j3649o1156J534O1497J2288n6352k3864M4129L4974k4925
509A2183l5121J1617L5227k270l7889j0065L4021J7088k6889k1905J4826J9968
521A0791l361j3000k982J0456P947r693j3596J1390K3851l438k7198j0145J6787
534b191J4815r392j7973M242K4523K104l1564j1360L4402K1568k8445k5973K0467
547d777K8962r486k6493L52K1573k77k6938n239L3198J4519l0580j8856K5364
560A322J6566k3145j2990K4587J8566j9233k3278R575K3323m459k3772L68K1169
573H599n038k4202J1621L3251r961l8009O629L8762j954l9493j844M4757J4550
$$ plain form
586 37668 -9086 -40280 736 41488 2336 -50977 -18884 43359 22220 -39523 -23816 39374
598 39374 30262 -38639 -43779 30564 58401 -9648 -54346 5342 60923 3627 -69173 -23904
610 -23904 60654 33829 -53573 -45911 38276 50353 -25557 -52436 15667 57180 -2535 -57118
622 -57118 -7480 56889 21439 -44827 -21637 38520 18963 -44213 -35070 31302 43336 -13738
634 -13738 -39627 4386 36568 986 -32411 -1653 31679 4100 -29095 -5000 27980 9398
646 9398 -22175 -12556 10092 -8 -19351 -3375 27411 19202 -17515 -19847 14753 18893 -14857
659 -14857 -18143 16069 20815 -12332 -19619 10129 16142 -14221 -25847 4021 24116 -680 -24228
672 -24228 1609 33803 10448 -30017 -13244 29586 18011 -26284 -22930 18060 23686 -10411
$$ packed form
586C7668m6754l1194M1016M0752l9152n3313L2093O2243k1139o1743J5707O3190
598C9374r112o8901n140P4343K7837o8049m4698N9688N5581n7296p2800M5269
610b3904Q4558k6825q7402P662Q4187J2077p5910k6879O8103M1513n9715n4583
622e7118M9638O4369l5450o6266K3190O0157j9557o3176R143O6372J2034n7074
634a3738k5889M4013L2182l5582l3397L0758L3332k7579l3195K4095L2980j8582
646I398l1573R619K2648j0100j9343J5976L0786q209l6717k332L4600M140l3750
659a4857l286L4212M746l3147p287K9748O013l0363j1626K9868K0095k4796k3548
672b4228K5837L2194k3355m0465J6773M2830j1575m4295L354M0990N626l4097
$$ plain form
684 -10411 -23770 2383 17965 -5417 -25848 -4029 23556 10930 -11750 -211 17034 1501
696 1501 -17413 -4302 12599 4019 -8239 -3360 3941 -1435 -6793 2281 9977 -5036 -22150 -5476
710 -5476 22899 13066 -13992 -242 28420 6362 -38713 -26446 25096 30307 -13606 -26968 13294
723 13294 31081 -12306 -43075 -637 43227 8630 -40304 -8980 46645 21772 -39292 -26998
735 -26998 32476 27833 -35119 -43533 21747 50012 -7198 -48222 345 47678 3072 -51984
747 -51984 -13955 50411 28468 -34082 -25700 31346 29833 -27675 -40420 12055 35621 -9945
759 -9945 -38425 4614 39395 2357 -34733 -3432 32561 5742 -30714 -8850 29879 17841
771 17841 -17969 -11441 19753 9127 -32619 -28445 20851 28994 -15013 -22927 21316 29034 -19913
$$ packed form
684a0411j3359K6153J5582k3382k0431K1819K7585j2626k2680J1539J7245j5533
696A501j8914J3111J6901q580j2258M879P301n376n358R074P696j5013j7114J6674
710e476K8375r833k7058J3750K8662k2058m5075J2267N1542N211m3913j3362M0262
723A3294J7787m3387l0769M2438M3864l4597m8934L1324N5625k4873o1064J2294
735b6998N9474m643o2952q414O5280K8265n7210m1024M8567M7333m4606n5056
747e1984L8029O4366k1943o2550Q382N7046j513n7508j2745N2475K3566m5566
759i945k8480M3039L4781l7038l7090L1301L5993k6819l6456K1864L8729j2038
771A7841l5810O528L1194j0626m1746M174M9296Q143m4007p914M4243P718m8947
$$ plain form
784 -19913 -37403 10395 38980 564 -32254 -401 38318 9859 -39506 -22143 30274 20093
796 20093 -33587 -28160 29382 35234 -17253 -31664 14208 32952 -10137 -37841 1137 40646
808 40646 12809 -32414 -15916 26689 13209 -31607 -23301 24038 26505 -14855 -24944 9654
820 9654 26101 -383 -20580 -672 21052 4222 -21559 -9790 15673 10025 -10150 -7123 5216
833 5216 -405 -10129 -3774 6043 4799 2038 6394 7063 -3207 -10722 -626 11587 841 -15478
847 -15478 -3443 17558 4202 -21777 -10531 18624 10588 -18889 -15499 17113 23440 -6244 -20225
860 -20225 6696 25575 -2104 -30176 -5896 27443 8103 -26545 -11465 23190 11881 -23678
872 -23678 -19570 16722 23625 -7130 -20082 7339 24488 -2674 -24885 307 25310 2472
$$ packed form
784a9913j7490M7798K8585l8416l2818L1853L8719k8459m9365J7363N2417j0181
796B0093n3680N427N7542N852n2487j4411M5872J8744m3089k7704L8978L9509
808D0646k7837m5223J6498M2605j3480m4816Q306M7339K467m1360j0089L4598
820I654J6447k6484k0197J9908K1724j6830k5781J1769K5463n648k0175L027J2339
833E216n621r724O355R817j244k761M356O69j0270p515J0096J2213j0746j6319
847a5478J2035K1001j3356k5979J1246K9155q036k9477L390L2612O327k9684j3981
860b0225K6921J8879k7679k8072K4280L3339j9340l4648J5080L4655j1309l5559
872b3678M108L6292O903l0755j2952K7421J7149k7162k2211K5192K5003k2838
$$ plain form
884 2472 -25455 -8205 18353 6523 -16494 -7594 14704 9712 -12612 -11938 11397 15542 -7164
897 -7164 -12438 10847 15079 -11607 -18374 7995 15556 -10962 -19127 7137 19636 -3640 -20729
910 -20729 765 24171 5865 -23825 -9288 26808 16473 -23429 -18734 21267 20641 -21312 -28365
923 -28365 10743 27890 -5111 -28203 -310 29994 7958 -28872 -12728 28922 20835 -21431
935 -21431 -20140 18233 21250 -15250 -25889 5140 22991 -1015 -23986 -5806 21389 9661
947 9661 -18430 -10570 18887 15251 -12220 -12716 10056 13278 -5611 -12938 160 9235 -65 -10661
961 -10661 -4170 7806 3663 -6967 -2156 7453 2888 -3676 1353 5803 -358 -3247 1738 2731 -3460
976 -3460 -5833 -434 4059 -663 -7774 -2737 8300 4895 -7894 -4213 10446 7842 -7386 -7086
$$ packed form
884B472k7927J7250K6558j1830k3017Q900K2298m992k2324O74K3335M145k2706
897g164n274K3285M232k6686o767K6369P561k6518q165K6264J2499k3276j7089
910b0729K1494K3406j8306k9690J4537L6096j0335l9902M695M0001o26m1953p053
923b8365L9108J7147l3001k3092K7893L0304k2036l6830J6144M1650q087m2266
935b1431J291L8373L017l6500j0639L1029J7851k4006k2971J8180K7195j1728
947I661k8091P860K9457l636k7471m96K2772L222j8889p327J3098R075r300j0596
961a0661O491J1976m143j0630M811R609m565o564N029M450o161k889M985R93o191
976c460k373N399M493m722p111N037J1037l405j2789L681J4659k604j5228L00
$$ plain form
990 -7086 6786 8641 -3250 -10094 -1647 7101 1121 -9963 -5423 8299 6583 -6663 -6101 6321
1004 6321 7502 -1755 -3883 2130 5060 1965 -3347 -4389 -142 2344 -2442 -4856 -877 1658 862
1019 862 569 -686 -1643 2881 6612 -297 -5453 2369 8097 -135 -8475 -3109 5188 3187 -6611 -9167
1035 -9167 2485 10333 -1502 -11881 1208 15212 3523 -12520 -4454 12799 8634 -8343 -10889
1048 -10889 4251 11487 -3269 -16156 -3374 14119 5032 -13327 -6629 12372 10058 -7376 -8815
1061 -8815 5649 11658 -172 -10021 -2399 9486 3731 -11731 -8967 7108 7607 -5893 -8262 3386
1075 3386 8516 1671 -5475 -2491 6054 6997 -2844 -6479 1936 6394 -1252 -6998 -2581 1785 630
1090 630 -2186 -2938 362 4567 2095 -3042 -535 4928 2541 -2529 -1442 2127 1319 -1515 -3113 -2807
$$ packed form
990g086J3872J855j1891o844Q447Q748n980j1084M540J3722j716j3246N62J2422
1004F321J181r257k128O013K930l095n312j042M247K486m786k414L979K535p96
1019H62k93j255r57M524L731o909n156P822N728q232q340N366Q297k001r798k556
1035i167J1652P848j1835j0379J3089J4004j1689j6043Q066J7253m165j6977k546
1048a0889J5140P236j4756j2887J2782J7493r087j8359O698J9001k314j7434j439
1061h815J4464O009j1830r849P622J1885n755j5462K764J6075M99j3500k369J1648
1075C386N130o845p146K984Q545R43r841l635Q415M458p646n746M417M366j155
1090F30k816p52L300M205k472n137K507N463k387n070J087L569q08k834j598L06
$$ plain form
1106 -2807 272 1275 -2510 -3399 1117 3382 532 -20 551 -107 2078 4024 -167 -4135 -404 3721
1122 3721 -28 -5462 -4018 2043 3542 -2021 -6751 -555 8234 3777 -6981 -2225 9619 5452
1136 5452 -7910 -5969 6774 7776 -5385 -11622 451 10958 662 -14351 -5126 14374 8461
1149 8461 -12269 -8819 12037 13227 -6445 -13127 3058 13504 540 -14275 -5147 12192 5621
1162 5621 -14155 -9813 11174 10366 -8666 -9723 7903 12227 -2103 -10251 297 10873 3124
1175 3124 -10163 -5738 8320 4933 -9009 -7084 5176 3863 -4820 -2819 4538 2704 -2242 -821
1189 -821 3745 2892 -2161 -3266 2756 4022 -4921 -6775 3019 5889 -5481 -7875 4304 7029 -4244
1204 -4244 -6705 4718 9593 -181 -7873 -344 9689 3423 -10941 -6540 9891 7200 -11168 -10965
$$ packed form
1106b807L079J003l785q89M516K265k850n52N71o58K185J946m191l968L731M125
1122C721l749n434J444O061J499n563m730O196Q789m457j0758M756J1844m167
1136E452j3362J941J2743J002j3161o237J2073J0507j0296j5013R225J9500n913
1149H461k0730L450K0856J190j9672o682J6185J0446j2964j4815R128J7339o571
1162E621j9776M342K0987q08j9032j057J7626M324j4330q148J0548J0576p749
1175C124j3287M425J4058l387j3942J925J2260j313q683K001P357j834m946J421
1189h21M566q53n053j105O022J266q943j854R794K870j1370k394J2179K725j1273
1204d244k461J1423M875r774p692P529J0033o266j4364M401J6431k691j8368K03
$$ plain form
1218 -10965 7748 10258 -6041 -10260 3693 10834 16 -8976 -449 11268 4827 -9602 -6258
1231 -6258 8051 5004 -9164 -6884 6470 5124 -5820 -5758 3276 5025 -1460 -3367 2372 5354
1245 5354 -135 -3528 2757 4689 -3729 -6780 3291 5280 -6482 -8437 5154 8602 -4185 -9343
1259 -9343 3134 11371 323 -11088 -1798 13929 6293 -13201 -8105 12806 9255 -14621 -14131
1272 -14131 10249 13770 -8089 -15323 5301 17973 -150 -17378 -2413 18908 7309 -17236
1284 -17236 -9080 16942 11939 -14884 -14887 9559 12888 -9392 -16282 4681 17084 282 -15282
1297 -15282 -834 16726 4403 -15022 -5380 14757 7065 -12571 -7438 9963 6637 -10059 -9793
1310 -9793 5793 8023 -6022 -9235 6807 13009 -3197 -10597 5255 12372 -5467 -13736 3782
$$ packed form
1218a0965J8713K510j6299m219J3953P141j0818q992Q527J1717o441j4429L344
1231f258J4309l047j4168K280J3354j346j0944O2R034J749o485j907N739K982
1245E354n489l393O285J932q418l051J0071J989j1762j955J3591L448j2787n158
1259i343J2477Q237j1048j1411R290J5727p636j9494N096K0911l551k3876M90
1272a4131K4380L521k1859p234K0624J2672j8123j7228J4965K1321j1599k4545
1284a7236Q156K6022n003k6823lK4446L329k2280o890K0963J2403j6802j5564
1297a5282J4448J7560j2323j9425R642K0137p692j9636N133J7401l326j6696K66
1310i793J5586K230j4045l213J6042O202j6206p400J5852P117j7839q269J7518
$$ plain form
1323 3782 14103 -1994 -14204 -507 13097 1086 -16013 -6655 14385 10210 -12450 -9655 15222
1336 15222 15019 -11453 -15953 8566 15831 -7215 -17565 2706 17557 862 -17926 -5804 15633
1349 15633 6792 -16771 -9805 16392 14727 -10230 -11700 10332 12554 -8742 -15729 2291 13345
1362 13345 -723 -12822 -1012 12831 2352 -13548 -5250 10976 5288 -9068 -2303 11731
1374 11731 6189 -7167 -4610 5329 1897 -8798 -6841 6181 7352 -5295 -6950 6990 7941 -8913
1388 -8913 -11362 7256 12865 -4254 -9913 7437 14453 -3312 -16031 -2817 12404 1630 -15547
1401 -15547 -5608 16580 10463 -13863 -11604 12406 11977 -11958 -13654 9770 17797 -2600 -14190
1414 -14190 1494 14504 -1477 -19356 -6435 14922 7172 -13295 -5872 14917 9129 -12571
$$ packed form
1323C782J0321j6097j2210J3697J3604j2011j7099R358K1040m175k2660K795K4877
1336A5222k03k6472m500K4519P265k3046j0350K0271J4851j6695j8788J2122K1437
1349A5633q841k3563O966K6197j665k4957j470K2032K222k1296o987J8020J1054
1362A3345j4068j2099J1810J3843j0479j5900Q298J6226n688j4356O765J4034
1374A1731n542j3356K557R939l432j0695J957J3022J171j2647j655J3940R51j6854
1388h913k449J8618N609j7119n659J7350P016j7765j2719J3214J5221j0774j7177
1401a5547R939K2188o117k4326K259K4010m29k3935j696K3424Q027k0397j1590
1414a4190J5684J3010j5981j7879J2921K1357p750k0467P423K0789n788k1700
$$ plain form
1426 -12571 -11138 8957 10794 -6209 -9593 7272 13223 -3281 -13613 -318 10274 -3475 -14640
1439 -14640 574 14355 2221 -10491 331 12777 1303 -13196 -4763 11998 7295 -9663
1451 -9663 -6483 11667 9372 -13158 -15280 7569 12957 -8245 -14128 8393 18462 -2139 -16346
1464 -16346 -250 16244 2701 -17290 -6828 17344 11184 -14663 -12835 11936 11970 -13133 -16984
1477 -16984 7622 16792 -2352 -13299 2864 16516 2021 -15794 -5670 13991 6805 -12830
1489 -12830 -7636 12154 8447 -11077 -10577 6604 8015 -6178 -8811 5065 11457 -289 -8400
1502 -8400 1574 9649 -1454 -11433 -353 10065 -238 -9869 137 8753 -1068 -10758 -2656 8671
1516 8671 3759 -7361 -3235 10231 7787 -8378 -9102 7839 9293 -8899 -12004 6359 11768 -5045
$$ packed form
1426a2571J433K0095J837j7003l384J6865N951j6504j0332J3295J0592j3749j1165
1439a4640J5214J3781j2134j2712J0822J2446j1474j4499Q433J6761m703j6958
1451i663L180J8150k295k2530k122K2849N388k1202n883K2521J0069k0601j4207
1464a6346J6096J6494j3543j9991J0462K4172o160k5847J828K4771L4k5103l851
1477a6984K4606R170j9144j0947J6163J3652j4495j7815J0124J9661p186j9635
1489a2830N194J9790l707j9524N00J7181J411j4193k633J3876O392j1746q111
1502h400R974Q075j1103r979J1080J0418j0303r631J0006Q616r821r690Q102J1327
1516H671m912j1120M126J3466k444j6165p24J6941J454j8192l105J8363N409j6813
$$ plain form
1530 -5045 -12725 2055 12212 312 -12460 -2865 13262 7269 -10193 -6778 11482 9196 -10297
1543 -10297 -11464 6208 9685 -5636 -10356 2722 9727 -705 -9583 -1142 9818 3496 -8046
1556 -8046 -2667 9114 4415 -7276 -3356 6494 2554 -7308 -4418 4308 3105 -4719 -3741 4329 5331
1571 5331 -3682 -5290 4699 7618 -3446 -7191 4588 8719 -3890 -9573 2028 8406 -2346 -10714
1585 -10714 -1162 9869 2967 -9863 -4408 10691 7909 -9012 -8756 9122 10936 -6764 -11064
1598 -11064 4534 10968 -3114 -12587 -1307 10805 3048 -11007 -5344 10252 7778 -7926 -7641
1611 -7641 8325 9314 -5369 -8676 3623 8159 -1988 -8742 -1432 6784 1164 -7400 -3308 6640
1625 6640 3391 -5389 -2499 6438 3659 -4201 -2600 4224 2501 -3474 -3207 2234 2614 -3323 -4535
$$ packed form
1530e045p680J4780J0157j1900j2772R595J6127n993j7462L415J8260k286j9493
1543a0297j167J7672L477j5321m720J3078P005j0432q878Q441J0960o322j1542
1556h046N379J1781m699j1691L920R850l940r862K890Q726j203p824R78Q070J002
1571E331r013j608R989K919j1064l745J1779M131j2609n683J1601O378j0752q368
1585a0714R552J1031o902j2830N455J5099k782j6921K56J7878J814j7700m300
1598a1064J5598O434j4082r473J1280J2112p757j4055N663J5596k474j5704K85
1611g641J5966R89j4683l307J2299M536j0147o754P310Q216n620q564M092R948
1625F640l249q780K890Q937k779p860J601O824j723n975K67N441L80n937j212
$$ plain form
1640 -4535 1834 4191 -2856 -5134 3253 6442 -1922 -5010 2911 6654 -1001 -6258 -664 5613 1391
1655 1391 -6573 -4231 5014 4456 -5932 -6275 5023 6981 -3442 -6017 3168 7098 -191 -5716 -1088
1670 -1088 5287 2508 -5459 -4685 3815 4325 -4326 -5375 2666 4572 -1428 -3518 1279 4146 1289
1685 1289 -1843 -1056 1994 1997 -1615 -2433 318 1181 -1378 -1720 144 -274 -677 1186 1112 -861 59 2385
1703 2385 1388 -991 -687 1293 1387 -963 -2695 -1348 2027 785 -3752 -2089 3415 2622 -3001 -2157
1719 -2157 3014 3811 -689 -2682 391 3466 1235 -3828 -2727 2215 2287 -3628 -3526 1754 2600 -1143
1735 -1143 -2355 719 2673 1526 -754 -1202 1781 2762 -928 -2624 150 1267 -969 -1813 -1202 -23
1751 -23 781 455 -1233 -631 2061 2041 -658 -680 1567 1777 -206 -1436 -1076 113 878 -1392 -2839 -95
$$ packed form
1640d535O369K357p047k278Q387L189q364l088P921L743p655n257N594O277m222
1655A391p964K342R245n58j0388l43J1298J958j0423k575R185L930p289n525M628
1670a088O375k779p967P74Q500N10q651j049Q041J906o000k090M797K867k857
1685A289l132P87L050Ll612q18K751Q63k559l42J864m18m03J863p4j973R20K326
1703B385r97k379L04J980R4k350j732J347L375j242m537J663N504p93n623Q44
1719b157N171P97m500j993L073L075k231n063J101M942P2n915J02N280Q46l743
1735a143j212L074J954j147k280m48K983R81l690j696K774J117k236q44O11J179
1751b3Q04l26j688O02K692k0k699k2K247K10j983j230L60J189P65k270j447K744
$$ plain form
1769 -95 2089 -442 -2567 392 2671 1198 -911 -199 1633 1526 180 -1807 -625 1373 -28 -2571
1785 -2571 -1630 734 422 -874 -631 -252 711 1958 725 -1175 244 2686 998 -1775 -1541 1003
1801 1003 1461 -1158 -3177 -1236 2524 1530 -3669 -2003 3904 3690 -2429 -3079 2434 4410 -886 -3956
1817 -3956 -558 4230 1279 -5524 -3822 3810 3704 -4262 -4603 3508 5325 -1680 -4309 1314 5291
1832 5291 1199 -4008 -1776 4264 2895 -4307 -4334 2863 3109 -3801 -3900 2380 3286 -1428 -2607 1322
1848 1322 3435 614 -1832 -17 2920 543 -3077 -982 2663 -271 -3801 -847 3002 -446 -3649
1863 -3649 315 4002 703 -2957 -430 3774 2553 -3141 -3199 3279 3986 -3726 -5788 2509 5557 -2657
1879 -2657 -6430 1315 6312 321 -5534 -649 6490 3481 -5047 -4137 5411 5446 -4527 -6661 3434
$$ packed form
1769i5K184k531k125K959K279j473k109P12J832j07j346j987J182J998j401k543
1785b571R41K364l12j296K43L79R63J247j233j900J419K442j688k773K34K544
1801A003M58k619k019J941L760r94n199J666N907k14o119o50N513J976n296l070
1817c956L398M788k951o803J702P632j06p966l41Q111J817p005k629N623L977
1832E291m092n207K232O040j369p202k7P197K46o910r9O280R06m714j179L929
1848A322K113k821k446J815K937k377l620K095L645k934l530K954L849l448l203
1863c649L964L687l299l660K527M204j221n694n8O478P07p712k062Q297L048q214
1879b657l773P745M997n991n855M885P139l009q528R10R548L5r973k134J0095
$$ plain form
1894 3434 5958 -3293 -6865 876 5967 -301 -5208 -805 5572 2538 -4400 -2451 4844 3997 -4049
1909 -4049 -3790 3498 2879 -4007 -4115 1904 3089 -2388 -3105 1747 3633 -889 -3010 1692 4618 -375
1925 -375 -4322 1132 5055 -1093 -5788 73 4671 -675 -6162 -1407 5416 2210 -4834 -2539 5867
1940 5867 4982 -4496 -5527 4530 6618 -3525 -7267 2643 7042 -2136 -8071 -631 6874 1367 -7052
1955 -7052 -2956 7172 5187 -5443 -4719 6148 6039 -4764 -6451 3371 6314 -2527 -6460 986
1969 986 5560 -1022 -6700 -1175 6127 2164 -5432 -946 6828 2903 -5587 -2504 5388 2543 -5198
1984 -5198 -3367 4325 3464 -4304 -4687 2770 4907 -3490 -6273 3155 7654 -1313 -6292 2322 7941
1999 7941 -990 -8278 -1011 7193 1706 -7241 -3407 6848 4884 -7058 -7147 5743 7780 -4518
$$ packed form
1894C434K524r251l572P741N091o268m907M403O377l034o938J949P295q47q046
1909d049K59P288o19o886j08O019J185n477p17M852J886m522k121M702K926m993
1925c75l947N454L923o148m695N861M598n346n487M755O823l206p044K295Q406
1940E867q85r478j031J0057K088j0143l742R910M399r178n935P440P505n507q419
1955g052M096J0128j985j0630P24J0867j09j0803j687R822K943q841l933P446
1969I86M574o582n678N525P302l963p596M486P774l925q490L083P892k845p741
1984e198J831P692q61p768l83P457K137q397k783R428M499q967m979Q614N619
1999G941q931p288P267Q204n487q947L834J0255j964j1942q9J2890K037j2298
$$ plain form
2013 -4518 -7402 4618 9994 -1485 -8258 756 7832 158 -8963 -3410 7401 4044 -6668 -5013
2027 -5013 6198 5647 -6110 -6621 4785 6802 -2366 -5319 3433 6326 -1602 -6781 -749 5181 -385
2042 -385 -6189 -886 6615 1745 -5942 -1549 5658 1535 -6006 -1909 6108 3746 -3712 -2956 4622
2057 4622 3827 -5201 -6754 2518 5816 -3112 -6391 3454 8042 -1572 -7655 351 7428 649 -7166
2072 -7166 -1215 8072 4373 -6884 -5525 5293 4807 -6743 -7777 4744 8040 -2692 -7050 2847
2086 2847 7839 -944 -7928 -651 7221 2181 -6008 -2509 6635 3428 -6924 -5768 4119 4059 -4815
2101 -4815 -4211 4924 5837 -2426 -4602 2010 4660 -1941 -5510 951 6203 64 -5782 -218 5536
2116 5536 -936 -7266 -1437 5885 1627 -5035 -955 6777 3577 -5246 -4520 4299 4915 -4548 -6099
$$ packed form
2013d518k884J2020N376j1479o773R014P076p674r121N553J0811l357j0712J655
2027e013J1211n51j1757n11J1406K017r168k953Q752K893p928n179O032N930n566
2042c85n804N303P501m870p687M393P207m123p541M097Q017k362p458P56P578
2057D622p95r028j553R272L298q928l279R845M588r614o083Q006P077o779p815
2072g166N951R287l699j1257J359J0818m86j1550j034J2521L296j0732m358R897
2086B847M992q783o984P277P872n040q189L499R144l207j0352J156R887o0q874
2101d815O04R135R13q263k176O612K650o601l569O461N252o139n846N564N754
2116E536o472o330N829P322m258o662M080P732l200q823P26Q819O16r463j551
$$ plain form
2131 -6099 4555 7102 -3391 -7633 1351 6796 -1748 -7925 -71 8288 2907 -6018 -2703 6808
2145 6808 4632 -6688 -6382 5150 6252 -4485 -6548 3503 6710 -2556 -7466 307 6240 516
2159 516 -5521 -375 7149 3109 -5653 -3359 5101 2818 -5745 -3873 4594 3962 -3545 -3670 2748 3594
2175 3594 -2827 -4739 1978 5050 -565 -4394 1536 6077 -587 -6448 -682 5392 -214 -6111 -980
2190 -980 5712 1953 -5234 -3003 4427 4068 -3798 -4655 4371 6249 -2767 -5851 2681 6152 -2050 -7303
2206 -7303 -512 5595 560 -5961 -1986 5615 3176 -4882 -3984 4583 5047 -3581 -4420 3573 5194 -2449
2222 -2449 -5418 769 4111 -1158 -4689 -615 4082 1031 -4024 -1101 4303 2069 -3574 -1367 3824
2237 3824 1809 -3105 -1527 3129 1647 -3129 -2938 1913 2460 -2577 -3482 2028 4141 -1282 -4099 1566
$$ packed form
2131f099J0654K547j0493m242Q984N445q544o177P854Q359n381q925L315R511
2145F808k176j1320L06J1532J102j0737k063J0051L207r266m910P773N933n724
2159E16o037N146P524m040q762K294Q460k283q563J872Q467o32p507j25O418Q46
2175C594o421j912O717L072n615l829N930M541o664n861N766O074n606n897N131
2190i80O692l759p187K231P430l59p866q57R026J878r016l084Q532L471q202n253
2206g303O791O107n035o521L975P601k439q058Q98Q567M64q628q39P993J621p643
2222b449k969O187L342n269l531M074M697l051n055K923N404k234n643K207N191
2237C824k015m914J578M656j482m776J91M851N47n037r05N510K113n423k817N665
$$ plain form
2253 1566 4939 -507 -4644 661 4697 263 -5025 -1605 4003 1657 -4600 -3677 3523 4000 -2957
2268 -2957 -4454 3074 5296 -1652 -4615 1318 5076 -347 -4426 -879 3933 1554 -4165 -2890 2817
2283 2817 2855 -3331 -3424 2882 3643 -1805 -2990 2114 3130 -742 -2903 302 2161 -119 -2839 -991
2299 -991 2257 350 -2994 -641 2798 870 -2307 131 3009 985 -2038 -827 2389 1412 -1906
2314 -1906 -2007 1446 2202 -2072 -3068 1242 3424 -1175 -3329 1133 3752 -67 -3235 90 3497 1501
2330 1501 -3023 -2195 2544 2303 -2731 -3831 1381 3346 -1590 -3408 986 3490 -80 -2567 131
2345 131 2633 1443 -1974 -1410 1693 1900 -1995 -2488 827 1844 -1387 -1973 598 1470 -280 -659 347
2362 347 1019 638 -483 -336 550 295 -935 -626 815 -221 -1441 -128 1048 -468 -1069 454 944
$$ packed form
2253A566L373n446m137N305M036m434n288L420N608k346o257R23P200M77o957
2268b957j497P528K222o948k963N933L758n423m079L547M812k379n719J275N707
2283B817L8o186r3O306P61n448j185N104J016l872k161L205J859k280k720J848
2299i91L248j907l344K353L439j928l177K438K878k024l023J211L216r77l318
2314a906j01L453P56m274r96M310K182m599k154M462K619l819l168L325L407j996
2330A501m524Q28M739k41n034j100N212J965m936j818M394K504l570k487K698
2345A31K502j190l417N64L103K07l895m93L315J017l231n86K571Q72j750l79J006
2362C47O72l81j121J47Q86k55j230L09J441j036j220J313J176j516o01J523M90
$$ plain form
2379 944 -18 -378 383 1140 688 -661 -959 756 1170 -1354 -2026 619 1596 -997 -1761 473 1749 103
2397 103 -946 -492 1460 1069 -288 -974 845 1667 -786 -1756 167 906 -192 -1230 -229 644 493
2414 493 82 -473 265 1487 611 -655 66 852 199 -537 -365 -379 -232 95 -695 -1136 102 678 -133
2433 -133 -682 379 1105 125 -13 -21 439 626 -54 -1040 -269 826 -268 -1416 -249 629 166 -323 374
2452 374 463 830 395 273 71 524 589 -570 -540 211 -499 -448 1 -420 -814 121 464 -319 -446 915 1154
2473 1154 -293 -382 371 937 376 -762 -1060 733 659 -1162 -2062 688 1669 -808 -1709 618 2033 303
2491 303 -1365 -226 1605 1521 -1196 -1741 1116 1494 -1316 -2598 530 1833 -774 -2030 311 1605
2507 1605 333 -1194 -326 1617 1416 -1015 -1238 1133 1091 -1327 -1601 837 701 -1414 -1268 756 759 -753
$$ packed form
2379I44r62l60P61P57m52j349k98J715M14k524o72K645R77k593p64K234J276j646
2397A03j049M54J952l91j357o86J819Q22k453r70J923P39j098j038J001Q73j51
2414D93m11n55P38J222q76j266P21P86o53p36J72j4J47L27p90m41J238N76q11
2433a33n49J061P26r80j38qM60J87o80r86P71J095j094j148J167Q78m63m89O97
2452C74Q9L67m35j22k02M53O5j159L0P51p10N1M49m21l94R35L43p83j27J361K39
2473A154j447q9P53N66n61j138k98J793p4j821r00K750R81k477r01K327J415j730
2491C03j668J139J831q4k717n45K857L78k810j282L128J303k607j256K341J294
2507A605j272j527Q68J943k01k431k23K371m2k418k74K438j36k115J46K024Lj512
$$ plain form
2525 -753 -506 469 1342 -138 -936 501 1456 -273 -1947 62 2053 -554 -2578 -231 2222 -73
2541 -73 -2272 -550 2354 1544 -1454 -1633 1652 2697 -1191 -2851 1093 2945 -1076 -3518 140 3092
2557 3092 -158 -3084 -738 2676 1566 -2169 -1537 2287 2620 -1703 -2520 1822 2901 -1597 -2977 683
2573 683 2375 -691 -2961 -474 2127 646 -2039 -609 2339 1423 -1771 -1184 2264 1458 -1737 -1432
2589 -1432 1746 1162 -1633 -1725 992 1550 -1371 -2199 992 2399 -593 -2487 900 3087 -162 -3265
2605 -3265 176 3159 17 -3161 -904 2575 1060 -3212 -2162 2283 2861 -2112 -3138 2362 3945
2620 3945 -1213 -3447 1234 3526 -257 -3893 -208 3213 674 -3613 -1921 2416 2009 -2954 -2589
2635 -2589 2895 3163 -1510 -2420 2138 3220 -1268 -3023 757 2567 -453 -3004 -313 2420 406
$$ packed form
2525g53K47R75Q73j480p98J437R55j729j674K009J991k607k024K347K453k295
2541g3k199J722K904q10k998j79L285J045l888j660L944J852m021k442L658K952
2557C092l250k926K346L414j110l735O32L824L33m323q17M342J079m498j380L660
2573F83J692l066k270K487K601j481k685J430K948r16l194N87L448q06l195L05
2589a432L178n84k795r2K717N58k921q28L191J407k992j894L387K187l249l103
2605c265L441K983l142l178K257L479j515m272J050M445N78m973j026N500J583
2620C945n158k234M681K292l783l636L685L421k539m287J692M337m07m963L65
2635b589N484K68m673r10M558J082m488j755L780J810l020k551K691K733k014
$$ plain form
2650 406 -3003 -1153 2838 884 -2812 -1082 3628 1855 -2397 -1408 2687 1472 -2417 -2520 1620 2586
2666 2586 -1574 -3284 998 3480 -1067 -3878 361 4276 335 -3449 217 4074 1140 -3523 -1937
2681 -1937 2826 2031 -3206 -3277 2431 3657 -1907 -3791 1567 3768 -1267 -4033 1004 4209 475 -3104
2697 -3104 -551 3521 1290 -3715 -2601 2536 2314 -2673 -2459 2958 3095 -2050 -2900 1768 2879 -1160
2713 -1160 -2467 1225 3289 99 -2982 -599 2704 -213 -3768 -851 3354 1238 -2986 -755 3404
2728 3404 1512 -3118 -1743 2394 2612 -1771 -2715 1873 3254 -1611 -4444 587 3464 -1059 -4432
2743 -4432 414 4489 949 -3545 -1169 3602 1789 -3336 -2586 3118 3270 -2418 -3236 2078 3418 -2153
2759 -2153 -4409 734 3524 -264 -3000 312 3864 1075 -3164 -1364 2841 1721 -2911 -1805 2949
$$ packed form
2650D06l409J850L991j954l696J730M710j773m252R89M095j215l889j03M140R66
2666B586m160j710M282K482m547k811M239L915l941l784L666L857k934m663J586
2681a937M763p95n237p1N708J226n564j884N358K201n035k766N037L205l734l579
2697c104K553M072k231n005J114N137k22m987K14N417J37n145q50M668J111m039
2713a160j307L692K064l190l081K383L303k917l555K917M205k116m224K231M159
2728C404j892m630J375M137K18m383r44M588J381m865k833N031K877m523l373
2743d432M846M075l540m494K376M771j813n125P50N704J52n688q18N314J340n571
2759b153k256N143K790l788k736L312L552k789m239J800M205j120m632J106M754
$$ plain form
2774 2949 2416 -2689 -2264 1699 1583 -2231 -2676 1549 2903 -573 -2101 1184 3063 -442 -3502 -403
2790 -403 3098 265 -3568 -210 3479 621 -3802 -1591 2425 1552 -2715 -2123 2745 3406 -1385 -3100
2806 -3100 1614 3207 -1759 -4137 465 4143 -302 -3535 -455 3317 493 -3516 -1837 2985 2625
2821 2625 -2223 -2281 3076 3134 -1992 -3654 955 2884 -1638 -3207 818 3075 -233 -3091 -710 2376
2837 2376 795 -2220 -1210 2824 1972 -2148 -1175 2552 1647 -3017 -2309 1806 1754 -1873 -2308 1692 2607
2854 2607 -870 -2715 712 2874 -300 -2808 215 3577 460 -3377 -926 2897 714 -3095 -1861
2869 -1861 2172 2047 -2048 -2523 1751 2892 -1560 -3245 1276 3536 -611 -3141 461 3188 83
2884 83 -3333 -1215 2252 1132 -2411 -1882 2418 2449 -1802 -2164 1841 2422 -1202 -2205 1256 2161 -607
$$ packed form
2774B949n33n105M25L963j16l814m45M225J354l476j528L285J879l505l060L099
2790d03L501k833l833L358L689k858m423K211M016q73m267N92M868O61m791j715
2806c100M714J593m966k378M602L678m445l233L080L772k824m009J679M822l60
2821B625m848n8N357N8n126j662M609J929m522j569M025K257l308k858K381L086
2837B376j581l015J010M034q52m120R73L727r05m664P08M115n2l627m35M000R15
2854B607l477j845L427K162l174k508L023L362l117l837K451L823k183l809J234
2869a861M033j25m095m75M274J141m452j685M521K260m147k530L602K727l105
2884H3l416K118L467j120l543N29M300L1m251l62M005N81l624j003L461R05k768
$$ plain form
2901 -607 -2461 77 1911 -260 -2273 -742 2172 534 -2193 -602 2393 843 -1939 -876 1868
2916 1868 1083 -1557 -1211 1432 1433 -1313 -2233 859 1955 -714 -2295 429 2719 130 -2323 385
2932 385 2869 545 -2281 -761 2272 1190 -2020 -1611 1627 1652 -1479 -2807 1160 2199 -1050 -2391
2948 -2391 767 2671 96 -1916 -137 2107 801 -1678 -1115 1521 1036 -1545 -1380 1145 1307 -1396
2964 -1396 -1392 1176 1258 -517 -1187 807 1364 -201 -1260 98 1205 80 -1561 -347 1507 166 -1798
2981 -1798 -278 1719 438 -1343 -370 1761 1164 -955 -770 1317 1484 -788 -1552 613 1764 -543
2997 -543 -2177 250 1804 -20 -1733 -74 1648 869 -1354 -716 1244 1347 -781 -1477 654 1267
3013 1267 -875 -1822 225 1217 -362 -1366 125 1210 390 -846 -192 1088 945 -546 -477 682 646
$$ packed form
2901f07j854K538J834k171k013J531K914j638k727J591K995j550k782J063K744
2916A868p85k640L46K643Jk746r20L092J096k669j581K724K290k589k453K708
2932C85K484k324k826J520L033j082l210M09L238K5l131j328L967J039l249j341
2948b391L158J904k575k012J779K244j306k479N63K636m85k581J65K525J62k703
2964a396MK568Q2j775o70J994N57j565j059J358J107j125j641J214J854j341j964
2981a798J520J997j281j781R73K131n97k119J85K087J67k272p64K165J151k307
2997e43j634K427J554j824j713J659J722p79k223O38J960J03k128o96K131O13
3013A267k142r47K047R92j579j004J491J085q20j236O54J280j43j491O9J159l6
$$ plain form
3030 646 -964 -1007 675 420 -766 -696 462 497 -255 -195 383 565 -1 -396 262 603 118 -1174 -161
3049 -161 659 -408 -1058 16 410 -97 -696 -119 646 736 -392 -609 540 949 -176 -946 99 736
3067 736 -308 -1128 -310 649 235 -648 -214 265 522 -148 -513 529 1033 131 -406 308 545 -202 -541
3086 -541 -206 -99 -113 -309 -227 -385 233 124 -378 -114 434 278 -187 188 19 25 82 74 -555 -254 247 -187
3108 -187 -542 -297 137 91 -8 -193 244 392 51 -135 -7 302 -134 -577 -278 -127 -237 -613 1 -39 51
3129 51 113 -35 -267 138 255 222 67 267 109 -125 112 -253 -372 43 318 -448 -710 237 584 -208 -666
3150 -666 63 557 551 -240 -326 450 771 -382 -1144 116 780 -201 -1092 -29 1060 12 -949 -59 846
3169 846 574 -495 -437 514 1065 -459 -838 411 729 -596 -892 321 623 -25 -884 -100 566 430 -396
$$ packed form
3030F46j610m3J682k55j186P0J158L5p52O0N78J82n66l95O58L41m85j292J013
3049a61Q20j067o50J074L94n07n99N77P65R0j128k17J149M09j125p70J045O37
3067G36j044q20Q18R59m14q83M34M79K57o70l65J042N04r02n37P14K37p47l39
3086e41L35J07j4j96Q2j58O18j09n02K64N48j56m65L75j69ON7qo29L01N01m34
3108a87l55K45M34m6r9j85M37J48l41j86J28L09m36m43K99J51j10l76O14m0R0
3129E1O2j48k32M05J17l3j55K00j58k34K37l65j19M15K75p66k62R47L47p92m58
3150f66P29M94op91q6P76L21j153p62J260O64r81q91J063J089j048r61Q90R05
3169H46k72j069N8R51N51j524l79J249L18j325k96J213L02o48q59P84O66j36q26
$$ plain form
3188 -396 -223 1080 709 -818 -518 602 414 -816 -589 443 489 -763 -509 434 570 -217 -765 377
3206 377 1168 -195 -1022 256 1534 1 -1644 -137 1403 58 -1573 -771 1050 670 -1079 -770
3222 -770 751 1418 -442 -1140 786 1742 -296 -1612 325 1419 -214 -1713 -345 1154 238 -1256
3238 -1256 -926 1021 1070 -821 -946 1017 1416 -821 -1574 799 1246 -618 -1287 314 1073 -126 -1404
3255 -1404 -376 1118 473 -1054 -395 1515 737 -1030 -687 1434 613 -1524 -807 880 939 -1235 -1031
3272 -1031 541 1207 -518 -1604 476 2197 -9 -1890 292 1908 131 -1949 -538 1622 588
3287 588 -1700 -1106 1135 1363 -1262 -1659 793 1943 -618 -2050 915 2295 -255 -1708 304 1950
3303 1950 210 -1728 -695 1489 566 -1509 -1246 1185 1227 -1582 -1535 962 1680 -894 -1185 788 1566
$$ packed form
3188c96J73J303l71j527L00J120j88j230K27J032M6j252K54R43J36p87n48J142
3206C77P91j363q27J278J278j533j645J507J540j345j631Q02J821l80j749L09
3222g70J521O67j860o98J926R56k038j316J937J094j633j499J368J499r16j494
3238a256L30J947M9j891j25J963L99k237p53K373M47j864o69J601P59j199j278
3255a404J028J494o45j527O59J910p78j767L43K121q21k137P17J687N9k174K04
3272a031J572O66j725j086K080J721k206j881K182J616j777k080J411K160j034
3287E88k288N94K241K28k625l97K452J150k561j432K965J380k550j453K012J646
3303A950j740j938J033K184r23k075K63K431M2k809M7K497P18k574k91J973P78
$$ plain form
3320 1566 -538 -1320 399 1280 -451 -1646 -209 1726 470 -1802 -467 1988 691 -1743 -621
3335 -621 1728 1136 -1299 -822 1478 1398 -1229 -1937 470 1877 -478 -2205 554 2543 -21 -2328
3351 -2328 -112 2065 273 -1796 -493 1957 1392 -1578 -1430 986 1425 -1528 -2229 989 2024 -506
3367 -506 -2048 606 2109 -83 -2104 -36 1699 403 -1362 -388 1799 720 -1721 -1695 1014 1137
3383 1137 -1682 -1550 1399 1413 -950 -1252 1002 1640 -756 -1900 446 2064 49 -1701 -222 1855
3399 1855 177 -2299 -649 1826 739 -1731 -789 1867 1525 -1324 -1292 1012 1750 -1084 -2063 883
3415 883 2636 -525 -2369 85 2173 -258 -2488 -198 1962 1015 -1363 -448 1948 1489 -1807 -1848
3431 -1848 1141 1690 -982 -1852 701 1886 -777 -2203 189 1467 -315 -1747 -57 2015 938
$$ packed form
3320A566k104p82J719Q81j731j195J437J935j256k272J335K455j297k434J122
3335f21K349n92k435M77K300q0k627p08K407J407k355j727K759J989k564k307
3351b328K216K177j792k069J303K450n65k970J48K416M39k953p01L218J035k530
3367e06j542K654J503k192k021K068J735j296j765R74K187j079k441K6K709J23
3383A137k819J32K949J4k363l02K254O38k396j144K346J618k015j750J479K077
3399A855j678k476J650K475j087k470R42K656l42k849L2K304P38k834r79K946
3415H83J753l161j844K454K088k431k230K290K160r47k378R15K396m59l296m1
3431a848K989N49k672q70K553J185k663j426K392J278j782j432J690K072j077
$$ plain form
3446 938 -1602 -481 1578 889 -1960 -1311 1668 1237 -1432 -1266 1222 1298 -1328 -1786 813 1769 -333
3463 -333 -1869 366 2310 60 -2160 -114 2002 -48 -2138 -672 1903 1145 -1877 -1198 1063 1463
3479 1463 -1528 -1865 1052 2423 -273 -1980 558 2081 -528 -2377 -239 1827 345 -1789 -531
3494 -531 1785 904 -1701 -1355 1500 1401 -1336 -1423 1392 1770 -894 -1473 659 1355 -516 -2003 -75
3511 -75 1582 -21 -1649 -432 1735 497 -1782 -394 1744 860 -1561 -787 1645 1183 -1396 -1297 788
3528 788 1322 -1198 -1719 662 1671 -438 -1986 140 2052 174 -2193 -247 2131 794 -1545 -815
3544 -815 1530 705 -1572 -1478 1015 1417 -1073 -1631 855 2067 -528 -1799 618 1664 -156 -1598
3560 -1598 -108 1651 300 -1597 -595 983 961 -1492 -906 1182 1229 -1028 -961 1156 1361 -666 -1098
$$ packed form
3446I38k540J121K059o89k849O49K979m31k669J66K488P6k626m58K599R56k102
3463c33j536K235J944k250k220K046K116k050k090J466K575p58l022O79K261M00
3479A463k991l37K917J371k696j707K538J523k609j849K138K066j482k134J258
3494e31K316q81k605L46K855r9k737q7K815L78k664n79K132O96j871j487J928
3511g5J657j603j628J217K167j238k279J388K138q84k421P74K432m62k579R9K085
3528G88N34k520n21K381J009k109j548K126J912j878k367J946K378j337k339P30
3544h15K345q25k277R4K493M02k490n58K486J212k595j271K417J046j820j442
3560a598J490J759j351j897J002J578k2k453N86K088M7k257O7K117K05k027m32
$$ plain form
3577 -1098 465 1232 -444 -1219 44 1080 -176 -1701 -402 1421 383 -1513 -394 1586 672 -1392
3593 -1392 -571 1152 731 -962 -1233 867 1293 -637 -1600 681 1326 -146 -1605 34 1755 324
3609 324 -1382 -91 1438 758 -1044 -739 1153 1061 -1114 -1279 1002 1177 -587 -1437 543 1183 -393
3626 -393 -1045 178 1252 255 -1140 -254 1094 714 -729 -738 651 444 -1133 -720 496 761 -931 -886
3644 -886 643 854 -316 -486 314 818 28 -894 -52 1047 69 -1178 -285 969 89 -1298 -203 913
3662 913 415 -951 -351 872 795 -259 -790 415 1169 -205 -1025 353 1112 -60 -1092 -156 787 10
3680 10 -849 -315 650 598 -249 -598 695 779 -99 -704 391 677 -405 -823 -68 462 -517 -350 -173 639
3700 639 226 -326 66 677 328 -317 -522 420 229 -416 -305 503 102 -506 -370 153 361 -43 -160 195
$$ packed form
3577a098J563P67j676p75J263J036j256j525J299J823j038j896J119J980r14k064
3593a392Q21J723m21j693k71K100M26j930r63K281O45j472j459J639J721j431
3609C24j706J291J529o80j802L05J892r2k175j65K281J75j764q50J980O40j576
3626c93o52J223J074r97j395Q86J348l80j443rJ389k07j577M13J216K65j692M5
3644h86J529K11j170j70Q00N04p90r22Q42J099r78j247Q93J254q80j387J095J116
3662I13m98j366O00J223p7j054n31J205P54j374q20J378P59j172j032R36R43p77
3680A0q59N34R65n2q47l49J293Q4q78o05J095K86j082m18P55N30r79J67J77Q12
3700F39m13n52L92O11l49o45k05R42j91o45J11Q08m01o08J36N23K08m04j17L55
$$ plain form
3720 195 757 -53 -378 110 802 -56 -644 -168 581 -141 -595 -242 218 185 -134 -160 297 332 183 -477 68
3741 68 657 76 -351 205 469 -51 -577 -355 21 56 -326 -214 -49 652 8 -49 48 526 -46 97 59 72
3763 72 -354 -70 -99 -234 -123 -132 82 -259 52 373 -276 90 106 -174 306 203 -108 -266 285 207 -208 -178
3785 -178 85 -152 -301 38 24 -69 326 231 28 341 200 151 -81 114 -65 -117 227 130 -74 41 84 -144
3807 -144 -167 -63 242 96 165 -25 28 188 95 3 127 442 -70 -236 252 417 -292 -628 -74 214 71 -185
3829 -185 -233 285 495 119 -464 348 651 -156 -622 82 432 -563 -470 -34 433 208 -174 -539 321 559 -51
3850 -51 -360 594 440 -288 -606 236 317 -188 -392 87 284 23 -354 -224 406 280 -623 -166 574 221 -503
3871 -503 -165 630 112 -532 -327 369 482 -345 -402 276 511 -391 -638 20 827 236 -595 112 1033 -57
$$ packed form
3720A95N62q10l25M88O92q58n88M76P49p22m54L53M60l3l19k6M57L5j49o60N45
3741F8N89n81m27N56K64n20n26K22L76L5l82J12J65P01o44n7R7M78n72J43l8J3
3763G2m26K84k9j35J11rK14l41L11L21o49L66J6k80M80j03l11j58N51p8m15L0
3785a78K63k37j49L39j4r3L95r5k03L13j41m9k32J95j79n2L44r7k04J15M3k28
3807a44k3J04L05j46O9j90N3J60r3r2J24L15n12j66M88J65p09l36N54K88j43k56
3829a85m8N18K10l76n83Q12L03q07m66P04L50r95R3M36M67k25l82l65Q60K38o10
3850e1l09R54j54p28l18Q42Q1n05k04M79J97k61l77J30O30j26r03M57P40l53p24
3871e03L38P95n18o44K05O96J13q27n7O78K35r02k47O58Q07n91q31P07R21j090
$$ plain form
3891 -57 -779 -186 768 139 -727 -537 460 756 -347 -690 565 880 -137 -737 390 979 -205 -826 -21
3910 -21 882 356 -566 -515 560 328 -592 -649 714 615 -606 -613 620 930 -351 -530 282 830 -408 -682
3930 -682 43 651 57 -1133 -311 1022 129 -1093 -338 955 512 -692 -288 853 605 -593 -613 209
3948 209 703 -310 -1119 424 830 -229 -1094 -42 1351 -23 -1194 -218 1211 512 -920 -345 897
3965 897 477 -614 -748 505 930 -697 -1027 414 931 -424 -1003 90 1285 -117 -801 93 1005
3982 1005 272 -992 -456 859 399 -842 -901 869 704 -913 -601 695 840 -602 -730 486 967
3999 967 -150 -939 211 1178 -78 -1227 -194 999 149 -1009 -495 875 300 -1170 -552 847 660
4016 660 -957 -867 839 1172 -277 -1049 38 1252 -266 -1424 126 1430 300 -1114 -68 1127
$$ packed form
3891e7p22N93R54o29q66J90R97K96j103l43J255L15j017o00J127N89j184o21Q05
3910b1R03n26r22N1J075k32r20n7J363r9j221pJ233L10j281j79Q12N48j238k74
3930f82P25O08n94j190Q22J333q93j222P55J293m43j204M04J141k48j198k0Q22
3948B09M94j013q09J543M06j059q65J052J393j374j171R76J429o99j432N75J242
3965H97m20j091j34J253M25j627l30J441N17j355n79J093J195j402o84Q94R12
3982A005p33j264N36J315m60j241n9J770j65j617L12J296J45j442j28J216M81
3999I67j117p89J150R67j256j149J033J193q50j158N14J370n75j470O18J399j87
4016F60j617R0J706L33j449p72J087J214j518j158J550J304j130j414J046J195
$$ plain form
4032 1127 822 -967 -706 665 814 -670 -1127 717 885 -929 -1162 286 800 -298 -1132 127 999
4049 999 -17 -1036 -125 1224 299 -1076 -453 1163 631 -1164 -525 884 429 -1212 -839 479 799
4066 799 -273 -891 786 1209 -279 -1322 88 1163 17 -1194 -202 1137 250 -1326 -526 860
4082 860 541 -1189 -800 1007 1152 -508 -1055 583 1422 -637 -1585 124 1366 -306 -1372 -27 1400
4099 1400 -68 -1480 -843 1091 528 -1134 -418 1193 1044 -759 -1148 704 900 -433 -1048 610 1171
4116 1171 -484 -1132 53 600 163 -1141 -212 1112 872 -846 -332 1223 679 -1149 -874 920 479
4133 479 -771 -717 500 1126 -470 -1019 347 1347 -156 -1250 67 1640 -36 -1439 -80 850
4149 850 254 -1476 -546 894 866 -744 -913 756 1162 -705 -1330 522 1216 -193 -849 304 1312
$$ packed form
4032A127l05j789K61J371J49j484m57J844J68j814k33J448N14j098q34J259Q72
4049I99j016j019R11J349r25j375O23J616n32j795O39J409m55j641L73J318L20
4066G99j072o18J677M23j488j043J410J075j146j211R92J339q87j576Q00J386
4082H60l19j730L89J807J45j660n47J638Q39k059r48J709J242j672j066J345J427
4099A400j468j412O37J934n63j662P16J611j49j803l89J852J96j333o15J658N61
4116A171j655o48J185N47m37j304R29J324k40j718N14J555n44j828K75J794m41
4133D79j250N4J217O26j596n49J366J000j503j094J317J573j676j403J359R30
4149H50n96j730R30J440k8j610j69J669M06j867o25J852O94j409o56J153J008
$$ plain form
4166 1312 12 -998 -354 944 364 -1035 -538 920 743 -1127 -660 874 503 -631 -850 718 982
4183 982 -347 -719 342 886 -276 -1130 -166 943 95 -1199 -249 1305 409 -1162 -474 1096 722
4200 722 -871 -545 848 957 -740 -836 386 856 -454 -1369 92 1135 -124 -1062 17 983 361
4217 361 -1319 -293 848 316 -608 -566 1021 671 -648 -1150 366 812 -707 -1176 504 824 -82 -940
4235 -940 338 1157 161 -893 -160 995 261 -1103 -551 792 371 -739 -516 809 650 -763 -651
4252 -651 456 776 -364 -807 237 1027 -105 -1029 49 907 304 -1165 -331 994 195 -1017 -438
4269 -438 973 517 -709 -401 672 594 -444 -907 453 993 -212 -855 -145 857 -72 -1056 21 977
4287 977 130 -724 61 778 662 -680 -446 586 699 -340 -701 345 684 -294 -606 -10 536 15 -701
$$ packed form
4166A312j300j010O44J298n80j399M97J458j77j870M67J534l71j134k19J568K64
4183I82j329l72J061N44j162q54R64J109q48j294R50J554q96j571O88J570l74
4200G22j593L26J393J09j697r6J222M70j310r15J461J043j259r38J079R66o22
4217C61j680J026J141n32r24M2J587l50j319n02J516M46j519m69J680L20r06q58
4235i40J278Q19r96j054P33J155p34j364N52J343m21j110K23J325j59j413J12
4252f51J107L20j140m43J044P90j132r24J078Q58o03j469Q34J325p99j212N79
4269d38J411m56j226L08J073p8j038m63J360N40j205o43P10J002r29r84J077R56
4287I77q47q54P85P17j16j342K34J032J13j039l61J046L39r78l12N96N46n21p16
$$ plain form
4306 -701 -3 714 194 -547 -470 735 473 -570 -319 567 359 -668 -241 258 21 -552 -285 140 575
4325 575 -81 -449 38 556 11 -812 -108 701 -18 -841 -295 633 313 -465 -228 295 321 -106 -478 566
4345 566 766 -176 -668 226 608 -134 -587 -199 401 -93 -732 -109 342 151 -537 -141 428 375 -116 -447
4365 -447 423 643 -265 -357 263 318 -263 -465 -43 76 -38 -533 -158 181 -50 -160 22 609 111 -359 -215
4386 -215 581 185 -390 -96 147 177 -116 -3 9 199 -108 -442 294 541 -85 -463 132 543 159 -388 -59
4407 -59 183 148 -366 -151 44 43 -21 -311 -88 220 97 -332 202 211 -18 -222 160 54 -27 42 -314 -233 89
$$ packed form
4306g01O98P17n20p41P7J205k62j043K51Q86k08j027M27M99k37n73K67M25M35
4325E75o56l68M87N18n45q23P04Q09p19q23N46R28l20p78K37N23K6m27l72J044
4345E66K00r42m92Q94L82p42m53L88O00m94o39O23M51j91o88L96N69n3m91l31
4365d47Q70K20r08r2O20N5n81k02M22J19j14m95L75L39k31j10J82N87m98m70J44
4386b15P96l96n75K94K43L0k93J13J2J90l07l34P36K47o26l78N95M11l84n47L29
4407e9K42l5n14K15J95jo4k90K23L08j23m29N34Rk29k04L82j06q1O9l56Q1L22
$$ [...]
16383A40
##END NTUPLES=NMR FID
##END=
