##TITLE=abcd
##JCAMPDX= 6.0         $$ Bruker NMR JCAMP-DX V2.0
##DATA TYPE= NMR FID
##DATA CLASS= NTUPLES
##ORIGIN= UXNMR, Bruker Analytische Messtechnik GmbH
##OWNER= root
$$ XWIN-NMR		Version 3.5
$$ Fri Jun 20 18:50:18 2025 Russian Standard Time (UT+4h)  servis@DPX200
##.OBSERVE FREQUENCY= 200.131235884673
##.OBSERVE NUCLEUS= ^1H
##.DELAY= (6, 6)
##.ACQUISITION MODE= SIMULTANEOUS
##.ACQUISITION SCHEME= undefined
##.AVERAGES= 32
##.DIGITISER RES= 18
##SPECTROMETER/DATA SYSTEM= spect
##.PULSE SEQUENCE= zg
##.SOLVENT NAME= DMSO
##.SHIFT REFERENCE= (INTERNAL, DMSO, 0, 16.5164)
##AUDIT TRAIL= $$ (NUMBER, WHEN, WHO, WHERE, WHAT)
$$ ##TITLE= Audit trail, XWIN-NMR		Version 3.5
$$ ##JCAMPDX= 5.01
$$ ##ORIGIN= Bruker BioSpin GmbH
$$ ##OWNER= servis
$$ F:\spectra/data/av/nmr/H1/1/audita.txt
$$ ##AUDIT TRAIL=  $$ (NUMBER, WHEN, WHO, WHERE, WHAT)
(   1,<2025-06-20 18:49:38.43 +0400>,<servis>,<DPX200>,
      <created by zg, POWCHK disabled, PULCHK disabled
       configuration hash MD5:
       00 E9 B6 7A A2 85 ED C7 34 08 36 98 17 FE 4E 26
       data hash MD5: 32K
       83 4F 59 B5 4F C2 CE 30 0B 79 1E C9 B4 1A C5 CB>)
$$ ##END=
$$ 
$$ hash MD5
$$ 3B E7 81 0F F1 F5 D5 A5 F6 4D 78 BE A9 08 64 2D
##$RELAX= 
##$RELAX= 
##$RELAX= 
##$RELAX= 
##$RELAX= 
##$RELAX= 
##$RELAX= 
##$RELAX= 
$$ Bruker specific parameters
$$ --------------------------
##$DU= <F:\spectra>
##$EXPNO= 1
##$NAME= <H1>
##$PROCNO= 1
##$TYPE= <nmr>
##$USER= <av>
##$AMP= (0..31)
100 100 100 100 100 100 100 100 100 100 100 100 100 100 100 100 100 100 
100 100 100 100 100 100 100 100 100 100 100 100 100 100 
##$AQSEQ= 0
##$AQ_mod= 1
##$AUNM= <au_zg>
##$AUTOPOS= <>
##$BF1= 200.13
##$BF2= 200.13
##$BF3= 200.13
##$BF4= 200.13
##$BF5= 500.13
##$BF6= 500.13
##$BF7= 500.13
##$BF8= 500.13
##$BYTORDA= 1
##$CFDGTYP= 0
##$CFRGTYP= 5
##$CHEMSTR= <none>
##$CNST= (0..31)
1 1 145 1 1 1 1 1 1 1 1 1 1 1 1 1 1 1 1 1 1 1 1 1 1 1 1 1 1 1 1 1 
##$CPDPRG= <>
##$CPDPRG1= <>
##$CPDPRG2= <>
##$CPDPRG3= <>
##$CPDPRG4= <mlev>
##$CPDPRG5= <mlev>
##$CPDPRG6= <mlev>
##$CPDPRG7= <mlev>
##$CPDPRG8= <mlev>
##$CPDPRGB= <>
##$CPDPRGT= <>
##$D= (0..31)
0 2 0 0 0 0 0 0 0 0.06 0 0 0 0 0 0 0.0002 0 0 0 0 0 0 0 0 0 0 0 0 0 0 
0 
##$DATE= 1750430978
##$DBL= (0..7)
120 120 120 120 120 120 120 120 
##$DBP= (0..7)
150 150 150 150 150 150 150 150 
##$DBP07= 0
##$DBPNAM0= <>
##$DBPNAM1= <>
##$DBPNAM2= <>
##$DBPNAM3= <>
##$DBPNAM4= <>
##$DBPNAM5= <>
##$DBPNAM6= <>
##$DBPNAM7= <>
##$DBPOAL= (0..7)
0.5 0.5 0.5 0.5 0.5 0.5 0.5 0.5 
##$DBPOFFS= (0..7)
0 0 0 0 0 0 0 0 
##$DE= 6
##$DECBNUC= <off>
##$DECIM= 32
##$DECNUC= <off>
##$DECSTAT= 4
##$DIGMOD= 1
##$DIGTYP= 9
##$DL= (0..7)
0 120 120 120 120 120 120 120 
##$DP= (0..7)
150 150 150 150 150 150 150 150 
##$DP07= 0
##$DPNAME0= <>
##$DPNAME1= <>
##$DPNAME2= <>
##$DPNAME3= <>
##$DPNAME4= <>
##$DPNAME5= <>
##$DPNAME6= <>
##$DPNAME7= <>
##$DPOAL= (0..7)
0.5 0.5 0.5 0.5 0.5 0.5 0.5 0.5 
##$DPOFFS= (0..7)
0 0 0 0 0 0 0 0 
##$DQDMODE= 0
##$DR= 18
##$DS= 0
##$DSLIST= <SSSSSSSSSSSSSSS>
##$DSPFIRM= 0
$$ [...]
##$SUBNAM0= <"">
##$SUBNAM1= <"">
##$SUBNAM2= <"">
##$SUBNAM3= <"">
##$SUBNAM4= <"">
##$SUBNAM5= <"">
##$SUBNAM6= <"">
##$SUBNAM7= <"">
##$SUBNAM8= <"">
##$SUBNAM9= <"">
##$SW= 20.6817932712277
##$SWIBOX= (0..15)
0 0 3 0 0 0 0 0 0 0 0 0 0 0 0 0 
##$SW_h= 4139.07284768212
##$TD= 32768
##$TD0= 1
##$TE= 0
##$TE2= 300
##$TE3= 300
##$TEG= 300
##$TL= (0..7)
0 120 120 120 120 120 120 120 
##$TP= (0..7)
150 150 150 150 150 150 150 150 
##$TP07= 0
##$TPNAME0= <>
##$TPNAME1= <>
##$TPNAME2= <>
##$TPNAME3= <>
##$TPNAME4= <>
##$TPNAME5= <>
##$TPNAME6= <>
##$TPNAME7= <>
##$TPOAL= (0..7)
0.5 0.5 0.5 0.5 0.5 0.5 0.5 0.5 
##$TPOFFS= (0..7)
0 0 0 0 0 0 0 0 
##$TUNHIN= 0
##$TUNHOUT= 0
##$TUNXOUT= 0
##$USERA1= <user>
##$USERA2= <user>
##$USERA3= <user>
##$USERA4= <user>
##$USERA5= <user>
##$V9= 5
##$VALIST= <valist>
##$VCLIST= <CCCCCCCCCCCCCCC>
##$VD= 0
##$VDLIST= <DDDDDDDDDDDDDDD>
##$VPLIST= <PPPPPPPPPPPPPPP>
##$VTLIST= <TTTTTTTTTTTTTTT>
##$WBST= 1024
##$WBSW= 30
##$XGAIN= (0..3)
0 0 0 0 
##$XL= 0
##$YL= 0
##$YMAX_a= 622133
##$YMIN_a= -698033
##$ZGOPTNS= <>
##$ZL1= 120
##$ZL2= 120
##$ZL3= 120
##$ZL4= 120
##$ABSF1= 10
##$ABSF2= 0
##$ABSG= 5
##$ABSL= 3
##$ALPHA= 0
##$AQORDER= 0
##$ASSFAC= 0
##$ASSFACI= 0
##$ASSFACX= 0
##$ASSWID= 0
##$AUNMP= <proc_1d>
##$AZFE= 0.1
##$AZFW= 0.1
##$BCFW= 1
##$BC_mod= 2
##$BYTORDP= 0
##$COROFFS= 0
##$CY= 19
##$DATMOD= 1
##$DC= 2
##$DFILT= <>
##$DTYPP= 0
##$F1P= 11.0000007629395
##$F2P= -0.999999237060547
##$FCOR= 0.5
##$FTSIZE= 0
##$FT_mod= 4
##$GAMMA= 1
##$GB= 1
##$INTBC= 1
##$INTSCL= 1
##$ISEN= 128
##$LB= 0.05
##$LEV0= 0
##$LPBIN= 0
##$MAXI= 10000
##$MC2= 0
##$MEAN= 0
##$ME_mod= 0
##$MI= 0
##$NCOEF= 0
##$NC_proc= 0
##$NLEV= 6
##$NOISF1= 0
##$NOISF2= 0
##$NSP= 1
##$NTH_PI= 0
##$NZP= 0
##$OFFSET= 16.51637
##$PC= 1
##$PHC0= -274.2557
##$PHC1= 1.101538
##$PH_mod= 0
##$PKNL= yes
##$PPARMOD= 0
##$PSCAL= 4
##$PSIGN= 0
##$REVERSE= no
##$SF= 200.13
##$SI= 16384
##$SIGF1= 0
##$SIGF2= 0
##$SINO= 400
##$SIOLD= 16384
##$SREGLST= <1H.CDCl3>
##$SSB= 0
##$STSI= 0
##$STSR= 0
##$SW_p= 4139.07284768211
##$SYMM= 0
##$S_DEV= 0
##$TDeff= 0
##$TDoff= 0
##$TI= <>
##$TILT= no
##$TM1= 0
##$TM2= 0
##$TOPLEV= 0
##$USERP1= <user>
##$USERP2= <user>
##$USERP3= <user>
##$USERP4= <user>
##$USERP5= <user>
##$WDW= 1
##$XDIM= 8192
##$YMAX_p= 0
##$YMIN_p= 0
$$ End of Bruker specific parameters
$$ ---------------------------------
##NTUPLES= NMR FID
##VAR_NAME=  TIME,          FID/REAL,        FID/IMAG
##SYMBOL=    X,             R,               I
##VAR_TYPE=  INDEPENDENT,   DEPENDENT,       DEPENDENT
##VAR_FORM=  AFFN,          ASDF,            ASDF
##VAR_DIM=   16384,         16384,           16384
##UNITS=     SECONDS,       ARBITRARY UNITS, ARBITRARY UNITS
##FACTOR=    0.0002416,     1,               1
##FIRST=     0,             0,               0
##LAST=      3.9581328,     0,               0
##MIN=       0,             -698033,         0
##MAX=       3.9581328,     622133,          0
$$ Real data points
##PAGE= N=1
##DATA TABLE= (X++(R..R)), XYDATA
$$ [...]
4113 -50 -118 96 -12 109 -12 -74 -5 -46 -29 -7 118 -118 93 22 -42 31 119 35 17 -28 -32 14 -37 -39 105 86 80 10
4141 10 -16 -4 61 79 -92 27 -8 -45 44 16 -62 -12 91 28 -9 -56 -88 -2 31 -199 28 18 84 -17 40 -79 -82
4168 -82 5 -25 -9 -118 -42 12 138 22 8 -29 -72 22 -46 -61 90 49 32 40 6 122 14 70 64 31 -23 24 3 -5 -42
4197 -42 10 -23 39 6 -51 13 20 91 37 -94 -10 -53 8 -95 9 -46 154 55 -20 99 119 1 -69 12 -69 -12 16 -55
4225 -55 -43 -152 -145 -14 88 25 59 -63 89 31 -20 93 106 0 52 48 38 -92 89 -34 -28 1 8 -34 27 19 58 -3
4253 -3 84 -79 -33 6 -17 89 -21 -87 -39 -28 -160 4 29 109 6 4 93 27 59 75 1 -3 131 22 81 -16 -21 71
4281 71 -4 -125 -81 77 -88 -125 15 6 12 94 -102 -4 -38 28 -43 61 -7 93 46 54 -19 -3 -94 112 -23 -38 -167
4308 -167 -117 114 53 -48 -17 -70 18 127 6 -32 -58 84 -3 -31 -68 36 -26 -19 99 -78 10 89 0 -8 -22 39 47
4335 47 -31 -21 -31 -13 107 128 8 3 29 -11 32 40 2 102 19 -34 -53 70 -34 42 73 92 -51 31 15 -2 4 -44 -39
4364 -39 119 -51 4 40 -48 69 76 -76 -53 110 -35 34 -33 196 -46 -31 132 17 66 -91 115 80 85 87 -18
4389 -18 -71 -58 -126 78 -11 -60 45 -45 19 64 134 -8 -97 7 -131 14 -76 -23 4 -51 -101 8 79 58 -10 -55 -21
4416 -21 -44 -96 -26 2 36 57 92 -22 -99 143 -76 -1 -4 -63 3 45 92 -49 22 -1 16 148 47 52 -79 32 -37
4443 -37 30 45 47 38 97 41 123 26 13 -27 39 21 -1 -30 81 1 131 -23 4 -28 -89 -78 10 -17 -24 45 -18 -27 -17 12 -8
4474 -8 37 -69 47 45 -9 116 52 27 -20 -32 116 77 -6 -37 82 52 -6 121 26 -86 -1 38 -25 112 66 24 -8
4501 -8 -92 -56 58 26 -45 -34 -129 26 19 72 57 -7 43 24 75 34 28 34 11 -51 27 5 105 19 -7 48 21 -3 -31 -36 27
4532 27 -81 -31 80 -75 39 34 110 7 -23 -114 10 24 -88 5 -24 -5 58 -54 -117 12 -16 -99 101 -62 -54 -57
4558 -57 88 -20 64 12 55 -10 -20 -32 61 40 -8 -2 -73 57 -26 -6 -75 -48 4 33 3 1 -51 -35 38 14 -16 43 31 34
4588 34 7 32 -20 -17 106 -21 -133 14 30 -2 -104 37 -3 -21 -27 26 -27 -103 -86 25 -89 45 154 -7 36 -20
4614 -20 -13 -69 -16 28 33 89 108 62 -20 65 -31 100 -9 -11 57 20 114 59 155 94 48 -27 -71 26 -41 46 -23 -18 -52 -29 43
4645 43 137 111 158 25 30 -90 -40 25 21 32 -126 -1 -94 -74 -171 -9 123 -7 46 56 74 103 138 -97 54 70 -36
4672 -36 -33 20 -100 -80 9 -64 -38 66 43 -24 -48 68 50 48 34 -25 34 -35 69 34 32 -73 97 -13 -6 -37 16 -25 -43
4701 -43 38 49 64 13 -37 -25 -57 5 -60 111 -13 -7 74 -45 127 69 1 89 137 109 -28 73 -7 -60 -56 -2 -17 -11 20
4730 20 53 -33 -51 84 66 -17 -22 118 21 -16 120 -8 80 -18 -22 8 34 -7 67 60 15 38 -10 -49 30 -5 -57 35 7 -47
4760 -47 84 -7 -47 -30 -72 -57 -100 -62 55 34 1 -7 24 44 -37 -48 35 16 11 72 -52 -9 17 73 44 46 9 31 13 -93
4790 -93 -133 -68 33 63 24 -77 50 -126 -37 27 -79 -31 22 -3 185 -44 -108 -6 29 -80 -60 -53 -6 86 34 91
4816 91 12 51 -48 -46 61 130 151 -117 -96 101 -20 44 50 45 7 14 -54 -5 43 -41 22 37 -48 22 -125 8 -68 -109 -29
4845 -29 -52 7 56 53 -7 -49 51 28 -10 -84 -50 -79 -24 132 29 -20 69 -39 -46 -104 -132 82 47 -70 11 -113 72
4872 72 57 41 29 55 57 30 88 -25 95 105 1 21 -72 87 35 -25 21 -20 119 -18 -46 -62 97 129 -17 -15 -4
4899 -4 38 -10 50 65 35 -30 -50 -118 22 -111 -61 -33 18 50 -77 52 -85 26 -30 -44 -16 115 2 -19 35 0 -65
4926 -65 150 82 -40 88 -27 -28 0 60 -107 48 -18 -24 -40 28 -7 -33 69 31 -19 -97 29 -43 -43 -34 -132 53 34 27
4954 27 74 -11 -35 49 70 82 33 -8 104 54 103 -57 -26 27 66 54 57 66 42 -109 -38 80 -64 -28 -18 -204 54 -38
4982 -38 -106 56 94 -29 65 48 -81 -33 -11 53 -129 -45 5 -42 -70 -45 -6 30 -64 23 -37 -32 -62 30 58 84 6 58 -19
5011 -19 -15 -3 6 108 -26 20 -27 102 84 -26 10 54 -83 154 -23 88 34 91 -34 -1 71 -85 128 56 -77
5036 -77 74 -81 -85 29 72 -42 14 117 205 -21 -66 -14 22 66 18 -43 -9 41 21 100 57 51 31 113 96 122 -6 38
5064 38 -58 -4 -54 -6 -9 -2 38 -103 -40 -83 -22 51 -45 -8 -1 -102 -23 9 -23 73 31 -56 -44 -40 18 -27 80 15 -44 44 -37
5095 -37 12 131 82 183 -36 22 -2 -7 62 -134 -20 21 -11 -71 81 40 -3 -35 -33 61 43 16 -39 44 68 -34 37 43
5123 43 42 -111 -102 -47 -12 -84 2 -61 -58 -56 -36 -88 19 -40 -12 -25 6 120 -20 -25 4 84 83 19 0 41 -28 -7 -54 51 -25
5154 -25 87 6 50 -70 101 127 43 69 41 -1 68 -60 -189 135 -75 13 -21 -42 2 20 26 143 -3 -116 37
5179 37 -13 19 12 -115 42 -64 0 -4 64 8 -103 -61 -18 -76 72 -49 41 1 -51 -23 -29 -44 -57 72 44 -24 56 19
5207 19 -83 45 -20 158 20 23 -60 18 -46 -29 -21 -80 -61 121 37 4 58 -105 -17 -8 85 -50 12 -23 -26 -72 42 47 -60
5236 -60 -62 21 -56 -26 102 0 -31 47 -10 5 27 -39 -121 -2 -88 -4 -29 84 54 39 -64 49 -55 1 11 -33 68
5263 68 72 -31 32 50 0 -8 -31 -75 -73 -31 -27 48 -140 -109 17 52 -61 -52 10 -118 -70 -154 -155 26 40 58 -85 9 -33 -116
5293 -116 -139 -49 25 66 2 27 -13 161 68 -1 7 -5 -49 -78 -24 12 63 84 -51 -50 -110 -67 -5 -105 55 -16 -51 -27 65
5322 65 41 -41 -13 177 -86 4 -8 7 47 -48 37 -7 17 -51 95 -50 -6 -28 126 54 46 57 -88 -51 92 -5 63
5349 63 83 5 47 -20 -7 71 -69 40 123 -60 -81 17 -117 -71 10 48 89 106 -86 -68 -105 -54 1 9 -2 -74 78 -71
5377 -71 18 -12 -21 13 46 62 -72 -36 -5 -2 23 -39 53 98 -29 29 -82 62 71 -40 96 -5 69 -58 -62 45 18 29
5405 29 -93 5 -97 -30 -37 87 -27 189 -94 68 -19 -24 40 3 127 142 190 -27 -57 41 -14 119 2 -15 13 -9
5431 -9 -78 13 -14 -142 74 55 0 -39 81 -56 -44 -66 39 5 -87 -12 -78 95 -38 105 14 -85 168 -50 76
5456 76 -74 110 -93 -13 7 31 -97 -37 -131 -76 -10 -42 -101 -2 13 30 41 22 -19 114 83 40 -47 39 -94 -114 -1
5483 -1 47 -28 45 -3 2 86 48 70 -86 105 79 56 25 74 -4 8 13 23 42 -29 -38 20 0 -86 -49 83 100 38 22 -31 -60
5514 -60 -5 -18 -18 -181 -102 -69 31 -5 -94 63 112 4 50 58 -147 -87 58 -22 117 -35 -171 35 56 36 -6 18
5540 18 62 118 -58 69 143 38 -67 45 -3 4 75 -50 -101 58 146 -54 -39 63 83 26 6 -65 80 40 35 -63
5566 -63 16 -131 -128 -55 -95 -77 49 -33 6 15 -75 -68 -35 -7 -13 60 22 63 61 35 31 169 84 -80 -80 -15 26 14 -139 -41 68
5597 68 101 45 14 24 -11 85 -33 134 34 -62 60 9 -41 -127 -50 51 -35 -30 48 -74 -40 -13 46 69 22 87 -78
5624 -78 -11 -25 38 -21 -12 -47 6 -112 65 8 48 38 -27 62 -1 -156 47 20 55 -26 -85 98 55 12 88 43 -7 -118
5652 -118 6 -34 65 31 12 -4 21 -52 -108 -6 -4 -126 -5 -87 -82 -1 95 -22 25 38 -65 59 22 92 25 17 -10 -30
5680 -30 16 73 107 -36 18 -47 -93 -111 84 97 10 86 28 -71 32 -6 -20 -59 12 31 40 -44 -31 -36 12 97 -78 67 39
5709 39 116 68 -44 1 -60 37 -32 18 48 -62 65 5 26 -24 -108 76 20 -25 36 -5 38 -68 10 -29 79 54 -16
5736 -16 20 3 13 -82 -48 33 27 -28 -28 12 41 36 15 29 -98 19 -17 -1 -60 -25 -9 -56 36 -8 -34 5 -51 -58 -47 11 -52
5767 -52 -30 34 145 -76 -55 -41 57 -71 41 76 1 -114 27 -30 107 135 55 106 44 0 11 100 64 38 88 181 11
5794 11 -88 68 -32 45 -11 8 -103 3 10 36 103 -9 60 -84 -103 -22 3 -145 -45 18 -67 13 30 46 -24 -84 -4
5821 -4 -8 -54 -43 4 88 -81 51 -25 23 65 -7 16 27 -39 25 -73 -39 -7 -33 -50 -56 78 4 -133 -96 -5 66 -71 43
5850 43 30 21 90 -11 69 -117 3 34 -88 99 -12 -55 -41 -31 -77 -78 -19 -10 -56 30 31 1 34 -29 37 63 25 -39 -30 -4
5880 -4 120 -23 -25 -73 -10 -35 67 -76 64 44 84 -35 75 69 -26 -21 -3 -12 -51 69 -14 -8 -59 0 -65 -100 -42 68 -78
5909 -78 39 -92 52 -69 -56 -121 -8 87 -56 8 -33 118 -25 8 -32 -98 -26 48 45 -112 -63 118 -140 86 48
5934 48 -64 -12 12 -13 147 -67 17 -8 67 63 -107 -39 15 -178 -2 10 77 -45 24 85 -13 5 -86 94 -14 8
5960 8 31 89 -62 -10 -100 66 38 -46 25 -19 36 81 -78 -19 38 -14 46 -83 65 -4 34 16 1 59 125 -82 34
5987 34 133 -39 6 -5 -73 -65 88 19 -74 -77 -111 -5 -7 -9 55 -46 -78 -71 5 25 60 18 63 46 42 -27 -41 32 -43 105 -5
6018 -5 -21 -28 -52 -11 -37 -212 7 -74 159 -48 -26 3 -10 44 32 3 -9 78 -26 58 -98 -12 5 99 21 -49 -48 -67 -30
6047 -30 12 3 -154 -110 53 32 -17 54 -44 61 -29 87 -93 -14 70 2 43 -27 -68 57 13 -78 32 86 74 -13 101
6074 101 13 67 -47 162 -60 69 77 12 9 -28 -28 61 15 -55 -68 -32 -83 -108 21 -119 -27 -3 -15 -8 127 53 1 -15
6102 -15 -19 -3 2 -140 80 12 -113 -65 94 90 -108 28 -86 -48 42 50 -7 61 -13 120 -59 -90 48 36 7 -31 -58
6129 -58 20 48 42 -104 -41 -2 13 -13 -46 -78 93 -122 26 -60 8 1 -111 -79 -33 45 -151 -15 35 -43 47 24 72 -37
6157 -37 53 19 30 9 -35 -81 39 10 -37 -43 -65 -52 1 -68 65 68 -49 -18 0 46 -62 -35 -36 -76 54 -14 -68 -46 15
6186 15 -44 -14 56 83 -79 -2 27 116 10 33 -47 -86 72 34 -73 -37 46 24 -72 -103 35 -14 -59 -43 -85 -15 109
6213 109 -13 95 -59 24 50 -28 76 4 52 130 -20 32 114 -70 9 3 -109 -63 9 -21 -17 -19 -30 49 30 20 -129
6240 -129 -82 -9 -5 21 18 -19 -20 -26 -40 53 29 -21 -30 -29 -59 48 -15 87 65 -36 32 -66 38 28 12 97 122 75 15 113 -46
6271 -46 43 -65 67 68 -83 7 -1 34 45 -60 -27 0 90 -41 -28 0 -81 -122 -8 -36 42 -98 125 -3 95 -109
6297 -109 30 17 82 38 -127 177 116 43 -86 -34 14 54 10 -23 83 51 19 83 87 -39 40 22 -39 -29 24 26 121 7
6325 7 -184 124 -65 -31 -8 -50 52 43 -30 -37 -63 -1 -13 30 -16 -31 84 13 -11 -116 -34 48 -6 -10 2 -58 -15 16 -79
6354 -79 7 -56 109 21 6 76 -53 -43 -53 -2 123 14 23 68 -13 -38 22 -47 128 78 175 -42 -152 -31 -117 32
6380 32 -89 68 113 -126 25 35 33 -39 -73 -27 99 110 -216 -11 5 49 -82 -72 -41 108 77 12 112 2 33
6405 33 66 71 -74 -37 61 -38 -65 75 41 -24 13 88 -32 -28 46 61 4 20 -11 -1 -15 -55 19 46 -12 -56 -91 -6 -32 -21
6435 -21 -2 -162 69 1 -45 -4 -34 48 -10 -42 -1 -29 -102 -21 23 48 10 14 6 -88 -31 80 71 121 88 65 -14 -36 14 103
6465 103 10 -63 -150 58 88 -16 33 -82 -124 -16 -69 21 -10 -19 -130 -61 31 51 -54 15 -7 -52 -31 -72 -25 -142 -7
6492 -7 -113 -38 -43 32 -35 46 77 -10 -175 -36 -35 16 -115 94 43 46 6 -55 0 -43 75 37 78 100 -25 -88 -118 94
6520 94 -65 -7 -10 -74 -8 -112 -116 -4 -152 -52 -60 -116 -98 -75 -45 -106 44 51 17 25 25 40 -28 52 65 73 12 -40 -66 89
6550 89 -28 20 -12 35 47 76 51 -197 99 109 36 -7 55 27 13 32 -4 -53 -54 -48 3 -38 -26 -46 -12 -30 62 -11 8 -46
6580 -46 13 -56 -46 11 -130 -29 21 -25 -19 -148 23 125 -61 32 7 122 9 34 79 97 -24 108 28 1 31 22
6606 22 -26 49 15 -19 22 0 61 74 -26 -17 79 54 35 104 -75 -179 -52 -38 -3 101 -58 -59 50 -80 0 -24 -73
6633 -73 -84 -49 97 -52 -13 67 32 30 -22 -124 4 56 26 -7 15 1 40 -19 -4 72 -34 -35 -25 -55 -18 -95 54 46 22
6662 22 55 -52 -41 16 126 -134 47 -93 95 101 -42 16 -74 62 -5 -38 51 -131 35 18 -52 135 37 -4 -105
6687 -105 -73 11 27 -39 49 24 84 111 -89 -84 -21 87 93 79 -26 -5 -76 33 -58 19 -94 0 2 80 17 56 76 14 -10
6716 -10 81 -132 82 -76 -30 -71 56 -32 -15 -60 -44 42 59 8 -16 -23 -66 15 -57 -73 -44 62 -31 -59 24 80 -95 -74
6744 -74 139 9 8 -37 9 111 22 69 37 -13 88 99 -72 -42 39 -50 109 24 22 -50 33 -7 -75 -18 112 -10 -124
6771 -124 -64 -15 -4 81 70 -123 1 11 -59 -12 97 28 -150 -63 75 -45 5 -28 10 -16 78 40 0 -58 114 -29
6797 -29 -97 138 20 14 88 165 78 85 28 63 57 -1 18 122 -69 75 -24 67 -67 -84 59 48 -27 38 -105 -19 9 -63
6825 -63 79 16 78 28 69 -18 -13 52 -81 85 -5 -114 45 -22 -58 82 -44 -9 172 133 127 51 55 -95 50 39 27
6852 27 -26 151 -24 -39 27 36 69 -67 -92 -20 0 25 -48 2 -22 -26 -77 -6 63 78 -104 79 -54 -3 -2 10 29 -33 22
6881 22 -1 -32 -72 -16 89 -104 -87 156 -11 0 -11 31 27 108 -20 -116 106 15 58 -44 -30 11 18 36 58 5 12 54
6909 54 -32 -19 14 90 -29 -23 -2 -81 -53 37 -126 48 31 -77 -36 0 11 40 1 51 -58 23 -11 -62 -22 -3 1 -63 103
6938 103 49 66 29 95 106 74 94 18 43 86 1 -93 49 44 -51 95 77 16 -11 91 -14 -107 -33 -1 -49 -55 8 -40 87
6967 87 -11 7 58 17 63 43 -29 -80 204 -87 11 -34 -33 78 -108 26 -52 -13 106 -1 -32 -110 -6 62 19 -20 -88
6994 -88 -29 34 49 0 -46 47 -99 18 -75 52 73 -5 -92 -44 -67 -60 -57 -29 -92 -85 -48 2 -75 -103 44 81 -1 -24 -21 84
7024 84 -13 28 -5 -31 47 -4 44 96 58 40 -2 -25 55 74 74 32 114 -115 -28 76 -68 11 -1 -103 -50 40 -36 -13 73
7053 73 3 -3 12 -116 -90 6 -81 -40 -26 -106 -132 -29 -53 -145 25 -113 -48 -63 87 -106 57 -58 -84 20 -28 -47
7079 -47 21 23 -112 -52 -72 -26 -68 -81 53 145 -58 20 48 163 -44 -6 -28 14 18 129 85 25 134 4 -5 -34 -36 -10
7107 -10 -49 0 106 -67 -16 -6 -23 30 -4 -37 -64 67 -12 -75 -101 -7 57 58 135 26 38 40 16 42 58 77 -63 69
7135 69 36 37 -31 42 78 -57 86 36 -38 14 49 95 -43 -31 90 18 30 64 -48 -7 17 -58 -36 10 -36 2 -87 59
7163 59 7 -33 -80 -61 -3 -97 -53 38 -53 -31 -27 -3 -22 27 23 -7 143 5 13 136 -77 14 89 -15 -10 25 10 106 -38
7192 -38 -19 -87 21 -62 10 -59 68 45 -75 -76 -54 -53 -96 29 -46 38 -9 -16 0 62 37 -110 -90 -34 45 136 53 -35 33
7221 33 -84 9 -15 37 16 136 101 38 41 132 136 67 134 -23 84 164 -47 70 19 74 107 15 56 55 -59 -18 77 63
7249 63 -43 -36 12 5 -12 5 -100 7 -38 -56 -61 -17 -28 15 97 45 -38 -27 11 35 171 125 -15 55 98 96 -25 0 78
7278 78 25 58 13 -71 11 -78 -115 -78 10 68 56 73 77 58 -24 -6 17 -56 -66 7 -42 -62 -57 -25 -58 54 -57 -140 -24 -2
7308 -2 1 20 32 81 38 -77 39 65 125 38 -1 62 9 -10 118 85 73 -27 21 90 105 5 -48 53 12 89 26 54
7336 54 45 69 16 26 -33 58 16 -57 -69 -31 -87 55 30 -10 -27 24 -69 -31 95 -5 29 127 -17 30 -111 20 13 27
7364 27 74 -114 -23 35 59 62 131 26 19 8 109 -41 24 -23 11 28 38 -83 -49 81 26 73 -137 8 -10 69 -35
7391 -35 18 67 -76 -93 -38 3 -2 -102 -38 -93 -48 3 -42 -25 -81 -7 59 -65 19 -162 -53 3 -15 -1 -2 -51 -63 123
7419 123 4 38 82 58 96 48 49 27 63 2 9 -2 -1 -23 -23 -18 83 12 -67 48 -89 27 -3 -20 -32 16 90 -33 -19
7448 -19 26 28 -49 -18 26 39 34 51 -36 -57 47 78 35 -83 -28 40 35 62 35 111 30 17 45 -117 -20 34 52 58 -66 40
7478 40 27 -5 98 145 33 -32 -104 -67 5 40 57 -41 59 -55 -139 48 19 10 58 8 12 -62 -51 -134 -5 8 -7 126
7506 126 74 -69 -94 -18 -35 -136 -67 97 -35 -68 -18 64 2 -13 44 -35 17 129 15 45 56 -43 0 81 55 -2 -62
7533 -62 -27 -26 -25 92 40 -78 45 86 22 26 -2 111 -67 -48 -56 45 -10 -40 36 -6 14 43 152 65 18 56 -32 51 144
7562 144 -33 41 45 -68 -7 72 -80 -9 -7 62 -38 10 -65 -16 46 -55 34 -77 -8 8 -83 22 -15 -31 -97 10 27
7589 27 27 21 -63 11 35 63 52 39 51 70 -49 7 -124 -12 -26 24 59 47 -26 70 55 41 -6 -31 37 42 26 -9 40 89
7619 89 9 66 9 56 127 94 40 79 44 -31 92 141 -82 -13 84 -55 -69 -48 19 44 52 -79 -76 9 86 -62 -71 -144 59
7648 59 -32 5 85 40 50 78 18 48 69 44 106 107 -5 13 75 0 49 80 -45 -4 105 21 -21 10 -27 48 68 -24 -10
7677 -10 -92 -4 -8 155 -6 50 -132 -82 -34 3 -173 -47 -89 18 110 -44 42 -25 82 87 59 -85 31 -63 -79 14
7703 14 56 -11 69 14 44 17 68 72 27 32 -24 -34 -35 121 124 59 -78 25 6 11 -75 48 68 -18 108 -37 -76 38 -117
7732 -117 74 -5 40 -32 26 -35 82 -34 -48 -109 -50 61 -56 -115 -58 51 -99 -28 -58 -94 123 -100 53 140 48
7757 48 -35 -19 -70 -23 -46 52 84 180 -3 -23 66 -61 125 -15 36 23 -65 -86 -54 38 75 5 24 -79 -16 62 40 -103
7785 -103 -17 116 -35 -17 41 -74 -5 -17 32 -42 91 -50 -27 -140 -20 -76 22 34 -13 -4 77 91 50 41 -14 60 -35
7812 -35 18 8 84 -3 -9 125 -53 -13 -60 22 -1 -47 30 82 39 49 -37 -55 108 -61 120 -9 -37 23 7 -60 -1 -20
7840 -20 -15 84 44 -7 -73 -116 -43 91 19 54 -53 8 85 66 -97 -23 164 -54 82 41 105 70 44 131 91 88 32 -29
7868 -29 48 90 -21 -24 96 20 6 33 58 -122 -33 -67 -53 56 -41 33 -32 111 -23 -108 21 18 49 -39 -27 -3 67 -49
7896 -49 -99 138 74 143 77 -132 53 103 71 89 -12 -121 65 85 88 -8 -63 46 51 24 -3 24 -65 -53 -31 36 70 35
7924 35 -21 -109 13 6 25 39 67 -30 -24 89 61 -50 10 11 25 146 121 -7 48 3 -18 -9 123 93 15 48 15 57 -30
7953 -30 17 34 -18 82 1 96 -45 29 51 -49 -41 51 65 160 36 -41 -51 -101 19 26 -34 42 11 -14 -40 80 40 -36
7981 -36 -14 -48 -39 17 -68 -46 0 20 -49 -125 -29 66 73 -66 -13 3 -26 33 146 114 -28 77 -28 63 -69 -7 10 -41
8009 -41 -54 -20 -16 -125 62 30 -36 27 95 50 12 -61 -42 35 57 -17 113 1 -77 -54 96 38 -32 -96 -75 27 -10 13
8037 13 34 76 27 23 47 -4 23 -50 -71 6 -18 49 0 -45 43 -50 -12 80 -112 62 59 -8 -5 85 5 -44 68 24 19 -100
8067 -100 -20 -6 -39 -13 128 -60 -63 36 71 -46 8 -18 -9 107 -3 -81 40 20 -65 -57 128 -27 -49 -38 -163 -19
8093 -19 73 29 26 72 90 32 23 100 -47 228 -34 69 49 122 6 108 6 59 -11 -75 57 26 89 -50 24 37 -78
8120 -78 132 184 4 53 46 -92 30 21 -64 -13 -14 118 -65 -50 -12 71 38 12 59 57 -36 17 88 137 36 40 24 65 110
8149 110 -31 -12 79 -4 52 13 -46 52 149 -14 186 73 -10 -133 11 48 54 -3 -55 89 -26 -30 -35 63 34 -162 -75
8176 -75 -146 -90 30 35 67 119 -103 67 35 -21 0 72 -69 -18 18 -46 31 -43 39 21 64 145 3 28 37 32 47 11 54
8205 54 60 48 -10 9 -46 4 22 62 48 155 -75 -39 -181 54 -20 41 -50 -63 -23 6 46 -29 2 15 -24 -83 55 -20
8233 -20 123 1 -102 62 31 -2 5 7 -61 -8 31 22 29 33 97 -2 -28 16 114 11 74 -49 27 9 69 13 -46 60 113
8262 113 30 -32 62 -34 -49 131 -118 -89 57 -67 -54 58 13 20 122 3 69 48 42 3 104 -25 66 1 63 2
8288 2 -84 14 84 -11 8 12 23 6 -72 83 -78 79 -16 95 78 -16 73 29 10 -19 -45 85 -36 -56 21 -9 8 40
8316 40 17 -40 -25 -27 -140 -65 32 6 -2 -44 85 98 70 82 16 17 73 -2 15 87 122 45 62 8 -46 142 99 85 -56 -39
8346 -39 0 49 -49 -62 -31 71 -118 -58 155 -24 35 -24 -72 26 -66 -3 117 54 53 -69 -17 -19 35 -131 -32 -13 -141
8373 -141 4 -53 76 -50 18 86 -20 75 -13 58 118 123 65 44 9 -80 71 -35 -32 20 -55 -43 9 67 62 13 81 16
8401 16 58 -34 134 -19 94 -3 71 -52 -52 -103 0 82 -64 3 -51 -41 -43 57 -156 152 -62 169 89 62 35 -84
8427 -84 66 2 -48 88 58 85 -33 -14 83 81 1 77 101 18 136 -27 -31 -40 24 -63 12 -42 -33 51 -74 -86 23 38 19
8456 19 -50 -63 103 -86 57 -66 -12 -40 53 -109 -47 69 -23 159 12 84 -81 -55 101 -28 27 76 -53 24
8480 24 -39 -22 117 -119 -39 -47 97 80 -19 53 62 -30 -61 21 -55 -44 99 28 51 25 15 94 -66 2 -21 5 -14 56 10
8509 10 -54 -59 68 -82 6 -14 97 -37 20 8 -35 55 -39 -14 22 20 -21 50 -59 45 124 82 38 -23 26 -33 77 81
8537 81 -41 -3 -6 -10 65 -43 -35 38 -63 -24 30 73 100 44 -133 25 -15 -33 -46 -28 -73 -21 -55 14 -23 113 -24 22
8565 22 -43 -41 1 -11 -67 -96 41 103 14 -24 -164 -28 119 19 30 163 -5 -7 90 93 42 61 147 21 104 -49 63
8592 63 63 42 3 -17 78 17 -24 -35 -41 -58 62 58 -80 -36 50 -81 -2 6 -22 41 13 -45 -3 11 10 -115 54 -36 61 -51
8622 -51 -17 81 70 79 41 60 -88 -7 27 -125 59 -40 -18 -61 22 -151 17 -1 -72 -4 37 -5 -41 124 -81 42 -55
8649 -55 88 53 7 33 -111 -78 -50 -3 -7 44 55 -71 24 82 14 -21 35 22 72 77 47 86 -108 41 -20 -59 -19 -35 106
8678 106 -12 63 101 89 33 -33 53 101 105 -41 -143 74 32 -88 88 -30 -60 -20 85 -31 -79 -135 130 -7 -102
8703 -102 -35 -56 -67 59 32 -79 95 -120 65 20 58 45 -62 95 -5 -9 31 -77 -27 38 -18 -12 132 34 -20 46
8729 46 -2 79 -4 113 -40 61 58 88 50 -34 -40 15 29 -137 -9 69 -29 52 -53 32 0 -32 -16 20 -44 24 63 80
8757 80 -27 -37 25 38 -8 -11 12 -78 45 -25 26 56 11 -9 -15 -104 73 89 33 13 40 72 40 29 94 3 38 87 -118
8786 -118 -25 33 -129 8 61 20 -35 -158 -82 -29 -79 -2 -93 -37 87 84 26 -23 14 -37 -8 95 30 65 -22 61 -87
8813 -87 52 10 2 25 -94 8 7 31 -48 12 3 -12 -27 9 36 96 115 37 -47 -81 77 -39 -6 -38 -77 47 -57 116
8841 116 -12 -45 74 -182 97 103 7 -54 -10 -24 -56 64 -48 -24 -84 7 0 -34 102 79 136 174 -18 107 108 -2
8867 -2 49 -53 -84 68 -6 2 51 81 93 -4 44 37 78 -75 -69 -43 -81 -45 -22 -7 -65 -30 4 80 -11 -28 92 -37 76
8896 76 -156 -20 12 -55 -18 -42 -55 -64 130 -50 65 56 10 83 72 -98 -53 -52 10 -23 41 -14 35 61 -88 35 87 -30
8924 -30 55 65 -22 -9 -28 75 25 162 -81 3 -15 16 123 -41 1 -9 48 -28 -32 18 -35 39 55 1 22 -37 92 24
8952 24 -4 -32 -87 -35 158 70 19 77 -109 -50 65 -37 -14 -26 63 11 0 87 35 24 55 10 22 -93 -23 64 82 -27
8980 -27 48 -79 1 46 -106 -51 -14 -27 37 43 -1 52 69 54 9 -111 -40 22 -94 39 -40 -80 49 -7 -51 66 -43
9007 -43 1 102 29 -24 -20 -27 39 40 -8 39 4 39 60 -23 -49 -11 -31 -28 -59 88 -37 16 35 9 -84 95 -38 -6 13 -18
9037 -18 -20 -68 -66 -26 -22 -11 39 15 78 34 13 33 24 150 -97 -42 10 -42 8 -49 68 51 -88 -29 80 -42 -104 -173 7
9066 7 69 -141 31 45 -78 4 25 53 18 -52 91 -118 24 -10 55 13 -7 38 -22 -18 43 34 -97 -49 29 62 -50 -117
9094 -117 -104 -96 -37 -4 -99 -34 4 45 -113 46 96 28 44 77 -7 52 -9 -24 -42 29 16 70 57 26 -17 -40 35 37 52 -43
9124 -43 71 -93 115 -52 49 -22 -60 -24 -32 43 3 -39 23 -14 45 78 42 69 -35 3 28 -95 -65 55 -33 91
9150 91 -18 27 5 62 -164 59 -16 100 -6 -14 -4 72 -3 21 -63 -94 24 -12 24 -41 33 -214 -49 -40 -33 -29 109 56
9178 56 -56 86 7 68 -144 131 39 -120 24 38 -63 -94 29 -38 14 -6 -12 18 -45 9 103 115 -6 70 68 -10 46
9205 46 59 -22 21 5 44 -129 56 112 82 -17 70 72 -11 6 -28 17 -112 1 20 104 -84 -163 50 -36 53 -3 -37 -3
9233 -3 -47 30 -2 -73 -64 -122 -52 -127 -23 46 -76 -32 144 -21 -73 162 36 -75 15 -3 4 75 110 56 41 -12 96 16
9261 16 65 61 101 37 40 -37 69 40 2 -10 -12 37 21 56 -35 34 142 -65 -82 29 94 132 -11 -4 92 -29 58 24 -7
9290 -7 -53 105 -32 -29 16 -52 61 4 -59 -52 -41 -76 1 94 44 -132 49 -91 -17 72 -36 -1 -13 34 -42 -80 -49 -46 -24
9319 -24 -40 -155 -10 -4 82 -79 -54 -50 81 176 2 -49 -6 -100 135 -21 -7 -8 67 -30 9 -79 -81 40 -123 -78 83
9346 83 35 -31 47 76 119 94 96 109 67 17 109 -37 2 -19 77 63 -19 -41 126 100 27 -74 -121 6 -40 -76 -31 -30 -105
9375 -105 -95 -28 -5 -74 -27 143 -76 -98 -109 16 90 65 22 30 39 43 17 9 -36 131 45 -56 -71 0 -33 47 2 -23 110
9404 110 121 23 58 75 -14 42 46 -52 -43 67 46 -168 63 -25 56 -69 -32 87 -11 -160 -72 33 72 -85 -40 -152
9430 -152 58 25 58 -88 24 -38 53 148 -37 19 -59 -60 -8 12 -18 1 58 43 -1 135 58 104 36 9 79 8 -74 9
9458 9 40 -24 77 10 -20 -57 -56 94 -107 -13 -74 -9 10 -71 -54 -112 15 85 -44 -28 -197 42 -17 -43 73 -98 -73
9485 -73 -13 -92 -19 -71 -84 130 8 -32 72 -109 2 -17 8 32 -108 171 -171 113 37 189 -20 69 5 152
9509 152 -28 -35 -8 -64 -6 10 72 22 -16 -30 3 -81 -7 -36 -6 -44 -42 -34 23 -137 -45 -66 58 71 -66 -7 101 -3
9537 -3 132 73 -114 -53 9 -124 116 88 -48 -56 -34 -8 68 60 11 -42 -47 32 -29 -32 7 -56 -89 10 -33 -9 47 1 -52 30
9567 30 16 19 47 -85 40 -16 1 74 -107 -65 -42 -53 -170 -7 -26 -44 -2 30 40 -26 -50 34 65 -46 111 62 71 4
9595 4 111 67 13 -121 -149 91 -24 43 169 72 62 -137 52 18 24 27 51 30 -19 32 -93 62 71 25 -64 -23 -55 -3
9623 -3 -10 -49 -89 -113 -50 -72 24 7 90 82 -12 -22 -86 56 131 -57 -119 19 8 79 -2 -24 -20 -37 78 84 -31 19 54 -61
9653 -61 10 -26 -9 -27 -66 -73 25 8 42 6 29 -90 0 -107 -102 -17 17 -24 -61 -11 66 82 67 55 -28 46 10 43 -26 33
9683 33 -67 -34 121 -63 -80 3 96 -8 -134 81 -19 83 61 -19 -94 56 42 -102 -6 66 153 -103 56 -49
9707 -49 -35 25 -160 -12 -20 3 -11 -66 -34 69 -22 46 112 -56 -64 -202 -61 4 -54 -16 120 -16 28 41 40 22 13 -6
9735 -6 -33 46 -29 30 25 71 40 58 128 59 135 9 -4 -12 30 -5 31 -70 -117 12 -44 10 -3 -18 -103 20 110 62 109 -3
9765 -3 2 -121 -36 -11 112 145 58 -40 -31 -55 -4 35 -44 33 47 56 16 97 9 -2 14 64 99 78 108 27 54 54 46 -70 -66 110
9797 110 87 28 38 124 18 70 10 -41 -51 20 -62 -96 -9 -1 -25 -37 56 21 -72 -27 14 13 -5 4 -54 80 93 -19 -45 0
9827 0 -70 6 -46 158 65 22 32 -175 7 -21 -33 0 41 71 111 -60 -22 -74 -22 44 -16 15 -87 -40 -177 -55 27
9854 27 -94 79 52 42 -27 76 -15 17 41 -19 38 -50 151 -39 71 28 -25 37 -67 98 90 95 -19 104 -47 61
9880 61 -49 44 0 32 41 -16 -24 95 84 -39 37 -95 15 -46 26 -39 -37 -6 -25 137 6 45 81 -53 -111 -99 -132 41
9908 41 13 -63 -27 -10 63 -53 -40 -4 108 -22 72 -86 -17 -16 -26 9 28 39 -62 78 32 76 -15 21 130 43 75
9935 75 41 5 0 -101 9 123 -24 24 60 32 41 55 -46 -33 66 151 26 -96 2 -48 -35 -30 -81 -8 -8 29 35 92 -62
9964 -62 -13 -191 -67 -24 84 -33 39 141 69 -4 -10 -20 -10 29 92 -27 38 -2 62 10 29 -51 -79 44 -19 36 73
9991 73 -13 54 -89 5 38 -59 14 22 108 59 -103 -105 65 -100 -8 94 57 -5 -39 90 -141 141 62 42 -23 4 28
10018 28 51 1 -24 10 -52 -103 17 17 -55 102 32 20 -39 -4 30 -136 111 -9 78 -44 47 -46 -113 31 5 66 -12
10045 -12 -71 85 -35 -40 -3 23 25 6 -24 -14 0 -28 19 6 93 -141 -2 -17 87 13 139 54 96 -18 28 -39 -60
10072 -60 0 62 -80 115 59 21 11 -29 41 80 -61 99 -32 -60 -35 -35 -14 -5 -51 58 151 66 48 -23 88 123 62
10099 62 -86 12 -59 -7 61 46 -144 -45 64 -84 -74 -18 -127 98 -18 60 78 3 65 53 23 -57 -24 112 11
10124 11 -23 11 -21 109 15 91 -67 60 3 0 70 90 24 -141 -59 2 9 69 -22 -1 88 -69 91 -37 -69 -32 -35 -52
10152 -52 40 -22 -36 -41 -31 6 27 21 1 4 -63 -23 80 -22 27 -33 13 76 -92 39 -69 78 -9 92 64 -28 80
10179 80 -29 74 -14 -8 -15 -31 115 58 55 69 47 -61 -31 153 62 59 6 -50 -122 -6 -80 56 51 -57 3 -84 118 11
10207 11 118 30 -8 -61 -116 40 28 6 0 -33 -2 58 22 -5 41 -9 -100 142 70 26 11 -75 45 -64 -23 -25 49 -81
10235 -81 67 -22 -117 9 -75 -24 -23 21 -18 -94 127 -28 -33 -24 -45 56 2 25 -67 -14 -40 -86 -25 -25 15 -49 154 -50
10263 -50 90 22 138 4 34 -33 28 -22 -15 76 72 112 106 105 37 -2 -25 -5 0 44 -38 137 73 59 6 21 -40 -50 -22 -8
10293 -8 -11 -4 -46 105 -74 9 -20 -75 -35 1 -6 22 26 80 61 47 113 26 149 -20 -18 -29 -45 -65 -34 22 -14 -7 80 136 27
10324 27 114 -10 41 32 87 62 69 47 66 20 206 85 11 -20 98 87 46 -97 -33 10 -34 136 69 -13 -54 82 -36
10351 -36 6 167 53 6 133 -107 -5 81 33 -62 -63 -106 38 64 90 -63 -114 -21 -68 -1 36 58 110 46 20 9 10
10378 10 140 -8 145 4 -22 5 -101 -54 -115 -133 13 -51 -10 40 -15 90 65 -24 -58 18 2 19 12 22 -13 69 -17
10405 -17 -67 215 57 62 -1 -51 117 9 -74 44 5 -78 -11 27 117 -8 14 -128 2 -73 51 -28 73 -18 -23 -48
10431 -48 -51 -45 -45 42 -107 -57 -45 -50 -103 16 -21 7 -28 43 -26 19 32 12 28 -6 69 57 26 120 -35 -10 28 31 49 71 35
10462 35 21 65 9 -23 46 19 -46 24 -69 46 56 -127 95 90 132 27 -1 21 109 6 -44 -14 58 -16 95 5 -15
10489 -15 0 -84 59 -42 -38 37 -71 0 -8 30 16 38 -3 -33 149 -7 97 13 -26 -50 -28 50 51 68 -59 40 -47 131
10517 131 54 64 40 35 37 0 -21 111 -102 -30 9 -52 1 19 2 -3 16 47 -88 -27 -47 119 94 -43 133 57 -12 -17
10545 -17 50 20 67 -48 19 -49 44 85 38 56 107 11 29 107 92 35 110 -18 0 4 -110 121 33 117 -35 -139 -15
10572 -15 13 37 28 67 -54 -136 11 -26 57 -123 -56 8 -45 -55 -115 -15 -180 -82 147 -110 9 17 22 44 -10 11 -117
10599 -117 -10 75 29 -6 -30 104 -22 79 52 -46 21 42 62 74 -17 15 37 85 7 -168 75 -70 47 -5 29
10624 29 39 55 -59 12 -8 6 17 44 -100 53 91 -126 43 30 -47 47 0 -58 -47 49 41 51 50 -58 -58 95 146 123
10652 123 -19 19 56 64 90 83 75 59 8 -6 -71 32 -48 42 -9 -30 123 -18 -4 -3 11 24 -39 14 8 -85 -40 -106 -38 58
10682 58 -27 44 -16 54 111 -82 -97 26 -49 -75 -41 -21 -37 99 5 -1 50 36 4 -61 100 -90 84 -25 18 -29 19
10709 19 12 -62 79 -18 2 125 -73 -69 -61 129 -37 -40 31 -9 45 -44 -16 -28 -14 -28 -59 72 49 54 -112 -12 56 14
10737 14 33 -63 50 14 58 -53 67 -68 182 69 -53 -34 39 89 -11 -50 -1 -2 -15 155 -28 36 129 13 193
10762 193 -7 31 144 23 -33 7 -56 -6 73 31 38 -13 0 -3 75 0 -76 59 -86 86 -80 7 74 51 -60 60
10788 60 -44 16 -56 33 132 46 61 -2 12 88 -58 -80 46 32 -64 76 -118 17 31 -45 36 63 75 -54 -10 14
10814 14 10 -68 -45 -107 -54 42 -87 64 30 -45 -35 25 10 -168 -112 22 11 -96 107 39 -17 34 30 -100 25 -2 -16
10841 -16 -49 126 -27 -52 -9 -90 134 -29 3 -44 -119 9 -36 -92 -49 47 -31 119 -42 30 151 86 -20 -144 46
10866 46 -203 -62 -12 8 6 15 -18 84 39 -17 5 -24 -32 -54 6 -33 -58 -44 -50 -5 -4 42 2 139 16 30 67 -186 -26
10895 -26 -120 112 190 55 61 -25 60 31 72 46 -12 36 -73 51 133 -13 -44 -11 -74 -58 -10 27 -84 -21 15 -50 15
10922 15 -95 -36 34 -35 -13 69 -55 20 -94 14 -36 67 37 -5 40 -20 66 -42 59 -7 -20 25 24 -104 38 37
10948 37 43 102 -24 3 -20 43 70 140 31 54 -4 -2 17 81 8 -38 -27 -80 68 -86 -24 8 -107 -54 52 -8 74 -55
10976 -55 -84 95 14 140 -16 238 56 4 98 18 6 -12 15 87 58 -8 71 -10 28 -63 4 -5 -4 -3 -69 -54 30 -38 56
11005 56 15 128 -33 -54 -36 -51 -83 109 1 -11 76 44 15 65 -66 32 141 12 -80 64 -73 -16 -11 -12 -62 -29
11031 -29 -41 -151 99 -18 47 -30 -31 30 12 -20 20 64 132 138 3 70 -23 -22 -2 21 86 -1 -95 -81 131 17 -115 115
11059 115 -64 65 -49 95 -10 -66 -72 45 -150 5 11 -19 49 8 1 -167 -15 -174 91 83 153 34 68 35 26
11084 26 -120 53 23 -30 114 106 -41 75 86 67 -15 6 141 112 18 2 24 27 65 -89 11 23 -107 -52 38 -105
11110 -105 -23 -36 -159 5 -13 -45 -104 -63 116 -33 37 54 43 -82 170 -2 -72 57 -56 91 161 26 -17 159
11134 159 57 77 -21 21 85 -16 -19 45 38 -71 54 54 7 -129 -8 65 -48 84 200 82 -9 65 -62 79 60
11159 60 -71 -49 -50 -25 -24 22 10 27 -131 70 27 -42 37 -52 45 -17 -62 60 -13 132 -1 29 25 5 80 135 -34 -41
11187 -41 -52 86 -34 87 29 -30 21 -21 34 44 -94 87 6 7 30 -91 -52 -104 -49 34 -23 -93 45 -39 -49 -18 11
11214 11 -61 42 -81 -42 19 50 -98 57 -37 -2 -56 -71 13 38 -4 -44 -51 16 167 17 11 16 28 14 -93 -89 90 -68
11242 -68 -46 -28 17 -13 130 -53 -27 9 58 -49 -173 117 -12 3 162 35 -118 3 -12 -33 21 -73 32 -86
11266 -86 -25 -22 -18 -63 -20 -18 43 27 21 54 -5 45 -5 -133 -63 -10 113 56 1 13 50 -60 94 -27 -43 87 10 33 -3
11295 -3 -12 25 -10 -33 4 -2 -3 36 13 46 11 -68 5 -37 49 23 -13 -12 -114 40 160 8 -29 -22 43 -34 -3 60 -14 59 75
11326 75 49 13 -120 9 -126 -96 97 33 -86 43 36 40 68 48 94 -14 21 -60 -48 -7 -15 -41 -95 7 107 -33
11352 -33 44 -80 -25 -73 73 -6 -136 -20 191 33 21 -25 26 37 -37 13 -8 -14 69 -5 -5 29 45 68 26 81 79 55
11380 55 26 39 51 45 -35 5 22 40 101 -82 27 24 -13 20 -32 -78 -68 46 113 -72 -51 -15 -17 24 38 41 -99 -74 -83 24
11410 24 9 11 84 -38 24 -1 73 89 96 -25 -112 38 -26 130 23 7 11 29 202 17 55 46 -132 98 -15 -11 61
11437 61 47 85 177 63 26 -46 45 -65 -36 -13 -55 27 -52 -30 -3 27 -38 -56 30 10 -190 -26 54 -18 -70 -39 8 -93
11465 -93 53 -17 10 -64 -79 -6 17 43 7 -40 18 52 17 -10 53 79 -4 -88 13 98 -31 3 68 82 175 -19 28 -49
11493 -49 103 41 -128 -83 32 26 15 -43 -33 51 -90 32 -1 -21 -39 59 76 35 43 24 159 13 -4 -57 -53 -72 63
11520 63 104 94 38 113 69 -33 128 31 -67 0 -9 -5 72 58 -73 22 -33 -75 13 11 -63 93 13 52 -35 -97 32 -19 -20
11549 -20 86 22 48 -56 -13 36 34 -20 -65 41 -96 -7 -28 139 -39 -53 -10 -73 56 93 124 40 76 -15 13 4 4 83
11577 83 85 53 -46 122 118 -63 -46 36 -7 30 -7 -28 47 60 71 -11 -27 -37 -120 -9 -70 -34 116 28 33 -59 -96 35 113
11606 113 120 146 -60 36 -81 -87 37 5 4 124 62 11 28 16 105 26 -14 43 53 -28 -22 64 111 -59 9 57 -63 -15
11634 -15 9 -32 -102 9 -89 6 -53 -53 11 48 -53 -17 -44 -16 -72 -76 -72 -47 32 -76 4 32 -114 -27 -76 -29 28 -70 119
11663 119 20 7 41 -14 55 -62 57 -46 29 199 60 100 124 23 63 -6 54 -11 -41 110 57 -62 1 78 22
11688 22 -33 -16 -11 -15 -68 49 -32 31 -8 -60 -43 7 -14 29 45 -50 -51 36 -23 -57 61 -128 -4 26 69 -38 -41 91 -11
11717 -11 -14 -52 23 -17 3 90 -68 99 -48 8 -40 33 -81 -17 51 -106 -8 -65 -72 53 -10 -83 103 20 -33 13 -48
11744 -48 -9 5 -64 1 -20 -156 36 96 -34 95 107 90 -63 -16 35 30 -62 117 136 8 61 -72 28 -47 -2 -4
11770 -4 -123 -100 -7 -40 56 73 65 66 75 8 -61 -51 21 93 -12 -42 4 -118 74 17 53 -9 43 69 -46 -78 5 12 26 -109
11800 -109 -106 -129 -85 -64 85 43 42 46 91 99 -17 70 108 40 -44 14 30 -43 -61 27 40 12 35 78 -34 -13 -5 169 62
11829 62 51 20 -25 -32 126 -151 61 52 -50 -150 -53 45 15 8 12 90 -8 168 64 4 72 -37 -32 -22 -59 -106 60 107
11857 107 -10 -34 -122 78 98 -13 -169 61 -25 34 124 41 48 -20 -21 56 -67 15 91 -16 -22 30 38 -9 -66 -115 -19 -129
11885 -129 -90 12 6 -29 -67 -19 -61 -77 33 11 82 -69 20 -32 -92 31 83 -20 14 -78 23 61 -6 111 138 59
11911 59 124 -9 75 96 78 64 69 41 -28 39 52 -13 -49 1 -18 44 -121 -93 -131 -46 90 -110 -16 -29 -40 51 62 53 -113
11940 -113 -126 -20 -65 19 38 25 18 42 -36 4 31 -106 27 93 -57 72 66 80 18 -6 -46 3 71 42 84 121 -17
11967 -17 71 -20 109 15 63 -41 -60 -129 -29 -30 12 -8 -46 -1 -197 -99 -18 -16 -47 -21 1 109 -104 19 -112 12
11993 12 -48 -54 -6 51 64 -101 -115 -69 -121 -11 -10 -90 -43 9 40 126 -36 -7 55 -71 -31 -32 78 -127 -31 -34 43 -76
12021 -76 -27 -14 -8 -39 -45 80 -24 21 -36 13 -33 133 69 -24 11 13 48 -31 -63 101 -15 1 -20 -37 84 -43 203
12048 203 -72 -68 45 -45 -70 -5 -101 47 64 2 -17 -46 -51 -3 3 -100 -26 36 -3 195 16 43 -48 89 -46 -45 -11
12075 -11 -7 -53 -40 -87 48 -14 63 -16 -35 5 -136 -17 25 33 77 -48 -153 33 118 -29 12 -20 100 -2 -2 36 -14
12102 -14 25 86 46 -12 47 30 -33 0 64 -8 -36 -23 -72 -36 15 17 -35 -36 -30 80 -92 -108 -132 -65 2 -8 -12 -36 -10 -28 -59
12133 -59 8 22 38 -32 -35 -72 -14 92 -67 33 -12 -106 -75 4 53 93 -44 75 -40 61 56 96 110 61 24 -20 120
12160 120 -56 44 31 9 58 -83 -24 -17 -113 21 69 -60 -100 55 152 -43 8 87 -37 33 -85 58 22 -148
12184 -148 101 -39 75 -24 -20 34 61 -16 -27 74 -5 -46 35 -4 15 8 12 -112 79 -128 11 54 -75 10 -21 14
12210 14 67 -26 42 58 -183 71 -32 -111 49 -57 95 116 -4 -57 -1 49 -2 -88 -75 97 -24 -108 -63 -50 38
12235 38 -90 -37 98 33 62 105 -7 -139 -33 -2 5 -5 12 87 119 -99 1 0 35 -6 1 -15 84 126 -49 -26 27
12262 27 -86 -113 12 -54 102 -108 11 78 -17 -30 -30 25 0 35 -74 35 -13 -87 32 44 13 -91 -43 -24 52 -51
12288 -51 25 107 -1 113 98 -117 -11 59 -63 77 2 -56 37 45 29 -98 -99 -34 -50 33 83 -87 -3 -27 113 18
12314 18 -68 117 -45 130 -56 -211 -4 -122 37 -45 -65 -21 -53 27 -78 -48 22 43 157 -13 29 38 74 -44
12338 -44 45 -84 83 -28 -26 45 -37 16 63 29 82 13 41 -40 71 39 24 35 34 -34 -50 24 62 -18 -48 21 -8 55 -50
12367 -50 -55 25 24 71 -7 -65 53 15 80 -172 -16 36 -18 10 -78 170 13 -63 -20 3 63 -4 -21 -8 -27 18 -87 -28
12395 -28 104 4 15 82 84 -38 -105 -11 71 107 -78 23 112 3 -9 31 36 -39 16 16 -2 -20 26 17 -42 -39 39 -16 1
12424 1 9 40 172 39 -62 3 42 37 -46 52 92 37 64 43 -46 61 75 34 -32 -29 49 32 92 -19 106 17 43 -51 -13
12453 -13 79 36 61 33 -48 -40 16 -31 -44 14 4 96 -73 21 -47 154 -8 1 -7 -18 42 82 70 -124 -30 -76 120 -35
12481 -35 60 -24 43 6 98 133 12 5 32 63 49 20 45 -47 2 73 -45 76 35 -94 -27 -15 54 29 -46 -103 -157 88
12509 88 16 -138 134 8 -29 -1 -63 -4 -54 12 -63 54 19 -47 -13 -23 8 28 49 57 -27 -17 -55 -57 -84 6 14 166 35
12538 35 -39 -38 98 177 36 72 44 -21 42 -8 -45 -49 -23 -66 16 -73 -34 -39 -60 17 6 -92 84 88 -70 10 -22 148 80
12567 80 115 -139 -68 54 -6 2 71 69 54 -5 -28 23 -49 -4 4 66 77 -54 20 -57 -21 28 40 -1 -30 -3 2 -15 -35 -61
12597 -61 64 54 22 -55 -63 -9 -144 -93 28 -40 41 20 -65 40 6 80 20 -30 -20 86 -56 -93 100 -29 126 -38
12623 -38 4 -7 -122 -52 105 -90 -11 -28 42 -40 -76 65 57 41 22 -12 -69 -60 -162 93 109 70 -116 -51 -62 -52 -41
12650 -41 -29 10 40 -145 83 94 -19 9 127 -18 -49 -47 -74 46 100 125 26 10 -51 -105 -51 16 -38 23 -82 133
12676 133 20 -43 49 28 76 115 98 -19 -33 248 46 -63 6 -64 -9 88 -90 33 84 -109 18 -1 -89 -26 7
12701 7 14 14 -18 36 -21 -94 39 29 58 6 59 22 21 116 -1 -23 -5 43 37 -42 -28 0 62 -51 39 95 36 42 -97 75
12731 75 148 129 -64 6 -106 -3 -28 41 -24 3 36 -44 -46 29 30 -56 -42 44 -169 4 -15 24 -2 -28 70 -18 -29 170
12759 170 29 -1 -17 -25 16 -6 35 -11 54 111 52 -33 -40 53 2 73 99 33 56 -46 84 -95 115 31 130 166 28
12786 28 50 3 -16 -60 -45 172 32 -28 -34 -36 13 -107 -23 -116 -28 -74 29 -54 -13 -82 -61 -26 -23 27 63 -3 -2 126 120 59
12816 59 7 -49 142 141 31 -23 -12 -7 -48 61 58 -33 -64 68 -51 143 175 -12 71 125 -20 -42 65 47 -16 -56 -55
12843 -55 89 50 -20 -2 35 -4 -51 28 79 -24 -88 -216 -3 61 -27 -31 -28 -26 27 56 -3 -72 -54 12 -182 41 21 24 -5
12872 -5 -16 -6 -59 -73 -120 18 -89 -41 110 63 -3 24 -34 68 94 136 -8 -40 11 -16 -12 -10 -74 9 -10 -16 57 2 -8
12901 -8 45 -68 -4 -47 -9 -26 -83 -33 48 11 -42 3 64 162 2 81 23 89 79 -52 -18 22 127 14 -93 31 46
12928 46 98 16 -57 13 -36 71 24 -19 -56 60 -31 92 -22 98 79 27 14 -56 -53 -72 -16 34 91 -101 -30 -47 -5
12955 -5 -55 13 67 -43 34 -25 16 138 -31 117 -60 -65 -55 73 -44 60 -28 -38 71 51 38 75 -2 -7 75 7 -90
12982 -90 -93 34 45 41 80 43 -71 -111 -39 9 34 -11 68 -77 -9 -83 -68 -16 -31 21 191 45 95 119 -2 -13 -24 11
13010 11 66 94 12 11 0 56 -90 58 89 -93 -65 22 39 -59 30 1 -30 70 5 25 14 11 -17 37 -18 4 23 45 27
13039 27 81 24 12 -17 -27 -101 -113 69 -23 46 43 -119 68 -22 -1 -41 -25 -32 -27 -61 14 -33 34 -5 14 29 -82 51 -80
13068 -80 -46 6 -13 -4 98 -40 17 -2 24 -34 26 -14 91 -31 20 13 -30 -6 164 -53 6 16 67 31 34 -75 97
13095 97 77 -20 85 36 25 -45 4 -34 -48 50 111 28 111 -80 -10 9 120 -73 10 61 -8 -53 -17 -100 108 51 84
13122 84 36 -35 73 -59 24 -62 -71 -3 68 -57 -22 72 -28 -89 -57 -30 -16 -65 47 46 46 114 -22 -44 -18 -11 6 -41 43
13151 43 -31 42 -7 7 36 6 47 -73 77 -22 64 23 9 136 -33 44 13 166 90 -58 26 2 30 -44 -112 -68 9
13178 9 34 -104 101 -13 17 33 -18 -75 -30 119 -26 -35 -10 -15 -78 -8 -69 -107 -28 138 193 78 -22 -41 -25 -53 81
13205 81 43 0 12 43 3 85 42 91 132 -72 17 54 170 -115 21 129 -69 -52 30 71 60 -14 32 142 -14 8
13231 8 87 7 -49 -23 -4 22 -66 -54 27 -27 1 -43 -22 54 127 -48 116 -68 49 -30 23 83 -17 -149 77 26 38
13258 38 113 1 54 97 16 25 -24 55 74 7 19 48 18 5 84 30 25 -26 26 52 29 35 69 68 34 -42 3 57 106 -58 29
13289 29 84 69 60 -29 59 73 22 -57 42 64 -147 57 -10 -91 16 -18 -88 135 27 6 -11 -16 84 -19 -51 42 -39
13316 -39 118 -6 63 -114 178 -25 16 89 5 38 10 -89 -66 -12 -30 -60 -8 -1 15 -16 73 25 4 -32 75 35 24
13343 24 74 -98 -6 -95 32 -77 61 17 -19 97 104 97 3 15 -122 61 55 0 -78 51 58 -33 34 2 -4 -32 61 118
13371 118 61 -49 -22 67 113 -44 -117 -26 -179 -105 92 -43 -7 4 1 -14 3 69 95 128 -29 -91 42 -2 -66 55
13397 55 98 -35 2 -33 2 142 -12 40 -42 -121 -39 -26 4 -25 106 -2 -70 23 27 33 -54 -84 48 0 -24 68 29 -5
13425 -5 -11 -71 -53 59 77 -19 -84 -38 -15 94 26 -102 70 36 -87 52 77 99 -55 -26 21 71 164 -5 24 54 -59
13452 -59 12 -42 -48 31 -43 8 10 -25 22 128 74 141 55 -90 34 56 29 -98 -17 102 -17 -36 -80 115 -21 -43 -36
13479 -36 -42 49 31 -79 -69 -29 90 -83 20 150 0 -26 -87 165 36 80 -33 41 -8 41 -16 81 -73 107 -37
13504 -37 58 -31 24 -5 98 91 -21 -53 116 -72 -24 -10 26 52 23 -7 -133 99 -89 10 11 10 45 -48 58 8 -25
13531 -25 -58 -19 7 -59 109 38 -4 23 -86 71 23 69 -46 22 -115 15 91 5 -35 144 38 25 65 -57 -112
13556 -112 67 81 81 15 77 -75 -47 -99 98 -41 -32 123 -48 104 -96 259 43 23 -57 -75 -23 -18 63 21 120 66
13582 66 -126 30 81 1 16 -56 56 45 14 -33 -117 -2 61 28 -20 85 94 -11 -56 44 -16 -42 4 -21 23 -34 -29
13609 -29 -36 62 131 18 -51 -15 -112 73 -48 -92 27 -12 -59 -3 -13 66 69 12 22 11 69 26 -45 -15 -57 -67 -5 81 -17
13638 -17 59 -131 -16 -50 68 -66 101 86 22 87 25 -19 15 47 70 -63 -47 -70 83 101 60 62 75 -66 -128 -73
13664 -73 -26 31 -7 -49 82 -36 -27 -26 -59 -150 40 -19 6 23 -54 -15 -17 -42 -62 3 45 100 57 24 -92 75 -66 143
13692 143 17 -51 125 14 -10 -25 25 -62 36 28 -65 -28 70 -46 -32 -62 -8 -100 -57 114 13 68 -113 41 -59
13717 -59 -66 -70 50 34 -43 -41 -33 117 4 31 9 87 -39 11 -56 -100 98 71 -9 88 -31 41 -89 7 64 2 72 5
13745 5 49 9 89 23 118 -17 73 -45 98 -66 -45 46 -119 63 16 -111 58 -30 -15 -6 114 -68 -47 -78 -29 -12
13771 -12 -18 66 -9 19 -21 -1 28 2 3 -22 54 24 -20 -42 -56 -28 3 66 48 -22 20 -28 -28 -10 -69 22 13 118 -11 -53 34
13802 34 88 94 -146 10 117 -47 -38 10 12 -32 96 19 126 -87 -76 19 -50 -92 57 135 -12 -166 26 -56 20 -10
13828 -10 95 45 -12 -66 1 108 136 90 169 72 43 34 -21 122 62 -40 -35 70 131 -54 54 12 2 -12 54 -125 -60
13855 -60 6 124 51 14 -48 154 -5 -114 -40 -24 -4 -100 1 -19 -42 138 -120 15 -116 -81 -43 118 47 -8 30
13880 30 63 90 8 112 -27 41 0 -30 10 30 -32 -71 75 -65 57 22 -91 3 74 12 -90 17 -105 -60 -92
13905 -92 52 54 66 9 -101 44 -63 96 -22 -134 21 -7 -10 -23 -45 25 -55 154 -125 -73 -56 -37 42 -42 47 70
13931 70 -103 25 33 17 74 11 89 -7 79 156 66 26 -29 22 1 135 -56 -44 -37 -86 -4 -197 6 -119 28 -16 17
13958 17 120 -88 -6 106 77 40 -125 -120 -59 31 -18 -48 -35 -8 -4 126 91 71 -73 90 67 9 -12 14 2 56 -58
13985 -58 -40 -7 -3 12 9 -31 43 58 22 -3 -17 19 -40 -5 113 -103 -78 92 5 123 10 -30 90 -45 -13 11 8 -29
14013 -29 -77 -34 -16 76 109 -57 -4 9 69 69 0 83 14 154 -72 -68 23 62 5 -50 -17 139 -42 7 -45 -57 41 143
14041 143 100 162 119 59 62 -25 -7 -65 -104 -39 127 -50 -52 72 52 -9 98 29 23 -61 -68 -73 58 -45 -107 -63 19 123
14069 123 87 -1 32 59 -62 84 111 10 16 80 21 -38 52 78 50 -115 -82 15 145 -2 -39 -13 -80 31 -21 -97
14095 -97 -4 -152 -62 -6 -76 -94 -77 136 58 47 21 -51 25 -33 130 209 -65 -109 -82 -68 36 -22 4 113 62 -32 5
14122 5 78 -49 -8 -46 -125 2 -25 -73 -118 122 85 2 69 11 -65 76 -36 107 -17 101 -52 99 25 98 49
14147 49 -71 144 33 -113 56 116 -50 -62 47 11 -64 -3 42 -1 -84 34 28 78 -2 -23 -51 69 79 7 -1 179
14173 179 -41 145 4 -40 15 -9 165 -97 68 -34 -41 -19 12 7 38 40 47 38 -27 -41 28 -67 -25 8 -99 -34 -102 3
14201 3 77 34 -84 -5 -8 14 94 -92 28 191 115 -57 -8 84 -34 -88 -31 -2 54 -35 18 -34 21 -11 -16 -60 -95 100
14229 100 -21 84 51 44 102 -24 -66 79 27 27 -29 77 111 -48 -8 -11 42 -41 28 68 -25 -35 -7 38 -97 -14 -12 -9
14257 -9 60 3 -145 -2 -21 -8 64 -79 1 37 1 -69 140 40 39 -2 62 -8 72 -13 99 17 29 0 104 64 33
14284 33 29 -86 10 -140 27 -116 -77 -38 7 56 45 130 -7 -15 31 -72 -4 91 -39 -38 54 92 47 112 -62 92 27
14311 27 -60 51 55 -21 120 42 -3 -6 -3 40 -32 64 -46 9 61 69 58 -108 -21 -16 39 62 -43 176 27 65 -13 -86 49
14340 49 69 83 35 33 4 -66 -37 73 -61 -24 104 20 -14 17 2 44 -109 39 22 -63 -91 23 -20 103 29 -111
14366 -111 42 -60 -26 51 147 83 -5 30 121 182 -50 -49 116 92 -115 31 -11 1 23 -5 91 23 -16 -34 101 -70
14392 -70 -91 72 -47 -29 -8 -118 -31 14 114 52 52 -80 5 38 26 -31 28 -71 -6 -15 -103 97 73 30 57 -126 101
14419 101 -65 42 -83 84 66 -55 60 -40 85 46 58 78 -30 62 -55 -41 -35 -27 6 -111 -20 -70 -44 84
14443 84 91 -58 -140 -30 -6 -17 -71 -49 18 -7 212 151 37 147 -5 37 -72 70 91 81 -48 99 72 121 -105
14468 -105 62 76 -108 24 41 -57 -112 15 2 80 -46 -2 84 86 -92 -23 20 -82 29 0 -22 104 20 23 0 0
14494 0 2 126 -20 42 56 -54 75 64 152 206 -109 -59 -63 -26 38 15 64 -36 -17 32 116 40 24 34 -22 5 -70 65
14522 65 -8 -43 -36 91 -2 75 -36 -99 -35 -39 0 64 -57 -84 50 -4 19 5 80 0 69 60 -22 -25 -86 -138 2 1 -74 60
14552 60 -13 -19 10 22 6 -52 34 -71 -137 32 -31 108 80 -24 26 25 107 -11 -3 46 109 -22 68 -81 -95 61 -48
14579 -48 -55 18 -12 -11 -5 -8 74 101 -44 -75 25 30 -50 -42 -10 10 -52 31 66 -63 50 -27 84 6 95 14 82 49 -66 47
14609 47 34 -68 105 21 20 7 56 -20 -2 120 -67 -30 -113 -2 -47 -51 -46 115 42 51 110 22 -54 27 -11 24 -43 -9 -25
14638 -25 -79 -8 -96 155 21 79 32 9 49 37 36 -19 104 50 -53 147 66 57 20 47 97 -12 1 -31 141 122 50
14665 50 -32 -57 -121 63 -86 7 69 24 42 42 -44 -10 63 61 73 63 40 -12 -40 -1 -5 -71 43 -35 45 -66 -32 93 4
14694 4 -62 -30 96 -68 79 47 -12 -53 -91 -9 42 90 -132 -53 192 27 -7 31 68 -49 55 43 -28 -60 23 47
14720 47 -68 -157 23 -22 30 -29 -41 -9 -76 47 32 73 -11 -59 -116 97 -79 63 83 54 -90 -2 -64 42 11 17
14746 17 -25 11 101 26 73 152 93 10 23 3 91 -97 -15 24 93 -60 71 7 8 -40 23 35 -57 4 -104 -8 -94 -118
14774 -118 36 0 -6 17 -23 -9 -98 12 -40 35 74 31 0 23 -21 26 74 -51 23 33 -50 43 37 60 43 82 36 -86
14802 -86 49 62 106 -11 -49 -29 -109 42 5 14 -85 98 -36 44 37 6 -85 96 -18 38 -56 -2 160 -25 -17 24 -23
14829 -23 -2 80 39 -32 2 -22 60 156 -41 -68 23 4 -9 -13 20 68 -43 -30 -33 -23 -13 -21 -6 -118 40 101 51 -38 34
14858 34 -21 61 15 86 9 -40 34 2 -68 35 26 -139 53 -5 52 113 -90 76 65 41 17 37 95 -32 111 67 -61
14885 -61 -24 84 -28 -36 33 118 -54 73 109 4 -12 169 -57 49 59 -30 136 -5 26 63 -39 148 -13 97
14909 97 39 87 57 57 -51 46 -67 -91 28 3 -24 55 71 -22 34 -111 36 -36 59 -60 22 -101 16 -20 16 -9
14935 -9 47 -44 -43 -74 -133 37 -30 -61 -24 79 138 29 39 -76 -41 -58 21 -98 -26 -51 -1 -18 15 45 -32 -40 71 11
14963 11 -20 -34 54 -27 62 39 1 22 -10 60 -88 20 56 20 5 27 150 -24 -70 -15 -35 140 16 52 -4 80 77
14990 77 41 -80 -43 -7 23 7 -61 -16 -25 -16 53 43 24 25 52 -62 10 26 -52 -65 67 186 -58 15 -21 -14 38 -52 53
15019 53 -93 -15 -3 32 16 -58 31 -63 -11 -24 -14 37 27 69 52 11 46 -58 103 -102 52 -23 63 19 77 -36 -37
15046 -37 29 -88 58 -1 102 -32 11 120 -42 67 59 18 2 90 80 108 -13 43 -111 -28 28 -146 28 -36 -153
15071 -153 87 -64 6 -29 -95 10 -16 21 132 -25 19 91 88 12 60 94 85 102 24 83 -2 14 32 -9 132 -7 68
15098 68 51 -98 95 -8 123 73 -57 34 131 -64 105 25 -13 64 -57 -67 -29 -52 -35 -114 75 53 80 35 9
15123 9 -24 37 -2 -48 18 -15 52 -30 -55 15 -7 -30 24 -95 -8 -113 92 -18 100 -96 30 -16 79 34 20 49 -122
15150 -122 -15 20 48 -80 24 -46 -34 -7 -89 -84 -24 12 51 -53 -110 109 -19 -100 48 32 73 -17 -134 -89 47
15175 47 103 8 45 -53 16 -121 78 -35 -17 35 21 111 29 44 51 -15 -8 -2 22 37 3 -4 -55 91 -86 59 -31 139
15203 139 -102 41 -42 56 11 -39 56 41 -41 -35 43 -37 66 33 -42 6 97 30 36 35 -46 -5 -25 -19 -80 45 -13 -9 -92 -111
15233 -111 75 99 -21 -9 72 -26 -102 64 29 49 -18 77 -155 8 41 -100 -103 26 -4 109 -9 -91 26 65 41
15258 41 33 -19 3 -8 -74 75 55 48 -53 -24 64 37 -9 -105 51 91 -41 -10 34 29 82 -26 -84 53 143 19 42 -25
15286 -25 -17 -50 -16 0 -20 -20 -92 65 -22 73 64 -92 -49 -116 -76 12 125 49 -143 102 -40 48 104 -121 2 -12 128
15313 128 45 94 -22 29 12 146 131 -5 5 -97 31 74 -14 90 21 55 -48 34 -22 90 9 61 46 26 88
15338 88 -50 -67 -57 54 -78 39 49 39 2 14 -78 37 33 78 -20 -38 117 -119 -73 -38 101 -22 -95 68 -20
15363 -20 41 -165 -42 -62 -1 -1 60 -20 37 69 -84 49 -80 106 -94 -21 -28 -105 12 30 -55 102 27 -6 27 128
15389 128 -26 -25 57 2 -79 -32 34 57 -150 -55 -41 18 -8 -48 -78 18 32 13 -44 -57 -8 15 27 -32 59 -55 117 -90
15417 -90 69 32 -75 9 2 12 -119 17 -4 88 -107 -35 99 72 18 60 19 21 -45 37 -87 26 45 59 -34 14 50
15444 50 0 -35 5 112 -32 95 -17 93 8 -93 60 -44 13 -19 -4 65 -1 -6 23 -48 35 -87 -103 77 -7
15469 -7 74 1 -23 1 25 -141 43 -17 0 2 37 -78 -29 -63 79 -11 -3 -30 -2 -46 -64 -22 -108 2 2 36 19 -48 -104
15498 -104 73 -86 22 34 -40 73 12 13 -116 0 -43 -42 44 -16 -30 -12 -62 14 -17 -58 68 90 -26 -60 48 154
15524 154 6 95 -38 9 26 25 30 -100 -34 46 106 -65 -70 35 39 31 -21 -70 -44 -129 -57 82 -66 45 -30 92 -22
15551 -22 29 -34 -31 179 -35 147 44 -59 61 2 34 52 28 103 94 25 80 99 -68 91 40 139 77 -9 12 37 29
15578 29 37 -2 -64 122 -30 -20 21 -6 49 10 3 -155 68 -29 14 13 13 96 130 -46 20 -54 -52 -151 -60 -1 21 7 -5 -22
15608 -22 104 -17 -17 37 19 58 42 113 39 71 113 35 73 -53 -49 -9 35 -4 -54 17 -61 48 0 82 160 128 48 51 -71
15637 -71 -4 -26 69 44 47 59 32 58 -21 -133 51 50 47 31 17 134 -38 -112 23 34 113 -34 14 -49 6 -70 -46 -41 -41
15666 -41 50 -81 4 -6 -46 -81 100 30 57 -21 65 -18 -7 -41 24 -6 -16 50 -55 -62 38 155 24 10 27 -51 42
15693 42 64 100 35 -53 53 -69 6 53 -11 8 9 21 43 -161 56 173 38 43 76 -58 -149 31 23 -17 14 94 -44
15720 -44 24 60 53 59 132 -12 -80 80 7 2 7 -22 4 -56 9 -11 -28 9 -35 30 120 -27 -88 -29 101 -6 152 117 12
15749 12 -20 -40 75 -28 122 -20 -69 86 82 45 21 29 14 -12 35 9 -18 -9 60 5 188 55 19 -9 -18 105 13 38
15777 38 25 76 72 36 64 47 125 -46 -40 55 49 45 121 127 102 20 -13 78 -4 107 -32 -3 116 51 -119 -137 -3 63 42
15806 42 21 50 -63 81 13 -23 22 84 6 -25 -52 91 36 64 42 -12 -31 -39 8 67 55 -45 -88 -69 73 12 27 8
15834 8 51 -12 34 -43 41 33 -28 -121 40 25 -56 54 -17 -45 25 -79 -135 53 -1 -80 149 27 -71 78 21 33 97
15861 97 92 -17 -86 30 -1 44 -47 13 68 107 77 -75 -70 80 0 -146 -59 -49 2 5 44 77 -70 38 -54 -14 8 21
15889 21 46 -25 -49 117 12 -97 -59 -47 11 33 108 -4 -80 -34 21 22 75 -4 115 31 -34 -52 -19 39 58 102 -94
15916 -94 15 50 -34 129 -115 110 -43 28 -23 59 -85 -110 4 50 4 -26 137 -21 32 -26 -8 77 17 103 -115
15941 -115 -77 23 -31 3 -58 -42 108 -79 13 133 5 -54 -39 96 26 102 86 86 42 90 -62 -20 88 34 169
15966 169 -4 -31 -50 6 -13 -29 109 99 40 59 38 10 29 38 7 -16 65 73 57 -13 -90 52 -38 -165 -6 29 30 -55
15994 -55 42 19 -19 130 47 152 53 87 25 10 -7 25 45 73 30 -20 16 58 -54 -108 62 167 48 73 32 -50 -56
16021 -56 97 13 110 70 60 -30 -64 60 88 1 38 54 150 69 -69 20 35 -23 2 45 54 -71 67 -8 -92 -1 -105
16048 -105 60 13 75 19 -20 74 -47 -136 -110 145 -22 -81 36 19 -43 64 -40 -16 67 -113 3 20 51 -105
16072 -105 -42 -82 7 23 13 68 71 -59 37 -33 89 23 47 74 191 13 9 23 -52 101 34 83 74 -51 -17 55 56 -59
16100 -59 -20 79 -38 71 -2 40 5 23 -138 -16 25 -13 44 55 -62 -147 21 2 79 27 1 93 -16 96 -34
16125 -34 55 69 14 69 37 146 47 -57 -90 -22 71 -35 65 110 -16 -66 -31 -19 4 39 -105 13 -36 27 -23 32
16151 32 81 -49 -20 32 43 -59 5 31 141 -44 70 4 19 -41 -54 150 -7 83 -94 68 81 37 95 13 -51
16176 -51 -69 58 45 99 -42 -34 133 24 142 103 78 -36 -90 -12 1 -67 -84 -56 -36 51 -103 20 -63 -77 31 61
16202 61 26 -50 -3 67 -70 -46 69 -34 -9 58 -24 -67 -7 183 -55 38 -96 8 -48 -96 58 -72 32 103 28
16227 28 -32 156 30 10 148 59 146 57 92 -31 -2 35 54 6 0 38 95 79 -23 -31 19 47 -40 35 -63 32 -28 -7
16255 -7 -25 47 162 57 -23 -79 12 -70 51 92 109 7 -12 39 -79 54 57 16 12 -19 -99 13 -7 -7 -42 -12 -91 -111
16283 -111 81 -39 -52 75 -52 53 16 68 -1 58 -134 72 56 15 50 -41 24 47 -94 16 49 40 8 -81 45
16308 45 -131 -75 -39 80 -76 47 4 -1 -109 4 36 -6 23 -58 2 -5 -102 -8 126 -45 -74 -80 -56 49 -19 -65 69
16335 69 -67 50 146 50 44 35 -94 12 -99 -25 42 -30 -24 -48 -106 -8 -63 5 -28 54 29 -49 -31 52 21 -9 -6 14 34
16364 34 -4 -53 -40 -12 37 -111 65 -67 53 -34 -83 -141 38 -154 -26 -18 -32 13 56
16383E6
$$ Imaginary data points
##PAGE= N=2
##DATA TABLE= (X++(I..I)), XYDATA
0 0 0 0 0 0 0 0 0 0 0 0 0 0 -32 32 -32 32 -32 64 -64 64 -96 96 -128 160 -192 194 -254 288 -320 374 -416 480
32 480 -544 609 -704 795 -892 992 -1110 1236 -1377 1532 -1697 1872 -2078 2291 -2527 2785
48 2785 -3072 3382 -3724 4105 -4525 4993 -5517 6108 -6784 7561 -8462 9525 -10806 12379
62 12379 -14366 16963 -20530 25758 -34156 49994 -90282 421812 622133 -296964 -508282
73 -508282 -181556 351236 322672 -32767 -341904 -250921 -66289 20662 -52435 -63560 -46057
84 -46057 -39066 -81941 -19354 117352 198643 79770 -81299 -93619 74772 184697 102191
95 102191 -90465 -182712 -143338 -62915 -21131 21892 66672 53249 -47108 -107537 -13585 162339
107 162339 202788 46980 -116627 -76892 112975 211416 92860 -96025 -146965 -43526 51793
118 51793 29320 -59362 -109104 -93401 -52680 -12526 27752 48588 22162 -31315 -49025 -11081
130 -11081 26111 15944 -6123 14459 52789 36328 -29804 -46855 31287 101546 40856 -97073
142 -97073 -123647 26090 174326 120718 -81091 -175042 -34086 167283 173659 -24007 -185953
153 -185953 -135699 35893 117292 45874 -52392 -59118 -1015 24982 -2779 -28725 -22301 -13890
165 -13890 -24251 -24695 6745 35611 16676 -31601 -44821 -2281 42514 38133 4492 -5738 11598
178 11598 18195 8037 20488 65681 83832 21208 -73902 -93249 -10269 69433 40444 -61141
190 -61141 -100919 -23276 74494 68605 -32489 -102476 -57457 44075 84066 28418 -47192 -59800
202 -59800 -8865 40639 39222 -3167 -40430 -40854 -11123 16569 16525 -5183 -12862 17716 61779
215 61779 67077 18809 -33162 -30552 18824 46547 11490 -43240 -46589 3212 35517 2563 -53730
228 -53730 -58031 -2007 44104 24933 -28062 -41478 3138 48652 42128 -1079 -26347 -13085
240 -13085 6946 -2857 -33134 -44133 -19329 17491 32620 18723 -3800 -10798 4975 28517
252 28517 36490 20394 -3473 -7388 14996 33963 17225 -26608 -49139 -22369 19348 18299 -31973
265 -31973 -71843 -46104 22753 59671 29476 -20608 -24666 17557 44907 17582 -32275 -41993
277 -41993 509 42880 33772 -14541 -47595 -32915 6583 25914 9061 -18090 -21330 3863
289 3863 31443 33985 12094 -8454 -3274 21198 31629 6901 -33677 -48446 -20933 17604 23988
302 23988 -5527 -31113 -20991 8852 17212 -5594 -25104 -10379 24983 38528 14590 -15858
314 -15858 -15957 9296 22800 5374 -22006 -25847 -4819 13454 6863 -12854 -16849 3694 27624
327 27624 27993 3994 -20660 -21649 647 21160 18402 -4095 -20200 -11851 9467 15449 -5506
340 -5506 -29654 -25418 6096 30175 19228 -11994 -23575 -311 29122 27675 -3294 -26659 -17356
353 -17356 7772 14234 -5252 -22418 -12329 15733 28103 10344 -16661 -22412 -2832 18492
365 18492 18457 56 -13989 -8103 7808 12519 -2362 -20830 -21537 -2217 16484 13222 -8053 -20273
379 -20273 -5460 22748 33470 14912 -11341 -16097 2076 15361 4231 -18053 -22283 -2178
391 -2178 17785 12473 -12545 -27387 -14325 10649 19314 5710 -9550 -6394 10800 20002 9140
404 9140 -9337 -14124 -1572 10914 6111 -12774 -24535 -15438 6850 19139 10772 -5969 -10042
417 -10042 3434 17090 13745 -2947 -11890 -71 18178 19816 631 -19352 -19150 -2449 8792
430 8792 290 -15690 -18308 -3665 10817 9392 -3308 -8839 1140 14469 13574 -1933 -14756 -10466
444 -10466 4860 13905 6982 -6897 -10831 -1193 8987 6196 -5968 -11927 -2059 14592 19629 7290
458 7290 -8838 -9997 3900 14743 7960 -10252 -19845 -11212 4036 6738 -5124 -14417 -7677 8503
472 8503 14628 2572 -13302 -13750 2400 17155 14410 -1047 -10560 -4267 7905 8432 -4343 -15175
486 -15175 -10438 5156 14043 6717 -6764 -9015 3978 17616 16481 2055 -9694 -6605 4434
499 4434 8104 -665 -11061 -10148 340 6158 -1969 -15184 -17958 -7089 6481 8547 67 -6070
513 -6070 -726 9556 12188 3992 -5347 -4590 4970 11707 6525 -5186 -10317 -3121 8113 10854 2255
528 2255 -8443 -9470 -1077 6372 4100 -3860 -6566 683 9583 8902 -2354 -11564 -8248 2727 7798
543 7798 937 -8658 -8651 1180 7736 1543 -10151 -11978 -1128 9865 7009 -6281 -13270 -3698 12886
558 12886 18363 7848 -5378 -5581 5889 13987 8534 -3884 -8726 -845 8410 6996 -4668 -14070
572 -14070 -12278 -3263 1998 -1608 -7740 -7765 -1374 4518 4184 334 -80 4693 8661 5839 -2197 -6570
588 -6570 -2858 4704 6998 786 -7676 -9306 -2672 4432 3343 -4035 -7832 -1640 9870 14819 8117
603 8117 -2776 -5768 2803 11762 10310 -1587 -11787 -10604 -1699 3273 -1874 -10180 -11042 -3711 2540
618 2540 211 -6625 -7383 854 9508 9417 2683 -1181 3236 9341 7588 -1518 -7632 -3122 6184 8220
634 8220 -689 -10313 -9646 663 8965 5856 -4268 -9232 -3671 5405 8004 2246 -4324 -3871 2022
649 2022 5729 2268 -4748 -8098 -4915 204 2353 -254 -3222 -2721 112 1565 81 -1810 -886 2930
665 2930 5077 2845 -1565 -2286 2180 7559 7208 744 -5397 -4403 2474 6310 2401 -5414 -7597 -1460
681 -1460 5920 4984 -4171 -11061 -8181 1418 6757 2720 -4998 -6859 -447 6227 5932 -122 -3689 -674
697 -674 4029 4186 -572 -4139 -1787 3308 4871 438 -4270 -4026 518 3389 1370 -2714 -2548 2374
713 2374 6719 5064 -1101 -5245 -2974 2878 5069 889 -5290 -6487 -2418 2335 1884 -2491 -5501
728 -5501 -3116 1572 3069 155 -3213 -2219 2691 6166 4755 236 -2142 -101 2806 2528 -1046 -3261
744 -3261 -1177 2769 3516 -60 -4423 -4334 277 4177 2869 -2213 -5000 -2248 3078 4456 590 -3915
760 -3915 -3477 1091 3753 1153 -4107 -5366 -982 3917 4045 -77 -3494 -1972 1866 3312 570 -2286
776 -2286 -1329 2116 3732 1567 -1963 -2439 664 3503 2462 -1398 -3706 -1824 1408 2609 174 -2784
792 -2784 -2517 509 2573 790 -3075 -4453 -1450 2801 3683 290 -2951 -2374 1225 3409 1791 -1691
808 -1691 -2383 404 3068 2024 -1420 -2986 -687 2967 3267 62 -3133 -2601 590 2604 1295 -1365
824 -1365 -1749 308 2696 1962 -1379 -3697 -2140 1301 2816 650 -2428 -3091 -458 2390 1997 -823
840 -823 -2360 -733 2098 2615 60 -2151 -1363 1903 3439 1364 -1866 -2752 -494 1674 1125 -1118
856 -1118 -2026 -77 2098 1929 -787 -2693 -1582 1291 2737 1006 -1786 -2227 -116 2038 1629 -694
872 -694 -2334 -1342 1122 1814 -23 -2290 -1997 743 3096 2249 -783 -2435 -1129 1503 2003 10 -1853
889 -1853 -1313 1111 2182 381 -1799 -2016 163 1903 1100 -1040 -2164 -787 1405 1900 78 -1521
905 -1521 -1081 704 1490 74 -1693 -1927 222 2288 1950 -259 -1936 -1194 864 1874 540 -1487
921 -1487 -1523 317 1606 857 -1188 -1902 -495 1483 1429 -451 -2033 -1135 903 1810 772 -835 -983
938 -983 683 1544 511 -1220 -1709 -451 1494 1615 -216 -1810 -1436 384 1405 530 -1106 -1457 92
955 92 1625 1313 -400 -1428 -622 1265 1849 233 -1645 -1668 -105 1233 806 -510 -1273 -279 800 726
973 726 -638 -1472 -593 1087 1679 582 -927 -846 345 1483 880 -651 -1318 -309 952 865 -366 -1587
991 -1587 -928 770 1431 337 -1390 -1713 -411 1001 1123 -82 -946 -254 802 1286 186 -923 -709
1008 -709 449 1231 685 -735 -1185 -173 801 751 -394 -1032 -674 456 801 -7 -1042 -637 666 1658
1026 1658 928 -635 -1177 -388 942 1147 12 -1022 -904 261 881 104 -1041 -1297 -345 763 795 -362
1044 -362 -1081 -415 895 1290 456 -297 -278 518 967 185 -620 -823 235 892 410 -723 -1385 -895 304
1063 304 546 -244 -1088 -662 509 1129 675 -400 -614 186 1157 1088 -232 -1007 -761 214 856 265 -534
1082 -534 -1020 -247 316 74 -529 -715 -208 662 1053 371 -448 -259 608 1062 660 -436 -749 -155 711 391
1102 391 -745 -1284 -660 345 619 -266 -1181 -1157 201 1005 823 -252 -512 263 1145 1032 -46 -583 -234
1121 -234 617 739 15 -868 -832 -212 279 -63 -717 -683 -201 406 276 -112 -494 37 757 945 347 -493 -493
1142 -493 174 593 503 -330 -752 -394 224 258 -304 -850 -767 37 693 301 -284 -497 -41 661 992 278 -272
1163 -272 11 329 509 105 -540 -544 -84 332 242 -684 -1094 -518 221 363 -22 -538 -275 577 963 397 -367
1184 -367 -275 451 982 541 -408 -768 -378 386 661 -314 -720 -708 -153 283 4 -439 -401 487 665 585 28
1205 28 -304 -37 542 471 185 -399 -399 16 146 -9 -560 -672 -228 71 243 -191 -483 -391 280 776 550 -40
1227 -40 -322 204 448 366 -117 -383 -289 373 379 -164 -804 -607 -115 180 197 -306 -431 20 511 463 -97 -259
1249 -259 -5 445 637 -89 -564 -484 120 431 137 -377 -734 -231 222 109 -317 -536 -73 419 531 230
1269 230 -414 -313 215 558 328 -255 -483 -87 227 184 -191 -579 -217 128 512 -3 -380 -413 -1 484 377
1290 377 -39 -187 46 300 464 -124 -335 -140 251 344 221 -237 -529 -270 259 350 -45 -409 -129 208 363
1311 363 257 -140 -169 303 558 288 -220 -483 -34 188 323 -24 -265 -207 156 174 -47 -336 -238 143 304
1332 304 224 -150 -156 -46 313 364 63 -341 -296 56 155 161 -231 -235 -71 232 174 -142 -392 -190 204 279 24 -275
1356 -275 -118 175 290 21 -228 -259 39 198 -5 -237 -401 -307 97 356 10 -161 -225 120 237 143 -90
1377 -90 -255 -64 316 254 7 -224 -302 81 311 12 -300 -431 -96 141 82 -278 -282 -132 213 186 -25 -299
1399 -299 -204 122 288 167 -142 -264 -75 147 57 -189 -255 -118 113 195 -19 -185 -199 1 217 259 -82 -158
1421 -158 24 159 237 17 -110 -138 132 168 15 -153 -223 28 146 149 -160 -282 3 100 136 -33 -201 -118 106
1444 106 248 48 -219 -155 -83 270 158 -301 -221 -100 11 106 34 -69 -141 28 185 108 -226 -227 -108 193 200 43
1468 43 -157 -106 121 168 -16 -229 -93 -124 66 -10 -106 -183 88 143 291 -86 -86 -120 98 124 -44 -19 -46 146 276
1493 276 99 -183 -151 -179 -40 205 7 -161 -131 144 272 15 -127 -123 78 139 195 -112 -233 1 174 132 -43
1516 -43 -96 -155 6 91 70 3 -108 15 179 88 -3 -180 -51 89 164 50 -203 -213 -54 98 87 -49 -65 -26
1540 -26 150 246 -15 -79 -130 52 106 63 -157 -65 -15 -33 15 -85 -204 -90 44 86 88 -121 -145 139 200 99 -44
1565 -44 -172 -35 122 73 23 -208 -62 13 113 -63 -190 -168 41 158 74 57 -119 82 239 113 36 -52 9
1588 9 49 51 -22 -109 -189 -25 39 52 -146 -252 33 37 158 -77 -75 16 145 248 -10 -86 16 35 117 84 3 -137 -73
1615 -73 37 -4 -36 -178 -22 62 79 6 -124 -183 -94 80 219 81 -21 -31 78 52 49 15 -7 23 107 -68 -88 -256
1641 -256 -117 40 190 -11 -147 -37 139 135 93 -106 -37 60 145 33 32 -169 -21 66 100 4 -197 -138 -68 -4 -107
1666 -107 -26 -155 79 81 239 -55 -25 135 202 177 99 -81 28 109 148 7 54 -161 -40 -21 -19 47 -164 -256 83
1691 83 68 72 79 6 145 178 81 94 -24 97 80 49 27 -54 -154 75 23 -71 6 -146 35 13 75 55 -3 66 118 124
1719 124 94 -81 -4 58 62 45 -17 0 -167 63 21 -164 -105 -1 7 172 88 16 99 25 257 54 -70 2 89 74
1745 74 14 -82 -19 22 -47 18 -66 -40 -20 18 -9 -98 63 -82 -107 118 92 -103 14 56 -115 91 8 -104 -101 -6 33
1772 33 121 -37 31 -28 25 -79 44 -91 6 -36 104 38 14 54 45 108 31 -146 -123 -76 79 -75 -21 -4 -84 -20 40
1799 40 -52 -126 11 48 52 63 21 -6 -30 16 -13 83 8 13 -61 124 20 -203 -75 50 136 158 7 -85 -78 11 17 -57 -89
1828 -89 -59 49 -14 42 -32 92 -80 -14 13 172 -65 59 -1 84 127 81 105 -3 -4 60 18 -74 15 -21 42 44 -23 -74
1856 -74 -72 25 81 76 17 29 19 60 1 153 -110 9 31 60 -35 6 13 -33 22 57 26 25 67 -33 -22 22 -113 26 73
1885 73 41 0 -29 -159 -185 -105 6 15 62 25 18 -3 -164 83 -64 38 20 -111 2 -51 111 6 19 0 -6 64 67
1912 67 76 -49 -21 -72 100 61 -31 4 33 115 83 74 -75 -10 29 76 18 -78 -84 34 35 4 8 -120 86 80 33 -50 -36 -7
1942 -7 -41 -61 -45 -70 -76 107 -49 56 -36 -7 90 -51 131 46 49 48 26 7 -4 -101 25 12 50 -74 106 -3 4 87
1970 87 34 22 -69 32 -25 95 10 116 31 -2 112 -39 32 -77 -46 -88 127 -178 -71 76 -50 -33 68 -72
1994 -72 -107 -64 13 17 55 -99 -84 40 181 64 -32 -136 -36 -39 80 64 -119 56 14 -37 32 -67 -90 54 -44 22
2020 22 30 81 -28 -21 83 43 -149 -31 -33 22 60 -74 -44 36 -98 33 15 4 -152 -13 -22 -63 -49 54 25 -44 2
2047 2 -56 -108 -65 17 90 34 -15 -52 11 44 27 -102 53 -75 -65 -72 29 -35 -88 76 -4 -51 76 -60 -99 -55 -39 34
2075 34 -10 17 -96 15 39 -26 20 -47 -36 -40 -93 15 -57 -54 -202 57 19 -32 189 -78 -20 -38 -54 91 102 56 104
2102 104 56 -23 122 -27 -4 -75 34 106 -64 -34 -94 -92 -25 -48 116 56 -40 14 -48 23 -67 -33 0 106 -46 -21 -132
2129 -132 -62 47 -53 45 -30 35 73 -66 29 11 -20 -148 14 -64 -101 -33 -9 60 -80 28 -113 21 24 -17 -9 -26
2155 -26 -58 -20 51 -22 -81 51 78 -103 -171 -11 -53 -29 26 4 -34 -100 88 -113 100 -38 -71 -48 103 -105 -48 97
2181 97 91 -26 -39 9 39 22 31 106 -29 -62 36 -60 -80 15 61 102 -88 -45 -87 64 -3 21 36 -149 46 11 42 80
2209 80 5 57 124 137 4 -148 11 -24 13 -8 -17 40 -17 138 41 37 -79 -29 103 67 -76 -152 2 -98 4 80
2235 80 54 -12 104 -41 110 -31 5 165 -28 45 -50 -14 101 -50 4 33 13 52 -10 7 25 67 -99 68 -96
2260 -96 -31 15 -34 9 -70 50 -100 62 -29 -43 26 52 27 -104 -94 -14 -2 79 -10 -10 -70 -6 45 16 55 -1 41 -30 -35
2289 -35 39 18 -84 16 63 -98 65 3 -25 100 57 -113 -87 25 -45 -35 -19 -14 109 48 55 -2 -25 17 -27 107 -66
2316 -66 43 -94 -13 139 -10 36 -67 -8 -7 13 -115 41 -49 55 -18 30 142 -160 6 63 2 -9 -3 -78 40
2341 40 46 24 -20 9 58 8 -22 81 -10 93 17 3 -11 51 -87 -86 -55 -36 63 104 37 4 100 -25 -34 -48 -1 -96 1 83
2371 83 52 -85 40 -98 -14 -95 -12 -27 -53 43 10 49 25 -25 -100 60 95 2 -3 -31 12 -25 -72 -79 -56 117 -56 39
2399 39 -11 40 121 28 10 41 14 81 -19 -10 -49 -89 -67 -55 -95 9 -37 120 -7 31 -53 -60 -55 5 1 -93 13 -72 75
2428 75 -9 -79 -21 -66 54 68 -23 90 27 -87 -34 70 -37 96 -24 83 119 19 92 41 56 -31 57 54 165 91
2454 91 42 -31 -16 23 -49 15 6 54 -43 -111 -34 -7 -25 -27 65 95 -175 -19 0 74 -107 95 51 -60 -7 -108 -65 -170
2482 -170 26 -3 65 39 73 90 -67 -48 36 26 -16 54 7 -1 -41 25 -66 -54 30 9 108 9 -70 -48 12 112 32 80 -30
2511 -30 66 38 -89 18 8 63 64 3 -25 -133 -5 -55 -155 -8 97 3 49 -109 16 -62 16 19 118 6 -15 65
2537 65 28 -6 -21 -20 -9 20 40 142 11 -6 -16 -56 -57 -71 -56 -57 -30 23 -31 -87 108 -38 8 48 -63 5 -100 -45 90
2566 90 -7 -8 -8 -26 -46 71 -83 -16 -27 14 24 -160 8 -28 8 -5 106 -72 -10 -49 41 92 -73 -17 -13 20 -56 51
2594 51 -94 86 26 19 72 138 -25 -80 -63 65 62 23 135 70 53 75 23 1 3 -38 91 -58 26 -58 0 58 19 41
2622 41 121 -143 -28 -43 1 39 -5 -45 -26 -68 83 -47 74 45 -7 -52 -59 75 -34 66 -11 -39 -5 -5 -18 -84 60
2649 60 151 28 4 -18 -114 8 90 -29 39 -94 -30 72 -125 104 22 -78 -43 -149 65 -113 -3 5 139 30
2673 30 -155 -21 -97 -13 40 -32 22 41 62 -18 119 -21 -10 86 103 72 -25 21 -92 -32 85 49 49 -79 -17 -2 -80
2700 -80 32 -70 122 140 -35 -35 46 -40 -39 17 -102 25 -49 -1 85 -41 16 -104 -68 41 67 -97 59 28 -4 81
2726 81 102 -38 -32 103 -45 -53 -37 5 31 64 -7 -105 11 110 -72 -49 -87 -76 16 28 132 -9 -31 -70 -39 6 -98
2753 -98 -31 9 -57 -116 -92 21 30 -33 -80 0 10 20 76 9 35 -38 42 -59 -82 65 130 88 34 -42 -27 37 -34 57 -83
2782 -83 41 11 -67 -24 124 4 112 139 -38 -96 -92 70 -92 -25 -192 -4 -70 14 -50 74 128 29 3 48 68 -117
2808 -117 52 -28 -58 -43 -64 -13 93 39 -37 -87 -66 -67 4 87 -27 25 42 -52 11 63 46 101 111 -61 -135 -53 9 89
2836 89 51 11 -10 -39 -8 -43 -49 102 38 4 64 -47 -66 -55 -78 100 29 68 140 -108 49 111 75 17 117 23 20 -11
2864 -11 -70 -121 0 57 45 83 17 -54 11 150 100 73 80 -41 76 26 170 -87 -29 113 -75 -28 69 75 -14 44 67
2891 67 39 45 32 -73 -84 -104 -75 -77 -18 -61 91 -70 80 -94 56 53 -5 39 -64 24 -88 44 45 23 -70 29 54 55
2919 55 -89 -6 89 -28 138 39 62 64 -30 65 7 -23 -1 -112 27 98 35 108 88 15 -59 -54 -15 -14 -102 190 5 -80
2947 -80 -6 -42 40 -176 46 -20 25 -65 -28 46 -20 -11 -3 -9 13 -29 -20 33 35 -40 -50 125 22 32 -69 -34 -10 74 59 -18
2977 -18 -15 46 83 -48 -4 -17 89 -16 118 -66 10 78 -43 -73 -78 -4 -64 -13 -38 -24 -58 37 -50 -71 -88 41 -9 -10
3005 -10 102 17 -43 82 -52 13 -36 69 -26 -71 -56 -12 50 9 101 87 69 42 -64 34 56 58 -11 117 -6 93 14
3032 14 -41 -71 -96 64 -61 51 17 13 -54 -51 73 40 -71 193 7 -42 -26 -53 -40 39 -61 -2 50 -36 9 -63 83
3059 83 -108 71 55 47 -15 8 78 145 25 61 8 -41 -86 13 129 -33 -34 -58 -35 6 -132 50 90 110 -41 20 -22
3086 -22 -1 -150 5 58 -3 -42 76 -67 15 93 -32 -75 -4 -6 -24 -98 -9 171 25 63 19 -2 -40 123 99 -63
3112 -63 -38 92 -5 181 55 -59 0 46 57 -47 40 -77 -29 -75 94 -12 37 -2 141 -137 23 16 50 -68 -6
3137 -6 -3 11 56 -75 11 -7 46 72 44 79 -24 38 32 23 -111 -55 -54 110 47 25 -5 -1 -44 -79 -40 -2 35 90 -9 -79 125
3168 125 7 -31 -62 -30 -52 45 69 34 78 60 -83 72 -99 -7 39 22 32 38 94 80 -28 79 -89 -86 12 92 0
3195 0 1 128 -62 -45 38 -14 41 55 -91 103 14 55 79 -17 85 -13 56 -20 13 53 -60 -68 -16 -32 -80 77 20 -51
3223 -51 -1 36 75 2 39 42 72 -138 6 -64 -1 69 24 -59 -35 27 -22 -16 63 20 120 53 17 -45 -131 -80 16 -79 5 -84
3253 -84 -5 100 86 -15 -20 1 68 -10 41 107 28 89 8 22 51 -30 -112 -16 91 25 43 -92 84 -41 25 5 -91 -24
3281 -24 -79 -127 -18 38 29 55 -49 23 -27 30 64 -40 -17 -51 12 -82 0 81 35 -42 67 -23 -17 13 92 -45 22 -17 1
3310 1 -35 -50 16 -111 -25 66 12 -13 6 87 -6 16 -88 38 -84 -34 -10 3 -55 -8 33 104 25 -50 -29 -6 47 105 -68
3339 -68 -18 -12 -23 -11 41 -32 -81 -80 -26 128 68 18 12 29 25 -51 38 -33 28 -47 21 22 52 131 -22 -45 -114 38 147 -65
3369 -65 -40 10 119 -8 74 38 5 63 27 -137 -160 17 -40 11 49 12 31 -30 -36 142 70 100 -102 -5 -94 -101 49 11
3397 11 -24 -120 -52 178 -84 126 137 85 -23 -10 3 63 -86 -44 68 -81 -23 110 -26 55 -11 -115 -12 -34 -2
3422 -2 -62 91 1 -18 29 -52 35 -30 16 22 44 -20 122 -33 -82 -89 60 -52 -66 -50 -14 39 56 44 55 9 -55 -13 83
3451 83 -28 -17 10 -35 29 -102 -73 -87 -81 41 49 40 5 -21 -82 87 47 -58 -45 11 -56 -68 -76 9 15 -64 -24 -48 12 -54
3481 -54 17 37 108 40 80 13 52 3 -26 23 -60 -74 -72 61 46 -30 5 26 -20 -61 -89 36 -103 -41 -44 -121 5 63 -31
3510 -31 -189 -18 20 -28 41 12 9 -44 15 31 51 -84 -22 6 -53 -54 -105 -1 -24 37 30 -83 -4 14 10 -27 -88 -72 12 -78
3540 -78 17 138 -99 11 -164 35 32 -56 45 97 52 -63 98 40 -59 -136 -7 15 36 10 -23 118 10 -43 52
3565 52 37 54 -34 -9 66 -9 -88 20 -122 52 0 39 19 -1 -28 27 -61 -10 36 -62 -84 -21 -154 96 1 2 -16 -49
3593 -49 -5 -48 -18 -14 -77 -58 61 -18 44 100 -1 108 9 85 6 24 -53 -62 37 35 14 -10 64 -20 -28 15 16 98 4 77 -53
3624 -53 -110 66 9 104 -94 -85 63 53 15 44 -58 54 18 -129 -65 61 34 69 -4 -27 40 -97 -9 -33 -62 4 -21
3651 -21 -2 72 19 -22 16 12 -55 148 15 62 -11 -142 -74 -117 51 6 -19 76 -16 92 -117 29 -19 -25 -65 49 86
3678 86 -42 -37 -9 21 57 -19 54 -50 -12 80 16 -68 -63 47 15 78 31 -65 -43 117 73 13 -16 119 -29 -29 1 -30 -33
3707 -33 -11 11 -17 -99 9 53 14 -53 -30 6 101 -87 -162 30 70 -38 -52 25 -27 -36 100 66 45 97 -14 4 9 6 21
3736 21 -57 -38 48 143 37 -30 -109 -9 104 -45 36 -70 -31 49 -11 114 -5 -112 -3 -60 12 -75 -108 130 85
3761 85 -23 -42 -66 -143 59 -112 -166 41 68 -125 -44 -48 -57 -52 -3 0 -50 -28 142 -101 32 -14 1 -56 10 -36 -3 -12 -101
3790 -101 -38 42 9 -53 91 7 -79 -95 -52 21 28 23 -82 73 -27 -74 45 -32 -113 26 2 -72 -226 -58 91 -87
3816 -87 -29 50 -31 -69 16 -61 -92 -61 -133 -77 48 5 53 -1 94 1 -55 5 -24 -20 -24 -35 -51 57 -71 -30 41 8 55 85
3846 85 -36 8 -26 -74 -29 56 52 -16 -18 73 70 -1 8 -86 -90 -29 -92 -151 157 -106 -8 159 -28 46 -40 32 51 6 -108 -32
3876 -32 -64 28 39 27 7 -72 -28 16 35 9 28 95 25 -3 74 33 52 -40 -57 157 -8 35 -17 42 -19 12 90 -32 118
3905 118 26 96 -24 -68 3 87 -59 -67 15 -32 -69 -40 68 -101 47 -27 13 65 -100 30 -48 6 43 78 29 -14 3
3932 3 75 31 -2 75 107 -9 71 -59 126 -19 -13 12 54 -69 -19 25 -106 -26 -2 42 57 75 -41 -27 -62 90 37
3959 37 -18 70 -13 51 -59 -22 -26 -1 16 55 -5 13 -120 64 -36 -70 -23 -15 -157 115 -19 -1 -32 29 -72 -102 9
3986 9 44 -20 40 -6 -37 57 -62 89 59 76 -9 -40 22 37 23 -81 66 87 -55 15 32 102 -122 -78 30 -115 -69
4013 -69 37 -23 6 15 76 53 -50 -10 21 84 -16 -30 50 -17 -5 14 58 16 -29 63 -72 -57 -140 -18 -11 -116 24 0
4041 0 -92 -28 -64 -69 84 72 47 -26 -81 -15 -38 16 -25 0 -102 41 76 -187 77 -81 -60 93 -18 30 -111 10
4067 10 26 -44 93 -24 51 -109 56 34 -45 -39 -2 -63 24 26 -80 98 39 -35 0 0 21 28 45 -52 -22 -15 55 -85 -36
4096 -36 -18 13 -20 19 34 33 -80 12 -46 -23 92 -73 52 62 -33 -107 70 -62 118 96 -92 8 -31 -130 -32 24
4122 24 1 50 75 15 72 29 -102 -27 -198 -9 -84 115 -64 -25 -15 72 -93 -10 -25 91 -93 -69 28 37 -71 -32
4148 -32 21 -104 -7 -53 -53 15 51 -58 48 -4 -71 63 74 -83 85 -43 -5 -58 -51 -36 -10 55 -1 128 16 37 -5
4175 -5 63 -12 -44 16 -57 -58 24 -3 -41 10 -114 7 -44 -115 -126 -148 -22 125 -6 -47 9 -11 -25 -35 -74 -2 -75 -3 -42
4204 -42 -60 -48 -29 64 -33 2 12 5 -94 -16 118 2 -87 22 -39 81 29 48 50 -80 97 -32 61 78 -65 -4 95
4231 95 -53 21 -37 -15 0 124 31 -71 19 95 -7 -11 -116 -48 19 18 -3 117 -76 37 45 11 66 -31 -65 -1 66 -167
4259 -167 9 -60 200 68 4 59 -12 -2 42 156 23 63 80 25 15 52 12 8 98 50 -32 -20 27 -97 -4 -60 -67 64
4287 64 0 2 -53 -27 -33 103 -51 -86 39 -86 6 181 35 -26 -75 -128 -31 -29 -8 49 -85 -80 57 -34 7 67 -83 3
4315 3 -78 -136 44 59 66 -65 19 17 129 -10 -20 36 87 -39 112 68 79 -143 -75 39 33 -46 -93 30 -41 46 -13 147
4343 147 -79 -5 -68 -68 -71 -55 62 -87 95 -82 -130 45 -85 25 11 -2 -52 42 -90 -22 57 56 81 -60 75 1
4369 1 99 -130 -66 61 -56 24 -72 27 16 101 28 -93 -65 55 5 -72 4 -70 -26 -52 71 32 -34 -92 60 53 -121
4396 -121 -34 -95 -91 -54 52 -4 -33 90 8 -77 -34 28 -47 -81 3 -111 -113 19 -102 -62 152 125 14 103 -33 -1 58
4423 58 31 -39 -53 18 -31 -71 -71 98 106 -84 35 61 -70 -89 41 12 -20 -49 8 -11 -46 -128 -167 -11 11 -33 -23 83
4451 83 -43 14 -25 205 -3 -110 65 27 -45 -18 133 -56 -24 49 11 55 -4 -85 46 -40 -6 12 129 43 36 5
4477 5 11 36 27 116 -60 -143 -113 6 -4 -16 -18 -19 42 -64 -31 18 31 -53 -72 17 49 -82 -15 53 -119 107 -113 -83 -59
4506 -59 1 56 22 -58 108 42 9 -4 65 -75 -148 -36 -28 -132 -64 34 -72 33 54 11 -22 1 50 -115 -116 -47 -24 -35
4534 -35 -67 -28 -34 -17 -105 55 15 160 -93 62 -37 -47 37 -152 -10 46 101 1 -84 4 -39 -27 -61 -4 132 -40
4560 -40 -10 -70 -37 90 130 -26 84 92 -62 -26 -141 -14 74 -4 52 -5 36 -79 3 -65 -16 59 -19 -55 -106 -132 -8
4587 -8 61 -44 -107 -13 -25 -44 -45 -76 -41 45 109 -53 -22 87 -8 -11 51 -51 -56 -156 6 64 -2 45 -16 -36 70 31 62
4616 62 -12 -37 1 14 -56 -79 9 -15 8 19 -34 15 -76 -50 -85 31 0 1 17 -65 50 63 -17 25 -120 -16 -26 22 54
4645 54 -71 75 -14 -66 -74 -6 68 58 -61 -79 64 135 -58 10 -46 87 29 66 10 -3 26 -54 15 -59 41 -30 -1
4672 -1 89 -2 -57 79 152 -38 3 147 50 -178 -88 26 -1 -105 36 -20 87 83 56 57 -128 -35 177 -107 -175 -47
4698 -47 -90 136 23 10 -5 23 -75 -12 -25 -16 3 84 79 4 39 44 56 88 85 -83 4 25 90 21 -17 -84 -42 -13 -26 -57 -132
4729 -132 -6 51 52 -24 74 -66 13 -44 7 22 44 -50 -145 77 61 12 89 -38 -64 69 -124 31 10 -45 -122 -59 118
4756 118 36 35 40 65 -144 8 -20 -41 40 -88 36 15 8 -111 83 -17 -27 -84 -100 25 10 11 -45 -122 32 -112 -29
4783 -29 39 74 -69 75 29 11 95 -25 -129 -45 3 -42 -169 -58 -75 -36 -13 -7 34 13 84 16 73 25 12 69 44 72
4811 72 38 -102 -55 -27 -32 -88 -13 -18 -72 43 14 -25 -78 -83 -20 82 -120 -2 -59 -75 -81 -151 -19 18 -116 -16 60 68 43
4840 43 -75 -9 20 -84 -9 8 129 -91 13 1 -100 132 41 -19 -66 58 -12 -144 -3 98 32 20 -11 92
4864 92 1 -138 24 82 -27 -24 -13 -23 -24 -77 -16 -60 0 1 -108 -53 20 -88 -8 -25 -59 -44 146 81 10 118 86 -38
4892 -38 83 -54 -24 86 -138 79 -53 62 14 0 -25 61 8 26 29 -74 -15 -55 28 -60 -43 67 -40 8 33 54
4918 54 -109 -96 135 -24 47 -30 -44 -89 -90 38 23 18 -70 13 33 -12 -32 100 -35 -50 0 -6 82 44 77 -30 14 -26
4946 -26 24 31 2 7 -4 -69 40 -26 -93 31 14 60 12 -10 -40 59 -7 -51 42 63 -12 -46 -12 -55 15 39 -69 -45 -56 41
4976 41 -73 19 -28 61 54 -49 -80 -10 22 -91 -131 48 -39 -94 -30 -28 -52 112 53 5 118 -121 123 -65 -62 51 32
5003 32 -63 9 -40 7 58 -19 -32 7 -91 80 -3 41 -94 45 4 30 44 -116 -4 -67 -14 84 -2 -119 98 4 -94
5030 -94 -112 21 -99 34 130 80 -27 48 92 -9 -3 -57 55 -8 21 -3 61 -50 -150 -40 -104 -72 -45 75 4 -47
5056 -47 39 83 -6 55 -109 110 -110 24 73 54 -138 -85 64 51 -30 17 -6 74 70 84 85 20 67 -1 17 -85 -26 -46
5084 -46 38 -74 32 -81 -17 -46 -61 -43 51 76 -46 3 61 111 25 -77 -17 189 66 30 -28 -110 8 -26 8 -60
5110 -60 -8 -52 36 -73 -61 -24 58 12 114 -16 -93 28 -64 -33 -81 23 -97 0 19 -56 18 44 15 37 16 -89 -24
5137 -24 -90 27 -10 -94 -141 48 5 -31 -12 -43 -24 39 38 37 -23 68 71 -55 37 -13 -4 120 35 -27 -52 31 41 78 -98 -80
5167 -80 -155 -49 -72 -68 -140 39 -9 0 100 -60 -3 71 -65 -102 27 -28 -65 -35 6 -18 -49 -38 50 55 75 -142 -62 50
5195 50 -65 28 38 -4 55 50 28 -45 -41 -150 61 19 -57 -36 64 -29 70 -123 15 9 -173 -22 -11 -183 -32 -70 -86
5222 -86 -31 -118 40 -70 -52 9 118 -56 -28 36 52 53 -22 -17 -111 30 -82 15 26 104 54 62 85 -5 53 -34 5 -43 -5
5251 -5 -73 13 -92 -8 6 42 11 22 1 -43 2 39 -77 -56 -37 -72 -53 27 2 -61 -21 31 51 -87 -12 -58 -38 27 -109
5280 -109 -45 27 181 -18 101 -3 -51 59 -23 -66 48 -36 1 68 19 -109 -1 -28 23 40 -28 -14 -113 58 -94
5305 -94 -145 26 -1 -19 150 -19 -37 105 -30 -3 -112 -74 -25 -39 -66 22 72 14 32 -2 -59 -24 -157 -38 102 -155
5331 -155 95 31 85 -16 27 1 -35 36 -14 80 -43 -69 -3 40 -140 67 71 7 -98 -26 -4 -130 -127 42 0 -34 -11
5358 -11 53 19 10 31 -6 29 71 -83 26 16 -73 25 21 54 89 57 -41 13 59 49 73 68 -6 -8 4 93 -68 98 -3 -25
5388 -25 77 62 -58 32 -23 28 -15 2 -63 -7 22 -133 -41 5 -13 62 32 10 79 -29 51 -132 4 9 -153 -57 106
5415 106 19 98 -34 -43 85 31 28 5 30 -5 -44 -19 -68 32 107 109 55 12 43 72 78 -37 46 105 146 61 49 22 -107
5444 -107 -10 139 -29 -62 -8 -52 -51 13 23 56 -106 18 -57 9 -26 -52 -52 43 41 107 61 -36 -42 18 -10 74 83 -42 46 -6
5474 -6 60 -9 34 -27 -13 -19 -49 5 21 -48 29 37 12 -38 -28 -36 -30 35 -75 62 -7 6 25 -156 -94 -107 -26 -39 -140 45
5504 45 -196 7 61 0 54 15 33 -28 -64 89 98 -80 -134 -39 -16 6 -2 15 -55 27 -56 23 -8 -18 25 -77 40 9
5532 9 -63 -7 -76 -98 14 -3 101 -48 -5 42 44 -9 65 96 -24 -47 101 26 -64 168 -106 -60 -3 -48 9 8 -33 34
5560 34 62 -8 52 57 -20 37 49 -65 101 -48 -123 -46 4 -47 -8 39 67 -54 25 -2 -24 2 108 31 24 -63 -85 96
5588 96 88 -35 -2 57 -63 -60 -57 -180 74 -26 33 -14 -121 -42 22 36 9 -58 -24 -13 -18 -118 28 52 62 -11 -84 16
5616 16 -51 -123 73 144 75 -28 -70 8 -106 8 89 14 -54 -9 24 -36 -23 12 9 -26 34 -16 46 2 -112 18 54 -53
5644 -53 99 13 59 26 -14 28 -91 -70 -107 -40 29 68 -70 38 1 63 -7 -63 -91 -112 17 43 130 17 33 -37 3
5671 3 -147 68 -40 -17 -99 -79 -188 36 18 -124 44 -47 -58 -54 -30 80 -52 16 149 138 -21 -55 -87 -92 -16 -85
5697 -85 -73 -30 19 58 127 -3 -32 -119 -65 29 26 15 -127 3 37 73 -23 -92 75 30 104 -47 -110 79 -12 -105 57
5724 57 41 73 -24 122 52 41 -36 16 -26 57 100 -40 -24 -81 -10 -91 -110 2 5 30 22 27 -62 33 34 -49 -54 -8 66 -7 13
5755 13 61 37 33 37 9 24 -86 7 22 -26 142 28 27 21 -42 -73 1 -22 128 -33 21 29 7 -51 -28 -5 57 -24 74 -31
5785 -31 -58 -64 -97 14 27 -23 -127 26 -9 -106 64 -103 -20 -80 -23 32 44 -17 -3 -46 -23 -127 24 18 -26 15 82 -74
5813 -74 44 78 61 -84 43 24 -6 19 -11 69 52 -27 -48 74 36 -79 126 -27 -84 -25 -8 76 -1 83 146 -23
5839 -23 -32 -102 85 -50 66 -78 -73 35 54 120 -51 127 79 13 27 -8 138 -76 73 -92 40 27 -14 14 -63
5864 -63 16 105 22 110 2 17 118 76 35 68 -45 21 10 -12 -18 -81 -15 -6 24 -48 25 14 1 -124 30 -34 1 -4 62
5893 62 -75 7 17 -31 82 -79 30 -7 -159 17 -67 34 -105 -33 -49 32 -12 -96 -50 46 -21 10 72 28 -30 104
5919 104 18 17 -9 -14 34 -32 -58 -23 112 60 -49 -131 -77 -104 -123 0 -88 12 -65 118 -45 112 45 -46 -64 -25 15
5946 15 21 114 11 65 81 38 119 -14 -58 -119 54 -35 14 110 22 -77 -23 62 -8 14 -19 -16 -36 28 -19 36 -67 -49 -134
5975 -134 -6 -19 -42 58 -41 -64 -50 24 -4 -92 -26 -53 -28 10 52 -47 74 31 24 -86 -26 -68 -24 -80 -20 69 34 34 -50
6004 -50 -32 -95 -75 -7 90 169 -69 -29 3 9 18 2 -51 -37 -16 -58 25 -92 11 -49 -72 115 -22 6 -60 -135 -116 88
6032 88 -23 -50 41 -51 -11 -58 24 -27 6 -18 -130 -191 -60 -74 -37 26 98 68 -34 -129 9 95 -41 -46 18 -53 -55 -35
6060 -35 -41 -13 64 46 -61 33 -34 85 -83 55 -2 -38 -15 -67 27 28 -30 80 7 -86 -73 -80 -55 23 13 47 -12 39 28
6089 28 46 12 -61 -31 -41 93 -23 92 -21 -54 -126 -12 11 -52 21 98 6 53 -81 47 -46 -62 58 -86 -92 23
6115 23 98 6 -163 -28 -44 -17 -50 -24 22 3 41 -41 -22 -6 -77 -121 40 37 55 153 35 38 -54 -35 -24 27 36 -72 -40
6144 -40 -56 0 112 -41 -54 -59 -90 26 -134 103 -12 9 38 38 7 90 -24 10 -24 17 63 71 120 5 -52 -32 86
6171 86 -27 -118 52 -101 -45 -67 -81 -35 -25 -16 -19 -111 6 26 9 -18 -79 -142 -50 40 44 102 -179 -15 27 -9 18 -25 -19
6200 -19 104 -78 41 -14 -24 -59 90 4 -88 -80 15 56 -14 -140 -1 40 -60 -39 -34 12 82 160 88 85 -50 -35 -4 -76
6228 -76 37 11 24 -78 70 96 53 -71 -61 42 -121 79 65 75 -43 39 26 -27 -86 8 2 10 -38 41 -46 -61 -79
6255 -79 -4 -6 88 8 2 13 120 -106 -56 62 -70 23 22 62 -67 -28 128 -45 -36 -41 43 21 15 -65 4 -25 -9 36 -64
6284 -64 -29 10 -29 5 10 43 -117 -56 -3 66 125 -63 109 14 50 39 -25 -22 56 -99 -21 -23 -75 -64 -55 -45 -11 15 50 -6
6314 -6 -8 10 24 -4 32 -70 28 -63 -6 -83 55 -79 38 33 -48 20 -70 -76 -14 -36 17 71 -35 54 18 34 -78 59 51
6343 51 35 -6 -19 -20 132 -33 -70 84 -66 -137 7 28 -106 -154 -25 4 31 -129 -69 63 -24 52 -33 65 -56 -37
6369 -37 -17 58 -55 66 -86 -13 -4 -163 -61 -8 34 -80 -64 -64 34 34 -94 2 76 -46 7 -69 24 62 106 29 59 49
6397 49 -68 -10 -11 13 -157 -45 -113 79 -13 13 46 -35 -37 -46 3 -32 78 -82 -8 -14 32 70 -88 -24 84 6 -90 1
6425 1 -62 -28 -116 -54 -13 -71 49 -106 -59 20 -23 104 -54 2 -2 181 20 -38 59 117 -79 87 -32 -53 25 19 59
6452 59 69 -41 -59 -77 -11 41 -45 14 -72 0 -6 47 -65 -5 12 13 37 -24 -115 -24 -56 82 -3 2 72 -4 44 -31 -100 -42
6482 -42 -4 -49 78 12 -2 75 -28 43 80 -54 103 -93 56 54 38 -33 -96 23 96 56 -64 -45 -18 -29 -133 -75
6508 -75 76 -65 -129 -37 71 13 -25 75 -213 56 -61 55 29 84 -3 -38 -133 -43 20 110 -43 14 59 26 -11 35
6534 35 -56 -20 -7 45 24 -4 107 18 -53 -38 110 52 131 35 -121 23 66 46 107 30 19 -45 25 -47 51 -42 55 66
6562 66 16 -8 -74 -93 -7 32 -65 28 49 4 70 -35 -75 -121 72 -12 68 26 -99 -44 -4 -115 -7 -116 -10 -36 -104
6589 -104 15 -106 126 48 31 -52 -44 34 130 41 -14 28 68 44 -91 -20 -63 29 -109 -84 -42 77 -70 -77 31 116 31
6616 31 132 -75 107 -10 66 5 -59 -8 -22 111 -4 94 -18 8 -74 46 -22 3 -94 47 64 -75 -30 -43 28
6641 28 -92 -34 -61 -8 117 -80 76 142 -32 54 -12 34 51 -31 79 -17 37 28 -51 -46 2 -25 8 127 -60 -164 -23
6668 -23 -50 70 -6 49 -20 28 -27 28 193 12 -36 -62 -17 -20 -93 25 74 -52 -43 20 -46 -12 5 -99 -53 -38 -32 148
6696 148 44 49 9 -89 -29 6 74 12 68 61 77 -2 -53 120 128 11 -108 30 11 14 -1 20 -76 -108 -29 32 59 91 -68
6725 -68 58 -99 -139 -6 -183 -54 82 -67 -87 13 -5 -38 97 -39 20 -25 132 23 -45 22 -83 -64 -12 -10
6749 -10 12 46 -75 -70 60 41 12 -46 14 52 5 -35 -47 -48 -76 -24 53 4 -101 -30 82 -60 -15 -120 -55 9 -165 49
6777 49 113 -122 -26 96 -172 -3 -41 -54 -5 12 61 35 -34 16 105 20 30 90 53 -119 19 -98 -131 108 -76 -31
6803 -31 70 -53 -22 89 5 -12 -83 -33 21 41 30 -30 -5 -41 -26 -8 178 42 39 -14 -36 33 -39 18 103 26 148 84
6831 84 63 -25 14 81 -35 87 -129 45 -50 -81 106 37 -73 53 -25 16 -34 13 -90 28 -40 -75 34 6 -7
6856 -7 13 108 97 -90 -77 -130 -67 44 0 -36 -17 -124 -33 118 -21 16 150 -36 103 -83 90 -14 81 -85 -39
6881 -39 159 88 43 28 -78 -15 28 70 151 21 10 41 -19 37 -87 53 27 -75 -31 -65 122 -116 -27 -62 -91 -78
6907 -78 -71 -49 -119 5 -131 7 6 47 70 46 2 9 22 -22 14 0 113 -3 65 80 8 12 48 -50 70 -152 47 -22
6935 -22 -46 -86 -194 24 6 -34 18 11 -52 -165 75 -40 -12 11 -59 -40 -77 -50 -15 -43 -68 101 -22 49 -32 19 -30
6962 -30 -15 30 -38 33 19 2 53 -48 13 109 52 84 23 -34 4 22 -56 7 -36 -59 -34 -20 25 -107 -57 72 39 -45 -3
6991 -3 -20 34 -26 -43 122 -7 44 81 22 -65 96 10 -70 49 16 -64 42 55 81 -188 -48 -72 -9 8 17 -127 64
7018 64 -14 -8 -19 -2 -88 96 21 -42 69 38 -41 34 -86 -30 34 -134 -122 35 -30 -52 -9 17 -45 -100 13 -43 28 -44
7046 -44 57 3 -143 46 -14 -13 35 -16 62 -87 -15 -91 -35 58 26 12 -68 16 89 -128 -16 -46 -22 18 9 -13 94 -112
7074 -112 -2 -23 95 14 -49 41 -92 -33 106 5 -9 -88 -64 -66 -62 -61 -49 33 34 -68 35 1 59 -6 -32 -116 60 -59
7102 -59 -63 22 -69 -24 3 -76 -34 -109 78 -53 11 32 -19 52 38 -89 73 84 83 113 -1 26 -46 -42 -182 0 106 -14
7130 -14 26 20 20 34 51 -135 -18 30 6 98 83 -125 -31 -39 -79 46 25 -22 17 -49 21 45 -41 -51 15 31 -23 -26 -23 34 19
7161 19 37 58 -39 11 -52 13 31 146 30 141 -48 -37 19 -85 27 17 14 -35 101 7 -2 94 -60 -9 -18 62 78 46
7189 46 -8 24 -9 23 -36 15 -11 11 51 -45 -45 -64 -53 24 70 -126 39 -25 62 -12 8 40 35 2 -85 13 50 70 36 52
7219 52 9 5 -16 69 -8 64 -110 -94 9 58 48 163 -7 92 -12 -6 -116 133 -1 -58 -62 -119 54 116 35 -52 31
7246 31 -31 -103 -130 -7 -33 -29 43 -23 100 104 82 -40 -47 -26 -13 -104 40 55 66 80 30 152 84 65 -25 6 104 -57 -149
7275 -149 26 -23 -156 49 50 -13 -55 -128 -66 47 -84 26 50 -27 57 35 141 -132 -118 -139 62 24 28 90 -17 -40
7301 -40 -99 -14 -110 99 -52 -44 152 -61 30 -76 -27 -29 -53 43 -44 -57 -84 -7 127 57 -97 26 -124 23 -151 -57
7327 -57 -82 -89 -201 -87 -2 -79 60 15 -63 -57 59 -79 -75 -18 -37 -23 -40 -30 22 21 -123 -23 -20 -65 7 -125 -52 28 -90
7356 -90 59 -21 -58 99 15 -43 -68 -13 124 -63 -92 45 -40 -81 98 -38 -82 -79 -77 -57 40 -13 12 -43 7 -11 49 -63
7384 -63 -51 -33 13 58 -47 60 -142 -109 -63 -16 75 -44 12 -43 92 -9 66 9 53 60 -119 35 20 -66 -76 8 -13
7411 -13 -23 -60 80 42 -51 50 -113 39 -24 -173 17 108 -6 124 30 -2 0 47 54 66 175 -41 28 137 23
7436 23 -21 11 37 -99 9 -120 -63 68 -26 -34 38 68 -23 -33 0 -9 -20 43 -95 -3 117 54 -6 -29 -15 60 -52 -36
7464 -36 98 31 -2 93 16 5 -121 95 97 82 0 15 76 29 -59 -147 38 -32 -4 -42 -50 -97 127 5 -3 84 35 109 40
7493 40 119 -65 89 51 83 62 74 -3 -14 -20 -12 -86 7 159 45 -9 48 -108 -47 56 83 30 8 23 17 -15 53 -156
7521 -156 -51 123 48 -2 2 -5 51 -45 -7 95 -33 67 -76 129 -76 -55 -55 -35 139 4 42 -71 21 125 26
7546 26 -123 5 -25 -44 16 -49 15 75 -8 -3 -83 10 35 43 -25 74 82 -12 -144 20 -70 -16 26 26 48 19 -16 39 155 -56
7576 -56 -9 44 -74 -17 60 23 -58 -62 42 50 81 -1 77 15 -49 1 -106 95 16 33 -29 60 -2 -41 15 16 14 88 -55 84
7606 84 -27 4 33 151 104 143 -66 -9 -52 -33 -137 -51 117 64 75 71 137 64 -77 24 -52 0 -7 -77 9 -112 -63
7633 -63 -49 53 19 -9 24 -89 -73 -24 28 -23 6 -70 -14 134 58 -71 -8 89 -64 1 89 38 16 104 -70 -24 87
7660 87 29 -78 -4 -37 100 89 -8 -26 15 54 9 -31 -24 -40 48 14 -2 -23 -19 -108 27 -53 -58 40 -38 23 -38 -19 2 116
7690 116 7 -10 -65 -26 25 111 64 -35 -3 45 44 143 21 -60 -71 71 -35 1 32 18 -50 12 -116 -7 77 -52 -56
7717 -56 -15 -51 -30 130 -64 -89 -62 23 -96 67 23 -27 -70 -19 10 -122 77 18 117 1 65 67 -47 -49 62 122 45
7744 45 68 20 56 -118 -66 -43 15 60 -80 -29 59 73 -48 31 49 -4 71 -127 -2 92 36 -80 -30 -12 -20 -73 -11 36
7772 36 11 -77 -41 -60 -70 -57 -41 -155 13 -144 10 -85 -68 34 11 3 7 0 -92 11 -62 -126 14 107 -77 34 -86
7799 -86 61 11 -28 -52 27 52 -75 -4 -87 -126 -92 -97 -90 -50 -47 -102 12 4 -2 2 47 -5 -18 -58 -115 68 -3 -12 37 -64 36
7830 36 139 16 40 20 -32 175 -33 69 111 -10 37 -132 41 118 -55 -51 46 22 28 -25 -50 -31 -31 -43 107 46 -12
7857 -12 -43 0 -5 132 -2 -108 34 -125 90 -47 66 -176 -6 -76 41 37 -49 30 36 202 -10 69 -13 130 -82
7882 -82 22 25 -82 38 33 15 24 -84 58 -74 112 15 -90 -118 -56 116 -27 117 -79 8 35 50 26 27 129 21
7908 21 -77 -9 35 -2 -85 9 28 -97 37 9 9 66 -84 50 10 28 -43 -30 5 19 102 -66 -51 5 -8 -66 44 25
7936 25 -85 -167 -15 82 -7 27 -82 -77 -27 32 -53 47 18 16 143 29 -55 76 27 -124 -117 -114 -11 -82 -15 42 27 -48
7964 -48 -34 59 -54 -116 -164 -64 2 17 -75 -52 -20 -18 69 27 -54 3 -23 -70 -18 -10 -19 30 -36 124 -110 -118 -89 73 22 -14
7994 -14 -52 33 37 -135 -56 43 -79 -81 -16 68 -119 -119 56 -1 -111 129 -9 -12 0 -10 49 -42 -85 80 -74 -2 48 -41
8022 -41 13 -62 -135 -64 16 -54 -118 36 52 -23 -61 34 -74 -41 29 -6 -3 85 -37 48 -52 -16 36 27 24 -37 88 -21 -41
8051 -41 -48 -110 107 -20 22 11 44 -50 -82 -107 63 32 27 82 -15 -48 37 65 -11 116 -97 -51 67 2 -78 -18 -131 -4
8079 -4 -74 7 -55 2 -8 -61 14 4 37 -52 -88 115 103 10 -18 36 82 160 70 24 -9 -93 11 4 64 -41 48 -46 42 -2
8109 -2 14 15 -3 100 -61 6 36 -40 9 -60 14 -80 14 -23 27 28 -34 116 -99 164 5 -35 -135 -74 17 105 -90 58
8137 58 -46 -8 83 -58 -121 -57 52 -149 -15 10 -17 70 19 -17 22 60 -11 37 -21 -59 91 58 18 30 -104 29
8163 29 47 -13 139 -89 39 25 102 -34 -52 87 -41 152 57 -48 123 -32 4 -44 3 11 115 18 -130 -7
8187 -7 65 -25 68 -54 -66 -66 79 -21 -15 -188 -162 -41 74 94 -21 -37 -68 2 46 -3 -78 61 -18 -84 77 106 58
8214 58 62 0 109 -66 18 -75 -35 58 -104 -92 97 -34 103 -157 -158 -54 102 -12 110 3 33 -29 -56 21 22 -87
8240 -87 -109 87 -23 -56 -73 90 31 -30 14 4 -36 125 -79 -10 -99 172 123 51 55 -138 -46 19 -35 -22 92 44 10
8267 10 -93 -26 1 33 -8 -76 -13 54 73 -120 -20 62 102 39 -19 -11 -66 10 -71 38 65 26 76 21 -118 -116 99 85
8295 85 26 25 -98 46 -21 -117 92 138 -22 -163 30 45 -101 104 23 27 29 61 6 -57 -6 -111 -32 28 88 -150 -32
8322 -32 -7 9 76 -39 -55 -33 -11 94 -120 67 78 -100 116 -2 7 -35 3 70 67 24 -53 -39 105 118 15 89 15
8349 15 9 1 33 62 11 -72 48 -17 -43 -25 7 -44 -138 0 -39 -50 90 6 -38 47 25 -78 113 27 -32 -35 -32 85 57
8378 57 19 -41 -19 69 -56 5 67 1 13 101 59 35 -39 -25 -75 27 20 -25 20 -55 105 17 88 -5 -14 39 50 -69 -124
8407 -124 142 7 29 -43 30 108 -51 -96 -21 68 49 -96 -99 -28 37 94 -88 0 -4 32 -66 74 -20 -74 -18 96 -22
8434 -22 72 35 -73 -13 -87 15 33 55 53 -74 -60 55 -24 91 -5 -37 -3 165 15 -179 -38 14 -13 137 -4
8459 -4 74 30 -48 -139 14 -33 -13 -29 16 175 -1 -74 149 -9 -105 69 97 -69 74 131 -28 85 39 -7 -27 54
8485 54 26 -25 -28 -84 -103 -56 4 -2 -21 80 -81 46 46 86 101 13 27 7 66 11 113 86 45 -114 77 -39 -37 38 55
8514 55 -77 -20 133 -10 94 -92 -10 -30 25 -53 57 -41 -60 -135 -71 14 8 68 -7 -114 64 -65 -69 -117 -10 -36
8540 -36 72 -7 -80 -24 -23 -84 -64 39 -56 -120 -92 136 57 -29 -26 -121 -21 78 34 -68 38 -83 -107 -24 67 21 146
8567 146 -27 2 -29 58 -2 17 -104 -29 94 -22 19 6 -46 -5 -26 96 -52 3 30 12 -16 34 7 48 -24 41 39
8594 39 0 -91 -74 20 34 92 -25 -12 27 27 -15 -136 -4 -35 -43 -35 -41 45 -49 61 26 12 -88 -71 -67 -98 77 57 -39 8
8624 8 -43 0 1 -122 52 -158 -42 -15 -52 -6 4 -50 -42 67 6 15 -19 -47 113 -118 -5 -30 -14 -26 43 -67 -13 79
8652 79 -63 70 76 29 -194 -5 -46 38 58 74 -84 12 -4 35 -109 -108 41 71 9 0 -46 114 95 39 -36 51 27 23
8680 23 -89 21 -22 6 22 -10 -53 -37 60 -116 4 -71 -24 -2 0 92 -12 -74 -105 -45 0 -14 25 -71 50 -106 27
8707 27 89 -32 -60 44 -47 -10 38 83 3 -2 4 69 -36 -85 14 2 -99 -99 -145 -41 20 26 36 -68 -145 -34 -24 -86 5
8736 5 12 -100 -36 22 -99 34 -25 -66 70 -6 -119 0 -76 26 40 -92 -4 45 -49 49 111 38 2 7 -112 -134 35
8763 35 -2 102 16 -61 -28 -31 -17 71 -101 168 76 -41 -83 -3 -19 -182 -20 86 82 -29 -68 12 -8 -8 45 -62 16
8790 16 -3 73 116 -82 54 -84 101 115 -28 -46 47 -2 26 39 71 -29 76 -41 -32 -2 114 97 -5 -23 -76 4
8816 4 68 -10 -54 -5 -24 19 65 -86 78 31 -55 -6 -2 -23 -14 -30 40 77 -51 139 -48 -85 5 -11 -38 -181 -97 -66 -42
8845 -42 19 59 -141 -83 -45 66 71 27 42 -11 15 56 -25 112 -51 8 88 -22 -36 21 86 -94 96 5 26 35 -30 58
8873 58 98 5 -43 -31 55 -25 -113 -47 -79 30 -95 -56 85 53 87 13 6 -59 -10 38 72 27 -158 -61 50 -18 -28 74
8901 74 103 181 19 104 -11 -43 1 53 26 -29 -10 -48 -39 -16 -89 -44 -41 -56 78 -54 59 -29 -68 -24 -43 -27 49 57 -7
8930 -7 -14 -33 20 -2 61 57 -69 -20 51 84 19 -94 -62 -80 110 -26 -42 18 -5 -75 -61 -74 83 -94 61 20 123 -46
8958 -46 -8 43 -45 -124 -43 -56 -36 -75 -65 -49 -3 -33 4 65 38 111 -27 -74 -71 80 6 -69 -17 5 10 69 45 -74 6 -48
8988 -48 -59 57 71 -67 129 15 6 -14 131 -28 27 -68 101 64 16 26 -85 -167 -45 22 19 -17 61 -16 61 -107
9014 -107 -87 -39 -48 27 47 45 14 33 -42 27 -108 -48 49 -24 43 98 -33 68 33 -72 62 -19 7 33 85 -26 -126
9041 -126 -19 96 -69 -105 111 -94 -3 87 -54 -32 -87 44 10 -224 43 96 23 9 -75 -109 -119 89 32 -5 41
9066 41 8 87 -105 -8 -13 -112 -24 -2 6 -71 113 2 -20 19 1 -102 7 -111 -85 69 15 -1 23 -137 -47 -170 -11
9093 -11 -45 35 -25 -72 -48 -97 0 70 16 40 -76 49 42 -87 -77 -72 31 2 -60 -139 -2 21 -63 118 -74 0 -114
9120 -114 -106 -72 33 18 48 -23 -79 21 -14 -79 119 -34 18 -11 38 -86 25 35 -7 31 24 40 -2 0 2 39 -2 14 -17
9149 -17 10 9 -64 -99 83 121 40 106 35 65 -26 86 -77 -9 91 -25 -15 -80 120 5 108 -18 42 -41 -83 38
9175 38 8 -3 -75 -39 91 47 -42 -44 -55 48 60 -4 103 -51 -53 -10 -46 112 64 38 98 -34 -73 161 33 -134 67
9202 67 22 14 38 -127 -28 63 109 -86 12 48 -60 -43 -11 -43 -57 -12 -100 -21 -9 -8 -94 -98 -2 38 3 -81 17 1 -88 142
9232 142 -89 -92 28 -60 80 -21 12 -59 -66 -7 -127 -5 20 -1 86 -18 5 61 21 108 22 -10 -13 -22 -1 114 97 -41
9260 -41 21 12 32 48 39 -101 61 77 -9 -176 10 -10 -47 44 61 22 103 71 24 47 125 52 11 99 -17 -30 14 -39 -71
9289 -71 96 -106 -23 43 -59 -16 -44 149 17 -86 -10 -11 -20 -50 114 51 91 -5 3 -77 34 -29 0 50 67 124 -133
9316 -133 96 25 -33 -72 206 27 -21 21 19 -100 29 32 36 -94 -12 -2 124 -12 10 -11 -132 43 -14 29 -16 42
9342 42 -35 -62 -84 -1 -14 -49 14 3 -79 -27 15 -15 31 -50 6 -15 66 -86 60 -51 10 -17 -27 109 -4 -6 -33 56
9370 56 -18 90 63 2 -128 -48 18 23 -57 2 5 -47 -40 -58 -59 -18 6 -55 -22 111 -44 -49 109 25 1 -42 -62 -28 45 43 19
9401 19 -34 -41 -22 34 86 64 -14 -59 6 -40 14 51 24 -103 68 -12 5 -71 -15 92 -59 30 -36 101 26 62 -2 39
9429 39 -18 -99 80 57 178 38 36 -140 -87 3 58 -14 18 -69 -108 -122 80 -15 -24 55 -145 -30 -82 173 -29 -39 54
9456 54 -110 -5 58 -110 -19 27 45 60 -8 -90 -82 -76 19 -87 -122 -180 95 -37 -92 -70 7 -25 9 45 3 -37 -66 45
9484 45 44 -52 13 5 -36 24 28 75 31 40 40 -138 -36 6 77 -100 -45 3 21 -5 -23 13 71 -11 -22 52 -105 0 98 41
9514 41 10 83 25 55 74 115 -108 -17 40 -34 -92 -29 -91 -94 19 97 51 31 0 -29 -40 123 70 95 -79 98 108 30
9542 30 18 -22 44 -9 -28 2 -89 36 -10 -24 -66 64 -10 -76 25 -65 17 47 -94 -70 -76 29 -82 -26 72 -37 -88
9569 -88 -54 -98 66 -7 -37 57 -86 73 24 2 -199 69 123 114 87 -23 101 -45 -61 -32 80 -76 78 -24 -29
9594 -29 -2 -13 -2 -30 -53 -54 -41 -87 -69 14 -35 -46 -87 28 -37 -36 21 68 89 1 2 117 -70 -124 52 -99 -60 -24 62
9623 62 -28 7 57 76 66 -12 -14 -39 -34 -73 -23 77 -198 -105 51 63 -33 19 10 47 -3 8 53 -96 113 -60 15 -81 -92
9652 -92 -77 34 -112 -100 41 125 -54 90 38 -74 -53 10 -25 123 -177 -48 -9 -82 45 -18 23 84 -68 -34 35
9677 35 30 111 21 56 -73 -48 56 -13 100 -3 -76 57 21 27 50 -32 36 10 63 44 -62 4 -86 -11 45 -8 -31 -80
9705 -80 -56 -54 76 -164 -144 -34 -70 25 16 107 -40 14 -167 149 33 48 -77 70 109 17 12 -55 66 -7 -3 -136 9
9732 9 40 -21 -40 21 5 57 7 -48 4 -55 30 70 -64 76 -65 135 91 -52 -115 -96 34 -5 -65 -32 -40 7 -10 25
9760 25 -56 -34 36 -53 50 -131 -49 14 102 26 -123 4 18 36 -38 -15 140 -96 38 -16 -1 1 89 150 62 -34 153
9787 153 37 2 59 30 -22 -1 -80 128 -22 2 -1 35 82 -88 -112 65 -34 -109 16 -85 -13 -29 -102 57 -75 67
9813 67 -24 -78 -97 -5 15 91 32 2 -67 40 103 -140 56 -32 -16 47 -21 -34 24 3 -80 -33 -26 -43 15 -103 -47 5 -54
9842 -54 155 -61 33 -22 5 79 -85 17 -12 -89 8 -67 15 80 -98 44 -85 80 21 -56 47 32 -9 86 16 15
9868 15 -87 -72 -82 95 36 -33 -84 -78 -7 -49 -44 -104 50 -78 75 17 -6 -44 -39 8 65 -79 69 21 -47 21 -112 -45
9896 -45 -53 -12 -107 134 67 53 -19 60 34 28 -104 49 109 84 -43 81 -24 -38 49 39 -15 31 8 -35 33 82 38 11
9924 11 7 -54 106 -65 41 50 30 -51 -123 -39 -43 -63 -19 -8 -38 78 56 116 -30 88 37 -65 -8 86 5 -41 21 21 32
9953 32 -67 24 -44 -54 54 -10 11 -23 -49 -40 27 -19 -24 -66 -75 32 -26 30 41 -49 60 -34 60 58 104 85 8 105 -130 83
9983 83 -16 92 -1 115 34 -10 59 9 -1 -15 -71 -23 60 97 -137 53 12 77 60 -88 8 34 21 26 -131 56 -61
10010 -61 -118 68 34 65 141 -173 57 42 -98 0 -108 -66 35 36 2 -87 -59 -13 46 -68 -76 -27 69 -6 60 -64 17
10037 17 25 -42 -146 -11 -8 -118 -40 -31 67 -10 55 -19 7 -16 -63 -54 -176 49 -6 28 -24 74 15 92 -43 37 24 -99
10065 -99 38 2 45 16 -50 8 57 -35 -54 -15 -28 -24 129 -43 -91 -92 52 0 -82 -22 -36 -88 98 -71 -60 -98 -162 -210
10093 -210 -52 -104 32 -137 -58 -102 10 -24 -86 94 -27 -115 47 82 -22 -83 77 10 42 -26 -54 -11 -91 14
10117 14 28 -103 -49 23 37 7 11 13 124 -38 -30 -106 -46 -52 -37 36 -79 58 -92 26 -33 10 47 -43 3 -6 -36 -30 50
10146 50 67 33 -10 37 49 -10 -106 80 -19 -20 28 -57 -37 46 -14 -109 55 9 44 -56 89 -96 44 -53 -46 -73 -71 -14
10174 -14 -75 67 -54 -4 -23 -93 -76 -8 -95 18 12 36 -112 -74 -8 -105 31 68 -70 -30 -68 9 -44 -48 -72 92 26
10201 26 15 -11 70 -8 -108 -22 23 -64 64 31 6 86 100 14 3 -86 -14 40 65 -3 40 7 25 86 -28 14 -125 -28
10229 -28 -22 -62 119 24 -8 50 -24 -28 -11 -80 112 11 -1 69 70 61 -52 -51 -27 -32 -14 -55 34 -3 104 15 102 79 41 57
10259 57 -52 53 10 -46 117 84 19 114 58 26 95 -50 -2 -32 61 -15 -166 2 106 38 -47 -61 98 138 54 -51
10285 -51 19 68 16 -48 14 91 9 66 -68 -15 44 -46 4 66 -32 -55 75 1 9 -50 -34 61 -10 11 -71 99 95 1 17
10314 17 57 -13 -50 27 -10 22 5 -38 -65 -102 -36 64 113 30 -55 10 -20 6 11 -57 27 61 -51 3 69 81 59 -40 -97
10343 -97 -57 9 11 126 94 17 -130 51 -54 20 -5 64 79 -1 -156 -1 28 -79 -60 -78 3 -53 -51 -34 -59 -24 -75
10370 -75 -53 58 5 6 -21 41 -41 10 -48 71 -73 88 41 -1 -31 -24 -25 29 -101 -33 -35 87 145 9 -28 45 25 -34
10398 -34 144 -133 -24 -29 -11 52 -124 90 -32 -108 -81 -58 -47 92 37 -126 -17 -23 28 -56 16 30 -140 86 45
10423 45 -50 -7 -44 30 -15 78 29 27 -27 111 71 34 -12 -84 -19 41 -56 -125 -56 -11 150 40 56 -12 -92 60 5 2 -56
10452 -56 44 -82 35 -9 -131 42 17 -4 11 83 -56 -88 -10 46 -47 42 6 55 -39 -42 37 -104 -79 -148 -79 -50 7
10479 7 78 -51 -77 -50 37 50 77 -111 -95 -7 -57 -14 -20 -106 45 -100 -118 5 16 -41 -141 -55 -14 -19 55 9 7 -57 20
10508 20 8 -17 -167 -56 0 70 53 -127 48 -42 14 -94 36 -42 27 67 -14 55 65 53 -72 126 119 134 25 -22
10534 -22 110 4 129 63 -22 -26 -50 -1 -82 -63 -20 -9 -104 35 -21 15 -13 -50 -57 -2 -33 18 -33 140 -32 38 1 95
10562 95 -18 47 9 -12 19 -38 76 20 120 2 -43 36 -41 -95 -3 30 105 85 29 66 -58 -43 99 -28 74 -4
10588 -4 26 85 -39 -41 -46 -66 48 -221 20 15 16 -35 -39 2 62 8 -143 -6 -46 -87 -53 -66 -16 -45 -90 -13 -96 -55 41 25
10618 25 -144 10 -9 -69 65 -49 -61 64 -39 5 -49 -63 64 -38 14 -11 -79 13 15 -39 -100 37 -97 62 71
10643 71 -47 -95 -72 -17 26 18 -69 -119 57 18 -11 56 71 4 51 -13 84 91 -37 -26 14 -21 -93 27 60 43 21 -29 -40
10672 -40 -8 72 4 43 -77 -47 -52 -57 3 47 -64 34 24 -48 11 -24 86 -7 41 -45 -92 -1 100 2 26 -35 -31 -57 18
10701 18 -7 18 -19 -10 -116 14 16 65 18 -71 -20 -7 28 -140 -123 -15 109 -43 -45 -11 -60 -28 -5 -113 -51 -48 -4 -61
10729 -61 -6 35 106 -102 129 -1 -9 -29 32 68 32 -113 -50 -111 16 105 -105 20 74 49 40 38 -83 62 67 -54 89
10756 89 64 -5 -58 27 7 -82 35 7 -54 3 -20 -84 11 -10 172 168 -13 43 -24 -55 -22 -46 -12 -51 -79 86 -111 27
10784 27 25 3 -72 82 31 -41 21 -139 39 6 5 50 6 -24 6 47 -65 72 64 -62 -66 71 16 20 35 39 -7 14 -18
10813 -18 -90 6 -79 -24 -7 63 -88 5 -59 16 -79 -15 -138 -6 -24 7 14 -145 -71 77 -22 -155 10 -6 33 -121
10839 -121 -24 -4 -21 -10 -11 -93 -5 14 -59 4 33 45 8 45 1 49 18 34 74 -78 14 -40 -105 51 -142 107 -35
10866 -35 9 -66 -21 27 42 53 -42 94 -12 -1 59 113 15 -23 -4 41 -59 64 21 -58 -41 14 -3 38 127 -9 -5 -19
10894 -19 -45 5 50 7 106 3 10 83 79 -2 -41 -64 -101 -25 27 56 134 -66 -25 -29 -29 -1 -30 -31 55 -23 -19 -15 16 -103 6
10925 6 -32 44 101 49 85 19 -45 7 -1 -45 -1 37 -16 -135 36 -39 60 70 -108 15 -71 20 58 -23 48 -153 -40 -32
10953 -32 57 -38 15 -67 -65 -58 -146 8 -91 -27 9 25 -133 -72 79 15 -69 -7 -11 -81 -43 25 16 -17 -50 35 32 -111 -39 2
10983 2 -94 53 29 -31 10 88 -11 61 -27 -175 -21 52 -25 -51 13 -42 81 -32 4 0 44 -28 -49 12 67 18 43 25
11011 25 11 10 125 42 -7 84 55 15 88 143 74 -70 -30 -8 13 46 47 -35 -157 -9 -55 83 -12 -35 84 146 -90
11038 -90 33 68 121 -54 99 -8 -131 106 -91 -34 -74 98 104 43 17 103 61 99 -20 -95 40 28 -78 -28 -30
11063 -30 32 47 -24 1 -95 52 45 3 -99 13 -38 -10 45 16 -15 -98 -7 100 -19 21 5 -109 58 -15 1 43 -187
11090 -187 -79 21 31 43 -153 52 -131 -52 35 18 -63 51 -21 30 -28 86 29 -30 48 -172 25 -13 67 -81
11114 -81 -48 -15 30 -3 -58 -24 29 108 -75 -97 22 -116 -132 -9 89 31 -1 -55 44 -10 -42 -34 -42 -11 -60 25 137 66
11142 66 48 -47 -35 11 75 24 60 62 -79 73 -96 -68 -44 57 -113 -86 -15 15 -108 7 -22 -43 98 -13 18 -39
11168 -39 125 97 85 66 40 -129 -38 -14 -34 47 61 80 -26 -12 -150 -47 -16 84 -1 -6 -8 21 -10 82 88 -72 76
11195 76 -56 48 -62 -115 44 42 25 0 5 -25 -122 0 39 79 63 109 -12 0 -66 -47 10 12 1 51 -86 -53 -64 29
11223 29 49 41 -12 52 50 -38 33 -49 116 -87 -71 42 -32 55 -99 77 20 21 -36 69 -56 -57 61 -11 7 -74 134
11250 134 -34 130 -13 -47 108 31 78 -34 -107 76 16 1 -32 152 37 -53 12 68 -16 -8 -80 6 8 -13 -63 -21
11276 -21 -102 -120 -60 -192 -48 -30 -64 -96 23 1 -70 -144 -13 -88 90 96 -23 -91 35 -22 101 -67 -74 13 -32 -5
11302 -5 -12 20 -9 -24 -12 41 10 61 33 9 23 -59 3 58 -41 -6 53 -20 5 90 -73 -2 -28 -26 -8 -67 32 61 68 -70 159
11333 159 -113 -73 -98 -93 0 -86 6 -83 -86 -59 -65 -48 -9 72 57 26 -31 28 18 32 -3 26 -47 -68 -6 99 44 62 -79
11362 -79 63 -24 -12 -38 -51 -87 -65 -55 53 73 18 -72 61 -47 -150 17 -112 -45 -7 -61 10 89 5 37 68 75 -109
11389 -109 78 -50 -104 33 -49 -50 -15 68 -3 9 25 -9 -119 7 84 86 -69 28 -1 -4 -76 82 -63 226 -93 5
11415 5 -51 16 107 -15 -96 -70 -31 57 8 -40 -28 51 53 -25 50 35 17 9 -2 102 -93 85 108 9 -33 -4 17 5 -80
11444 -80 -7 -108 46 134 -119 -70 -90 0 40 -44 -5 11 62 52 68 53 51 -1 -39 41 -73 -6 -33 -35 -94 -39 -83 35
11472 35 -37 -48 -80 -134 40 -62 8 30 90 -24 -49 47 -22 -83 -65 110 25 -29 -61 -12 -1 -37 35 -16 -39 -4 -16 -131
11500 -131 -8 -141 6 2 0 -117 39 -41 -26 85 -118 40 -38 109 2 8 -15 -30 -84 66 11 -32 -38 48 -35 96
11526 96 -74 34 10 11 149 7 -28 -26 -27 -56 80 192 -36 -71 22 -15 -74 -22 -65 -25 37 -44 8 4 42 -20 -20 3 73
$$ [...]
16383H8
##END NTUPLES=NMR FID
##END=
