##TITLE=abcd
##JCAMPDX= 6.0         $$ Bruker NMR JCAMP-DX V2.0
##DATA TYPE= NMR SPECTRUM
##DATA CLASS= NTUPLES
##ORIGIN= UXNMR, Bruker Analytische Messtechnik GmbH
##OWNER= root
$$ XWIN-NMR		Version 3.5
$$ Fri May 30 17:58:43 2025 Russian Standard Time (UT+4h)  servis@DPX200
##.OBSERVE FREQUENCY= 200.131235884673
##.OBSERVE NUCLEUS= ^1H
##.ACQUISITION MODE= SIMULTANEOUS
##.ACQUISITION SCHEME= undefined
##.AVERAGES= 16
##.DIGITISER RES= 18
##SPECTROMETER/DATA SYSTEM= spect
##.PULSE SEQUENCE= zg
##.SOLVENT NAME= CDCl3
##.SHIFT REFERENCE= (INTERNAL, CDCl3, 0, 16.4885)
##AUDIT TRAIL= $$ (NUMBER, WHEN, WHO, WHERE, WHAT)
$$ ##TITLE= Audit trail, XWIN-NMR		Version 3.5
$$ ##JCAMPDX= 5.01
$$ ##ORIGIN= Bruker BioSpin GmbH
$$ ##OWNER= servis
$$ F:\spectra/data/av/nmr/H1/1/pdata/1/auditp.txt
$$ ##AUDIT TRAIL=  $$ (NUMBER, WHEN, WHO, WHERE, WHAT)
(   1,<2025-05-30 17:56:27.07 +0400>,<servis>,<DPX200>,
      <created by zg, POWCHK disabled, PULCHK disabled
       terminated by command 'halt'
       configuration hash MD5:
       00 E9 B6 7A A2 85 ED C7 34 08 36 98 17 FE 4E 26
       data hash MD5: 32K
       3C 59 2B E8 2B E2 9A 1A D0 46 CE 52 49 B7 5E 19>)
(   2,<2025-05-30 17:56:28.98 +0400>,<servis>,<DPX200>,
      <Start of raw data processing
       efp BC_mod = 2 LB = 0.05 FT_mod = 6 PKNL = 1 PHC0 = -263.3773 PHC1 = -4.898466 SI = 16K 
       data hash MD5: 16K
       69 F0 54 29 D3 66 FD CC 14 05 5D 8F 7F FE F3 EC>)
(   3,<2025-05-30 17:56:31.46 +0400>,<servis>,<DPX200>,
      <abs ABSG = 5 
       data hash MD5: 16K
       6C 57 26 85 6D 0B 6E 7B 59 41 35 FB C4 02 F9 37>)
(   4,<2025-05-30 17:56:57.42 +0400>,<servis>,<DPX200>,
      <pk PHC0 = -0.2004289 PHC1 = 0 
       data hash MD5: 16K
       40 B1 1B 64 C6 7B A4 BC 60 D9 A7 0C 09 91 33 DC>)
$$ ##END=
$$ 
$$ hash MD5
$$ B2 05 ED 24 81 4A FE AF 1B 34 DB B7 74 D6 4A DB
##$RELAX= 
##$RELAX= 
##$RELAX= 
##$RELAX= 
##$RELAX= 
##$RELAX= 
##$RELAX= 
##$RELAX= 
$$ Bruker specific parameters
$$ --------------------------
##$DU= <F:\spectra>
##$EXPNO= 1
##$NAME= <H1>
##$PROCNO= 1
##$TYPE= <nmr>
##$USER= <av>
##$AMP= (0..31)
100 100 100 100 100 100 100 100 100 100 100 100 100 100 100 100 100 100 
100 100 100 100 100 100 100 100 100 100 100 100 100 100 
##$AQSEQ= 0
##$AQ_mod= 1
##$AUNM= <au_zg>
##$AUTOPOS= <>
##$BF1= 200.13
##$BF2= 200.13
##$BF3= 200.13
##$BF4= 200.13
##$BF5= 500.13
##$BF6= 500.13
##$BF7= 500.13
##$BF8= 500.13
##$BYTORDA= 1
##$CFDGTYP= 0
##$CFRGTYP= 5
##$CHEMSTR= <none>
##$CNST= (0..31)
1 1 145 1 1 1 1 1 1 1 1 1 1 1 1 1 1 1 1 1 1 1 1 1 1 1 1 1 1 1 1 1 
##$CPDPRG= <>
##$CPDPRG1= <>
##$CPDPRG2= <>
##$CPDPRG3= <>
##$CPDPRG4= <mlev>
##$CPDPRG5= <mlev>
##$CPDPRG6= <mlev>
##$CPDPRG7= <mlev>
##$CPDPRG8= <mlev>
##$CPDPRGB= <>
##$CPDPRGT= <>
##$D= (0..31)
0 2 0 0 0 0 0 0 0 0.06 0 0 0 0 0 0 0.0002 0 0 0 0 0 0 0 0 0 0 0 0 0 0 
0 
##$DATE= 1748613386
##$DBL= (0..7)
120 120 120 120 120 120 120 120 
##$DBP= (0..7)
150 150 150 150 150 150 150 150 
##$DBP07= 0
##$DBPNAM0= <>
##$DBPNAM1= <>
##$DBPNAM2= <>
$$ [...]
##$SUBNAM5= <"">
##$SUBNAM6= <"">
##$SUBNAM7= <"">
##$SUBNAM8= <"">
##$SUBNAM9= <"">
##$SW= 20.6817932712277
##$SWIBOX= (0..15)
0 0 3 0 0 0 0 0 0 0 0 0 0 0 0 0 
##$SW_h= 4139.07284768212
##$TD= 32768
##$TD0= 1
##$TE= 0
##$TE2= 300
##$TE3= 300
##$TEG= 300
##$TL= (0..7)
0 120 120 120 120 120 120 120 
##$TP= (0..7)
150 150 150 150 150 150 150 150 
##$TP07= 0
##$TPNAME0= <>
##$TPNAME1= <>
##$TPNAME2= <>
##$TPNAME3= <>
##$TPNAME4= <>
##$TPNAME5= <>
##$TPNAME6= <>
##$TPNAME7= <>
##$TPOAL= (0..7)
0.5 0.5 0.5 0.5 0.5 0.5 0.5 0.5 
##$TPOFFS= (0..7)
0 0 0 0 0 0 0 0 
##$TUNHIN= 0
##$TUNHOUT= 0
##$TUNXOUT= 0
##$USERA1= <user>
##$USERA2= <user>
##$USERA3= <user>
##$USERA4= <user>
##$USERA5= <user>
##$V9= 5
##$VALIST= <valist>
##$VCLIST= <CCCCCCCCCCCCCCC>
##$VD= 0
##$VDLIST= <DDDDDDDDDDDDDDD>
##$VPLIST= <PPPPPPPPPPPPPPP>
##$VTLIST= <TTTTTTTTTTTTTTT>
##$WBST= 1024
##$WBSW= 30
##$XGAIN= (0..3)
0 0 0 0 
##$XL= 0
##$YL= 0
##$YMAX_a= 2385235
##$YMIN_a= -2502450
##$ZGOPTNS= <>
##$ZL1= 120
##$ZL2= 120
##$ZL3= 120
##$ZL4= 120
##$ABSF1= 16.48848
##$ABSF2= -4.193441
##$ABSG= 5
##$ABSL= 3
##$ALPHA= 0
##$AQORDER= 0
##$ASSFAC= 0
##$ASSFACI= 0
##$ASSFACX= 0
##$ASSWID= 0
##$AUNMP= <proc_1d>
##$AZFE= 0.1
##$AZFW= 0.1
##$BCFW= 0
##$BC_mod= 2
##$BYTORDP= 0
##$COROFFS= 0
##$CY= 18.4799938201904
##$DATMOD= 1
##$DC= 0
##$DFILT= <>
##$DTYPP= 0
##$F1P= 9.9274215381318
##$F2P= -0.165520771350173
##$FCOR= 1
##$FTSIZE= 16384
##$FT_mod= 6
##$GAMMA= 0
##$GB= 0
##$INTBC= 1
##$INTSCL= 4.127829e-11
##$ISEN= 128
##$LB= 0.05
##$LEV0= 0
##$LPBIN= 0
##$MAXI= 10000
##$MC2= 0
##$MEAN= 0
##$ME_mod= 0
##$MI= 50
##$NCOEF= 0
##$NC_proc= -3
##$NLEV= 6
##$NOISF1= 3.799351
##$NOISF2= 2.8
##$NSP= 0
##$NTH_PI= 0
##$NZP= 0
##$OFFSET= 16.48848
##$PC= 4
##$PHC0= -263.5777
##$PHC1= -4.898466
##$PH_mod= 1
##$PKNL= yes
##$PPARMOD= 0
##$PSCAL= 4
##$PSIGN= 0
##$REVERSE= no
##$SF= 200.130005582386
##$SI= 16384
##$SIGF1= 3
##$SIGF2= 2
##$SINO= 400
##$SIOLD= 16384
##$SREGLST= <1H.CDCl3>
##$SSB= 0
##$STSI= 16384
##$STSR= 0
##$SW_p= 4139.07284768211
##$SYMM= 0
##$S_DEV= 0
##$TDeff= 32768
##$TDoff= 0
##$TI= <>
##$TILT= no
##$TM1= 0
##$TM2= 0
##$TOPLEV= 0
##$USERP1= <user>
##$USERP2= <user>
##$USERP3= <user>
##$USERP4= <user>
##$USERP5= <user>
##$WDW= 1
##$XDIM= 16384
##$YMAX_p= 287722851
##$YMIN_p= -5405947
$$ End of Bruker specific parameters
$$ ---------------------------------
##NTUPLES= NMR SPECTRUM
##VAR_NAME=  FREQUENCY,     SPECTRUM/REAL,   SPECTRUM/IMAG
##SYMBOL=    X,             R,               I
##VAR_TYPE=  INDEPENDENT,   DEPENDENT,       DEPENDENT
##VAR_FORM=  AFFN,          ASDF,            ASDF
##VAR_DIM=   16384,         16384,           16384
##UNITS=     HZ,            ARBITRARY UNITS, ARBITRARY UNITS
##FACTOR=    0.252644378177508, 1,           1
##FIRST=     3299.83951724647, 0,            0
##LAST=      -839.233330435636, 0,           0
##MIN=       -839.233330435636, -5405947,    0
##MAX=       3299.83951724647, 287722851,    0
$$ Real data points
##PAGE= N=1
##DATA TABLE= (X++(R..R)), XYDATA
$$ [...]
6622a394828R560j5268P403J0309j0010k4464J839P965p696p184L628m025L893
6609a418878k5208r74l012J2710l4037O483J4246k3353N350N029j1368n165J0412
6596a467765K871J0089l2441m578l530J8674l593j6727K0095l0320O10j2334n575
6583a524524J2355P413j169j5017j6132R797j485N180p600j7430J6351q075r929
6570a550265j0197j3545l725K7118N392r630M324k9725K2852k3657o439j161J4358
6557a574300j7462l552J5709l576k2333l132M999k3672J2456o023P348k436j0180
6544a626154p329M256J662L197j0466k5795L748q025J5976L519j8760P57J2336
6531a651078q845j7995L706j1230j3329L842J0375j6807P932o432j3199J2386
$$ y = [-1394828, -1385268, -1400536, -1393133, -1382824, -1392834, -1417298, -1415459, -1407494, -1415190, -1422374, -1418746, -1422771, -1418878, -1444086, -1445060, -1448072, -1435362, -1469399, -1462916, -1448670, -1472023, -1466673, -1461644, -1473012, -1478177, -1467765, -1464894, -1454805, -1487246, -1491824, -1495354, -1476680, -1480273, -1497000, -1476905, -1507225, -1506615, -1518949, -1524524, -1512169, -1504756, -1505925, -1520942, -1537074, -1527277, -1528762, -1523582, -1531182, -1548612, -1532261, -1540336, -1550265, -1560462, -1574007, -1577732, -1550614, -1545222, -1554852, -1550528, -1580253, -1557401, -1581058, -1587497, -1588658, -1574300, -1591762, -1595314, -1579605, -1583181, -1605514, -1608646, -1603647, -1627319, -1614863, -1620886, -1613538, -1615974, -1626154, -1633483, -1629227, -1627565, -1624368, -1634834, -1660629, -1656881, -1664906, -1648930, -1645411, -1664171, -1663414, -1651078, -1659923, -1677918, -1674212, -1685442, -1698771, -1694929, -1684554, -1701361, -1693429, -1699861, -1713060, -1700674]
6519a700674n648P075j7411M48j174j4398J0004K241O324k9285K015M811j7272
6506a752944J0777j7664K1977m953o146j5983M064m236k235L370k8430J2976l302
6493a782729P239j1867j2433L1354k0232j3277J0077m352j9541J5904j3215J4824
6481a798248j0735n118o855k385n022n266J8322j502k996k1098J3222l6197K1482
6468a842396k1502J2768J2255j6593j9972K1004j6389J0606o235l18j183j169
6456a869124j3592l708m948J2965j5332j0244L098O374N769k5439J4742m290j8156
6443a921885K9205m1077K0132k9305J0620J425p469P078n036m330l642r840J6724
6430a937400m600m214j7002L036j2765N511j4360Q606j0538O914p933n47J291
$$ y = [-1700674, -1706322, -1699247, -1716658, -1716210, -1717384, -1731782, -1721778, -1719537, -1713213, -1742498, -1740483, -1735672, -1752944, -1742167, -1759831, -1737854, -1742807, -1748953, -1764936, -1760872, -1765108, -1767343, -1763973, -1792403, -1779427, -1782729, -1775490, -1787357, -1799790, -1768436, -1788668, -1801945, -1791868, -1796220, -1815761, -1799857, -1813072, -1798248, -1808983, -1814101, -1820956, -1823341, -1828363, -1833629, -1815307, -1816809, -1819805, -1840903, -1827681, -1863878, -1842396, -1863898, -1851130, -1838875, -1855468, -1875440, -1854436, -1870825, -1860219, -1866454, -1866772, -1867955, -1869124, -1882716, -1886424, -1891372, -1878407, -1893739, -1903983, -1900885, -1894511, -1888742, -1914181, -1899439, -1903729, -1921885, -1892680, -1933757, -1913625, -1942930, -1932310, -1930885, -1938354, -1931276, -1936312, -1940642, -1944284, -1954124, -1937400, -1942000, -1946214, -1963216, -1960180, -1972945, -1967434, -1981794, -1973188, -1983726, -1976812, -1984745, -1985292, -1984001]
6417a984001l4275J7819J808j9779o62Q642n663k1944J9261k8893J4092K813m71
6404b031253j8260m976j1431J4507j818k5867K3335L50r23j1668n940m761m576
6391b083281P275j5575p463J0969k2056J017Q972k1893O845P63J85k0216k702
6378b137160R269o475j3285K5171k574k6393Q957Q43k2514R656L996q770n479
6365b164758n346N689j3865L137j55j0424l674Q545J39m428j3256J3353j2598
6352b197641o505j1921J6974k6205j3134J3875o682R434q207p138P761j1779j7922
6339b259090O774r583p567n394q07J601j547N458j9003J5736p750J0022l436k8238
6325b302824J1432k7782J1476J0946j1715J5083j0015r609L374j5762n04J3995
$$ y = [-1984001, -2018276, -2000457, -1998649, -2018428, -2019090, -2010448, -2016111, -2038055, -2018794, -2047687, -2033595, -2030782, -2031253, -2049513, -2054489, -2065920, -2051413, -2053231, -2079098, -2055763, -2055413, -2056336, -2068004, -2073944, -2078705, -2083281, -2076006, -2091581, -2099044, -2088075, -2110131, -2109114, -2100142, -2122035, -2115190, -2114427, -2114242, -2134458, -2137160, -2127891, -2134366, -2147651, -2122480, -2125054, -2151447, -2142490, -2141647, -2164161, -2154505, -2150509, -2159279, -2164758, -2170104, -2164415, -2178280, -2175143, -2175298, -2185722, -2189396, -2180851, -2180712, -2185140, -2198396, -2185043, -2197641, -2204146, -2216067, -2199093, -2225298, -2238432, -2224557, -2231239, -2221805, -2230012, -2237150, -2229389, -2241168, -2259090, -2252316, -2261899, -2269466, -2274860, -2275667, -2274066, -2275613, -2270155, -2289158, -2273422, -2281172, -2271150, -2274586, -2302824, -2291392, -2319174, -2307698, -2296752, -2308467, -2293384, -2303399, -2313008, -2309634, -2325396, -2325900, -2311905]
6313b311905j0988k0132K8356o772l0673n79J6051k4002R103r916O019k0936J3
6300b376361J3095j8907J2485j5679j2999J2288r228J4794L373k5108j0831J8961
6288b394117j3269o102J6254j3778r878J6237p609j8151O525k020j2649K05J3275
6275b425077l0265J1178j4644L833J935l0913J4218R262j0597p837K571q354J4150
6262b470540N138l3870j3655J0113J2019k8800J1279P094j1703j0512K598Q367
6250b512472n697k2450J163P744m43J0658m4985L4482k1488j837J2910j1413j2381
6237b566209J794j1942K227K581j6501M905k815j2664P337r556n432q065M077
6224b610263K83q961J0357k429k0614j5754J3747j203R003j6721L178l980J2619
$$ y = [-2311905, -2322893, -2343025, -2314669, -2321441, -2352114, -2352693, -2336642, -2360644, -2351541, -2361457, -2355438, -2376374, -2376361, -2363266, -2382173, -2369688, -2385367, -2398366, -2386078, -2395306, -2380512, -2377139, -2402247, -2413078, -2394117, -2407386, -2413488, -2397234, -2411012, -2420890, -2404653, -2412262, -2430413, -2423888, -2425908, -2438557, -2438352, -2425077, -2455342, -2444164, -2458808, -2454975, -2453040, -2483953, -2469735, -2460473, -2471070, -2478907, -2476336, -2484690, -2470540, -2465402, -2499272, -2512927, -2502814, -2490795, -2519595, -2508316, -2501222, -2512925, -2523437, -2520839, -2512472, -2518169, -2540619, -2539456, -2531712, -2532155, -2521497, -2566482, -2532000, -2553488, -2555325, -2542415, -2553828, -2566209, -2564415, -2576357, -2574130, -2571549, -2588050, -2583145, -2585960, -2598624, -2591287, -2600843, -2606275, -2614340, -2610263, -2609980, -2618941, -2608584, -2611013, -2631627, -2647381, -2633634, -2634837, -2625834, -2642555, -2639377, -2643357, -2630738]
6211b630738j4473l917J3355k8234j7870J3214j0967P501o226P610j1773J7758
6199b664760l6355J0391j3420P745K1604j6723J6790l1160J8933l3841K0650L709
6187b696437l317l3660N327J0105R814k3986l109P426J488p468j0507j466j2507
6174b758297Q565j234K78P702l5278K305Q953j5004M820p272p08L511l385k2045
6160b807089P388j1082Q397K785q06N750l505k5964o14K2434j8696O288Q104l589
6146b810199k0000j800K862j5289J7058j5091j2815J8144j0634p992J2275j055
6134b844536j6948j0132P623o72k431j2379J2696j7076J915m75k0928K773K0512
6121b880058k7286J4710j5184k879k57J046k381j1959L277q976k0746J4424k794
$$ y = [-2630738, -2645211, -2649128, -2635773, -2664007, -2681877, -2668663, -2679630, -2672129, -2678355, -2670745, -2682518, -2664760, -2701115, -2690724, -2704144, -2696399, -2674795, -2691518, -2674728, -2705888, -2686955, -2720796, -2700146, -2696437, -2699754, -2733414, -2728087, -2717982, -2708168, -2732154, -2735263, -2727837, -2726349, -2733817, -2744324, -2745790, -2758297, -2749732, -2750966, -2750688, -2742986, -2778264, -2775959, -2767006, -2782010, -2777190, -2784462, -2785170, -2781659, -2785044, -2807089, -2799701, -2810783, -2802386, -2799601, -2800407, -2794657, -2798162, -2824126, -2824740, -2802306, -2821002, -2814714, -2806610, -2810199, -2830199, -2831999, -2829137, -2844426, -2827368, -2842459, -2855274, -2837130, -2847764, -2855756, -2843481, -2844536, -2861484, -2871616, -2863993, -2864665, -2867096, -2879475, -2866779, -2883855, -2881940, -2882415, -2903343, -2900570, -2880058, -2907344, -2892634, -2907818, -2910697, -2910954, -2909908, -2912289, -2924248, -2920971, -2929947, -2950693, -2936269, -2939063]
6108b939063J1976j0744j5619M818n804l625p626j3449N207K56K298n013j1653
6095b988041Q091j1011N214j1620j3304J1814r160p268K185j3471K2665k005j5401
6082c021312L315N271k5485J7955j1055q217m153M023J909m382j2599J2892l304
6069c045142r918n797p196L272R711r803j0860P12r084K673P048K5451l3257R57
6055c081233m238P341m64j5541m613K4912k0796n85Q211l3168J5574K455j1757
6042c113902j3458M501m607Q109P9k0841K105R038k000o843p290K821q287N86
6028c149989n788j2129J7018j8760Q478K037l0106K0583N130j8386j6804O054
6016c192662j5262R551m78j1415j4257R081J5196j492j266p670j645j1884Q820
$$ y = [-2939063, -2927087, -2937831, -2953450, -2948632, -2954436, -2958061, -2965687, -2979136, -2973929, -2973673, -2971375, -2976388, -2988041, -2979950, -2990961, -2985747, -2997367, -3010671, -2998857, -3008017, -3015285, -3013100, -3026571, -3003906, -3005911, -3021312, -3017997, -3012726, -3038211, -3020256, -3031311, -3039528, -3043681, -3039658, -3037749, -3042131, -3054730, -3041838, -3045142, -3055060, -3060857, -3068053, -3064781, -3055070, -3064873, -3075733, -3075021, -3084105, -3081432, -3074384, -3048933, -3082190, -3081233, -3085471, -3078130, -3078594, -3094135, -3098748, -3073836, -3094632, -3095217, -3087006, -3120174, -3104600, -3102145, -3113902, -3127360, -3122859, -3127466, -3119357, -3119278, -3140119, -3138014, -3128976, -3130976, -3137819, -3145109, -3142288, -3150575, -3149989, -3155777, -3167906, -3150888, -3169648, -3161170, -3159133, -3189239, -3168656, -3163526, -3181912, -3198716, -3192662, -3207924, -3198373, -3198851, -3210266, -3224523, -3215442, -3200246, -3201738, -3203004, -3210674, -3212319, -3224203, -3215383]
6003c215383j6798q776J9618j5354j4481j81Q255j5191m081K3214k7027J2976
5991c253209j2075q905J5137k3732R598k896r993l613P610j5797K770J6349k4902
5978c303658J6694m963j4371N968M484j8441Q562j2887o662P52L841M102j3518
5965c330097J879J2751k572l077k074j9891Q590r05j4066K0783K072j1485j471
5952c339563J0496j6857J0194j3249l738j4257J9571o530O591j9052J9466j7505
5940c364433J8132j4996K3085k4816p700P706j86R239j537L979j0923j3954l019
5927c379423J4033j3671j15n827M749p864n429J5275j1914J3412j1718r42J5553
5914c373881m42k952r667l353J6512p204l854l305K834k3123J5573q569P006J0651
$$ y = [-3215383, -3232181, -3240957, -3221339, -3236693, -3251174, -3251355, -3243100, -3258291, -3262372, -3239158, -3266185, -3253209, -3265284, -3274189, -3259052, -3282784, -3273186, -3276082, -3286075, -3289688, -3282078, -3297875, -3295105, -3278756, -3303658, -3286964, -3291927, -3306298, -3300330, -3295846, -3314287, -3305725, -3318612, -3325274, -3324522, -3320681, -3316579, -3330097, -3328218, -3315467, -3318039, -3321116, -3323190, -3343081, -3334491, -3335396, -3349462, -3328679, -3326607, -3338092, -3339563, -3329067, -3345924, -3335730, -3348979, -3352717, -3366974, -3347403, -3353933, -3347342, -3366394, -3346928, -3364433, -3346301, -3361297, -3338212, -3363028, -3370728, -3363022, -3363208, -3353969, -3355506, -3351527, -3362450, -3376404, -3379423, -3365390, -3379061, -3379176, -3385003, -3380254, -3388118, -3393547, -3378272, -3390186, -3376774, -3388492, -3389434, -3373881, -3374323, -3377275, -3386942, -3390295, -3373783, -3380987, -3384841, -3388146, -3385312, -3408435, -3392862, -3401431, -3394425, -3383774]
5900c383774j5387J781J2466L628j4321L60q638P879J406J3656j1389K5588j6730
5887c383475o053p427K1598l491k6837R811L196l661L811N706P617P7o834N46
5873c385416J1136q149k614j734J0077m723O393J2289j2120R333J8362r363m032
5860c360561k431K0027k1560N128j1981J8907j3456J218L899J0416p078l526J6675
5847c344323o437j7053J9858J0688Q65J616k6197J6708N844m258j84J7253j4873
5834c340493P428J1893p443L493J654k0899J0817J2752n089J2150K578j9593K0091
5821c310661p788R49J0024m400J1720Q05o183J2184l808P511O540k331j1736P437
5807c289737o598M571j3223o144J8003o204Q592P003k3982J6799o020j0056J1723
$$ y = [-3383774, -3399161, -3397380, -3384914, -3381286, -3395607, -3395247, -3403885, -3396006, -3394600, -3380944, -3392333, -3366745, -3383475, -3389528, -3396955, -3375357, -3378848, -3405685, -3395874, -3392678, -3396339, -3392528, -3386822, -3379205, -3379128, -3385962, -3385416, -3374280, -3382429, -3385043, -3386777, -3376700, -3381423, -3375030, -3362741, -3374861, -3365528, -3347166, -3356529, -3360561, -3362992, -3342965, -3364525, -3359397, -3371378, -3352471, -3365927, -3364709, -3360810, -3350394, -3357472, -3360998, -3344323, -3350760, -3367813, -3347955, -3337267, -3336402, -3334786, -3360983, -3344275, -3338431, -3342689, -3342873, -3325620, -3340493, -3333065, -3321172, -3328615, -3325122, -3323468, -3344367, -3333550, -3320798, -3325887, -3313737, -3311159, -3330752, -3310661, -3318449, -3317500, -3307476, -3311876, -3300156, -3299351, -3305534, -3293350, -3297158, -3289647, -3283107, -3285438, -3297174, -3289737, -3296335, -3291764, -3304987, -3311131, -3293128, -3299332, -3290740, -3283737, -3307719, -3290920, -3296940, -3306996, -3295273]
5794c295273P542o167m749R36j880J247J2052j0039J1469J0978k289n302M605
5781c276870Q306M375N260J4078J992n938J0700j4288R115L441R92N928K7894
5768c205015j1737J1543m546N275K0707m496o771K4129r735J7091K604K7240p610
5755c141321M989Q078O335R736L378J9424L991p081K8607J3537K964J7509O836
5742c023018P08L1901l9J0272m070M4915N024m563J4769J1426K9878j1047J2850
5729b880994J4761J6830K7944k486L1102J4146O550J1906J7281M4505o027J1467
5717b693015L0655J0416K9840L4355K3548l97K5869J5342L9288K9118R924M0072
5705b404985J2710L2170K8439J2590M6120J0671L9711L3060K2986O0118J7536
$$ y = [-3295273, -3287731, -3293898, -3298647, -3297711, -3299591, -3298344, -3286292, -3296331, -3284862, -3273884, -3276173, -3281475, -3276870, -3268564, -3264189, -3258929, -3244851, -3242859, -3248797, -3238097, -3252385, -3243270, -3239829, -3238837, -3232909, -3205015, -3216752, -3205209, -3209755, -3204480, -3183773, -3188269, -3195040, -3170911, -3180646, -3163555, -3160951, -3133711, -3141321, -3136332, -3128254, -3121919, -3112183, -3108805, -3089381, -3085390, -3092471, -3063864, -3050327, -3047363, -3029854, -3023018, -3022310, -2990409, -2990448, -2980176, -2984246, -2939331, -2934307, -2938870, -2924101, -2912675, -2882797, -2893844, -2880994, -2866233, -2849403, -2821459, -2823945, -2792843, -2778697, -2772147, -2760241, -2742960, -2698455, -2704482, -2693015, -2662360, -2651944, -2622104, -2587749, -2564201, -2564598, -2538729, -2523387, -2484099, -2454981, -2445057, -2404985, -2392275, -2360105, -2331666, -2319076, -2272956, -2262285, -2222574, -2189514, -2166528, -2106410, -2088874]
5694b088874L6764K8614K3954M0704K6857O1409K4522O1360M4050J7706M8170
5683a674764M5499N3153K8428N7133N3365L5221N7804N2633O3707L9293M5424
5672a143104O7729P5715N1185O3300Q0246P7796N6028P5399O6026Q0665Q0965
5661c68050R3928Q1960P6974Q6683P9543J09500J09938R2643J00712J09394J10758
5650F83983J19609J09557J38499J19502J29767J22583J56383J48060J34593J74051
5640B036587J65971J51524J89847J75695J97731J84015K06883K18419K17864K09729
5630C954265K44446K69277K29900K42771K66787K84012K82058L12499K89525L26428
5620F701968L15252L05949L79456L41246L68658L70315L89787L74555L99044M22322
$$ y = [-2088874, -2052110, -2023496, -1999542, -1958838, -1931981, -1870572, -1846050, -1784690, -1740640, -1722934, -1674764, -1629265, -1576112, -1547684, -1490551, -1437186, -1401965, -1344161, -1291528, -1227821, -1188528, -1143104, -1075375, -999660, -948475, -885175, -804929, -727133, -671105, -595706, -529680, -449015, -368050, -274122, -192162, -115188, -28505, 51038, 160538, 270476, 363119, 463831, 573225, 683983, 803592, 913149, 1051648, 1171150, 1300917, 1423500, 1579883, 1727943, 1862536, 2036587, 2202558, 2354082, 2543929, 2719624, 2917355, 3101370, 3308253, 3526672, 3744536, 3954265, 4198711, 4467988, 4697888, 4940659, 5207446, 5491458, 5773516, 6086015, 6375540, 6701968, 7017220, 7323169, 7702625, 8043871, 8412529, 8782844, 9172631, 9547186, 9946230, 10368552]
5610A0368552M28845M07758M43592M27210M55474M36250M40509M59841M53171
5601A4321202M61604M68795M58080M58454M75325M45509M68757M51773M59026
5592A8468525M59969M74669M41558M50530M30686M40803M48820M04490M36097
5583B2456147L99825L75463L72143L70048L33612L27216L20047K70741K82666
5574B5507908K35378K28890J96746J85571J49538J26268J19584R9484M6219O7369
5564B6962955L4418P154j2144l5354o3141m2301r2391j21135j53480j55538j83373
5553B6145670j99935k14845k58625k56683k77563l02412l06693l43874l26998
5544B3658042l52924l87731l92646l67914l89317m23810m06794m07793m42225
$$ y = [10368552, 10797397, 11205155, 11648747, 12075957, 12531431, 12967681, 13408190, 13868031, 14321202, 14782806, 15251601, 15709681, 16168135, 16643460, 17088969, 17557726, 18009499, 18468525, 18928494, 19403163, 19844721, 20295251, 20725937, 21166740, 21615560, 22020050, 22456147, 22855972, 23231435, 23603578, 23973626, 24307238, 24634454, 24954501, 25225242, 25507908, 25743286, 25972176, 26168922, 26354493, 26504031, 26630299, 26749883, 26849367, 26895586, 26962955, 26997373, 27004527, 26992383, 26957029, 26893888, 26851587, 26759196, 26638061, 26484581, 26329043, 26145670, 25945735, 25730890, 25472265, 25215582, 24938019, 24635607, 24328914, 23985040, 23658042, 23305118, 22917387, 22524741, 22156827, 21767510, 21343700, 20936906, 20529113, 20086888]
5535B0086888m23525m11810m37706m45389m33413m45186m27287m34593m41558
5526A6186421m39801m35250m24348m54719m23090m29333m42307m30796m28665
5517A2278112l97105m14877l93598m10530l86380l85481l72166l52068l68661
5508H797246l50825l44365l17874l30895k95988l13891k80259k83011k76666k62915
5498E740557k46067k58665k33071k36090k19321k21737k23739j96521k01616j76593
5488C527137j95233j58790j91934j54413j65744j49434j63661j27943j38852j36892
5478A944241j20023j23989j26373j35539r0038j27237r4930j04500j08100j13028
5468H00484r2394q9691r2368r0283q9457r2505p7630q4890p3402n8559p6743q0634
$$ y = [20086888, 19663363, 19251553, 18813847, 18368458, 17935045, 17489859, 17062572, 16627979, 16186421, 15746620, 15311370, 14887022, 14432303, 14009213, 13579880, 13137573, 12706777, 12278112, 11881007, 11466130, 11072532, 10662002, 10275622, 9890141, 9517975, 9165907, 8797246, 8446421, 8102056, 7784182, 7453287, 7157299, 6843408, 6563149, 6280138, 6003472, 5740557, 5494490, 5235825, 5002754, 4766664, 4547343, 4325606, 4101867, 3905346, 3703730, 3527137, 3331904, 3173114, 2981180, 2826767, 2661023, 2511589, 2347928, 2219985, 2081133, 1944241, 1824218, 1700229, 1573856, 1438317, 1348279, 1221042, 1126112, 1021612, 913512, 800484, 708090, 618399, 526031, 435748, 346291, 253786, 176156, 91266, 17864, -40695, -117438, -198072]
5456a98072p4193o2723n6049q0862o3011m9489p4175o3216n8291o1481n7096l4039
5444i32697o7769n7690m3020m0068o2548n1822k9570o9396l7363n1823l0881o1723
5432a536370l2986n4899l6010n4683r011m8588m0558m0419m1259k0978n2377m7283
5420b015421l8348j4905l4034m0034j6493l8364k9976j8357l8191j9699l3080
5409b336902l9060k6676q507l3760r645l7880k0649p607m2735l957j5565l4272
5397b617215k5148j8102l4509l261q532k8480k7876J37j6656k2779p257r587j8889
5384b838154j2045j5643K424j3412j4632j5239j060k1721J1399l3206J7298k1958
5372b955949m808q224j3183J7317k1138P094P721j0023j2682n477l636K2758k4651
$$ y = [-198072, -272265, -334988, -391037, -471899, -534910, -584399, -658574, -721790, -780081, -841562, -898658, -932697, -1000466, -1058156, -1101176, -1141244, -1203792, -1255614, -1285184, -1354580, -1391943, -1443766, -1474647, -1536370, -1569356, -1624255, -1660265, -1714948, -1723959, -1772547, -1813105, -1853524, -1894783, -1915761, -1968138, -2015421, -2053769, -2068674, -2102708, -2142742, -2159235, -2197599, -2227575, -2245932, -2284123, -2303822, -2336902, -2375962, -2402638, -2411145, -2444905, -2454550, -2492430, -2513079, -2520686, -2563421, -2567378, -2582943, -2617215, -2642363, -2660465, -2694974, -2698235, -2706767, -2735247, -2763123, -2762986, -2779642, -2802421, -2809678, -2819265, -2838154, -2850199, -2865842, -2863418, -2876830, -2891462, -2906701, -2907761, -2929482, -2918083, -2951289, -2933991, -2955949, -2960757, -2968981, -2982164, -2964847, -2985985, -2978891, -2971170, -2981193, -2993875, -2999352, -3002988, -2980230, -3004881]
5359c004881Q691k2201K2909j093O921M514l157J3046p838M832O809Q926J5771
5346b946751j0787J7599j2335J4906J6490K4124P521n592K5321L800J3120n798
5334b858382L5627K1177m628J0072L7990m131L1325J5199L705J8532K4125Q219
5322b661170K3063J8641M8422L249J4908L2566k974L1620M0984J9286K2620M2003
5310b366782P15L3132K5138L3736L4381J6541K7149K1622N6391J9970K6212M9262
5298b022533K4595L9726K5774L1745M9171L7029N9657L1206K7290N0480M4292
5287a601568L9877O0540J7348P7033M1736L3183O7883P7925L7421O4425M8855
5276a035342P8929N9408P3322N9509O2173Q1517Q1158J01617O7857P7362Q9188
$$ y = [-3004881, -2996190, -3018391, -2995482, -2996575, -2989654, -2985140, -2988297, -2975251, -2983089, -2978257, -2971448, -2962522, -2946751, -2957538, -2939939, -2952274, -2937368, -2920878, -2896754, -2889233, -2894825, -2869504, -2865704, -2852584, -2858382, -2822755, -2801578, -2806206, -2796134, -2758144, -2762275, -2730950, -2715751, -2712046, -2693514, -2669389, -2661170, -2638107, -2619466, -2571044, -2567795, -2552887, -2520321, -2523295, -2491675, -2450691, -2431405, -2408785, -2366782, -2366067, -2332935, -2307797, -2274061, -2239680, -2223139, -2195990, -2174368, -2117977, -2098007, -2071795, -2022533, -1997938, -1958212, -1932438, -1900693, -1851522, -1814493, -1754836, -1723630, -1696340, -1645860, -1601568, -1561691, -1501151, -1483803, -1406770, -1365034, -1331851, -1263968, -1186043, -1148622, -1084197, -1035342, -956413, -897005, -823683, -764174, -702001, -620484, -539326, -437709, -369852, -292490, -203302]
5265b03302J08813Q5302J12161J08532R7532J10732J14991J22718J21722J33803
5255I13004J40663J46503J33969J51981J70164J70275J77040J74332J95379K09589
5245B582899K25079K12042K31886K32202K59404K47941L00794L04840K96154L47222
5235E240463L25948L63138L84435L93603M13550M44928M59411M79256M98923N04950
5225I508605N49692N43451N68716N82960O00216O11557O28179N95955O39830O15436
5215A5444597O44480O37482O39422O53708O50029O66545O86452O94334P38011
5206B1455060P36699P57971P86174Q16419Q29503Q73117Q67675R01215Q92109
5197B8915942Q87821Q81554Q63294Q33155Q29500P84722P20876O79384O21115
$$ y = [-203302, -94489, -9187, 102974, 211506, 309038, 419770, 534761, 657479, 779201, 913004, 1053667, 1200170, 1334139, 1486120, 1656284, 1826559, 2003599, 2177931, 2373310, 2582899, 2807978, 3020020, 3251906, 3484108, 3743512, 3991453, 4292247, 4597087, 4893241, 5240463, 5566411, 5929549, 6313984, 6707587, 7121137, 7566065, 8025476, 8504732, 9003655, 9508605, 10058297, 10601748, 11170464, 11753424, 12353640, 12965197, 13593376, 14189331, 14829161, 15444597, 16089077, 16726559, 17365981, 18019689, 18669718, 19336263, 20022715, 20717049, 21455060, 22191759, 22949730, 23735904, 24552323, 25381826, 26254943, 27122618, 28023833, 28915942, 29803763, 30685317, 31548611, 32381766, 33211266, 33995988, 34716864, 35396248, 36017363]
5188C6017363N42524N25947M65553M32147L77689L43213L43034L15688L14489
5179C9677647K83848K82446K89239K73027K49871K30832K05673J83704J56274
5170D1832561J10008P0267K3631m7354j05583j74167k37474k94035l78044m23462
5160D0376348m58445n05468n37017n45126n76193o11012o02411o05005o12236
5151C5323435o17777o11844o28730o42451o34739o21671o12564o31964o08905
5142B9712790o08425o30209o28820o09022o06542o16505n88869n84021o08834
5133B4231543n75010n59609n31575n42291m97597m91242m58028m50770m25645
5124A9699776l89662l60667l48613l24688l04661k55201k42421k16852j91607
$$ y = [36017363, 36559887, 37085834, 37551387, 37983534, 38361223, 38704436, 39047470, 39363158, 39677647, 39961495, 40243941, 40533180, 40806207, 41056078, 41286910, 41492583, 41676287, 41832561, 41942569, 42012836, 42036467, 41989113, 41883530, 41709363, 41471889, 41177854, 40799810, 40376348, 39917903, 39412435, 38875418, 38330292, 37754099, 37143087, 36540676, 35935671, 35323435, 34705658, 34093814, 33465084, 32822633, 32187894, 31566223, 30953659, 30321695, 29712790, 29104365, 28474156, 27845336, 27236314, 26629772, 26013267, 25424398, 24840377, 24231543, 23656533, 23096924, 22565349, 22023058, 21525461, 21034219, 20576191, 20125421, 19699776, 19310114, 18949447, 18600834, 18276146, 17971485, 17716284, 17473863, 17257011, 17065404]
5115A7065404j36400j53178j17449q6146n8971l6871l6142K5941L1853L7988J05376
5104A6641405Q2868J21532J59450J67763J80402J95529K60209K38198K82566K95947
5094A8625869L07533L37057L70703L64522M16452M00882M39397M37542M75716
5085B2175673M88732M70744N16995N14087N24215N31731N51054N03633N72791
5076B6849655N39485N54514N38551N41442N39738N69040N27339N52005N67131
5067C1778900N61997N57273N88877N71671N94916N93890O10471O29084O20385
5058C7107464O46680O33144O92512O34412O57913O54581O67838O59330O12635
5049D2966509O42376N85390N74948N54212N21509N21966M84031M50072M40967
$$ y = [17065404, 16929004, 16775826, 16658377, 16572231, 16513260, 16476389, 16440247, 16466188, 16498041, 16536029, 16641405, 16724273, 16845805, 17005255, 17173018, 17353420, 17548949, 17809158, 18047356, 18329922, 18625869, 18933402, 19270459, 19641162, 20005684, 20422136, 20823018, 21262415, 21699957, 22175673, 22664405, 23135149, 23652144, 24166231, 24690446, 25222177, 25773231, 26276864, 26849655, 27389140, 27943654, 28482205, 29023647, 29563385, 30132425, 30659764, 31211769, 31778900, 32340897, 32898170, 33487047, 34058718, 34653634, 35247524, 35857995, 36487079, 37107464, 37754144, 38387288, 39079800, 39714212, 40372125, 41026706, 41694544, 42353874, 42966509, 43608885, 44194275, 44769223, 45323435, 45844944, 46366910, 46850941, 47301013, 47741980]
5040D7741980L98364L97289L52444L75993L32704L62805L49423L55033L66254
5031E1032289L81143L74110M10622M23823M41468M64746M84085N04064N50624
5022E5066974N09435N67075N56690N91985N94893N90741O10817N93246O01988
5013F0283844N87252N90786N92276N78054N71790N63677N53361N52026N37064
5004F5410130N45208N17382N33012N35353N14441N16679N17125N11154M95181
4995G0095665M83206M66662M51487M45379M24443L97461L45369L22846K82320
4986G3714838K47668J77432J22488O5262J0816k9450j12110j91592k25314l25903
4976G3454135l45790m49382m62311n29349n65745o04519o78545o79360p13539
$$ y = [47741980, 48140344, 48537633, 48890077, 49266070, 49598774, 49961579, 50311002, 50666035, 51032289, 51413432, 51787542, 52198164, 52621987, 53063455, 53528201, 54012286, 54516350, 55066974, 55576409, 56143484, 56700174, 57292159, 57887052, 58477793, 59088610, 59681856, 60283844, 60871096, 61461882, 62054158, 62632212, 63204002, 63767679, 64321040, 64873066, 65410130, 65955338, 66472720, 67005732, 67541085, 68055526, 68572205, 69089330, 69600484, 70095665, 70578871, 71045533, 71497020, 71942399, 72366842, 72764303, 73109672, 73432518, 73714838, 73962506, 74139938, 74262426, 74327688, 74338504, 74309054, 74196944, 74005352, 73780038, 73454135, 73108345, 72658963, 72196652, 71667303, 71101558, 70497039, 69818494, 69139134, 68425595]
4967F8425595p44466p96351p85456q12584q21004q48618q67135q81063r13934
4958F0954984r00969r29807r51286r47290r67852r90976r92248j025403j009099
4949E2240054j002116j033753j033400j040615j026261j014332r83862r96047
4941D4109668r82705r59684r53873r09646r06649q59336q68404q32130p96533
4932C6040708p79482p39411p11188o98990o55081o51119o08247n78547n36318
4923C0082325n45319n04138m74065m72698m46840l73038m02852l42104l40135
4914B6181136l14154k96912k74637k35927k24727k28253j83652j63566j83288
4905B4076020j50384j19429j40205j03944j16964q9337q2660p6340o6618o8236
$$ y = [68425595, 67681129, 66884778, 66099322, 65286738, 64465734, 63617116, 62749981, 61868918, 60954984, 60054015, 59124208, 58172922, 57225632, 56257780, 55266804, 54274556, 53249153, 52240054, 51237938, 50204185, 49170785, 48130170, 47103909, 46089577, 45105715, 44109668, 43126963, 42167279, 41213406, 40303760, 39397111, 38537775, 37669371, 36837241, 36040708, 35261226, 34521815, 33810627, 33111637, 32456556, 31805437, 31197190, 30618643, 30082325, 29537006, 29032868, 28558803, 28086105, 27639265, 27266227, 26863375, 26521271, 26181136, 25866982, 25570070, 25295433, 25059506, 24834779, 24606526, 24422874, 24259308, 24076020, 23925636, 23806207, 23666002, 23562058, 23445094, 23355757, 23273097, 23196757, 23130139, 23061903]
4895B3061903k2600j1478l9054N570K5675M4817L8167O6906Q2551J01100J29200
4884B3482757J19640J40956J52307J88084J83699J95827K15201K11849K56526
4875B5146846K26272K57239K55790K62554K98795K70172L06969K64004L18630
4866B7607271K89702K82438L18583L21273K87738L24995K77266L03959L02706
4857C0315931K80509L19216K56817K68898K54723K62787K25028K13249K15471
4848C2612629J73041J64167J14694J28896Q0315N1430N6320O108l0909n4435p4432
4837C3227824j16514j57844j89468j95251k41820k65409l07784l12077l18477
4828C1123180l78458l57587m20931m31403m43311m47596m72085n01067m92190
$$ y = [23061903, 23039303, 23027825, 22988771, 22994341, 23020016, 23064833, 23103000, 23169906, 23252457, 23353557, 23482757, 23602397, 23743353, 23895660, 24083744, 24267443, 24463270, 24678471, 24890320, 25146846, 25373118, 25630357, 25886147, 26148701, 26447496, 26717668, 27024637, 27288641, 27607271, 27896973, 28179411, 28497994, 28819267, 29107005, 29432000, 29709266, 30013225, 30315931, 30596440, 30915656, 31172473, 31441371, 31696094, 31958881, 32183909, 32397158, 32612629, 32785670, 32949837, 33064531, 33193427, 33273742, 33325172, 33381492, 33387600, 33356691, 33302256, 33227824, 33111310, 32953466, 32763998, 32568747, 32326927, 32061518, 31753734, 31441657, 31123180, 30744722, 30387135, 29966204, 29534801, 29091490, 28643894, 28171809, 27670742, 27178552]
4819B7178552n29131n03947n57784n25652n43564n75874n63984n72888n67599
4810B2238129n70509n59394n96405n54723n89178n59128n56785n35466n66204
4801A7150337n37893n33804n23604n27488m86585m76972m96240m67324m71959
4792A2628468m25592m58113m13731m10204l89892l94591l80507l67062l47643
4783I041133l65445l41473l42036l00803l33507l08973k82804k92002k72465k43448
4773E958177k83663k29879k59283k28534k45025k01098k31596j96939k21448j97182
4763C663530j84243j95378j91679j69310j70948j62557j65597j55993j55895j54952
4753A956978j30484j51849j55426j27913j21677j53693j14491j18664j45814r5001
$$ y = [27178552, 26649421, 26145474, 25587690, 25062038, 24518474, 23942600, 23378616, 22805728, 22238129, 21667620, 21108226, 20511821, 19957098, 19367920, 18808792, 18252007, 17716541, 17150337, 16612444, 16078640, 15555036, 15027548, 14540963, 14063991, 13567751, 13100427, 12628468, 12202876, 11744763, 11331032, 10920828, 10530936, 10136345, 9755838, 9388776, 9041133, 8675688, 8334215, 7992179, 7691376, 7357869, 7048896, 6766092, 6474090, 6201625, 5958177, 5674514, 5444635, 5185352, 4956818, 4711793, 4510695, 4279099, 4082160, 3860712, 3663530, 3479287, 3283909, 3092230, 2922920, 2751972, 2589415, 2423818, 2267825, 2111930, 1956978, 1826494, 1674645, 1519219, 1391306, 1269629, 1115936, 1001445, 882781, 736967, 641966]
4743F41966j12111j10047j13519j03500j10491j02900j03920r9955r9506q9384
4733d03367q6917r1148p4113q4451p2173j12870p3884q0053p7635p5148p2648
4722a304407n2006q9326p2294q2637n6639p5532p2120n7743m4141r4944m6622
4711b048411p3073o1459m6688p0470n7085n1751m2310p4052m9152l9833n7133
4700b671417m4950n4519l9270m0705p1101l7820k9802n1333l7246m7928k5939
4689c152030m3782k1070o4080l8566m5219k4071m8688k9703l3209k9745m5756
4678c575919l2184k9182l8639j9844o5201j3666j7015l6817j8881m7402k6291
4667c921041j6510k2114l8551l5081k454n1758o527l5527p441l5324p218l6161
$$ y = [641966, 529855, 419808, 306289, 202789, 92298, -10602, -114522, -214477, -313983, -403367, -490284, -581432, -655545, -739996, -812169, -925039, -998923, -1078976, -1156611, -1231759, -1304407, -1356413, -1445739, -1518033, -1600670, -1657309, -1732841, -1804961, -1862704, -1906845, -2001789, -2048411, -2121484, -2182943, -2229631, -2300101, -2357186, -2408937, -2451247, -2525299, -2574451, -2614284, -2671417, -2716367, -2770886, -2810156, -2850861, -2921962, -2959782, -2989584, -3040917, -3078163, -3126091, -3152030, -3195812, -3216882, -3280962, -3319528, -3364747, -3388818, -3437506, -3467209, -3500418, -3530163, -3575919, -3608103, -3637285, -3675924, -3695768, -3760969, -3774635, -3791650, -3828467, -3847348, -3894750, -3921041, -3937551, -3959665, -3998216, -4033297, -4035751, -4087509, -4094036, -4129563, -4137004, -4172328, -4179546, -4215707]
4655d215707k9358p390l1452l1578j7689k4968j2812j8577j5821j3448l4660n604
4643d459064l7878O870l6783j0730j8872j0671k4868l2620o940j0771o99j4427
4631d657453j5284p099k6930k9344J3531j4324l524k2142n980k3294j220j8337
4619d811400P227j8761r155k2396p180p001P47j2741k2934J9190k3713j055p641
4606d916813j503r630j1262n357k63L513j8695j401R671j4895j0042N352j2892
4593d984217O093r011j2556k081O114o321M248k968r567P3R144P509o103k244
4579e001887j5762M920q230o667J170P467k373N684k4979K8902m485r967R01n181
4565e030487j95p253n148J6164n250O741J084J8713k1276K1059N231J7832M910
$$ y = [-4215707, -4245065, -4252455, -4283907, -4315485, -4333174, -4358142, -4370954, -4389531, -4405352, -4418800, -4453460, -4459064, -4496942, -4490072, -4526855, -4537585, -4556457, -4567128, -4591996, -4624616, -4631556, -4642327, -4643026, -4657453, -4672737, -4679836, -4706766, -4736110, -4722579, -4736903, -4740427, -4762569, -4768549, -4791843, -4793063, -4811400, -4804173, -4822934, -4832089, -4854485, -4861665, -4868666, -4867919, -4880660, -4903594, -4884404, -4908117, -4909172, -4916813, -4918316, -4927946, -4939208, -4944565, -4944828, -4941315, -4960010, -4961411, -4951740, -4966635, -4976677, -4971325, -4984217, -4978124, -4987135, -4999691, -5001772, -4995658, -5001979, -4997731, -5000699, -5010266, -5010193, -5001049, -4993540, -4999643, -5001887, -5017649, -5012729, -5020959, -5027626, -5026456, -5018989, -5021362, -5015678, -5040657, -5011755, -5016240, -5026207, -5025306, -5030487, -5030682, -5037935, -5043083, -5026919, -5032169, -5025428, -5024344, -5005631, -5026907, -5005848, -5000617, -4982785, -4977875]
4552d977875j0917J6167j4824L2860P298J638n602J3840O029O061P825K6427P121
4539d883952L944K745L4023l1552M1935O642K1503J5130K5467N714K3898J9603
4527d714900K370L1373N338K9709M9488J296L7286L7582L1830K7151L7020M5107
4515d379350M6225N2237K8307L1182L5880R852n741J5835k049R236K6510j033
4503d132909M472L9008J8061L1105L3171M0161J9189M0453K3574M9042M9842L2964
4491c751867N5945L6844N5971M2302N0040O0793N3064M8542P3405N3188N8069
4480c163704O4836N8327R7895P6766O3276Q0036O8208Q5194R0732Q0293R5204
4469b302937R5715J14159R2883J04312J37184R0646J37972J06550J51688J14619
$$ y = [-4977875, -4988792, -4972625, -4987449, -4954589, -4947291, -4945653, -4951255, -4937415, -4931386, -4925325, -4917500, -4891073, -4883952, -4880008, -4877263, -4843240, -4874792, -4832857, -4826215, -4804712, -4789582, -4764115, -4758401, -4734503, -4714900, -4712530, -4681157, -4675819, -4646110, -4596622, -4595326, -4558040, -4520458, -4488628, -4461477, -4424457, -4379350, -4333125, -4280888, -4252581, -4221399, -4185519, -4175667, -4181408, -4165573, -4167622, -4158386, -4131876, -4132909, -4128437, -4089429, -4071368, -4040263, -4007092, -3966931, -3947742, -3907289, -3883715, -3834673, -3784831, -3751867, -3695922, -3659078, -3603107, -3560805, -3510765, -3449972, -3396908, -3348366, -3274961, -3221773, -3163704, -3098868, -3040541, -2942646, -2865880, -2802604, -2722568, -2654360, -2569166, -2478434, -2398141, -2302937, -2207222, -2093063, -2000180, -1895868, -1758684, -1668038, -1530066, -1423516, -1271828, -1157209]
4459a157209J38531J64252J42796J54307J73912J60354J82015J70783J86262J98826
4449E14829K09005K16926J98609K47767K36048K49723K62804K54271K65141K93823
4439B948946K88127L11695L08908L08747L29062L34519L40919L44721L42093L50384
4429F208121L40771L68130L79268L55545L72695L42422L60197L65663L58649L55459
4419I806920L78619L72025L76261L87711L95763L78778M06809L90281M13430M05417
4409A3712014M19041M17640M14687L84684M14815M13135L64210L89348L73253
4400A7302827L44832L40257L28678L20464K86696L13714K68200K41567K55016
4391B0002251K44546K40060K19058K15558K02442K05292J96316J91118J86302
$$ y = [-1157209, -1018678, -854426, -711630, -557323, -383411, -223057, -41042, 129741, 316003, 514829, 723834, 940760, 1139369, 1387136, 1623184, 1872907, 2135711, 2389982, 2655123, 2948946, 3237073, 3548768, 3857676, 4166423, 4495485, 4830004, 5170923, 5515644, 5857737, 6208121, 6548892, 6917022, 7296290, 7651835, 8024530, 8366952, 8727149, 9092812, 9451461, 9806920, 10185539, 10557564, 10933825, 11321536, 11717299, 12096077, 12502886, 12893167, 13306597, 13712014, 14131055, 14548695, 14963382, 15348066, 15762881, 16176016, 16540226, 16929574, 17302827, 17647659, 17987916, 18316594, 18637058, 18923754, 19237468, 19505668, 19747235, 20002251, 20246797, 20486857, 20705915, 20921473, 21123915, 21329207, 21525523, 21716641, 21902943]
4382B1902943J84017J77664J70975J44225J61764J31567J22612J20321P8830Q0104
4372B3275022M0312M0066J9633j4622m2543n6118o0403j01284j15567j29852j37457
4361B2717187j62176j71321j97669j69291j98069k08211j89267k30083k10137
4352B0980963k07128k35837k24361k32153k28019k45201k31357k48511k59369
4343A8869027k60694k67864k76621k96719l16646l14402l10480l35454l35163
4334A6154984l29924l66066l67466l55760l63373l62550l75258l42589l61012
4325A2930986l75796l52221l36221l44237l24675l38028l13286l05991l06908
4316I933623k72140k93583k89027k76020k57731k59065k68706k46724k49345k66973
$$ y = [21902943, 22086960, 22264624, 22435599, 22579824, 22741588, 22873155, 22995767, 23116088, 23194918, 23275022, 23315334, 23355400, 23375033, 23360411, 23317868, 23261750, 23201347, 23100063, 22984496, 22854644, 22717187, 22555011, 22383690, 22186021, 22016730, 21818661, 21610450, 21421183, 21191100, 20980963, 20773835, 20537998, 20313637, 20081484, 19853465, 19608264, 19376907, 19128396, 18869027, 18608333, 18340469, 18063848, 17767129, 17450483, 17136081, 16825601, 16490147, 16154984, 15825060, 15458994, 15091528, 14735768, 14372395, 14009845, 13634587, 13291998, 12930986, 12555190, 12202969, 11866748, 11522511, 11197836, 10859808, 10546522, 10240531, 9933623, 9661483, 9367900, 9078873, 8802853, 8545122, 8286057, 8017351, 7770627, 7521282, 7254309]
4306G254309k32785k56535k52512k20923k28123k59637k09788k27376k11532k25221
4296D929877j84709j97367k02258j70607j86327j59659j47916j55906j34750j23387
4286C266991j35464j41451j15720r8860r4597q7358r5611p6876o8420n9625o4224
4275B228785m6871l7147n5740k6115m4261j4877j9402k8687M159M465P902o190
4263A966021L078L3373J6636L8520K3481M9707O0393L7381N5377O1528P3222R2511
4251B511228Q6380Q9375J09377J01342J15753J23367J36903J48500J45193J68155
4241C735573J98894J73904J71061K29580J98546K46187K53457K49692K74756K84666
4231F016316K93155L24935L28386L31056L52754L63873L72431L99659L79714L82554
$$ y = [7254309, 7021524, 6764989, 6512477, 6291554, 6063431, 5803794, 5594006, 5366630, 5155098, 4929877, 4745168, 4547801, 4345543, 4174936, 3988609, 3828950, 3681034, 3525128, 3390378, 3266991, 3131527, 2990076, 2874356, 2775496, 2680899, 2593541, 2497930, 2421054, 2352634, 2293009, 2228785, 2181914, 2144767, 2089027, 2062912, 2018651, 2003774, 1984372, 1955685, 1959844, 1964309, 1972211, 1966021, 1969099, 2002472, 2019108, 2057628, 2081109, 2130816, 2191209, 2228590, 2283967, 2345495, 2418717, 2511228, 2597608, 2686983, 2796360, 2897702, 3013455, 3136822, 3273725, 3422225, 3567418, 3735573, 3934467, 4108371, 4279432, 4509012, 4707558, 4953745, 5207202, 5456894, 5731650, 6016316, 6309471, 6634406, 6962792, 7293848, 7646602, 8010475, 8382906, 8782565, 9162279, 9544833]
4221I544833M43218M18424M33424M38836M45054M83514M74904M84168N10790N13834
4211A4190999N25435N27399N34932N62873N36653N74598N76479N78569O08326
4202A9216263O08735O08445O29043O15662O71217O34693O87653O96938O77499
4193B5046148O98471P00469P29069P31069P38268P33985P41486P30418P31172
4184C1580555P34146P17426P23225P00514P33102P04623P07489P35621P23775
4175C8060476P39753P61428P66621Q06374P86521Q23705Q49234Q46949Q71220
4166D5312281Q85284Q78728Q74974Q87604Q77752Q67004Q33013Q21983P63636
4157E3002259P49828P11400O66223O26986N59288N39911N02015M27243M00535
$$ y = [9544833, 9988051, 10406475, 10839899, 11278735, 11723789, 12207303, 12682207, 13166375, 13677165, 14190999, 14716434, 15243833, 15778765, 16341638, 16878291, 17452889, 18029368, 18607937, 19216263, 19824998, 20433443, 21062486, 21678148, 22349365, 22984058, 23671711, 24368649, 25046148, 25744619, 26445088, 27174157, 27905226, 28643494, 29377479, 30118965, 30849383, 31580555, 32314701, 33032127, 33755352, 34455866, 35188968, 35893591, 36601080, 37336701, 38060476, 38800229, 39561657, 40328278, 41134652, 41921173, 42744878, 43594112, 44441061, 45312281, 46197565, 47076293, 47951267, 48838871, 49716623, 50583627, 51416640, 52238623, 53002259, 53752087, 54463487, 55129710, 55756696, 56315984, 56855895, 57357910, 57785153, 58185688]
4148E8185688L64932L18205K76326K32535K16235J60844J49998J04059P7674O6061
4138F0152557J2201m525o7372q2587j05713j82335j96246k48522l03544l47492
4128E8626422l82241m43541m90989n34777n99101n90363o61249o90563p11469
4119E3522129p29510p30771p68785p52629p58254p58201p31595p23730p30588
4110D6838066o79143o81301o49420o47475n87333o05789n86671n66454n68405
4101D1266075n44414n56195n24728n61058n43924n77610n51546n72071n95928
4092C6238601n76897n84481n66049n60944n47168n31505n31830n04115m80778
4083C1354834m72359m55457m43334m14104m11314l84755m07305l76346l65796
$$ y = [58185688, 58550620, 58868825, 59145151, 59377686, 59593921, 59754765, 59904763, 60008822, 60086496, 60152557, 60164758, 60160233, 60092861, 60010274, 59904561, 59722226, 59525980, 59277458, 58973914, 58626422, 58244181, 57800640, 57309651, 56774874, 56175773, 55585410, 54924161, 54233598, 53522129, 52792619, 52061848, 51293063, 50540434, 49782180, 49023979, 48292384, 47568654, 46838066, 46158923, 45477622, 44828202, 44180727, 43593394, 42987605, 42400934, 41834480, 41266075, 40721661, 40165466, 39640738, 39079680, 38535756, 37958146, 37406600, 36834529, 36238601, 35661704, 35077223, 34511174, 33950230, 33403062, 32871557, 32339727, 31835612, 31354834, 30882475, 30427018, 29983684, 29569580, 29158266, 28773511, 28366206, 27989860, 27624064]
4074B7624064l70043l51241l38522l16394l35654l07530k89944k84962k73211
4065B4756563k34348k31536k31697j77659j99886j62651j29676j44359q7824j16247
4055B3040680q5623l2452n6317j1884l5506L0514K8821N0411O1151R8874J10808
4044B3199477J22830J44612J81549J72286J97346J95002K11680K38767K34219
4035B4897768K51934K54900K49635K89986K78290K70676K77744K96792K90446
4026B7358171K78966L00615L10116K95209K93192L26177L08046L11997L05225
4017C0087714L17912L06352L29209L16592K98789L33149L03042L37880L08672
4008C2939311L03745K81168K95079K95552K52639K79612K60680K50293K42921
$$ y = [27624064, 27254021, 26902780, 26564258, 26247864, 25912210, 25604680, 25314736, 25029774, 24756563, 24522215, 24290679, 24058982, 23881323, 23681437, 23518786, 23389110, 23244751, 23156927, 23040680, 22955057, 22922605, 22866288, 22854404, 22818898, 22849412, 22878233, 22928644, 22989795, 23088669, 23199477, 23322307, 23466919, 23648468, 23820754, 24018100, 24213102, 24424782, 24663549, 24897768, 25149702, 25404602, 25654237, 25944223, 26222513, 26493189, 26770933, 27067725, 27358171, 27637137, 27937752, 28247868, 28543077, 28836269, 29162446, 29470492, 29782489, 30087714, 30405626, 30711978, 31041187, 31357779, 31656568, 31989717, 32292759, 32630639, 32939311, 33243056, 33524224, 33819303, 34114855, 34367494, 34647106, 34907786, 35158079, 35401000]
3999C5401000K29056K25711K26560K01443J92103K32553J79055J94519J79661
3990C7261661K06912K09061K18832J97838K05563K21565K10012K41614K23670
3981C9196728K37688K54504K41328K44625K80686K55471K68782K79362K79378
3972D1538552K83016K79646L07185K92450L19526L17725L52579L41673L46045
3963D4378397L90480L53164L96195L86742L99258L91528M04159L47215M00922
3954D7848060L55685L62712L53418L42859L59774L50040L50938L28780L69882
3945E1022148L18893L70979L49010L51291L46649L32465L37332L49759L33020
3936E4111546L12378K86237K76967K82829K52021K22569K10081J71236J60116
$$ y = [35401000, 35630056, 35855767, 36082327, 36283770, 36475873, 36708426, 36887481, 37082000, 37261661, 37468573, 37677634, 37896466, 38094304, 38299867, 38521432, 38731444, 38973058, 39196728, 39434416, 39688920, 39930248, 40174873, 40455559, 40711030, 40979812, 41259174, 41538552, 41821568, 42101214, 42408399, 42700849, 43020375, 43338100, 43690679, 44032352, 44378397, 44768877, 45122041, 45518236, 45904978, 46304236, 46695764, 47099923, 47447138, 47848060, 48203745, 48566457, 48919875, 49262734, 49622508, 49972548, 50323486, 50652266, 51022148, 51341041, 51712020, 52061030, 52412321, 52758970, 53091435, 53428767, 53778526, 54111546, 54423924, 54710161, 54987128, 55269957, 55521978, 55744547, 55954628, 56125864, 56285980]
3927E6285980J16759J08779J14181J01327P2561Q6021P5751Q6702J07245J06653
3917E7261959R5306J10687R9974J01352J06123R0498R7580P7362Q0749Q0715P1865
3906E8274170O6248P5530P3131M6787P8984O8503Q3110O3742P4659R2055J09065
3895E9105984J01335J39129J12139J34130J49366K12578K64598L36836M08483
3886F0964578M81758N56617O45881P49122Q41745R31795J038093J157173J302177
3877F8668939J405751J570993J736998J881948K075495K277209K488231K753671
3869H4859235K973192L277156L583206L949548M325261M752761N226194N744374
3861A18690927O328850O893612P550757Q227963Q896567R584332J0247185J0899542
$$ y = [56285980, 56402739, 56511518, 56625699, 56727026, 56799587, 56885608, 56961359, 57048061, 57155306, 57261959, 57357265, 57467952, 57567926, 57669278, 57775401, 57865899, 57963479, 58040841, 58121590, 58202305, 58274170, 58340418, 58415948, 58489079, 58535866, 58614850, 58683353, 58766463, 58830205, 58904864, 58996919, 59105984, 59207319, 59346448, 59458587, 59592717, 59742083, 59954661, 60219259, 60556095, 60964578, 61446336, 62002953, 62648834, 63397956, 64239701, 65171496, 66209589, 67366762, 68668939, 70074690, 71645683, 73382681, 75264629, 77340124, 79617333, 82105564, 84859235, 87832427, 91109583, 94692789, 98642337, 102967598, 107720359, 112946553, 118690927, 125019777, 131913389, 139464146, 147692109, 156588676, 166173008, 176420193, 187319735]
3853A87319735J1444115J1896749J2078514J1987957J1471913J0349593Q684223
3846B65232799O488718M184840K113007O17820j94646m13068j95689K06892O97609
3837B78738282J184446J466406J691444J679593J466026J055046M41608m13009
3829B87309842j392714k470274l608503m781940n845896o853398p718135q358516
3821B46280466q902026r219904r375987r450861r354312r176567q918100q648191
3813A73234518q283891p954066p580145p205994o831295o470733o127503n788594
3805A16992297n448837n149952m877916m584731m332056m082823l821325l636965
3797H1057692l411271l227534l053094k863650k718815k565455k423815k274805
$$ y = [187319735, 198763850, 210660599, 222739113, 234727070, 246198983, 256548576, 265232799, 271721517, 275906357, 278019364, 278637184, 278442538, 278029470, 277833781, 278040673, 278738282, 279922728, 281389134, 283080578, 284760171, 286226197, 287281243, 287722851, 287309842, 285917128, 283446854, 279838351, 275056411, 269210515, 262357117, 254638982, 246280466, 237378440, 228158536, 218782549, 209331688, 199977376, 190800809, 181882709, 173234518, 164950627, 156996561, 149416416, 142210422, 135379127, 128908394, 122780891, 116992297, 111543460, 106393508, 101515592, 96930861, 92598805, 88515982, 84694657, 81057692, 77646421, 74418887, 71365793, 68502143, 65783328, 63217873, 60794058, 58519253]
3789E8519253k158372k046011j956524j841984j721101j649752j548209j503279
3781D4094021j406290j339995j278775j197010j173986j091399j049764r76963
3773C4579839r56834r13109q41977q13860p99104p09416p20355o55655n98240
3764B7571289n98161n86070n00385n15074m57148m35217m16966l73282l60539
3755B3328447l17817k84475k74363k28472j89711j59013j49351p1993n7714k7189
3745B1568349K3074O5326P2969J07530J35634J29222J57047J36379J13122N8030
3735B2566682K845l9343j62038k29788k60987l03704k70455k15460j14844m742
3725B0968166R9918K33598L77649N00988O25485P73694R42510J074742J239670
$$ y = [58519253, 56360881, 54314870, 52358346, 50516362, 48795261, 47145509, 45597300, 44094021, 42687731, 41347736, 40068961, 38871951, 37697965, 36606566, 35556802, 34579839, 33623005, 32709896, 31867919, 31054059, 30254955, 29545539, 28825184, 28169529, 27571289, 26973128, 26387058, 25886673, 25371599, 24914451, 24479234, 24062268, 23688986, 23328447, 23010630, 22726155, 22451792, 22223320, 22033609, 21874596, 21725245, 21653252, 21595538, 21568349, 21591423, 21656749, 21729718, 21837248, 21972882, 22102104, 22259151, 22395530, 22508652, 22566682, 22569527, 22530184, 22368146, 22138358, 21877371, 21573667, 21303212, 21087752, 20972908, 20968166, 21068084, 21301682, 21679331, 22180319, 22805804, 23579498, 24522008, 25596750, 26836420]
3716B6836420J374932J467159J492535J342116Q62231q087j033675j950179k378948
3707B8004504k448522k283003k054268j788697j531621j365168j210267j045249
3699A4277709r59669q77397p65241p08889o49492o20883n46613n21967m84035
3690H143523m42237m10339l81222l69997l48035l19014l10056l03571k43937k70700
3680D744415k74724k14197k25473k07616j89798j83497j69758j61084j43435j28363
3670B846470j42525j29889j27471j10384j18616j21460j29896j31742j61404j49214
3660A523869j14026j39113j45398j11233j34885j00224j15007j06830j11083r0257
3650C55813j11436o3688r4411q6515p6668q5293n6953r1066n1755o1354p8095
$$ y = [26836420, 28211352, 29678511, 31171046, 32513162, 33375393, 33367306, 32333631, 30383452, 28004504, 25555982, 23272979, 21218711, 19430014, 17898393, 16533225, 15322958, 14277709, 13318040, 12440643, 11675402, 10966513, 10317021, 9696138, 9149525, 8627558, 8143523, 7701286, 7290947, 6909725, 6539728, 6191693, 5872679, 5562623, 5259052, 5015115, 4744415, 4469691, 4255494, 4030021, 3822405, 3632607, 3449110, 3279352, 3118268, 2974833, 2846470, 2703945, 2574056, 2446585, 2336201, 2217585, 2096125, 1966229, 1834487, 1673083, 1523869, 1409843, 1270730, 1125332, 1014099, 879214, 778990, 663983, 557153, 446070, 355813, 244377, 180689, 86278, -237, -76905, -162198, -219151, -310217, -361972, -423326, -501421]
3639e01421o9624r9471q7063r4955p3575r0501q5719q2959p1617q5968l5474n8718
3627a437065p3918p1232k7467n4184m4282m5298m4905m7978l4051l6983j5613
3616a932976n6468k7709k5089n080k0157l8338q052Q81j0431r74J0794j4757K3385
3603b104971J4918J8789J9840O529L5122J9477J8237J0874P272N60K041l0377
3591a981689k4634l5810k9483j5400k7327l5639l7074J2725l6274k4846l0920
3580b266371j9947l5034k6339n4812j1171n1269n1755n6754n5859n4452n6594
3569b740357p6693n1128o6127p5833p1619p0278n9996o8488p0809n6207n8203
3558c465738l9145n7752n1505n2200m0773l4873m9168j2414n3227m2466n0003
$$ y = [-501421, -571045, -670516, -757579, -852534, -926109, -1016610, -1102329, -1185288, -1256905, -1342873, -1378347, -1437065, -1510983, -1582215, -1609682, -1663866, -1708148, -1753446, -1798351, -1846329, -1880380, -1917363, -1932976, -1989444, -2017153, -2042242, -2047322, -2067479, -2105817, -2113869, -2112988, -2123419, -2124393, -2113599, -2128356, -2104971, -2090053, -2071264, -2051424, -2044895, -2009773, -1990296, -1972059, -1961185, -1953913, -1953353, -1951312, -1981689, -2006323, -2042133, -2071616, -2087016, -2114343, -2149982, -2187056, -2174331, -2210605, -2235451, -2266371, -2286318, -2321352, -2347691, -2402503, -2413674, -2464943, -2516698, -2573452, -2629311, -2683763, -2740357, -2817050, -2868178, -2934305, -3010138, -3081757, -3152035, -3212031, -3280519, -3351328, -3407535, -3465738, -3504883, -3562635, -3614140, -3666340, -3707113, -3741986, -3791154, -3803568, -3856795, -3899261, -3949264]
3547c949264j4491k6181m9222l1359k3039k0289m8252q595k0234l5684k7829J0714
3535d243725m8245j9170k2975j7722n260k4738k9703k366j4227j5849j9335j2152
3523d475467j5066j6167p38j8713k3838j0429n037M074k0346k147L36r532r802
3510d602872j2524J7109n152r126P260N912r764M786J0339J802k8516n194K030
3497d623910k0330J9838M412r362j6336q383L365J9314j2731p497m229L935p655
3484d659569K2612n913o474J3910Q192J0579K0604p547L1565N789O527J7664K2310
3471d519751J6262J384L2915K5931J7602L4193K4943J0521M3823J4882L2393k82
3459d265184R815K1479L5332J0844K2687K0667R846M0955K1148J5886K2401M2957
$$ y = [-3949264, -3963755, -3989936, -4039158, -4070517, -4093556, -4113845, -4162097, -4170692, -4190926, -4226610, -4254439, -4243725, -4291970, -4311140, -4334115, -4351837, -4357097, -4381835, -4411538, -4413904, -4428131, -4443980, -4463315, -4475467, -4490533, -4506700, -4507438, -4526151, -4549989, -4560418, -4565455, -4561381, -4581727, -4583874, -4583538, -4593070, -4602872, -4615396, -4598287, -4603439, -4612565, -4605305, -4599393, -4609157, -4604371, -4594032, -4592230, -4620746, -4625940, -4623910, -4644240, -4624402, -4619990, -4629352, -4645688, -4654071, -4650706, -4631392, -4644123, -4651620, -4655849, -4651914, -4659569, -4636957, -4642870, -4649344, -4635434, -4627242, -4616663, -4596059, -4603606, -4572041, -4566252, -4559725, -4542061, -4519751, -4503489, -4502105, -4469190, -4443259, -4425657, -4391464, -4366521, -4356000, -4312177, -4297295, -4264902, -4265184, -4255369, -4233890, -4198558, -4187714, -4165027, -4144360, -4134514, -4093559, -4072411, -4056525, -4034124, -3991167]
3447c991167p753N1363K4641K0070N2508M4289L6193M5346N5918N2130N7834O0540
3435c498088M4450O3260O6903O2256L2296M2490N4211M0093M0393Q442K306j8608
3423c059596L085j214k8276J7335n138J1395O019J2353K6119l0385k0530q394
3411c077227m4601j8447o4583l365m4958m913k2523l0962q603m9837j1408n2620
3399c434047l8291l8466l7448m3357l8551l5171o7424m0341m1889n1850l1453
3388c898288p4280k5910q2121o3472n1531l4070m8886o8106l8370m5459n6115
3377d486608j9373m2829l0791m1562l4459j7274k6622r808l5011l1005j7211j1726
3365d804279k5490l3548j6767j0755k6246O100k7619l239j9099k0542j3165r663
$$ y = [-3991167, -3998920, -3947557, -3922916, -3902846, -3850338, -3806049, -3769856, -3724510, -3668592, -3616462, -3558628, -3498088, -3453638, -3390378, -3323475, -3261219, -3228923, -3186433, -3132222, -3092129, -3051736, -3043294, -3040988, -3059596, -3056511, -3057725, -3086001, -3068666, -3073804, -3062409, -3056390, -3044037, -3017918, -3048303, -3068833, -3077227, -3121828, -3140275, -3204858, -3208223, -3253181, -3258094, -3280617, -3311579, -3320182, -3370019, -3381427, -3434047, -3472338, -3510804, -3548252, -3591609, -3630160, -3665331, -3732755, -3773096, -3814985, -3866835, -3898288, -3972568, -3998478, -4080599, -4144071, -4195602, -4229672, -4278558, -4346664, -4385034, -4430493, -4486608, -4505981, -4548810, -4579601, -4621163, -4655622, -4672896, -4699518, -4709326, -4744337, -4775342, -4792553, -4804279, -4829769, -4863317, -4880084, -4890839, -4917085, -4910985, -4938604, -4941843, -4960942, -4981484, -4994649, -5004312]
3353e004312j7546j5698r055k5493r272r463j5510j1902j9595m716k83j0411k5374
3340e178630J248r513j2641l386j28j5750k409j0555m767p797K619k4868j416
3327e267993j566j3632J2331j7680r182q810R493l861l1663K5380j1936j9970
3315e339089Q624j1851K2721k4377q040N628k918p476L637l464j0068r736O458
3302e369951J0165j1521J0671q706m553p85j1615J0971j1890K1573k8723J169
3290e393195P480m030n885O334L447k255k025L890m278j746q693J2780l435O472
3276e385139j0629O414M987M744k5123K6282j0023L187j1917O56J4116k0754L1143
3263e372056k5462N881j4310J0053r024K8917p064l461O32l428O131N873k3269
$$ y = [-5004312, -5021858, -5037556, -5046611, -5072104, -5081376, -5090839, -5106349, -5118251, -5137846, -5142562, -5142845, -5153256, -5178630, -5177382, -5186895, -5199536, -5202922, -5203050, -5218800, -5221209, -5231764, -5236531, -5244328, -5241709, -5266577, -5267993, -5269559, -5283191, -5270860, -5288540, -5297722, -5306532, -5297039, -5300900, -5332563, -5307183, -5319119, -5339089, -5330465, -5342316, -5319595, -5343972, -5352012, -5346384, -5349302, -5356778, -5353141, -5356605, -5366673, -5376409, -5369951, -5359786, -5371307, -5360636, -5369342, -5373895, -5374680, -5386295, -5375324, -5387214, -5365641, -5394364, -5393195, -5385715, -5389745, -5395630, -5389296, -5385849, -5388104, -5390129, -5386239, -5390517, -5392263, -5400956, -5388176, -5391611, -5385139, -5395768, -5389354, -5384367, -5379623, -5404746, -5378464, -5388487, -5385300, -5397217, -5396561, -5382445, -5403199, -5372056, -5397518, -5391637, -5405947, -5395894, -5404918, -5376001, -5383065, -5386526, -5385894, -5389322, -5383191, -5377318, -5400587]
3250e400587K7708p277j054J1807N7P782l194o16o557J3338J3075k4594K1771
3237e348341N60o564P340N077o97r83P059M43j148M144L704J4800j2150N272n818
3222e327302L3950q04j0916J4780l678j5624N821J3136M720q22M573j451l807
3209e287424K5067l065k23K0270j0059R51N860J488q259J6320J992n821J4260
3196e228643k2202J7458N078k637K2033m587L969l197J8384k08R614L253j6955
3183e198640J0958Q838J129Q954j224J3745m966j06M850o123m265R4J4022k619
3169e155353L2682k4806l222O088J8234k1442R885M699O691K1296k7036L5423
3157e096861j3689O298l518o285K6376p636K0338j8768L517J4589j4498J7950
$$ y = [-5400587, -5372879, -5380156, -5381210, -5369403, -5369346, -5361564, -5364758, -5365374, -5371931, -5358593, -5345518, -5370112, -5348341, -5347781, -5354345, -5347005, -5341928, -5342625, -5343608, -5336549, -5336106, -5337254, -5333110, -5329406, -5314606, -5326756, -5321484, -5327302, -5293352, -5294156, -5305072, -5290292, -5293970, -5309594, -5303773, -5290637, -5285917, -5286739, -5282166, -5283617, -5287424, -5262357, -5265422, -5265645, -5245375, -5255434, -5254483, -5248623, -5247135, -5255394, -5239074, -5237082, -5242903, -5228643, -5250845, -5233387, -5228309, -5230946, -5208913, -5213500, -5209531, -5212728, -5194344, -5194552, -5184938, -5181685, -5198640, -5187682, -5178844, -5177715, -5168761, -5169985, -5156240, -5161206, -5161312, -5156462, -5162585, -5166850, -5166756, -5152734, -5155353, -5122671, -5147477, -5150699, -5144611, -5126377, -5147819, -5137934, -5133235, -5126544, -5105248, -5132284, -5096861, -5110550, -5104252, -5107770, -5114055, -5087679, -5095315, -5074977, -5093745, -5090228, -5075639, -5090137, -5072187]
3145e072187r280J820J0161J1368j5271K0102j4379K2907o673N107Q388l0301
3133e068238L1883k3657J9424J448N733k0755K8675j540R47k781J2980k0994J4134
3120e022741J4516k2742J0005J2749P578R119q623K0725q448j455O07r040R179
3107d988571P126J1838j3358K2589r956K1302r425j566O720n907R783J0427o206
3094d945204R451j0504L4857k7976J5731n86Q990k27J0112j3653J7157L584l09
3081d898577J7186j2561J334J3062J3781n330J6272j8678k986K1042P203J0768
3069d837484j3416J9324k2785K3515R878M01j837Q171L2915j4939r798K1489o61
3056d785227J7935n427K0240o687J4692O568q4R533J916J4492J761P78O557J9375
$$ y = [-5072187, -5081467, -5079647, -5069486, -5058118, -5073389, -5053287, -5067666, -5044759, -5051432, -5046325, -5037937, -5068238, -5036355, -5060012, -5040588, -5039140, -5033407, -5054162, -5025487, -5027027, -5026080, -5028861, -5015881, -5036875, -5022741, -5008225, -5030967, -5020962, -5008213, -5000635, -4991516, -5000139, -4979414, -4987862, -4989317, -4988710, -4997750, -4988571, -4981445, -4969607, -4982965, -4960376, -4970332, -4949030, -4958455, -4960021, -4953301, -4959208, -4949425, -4938998, -4945204, -4935753, -4946257, -4911400, -4939376, -4923645, -4924231, -4915241, -4915468, -4905356, -4919009, -4901852, -4898268, -4898577, -4881391, -4893952, -4892618, -4879556, -4865775, -4871105, -4854833, -4873511, -4876497, -4855455, -4848252, -4837484, -4850900, -4831576, -4854361, -4830846, -4820968, -4820567, -4822404, -4814233, -4781318, -4796257, -4806055, -4784566, -4785227, -4767292, -4772719, -4752479, -4759166, -4744474, -4737906, -4737990, -4728457, -4726541, -4712049, -4710288, -4709510, -4702953, -4683578]
3042d683578j2168J0914J6468M819J1358o318K8734Q639j4933N1272n731K2199
3030d568325K106J4179q786J7285k1536N494j0102l069o280R749R256j4266R848
3017d564447k6033J3683j1464J9185o334k062K641n83J4996J2983q559N148J9818
3004d531028j9915O108L128L743K1122p551q374K0197j7729J285J5182j372J8082
2991d497122j1332K2652o56q663K8098j9060J4096J5444k0134J6633n690J6970
2979d448764j3470L6310k240L623r285K7112r862K445J2712M709J6089m193O718
2966d378096J0675j487J6563O795M174k2108J7821P466n086P076J1722M396J2964
2953d307125K643N838J8947N935J0560r926O096J1558N139q48J3476n386K1138
$$ y = [-4683578, -4695746, -4684832, -4668364, -4663545, -4652187, -4658505, -4629771, -4621132, -4636065, -4584793, -4590524, -4568325, -4566219, -4552040, -4560826, -4543541, -4565077, -4559583, -4569685, -4572754, -4579034, -4569285, -4560029, -4574295, -4564447, -4590480, -4576797, -4588261, -4569076, -4575410, -4577472, -4574831, -4575414, -4560418, -4547435, -4555994, -4550846, -4531028, -4550943, -4544835, -4541707, -4537964, -4516842, -4524393, -4532767, -4512570, -4530299, -4529014, -4513832, -4515204, -4497122, -4508454, -4485802, -4486458, -4495121, -4467023, -4486083, -4471987, -4456543, -4476677, -4460044, -4465734, -4448764, -4462234, -4425924, -4428164, -4424541, -4433826, -4406714, -4416576, -4414131, -4401419, -4396710, -4380621, -4384814, -4378096, -4367421, -4368908, -4352345, -4345550, -4341376, -4363484, -4345663, -4338197, -4343283, -4336207, -4324485, -4320089, -4307125, -4304482, -4298644, -4279697, -4273762, -4263202, -4273128, -4267032, -4255474, -4250335, -4251183, -4237707, -4243093, -4221955]
2940d221955K0359j7695L1711M481l46k135J9320J1407q342m951K3387P940j887
2927d138706J2786J35R789j893J3822K1508N088j2289K1983M342N830J3118o967
2914d051454J9497L500J9083j2704M4711k173j1256N917J6538J2637k749J5110
2902c943343J9317R260j1717K8934N982K377J2712J5028J6484j308J3783J9645
2890c812846R064J408K5930K7143O325q884L1105R439K5974p133J8374K0629L3477
2877c619995O363K4869K0145N495K8571K0594J7169N540K6547K8362K9755J6883
2865c389702L3590J2270M4479K1588L2887K0449J9493N5173K3999L0288N5623
2854c039863J7594N3317K6339M6753N4282K0822O2775P1522M5581M6910P3798
$$ y = [-4221955, -4201596, -4219291, -4187580, -4183099, -4183445, -4185580, -4166260, -4154853, -4163195, -4168146, -4144759, -4136819, -4138706, -4125920, -4125785, -4115996, -4117889, -4104067, -4082559, -4077471, -4089760, -4067777, -4063435, -4057605, -4044487, -4051454, -4031957, -4028457, -4009374, -4022078, -3977367, -3979540, -3990796, -3984879, -3968341, -3955704, -3958453, -3943343, -3924026, -3914766, -3926483, -3897549, -3891567, -3889190, -3876478, -3861450, -3844966, -3846274, -3832491, -3812846, -3803782, -3802374, -3776444, -3749301, -3742976, -3751860, -3720755, -3711316, -3685342, -3692475, -3674101, -3653472, -3619995, -3613632, -3588763, -3568618, -3563123, -3534552, -3513958, -3496789, -3491249, -3464702, -3436340, -3406585, -3389702, -3356112, -3343842, -3299363, -3277775, -3244888, -3224439, -3204946, -3149773, -3125774, -3095486, -3039863, -3022269, -2968952, -2942613, -2895860, -2841578, -2820756, -2757981, -2686459, -2640878, -2593968, -2520170]
2843b520170P7220P3325N8142R8616O5429R5178P3791J13462J01366J37177J13060
2832a513404J37621J38263J65539J75358J70277K18933K16108K32555K55926K83545
2822D80721K83702L36769L69606L79183M24126M71451N22048N43530O04125O33980
2812E049241O99799P18736P32935O97785P18510P16247P63553Q06538R51258J061613
2802A2916215J151990J273035J329675J281521J073822O78307r329p51431j347938
2793A7595867j699904j757833j689577j525518j322883j165802r95663q50424
2785F588263p49114o51795o06891n22096n34677m39118m34466m47210l60704l43681
2775A498511l12839k77260k49532k45020k12174j90067k06246j86092j56369j62821
$$ y = [-2520170, -2442950, -2369625, -2311483, -2212867, -2147438, -2052260, -1978469, -1865007, -1763641, -1626464, -1513404, -1375783, -1237520, -1071981, -896623, -726346, -507413, -291305, -58750, 197176, 480721, 764423, 1101192, 1470798, 1849981, 2274107, 2745558, 3267606, 3811136, 4415261, 5049241, 5749040, 6467776, 7200711, 7898496, 8617006, 9333253, 10096806, 10903344, 11854602, 12916215, 14068205, 15341240, 16670915, 17952436, 19026258, 19704565, 19695236, 18943805, 17595867, 15895963, 14138130, 12448553, 10923035, 9600152, 8434350, 7438687, 6588263, 5839149, 5187354, 4580463, 4058367, 3523690, 3084572, 2650106, 2202896, 1842192, 1498511, 1185672, 908412, 658880, 413860, 201686, 11619, -194627, -380719, -537088, -699909]
2765f99909j35512j37880j14182r3913j07166q4322r4720n7546o3848m8128m1105
2754a678231n6216m8645k9689m964k7563j9221j3953P779P980J7338M965L2468
2742a807952L8578L3042O3833J02691P0084R2552J05767P7531N1886m5687j28748
2731a346423j68102j44136j74532j41518q9421q8524q1487q5302l4722n6837m7109
2720b458113l1743l8557l3672n5375l3002k0280l062n2658j8603j7455m0754K0214
2708b783060k3821l7163j4549l53j0792k7056M201k5338p060q82k0971m943o922
2695b958709o584M743q832l262j7321j820j1652R680j5487q04j0704N270j7654
2682c033136J7111r074l838j5283j741n736J3929Q15j3440j4813K2288k4982K7876
$$ y = [-699909, -835421, -973301, -1087483, -1181396, -1288562, -1372884, -1467604, -1525150, -1588998, -1637126, -1678231, -1734447, -1783092, -1812781, -1817745, -1845308, -1864529, -1878482, -1870703, -1862723, -1845385, -1840420, -1807952, -1769374, -1736332, -1672499, -1569808, -1499724, -1407172, -1301405, -1223874, -1171988, -1217675, -1346423, -1514525, -1658661, -1833193, -1974711, -2064132, -2152656, -2234143, -2319445, -2354167, -2411004, -2458113, -2489856, -2528413, -2562085, -2617460, -2650462, -2670742, -2673804, -2726462, -2745065, -2762520, -2803274, -2783060, -2806881, -2844044, -2858593, -2858946, -2869738, -2896794, -2892593, -2917931, -2924991, -2925873, -2946844, -2951787, -2958709, -2965293, -2960550, -2969382, -2972644, -2989965, -2991785, -3003437, -2993757, -3009244, -3010048, -3020752, -3015482, -3033136, -3016025, -3025099, -3028937, -3044220, -3045961, -3051697, -3037768, -3036953, -3050393, -3065206, -3042918, -3067900, -3040024]
2669c040024J38q185m318J942O538o960j8309M467J5197R560k1985J7947j6197
2656c060189J6904n80j5792J6705J824n003Q729l860l631o988N10o771J6465K1813
2642c019864q557k449M740l728K341P967J1710Q74l024P833l098l723J5431r817
2628c003364J227N279j666j6948L1094l212o1J3474p608J2223M156q615n816N815
2614b974022J249P799J1271k1861K8139M295j5318r98P73J6220J3573j4895K260
2601b941515P189J0014N74J063M292o02J3390N48K1172q622O686q416J6608l522
2587b881141O688P333Q437o226P147K109J3113P246k904N763J4777p311J7307
2574b807662R154J7433J922j020K04L5501O986J5465N659J9039k760O689j067
$$ y = [-3040024, -3039886, -3048071, -3052389, -3050447, -3043909, -3050869, -3069178, -3064711, -3049514, -3039954, -3061939, -3043992, -3060189, -3043285, -3043865, -3059657, -3042952, -3041128, -3046131, -3037402, -3041262, -3044893, -3051881, -3051371, -3058142, -3041677, -3019864, -3028421, -3030870, -3026130, -3029858, -3027517, -3019550, -3007840, -3006966, -3009990, -3002157, -3005255, -3008978, -2993547, -3003364, -3002137, -2996858, -2998524, -3015472, -2984378, -2987590, -2987651, -2974177, -2981785, -2969562, -2965406, -2974021, -2979837, -2974022, -2972773, -2964974, -2953703, -2975564, -2947425, -2943130, -2958448, -2959446, -2958673, -2942453, -2928880, -2943775, -2941515, -2934326, -2924312, -2923738, -2922675, -2918383, -2918985, -2905595, -2905047, -2883875, -2892497, -2885811, -2894227, -2877619, -2881141, -2874453, -2867120, -2858683, -2864909, -2857762, -2855653, -2842540, -2835294, -2838198, -2832435, -2817658, -2824969, -2807662, -2798508, -2781075, -2779153, -2780173, -2779969, -2744468, -2737482, -2722017, -2716358, -2697319, -2700079, -2693390, -2694457]
2561b694457J2362o438j336r621j1205N296k040k0875j1381J5741j0198R814j594
2548b725932o590P364j1651J4622L436n97o66J0210q52p394p836J4009J0727m081
2534b705231k888K023J8125o701L866k896j6477L5582m850r863J2578N765j401
2521b672368J3510L913j6724L9245j3165J0261l69j736N012K794J6719j1280J7304
2508b606884j0955Q111j406M720J992J3024P299r715J7360J0242q987J1366M601
2495b559232j2208J3805o148R788o07L289L0434k020j5407P400J1123j0793L051
2482b527525J9388m153O53j1488p766M5105k2832P516N267L823J533K4879n526
2469b471126q329J9661l395j2097R177N498Q867R887M60J2252j985m370J7241
$$ y = [-2694457, -2682095, -2688533, -2689869, -2699490, -2710695, -2705399, -2707439, -2728314, -2739695, -2723954, -2734152, -2724338, -2725932, -2732522, -2725158, -2736809, -2722187, -2718751, -2719348, -2720014, -2709804, -2710656, -2718050, -2725886, -2711877, -2701150, -2705231, -2708119, -2706096, -2687971, -2694672, -2690806, -2693702, -2710179, -2674597, -2679447, -2689310, -2676732, -2670967, -2672368, -2658858, -2654945, -2671669, -2632424, -2645589, -2635328, -2635697, -2637433, -2632421, -2629627, -2612908, -2624188, -2606884, -2617839, -2609728, -2611134, -2606414, -2604422, -2591398, -2584099, -2593814, -2576454, -2566212, -2575199, -2563833, -2559232, -2571440, -2557635, -2563783, -2553995, -2554602, -2551313, -2520879, -2522899, -2538306, -2530906, -2519783, -2530576, -2527525, -2508137, -2512290, -2511637, -2523125, -2530891, -2485786, -2508618, -2501102, -2495835, -2492012, -2490479, -2465600, -2471126, -2479455, -2459794, -2463189, -2475286, -2466109, -2460611, -2451744, -2441857, -2441397, -2429145, -2431130, -2435500, -2418259]
2456b418259m952L805P474J986J2932j7329J1101J3672k4324J7246L651M521J379
2443b387097J8235q636J8410q548J5936j9753J3941Q962r957O162J1935K27j0023
2430b350206K7477n706M870l713Q04J9208o400J2357j2083K1274j4160L7370k2339
2417b291247J6460j3550L5280k6360O588k553J5982n715Q855R377j3255Q434J646
2404b250058J3834q145J5655j319J6240N21m877J6968j4980J2205K5075J47P82
2391b177952j9957K1614K518o797K0714o15k758j6857K0294N15k008J6150Q670
2378b136469n260O893k368M91J6666N80L386J0052j0733k387J1727K4037k4143
2365b107528J6128j3759L040J5809m073J7654K1235j0570M727q613j0671K6122
$$ y = [-2418259, -2423211, -2419406, -2411932, -2409946, -2397014, -2414343, -2403242, -2389570, -2413894, -2396648, -2392997, -2388476, -2387097, -2368862, -2377498, -2359088, -2367636, -2351700, -2371453, -2357512, -2348550, -2358507, -2352345, -2340410, -2340183, -2350206, -2322729, -2328435, -2323565, -2327278, -2326474, -2307266, -2313666, -2301309, -2313392, -2292118, -2306278, -2268908, -2291247, -2274787, -2288337, -2253057, -2279417, -2272829, -2275382, -2259400, -2265115, -2256260, -2246883, -2260138, -2251704, -2250058, -2236224, -2244369, -2228714, -2230033, -2213793, -2213272, -2218149, -2201181, -2216161, -2203956, -2178881, -2178734, -2177952, -2197909, -2176295, -2173777, -2180574, -2159860, -2160475, -2163233, -2180090, -2159796, -2159281, -2161289, -2145139, -2136469, -2141729, -2134836, -2137204, -2136713, -2120047, -2119467, -2116081, -2106029, -2116762, -2119149, -2107422, -2083385, -2107528, -2091400, -2105159, -2102119, -2086310, -2090383, -2072729, -2051494, -2062064, -2057337, -2065950, -2076621, -2050499]
2353b050499m536m803J2817J4003q265J0175o634P128J2004k99L782n101J9557
2340b000671q112J925O853J1409P210k0163K3440P091n043R39K5453q308M399
2327a953578Q6m256O118N397K010q973J2456N562j4161l91J8255M944o496K5412
2313a907615K400j704M505J4558r274K0208m884m571J2186P452j1248j445J0800
2300a868632k797J1019o836J9748j8055K0289P897N682r729J3488n422N438R407
2287a818503l435J0174j619M54K165k821J0682J2874R52J06k363o672J0359O914
2273a780733J9524j2340P684J5614j9942J1239P896L272J1403k2553K6445k3680
2261a756171L077J7858J553m840J2359O415k764P892O678K1681j7933Q040r17
$$ y = [-2050499, -2055035, -2059838, -2047021, -2033018, -2041283, -2031108, -2037742, -2030614, -2018610, -2018909, -2015127, -2020228, -2000671, -2008783, -2006858, -2000005, -1988596, -1981386, -2001549, -1978109, -1971018, -1976061, -1975122, -1949669, -1957977, -1953578, -1953492, -1957748, -1951630, -1946233, -1944223, -1953196, -1940740, -1935178, -1949339, -1949730, -1931475, -1926531, -1933027, -1907615, -1905215, -1906919, -1902414, -1887856, -1897130, -1876922, -1881806, -1886377, -1874191, -1866739, -1877987, -1879432, -1868632, -1871429, -1860410, -1867246, -1847498, -1865553, -1845264, -1837367, -1831685, -1841414, -1827926, -1833348, -1827910, -1818503, -1821938, -1811764, -1813383, -1812929, -1810764, -1813585, -1802903, -1790029, -1789077, -1788971, -1791334, -1798006, -1787647, -1780733, -1761209, -1773549, -1765865, -1750251, -1770193, -1758954, -1751058, -1747786, -1736383, -1758936, -1732491, -1756171, -1753094, -1735236, -1733683, -1738523, -1726164, -1719749, -1722513, -1714621, -1707943, -1686262, -1704195, -1696155, -1697072]
2248a697072n5L932L254l555J66L866K2214l793R492o942J5181n9L944Q063q593
2233a649957j0566Q010J0753O908K8058k3578J3655j1323N16J9281K10R481j3063
2220a611615j0435J5424O637J2464o734P303L271Q307k724l561Q686j456K1343
2207a553090j0568m671J6282k4760J9878O591K818M24K365o25L0990k2233J0812
2194a525787n793J6295j9k365J1564L612j0958J1006r029K2576q815Q229J1165
2181a478319j4118J5699Q931n358M825q842o859O963K8859p743Q225l503J5894
2168a435346k3287J8819J231M39R036R832n266Q097j3336Q37M274L078J1465L1470
2154a378657k2338P168k2564p290M2167j0973q543J5012o739R247J9245N24Q045
$$ y = [-1697072, -1697127, -1693195, -1689941, -1693496, -1693330, -1689464, -1667250, -1671043, -1661551, -1668493, -1653312, -1653371, -1649427, -1641364, -1649957, -1660523, -1652513, -1641760, -1634852, -1606794, -1630372, -1616717, -1628040, -1627524, -1608243, -1608033, -1598552, -1611615, -1622050, -1606626, -1599989, -1587525, -1594259, -1586956, -1583685, -1575378, -1578102, -1581663, -1572977, -1574433, -1553090, -1563658, -1568329, -1552047, -1576807, -1556929, -1550338, -1547520, -1547096, -1544731, -1545356, -1514366, -1536599, -1525787, -1531580, -1515285, -1515304, -1517669, -1506105, -1502493, -1513451, -1502445, -1511474, -1488898, -1497713, -1489484, -1478319, -1492437, -1476738, -1467807, -1473165, -1468340, -1477182, -1484041, -1477078, -1448219, -1455962, -1447737, -1451240, -1435346, -1458633, -1439814, -1438583, -1438144, -1429108, -1419276, -1424542, -1416445, -1429781, -1428944, -1424670, -1421592, -1410127, -1378657, -1400995, -1393827, -1416391, -1423681, -1381514, -1392487, -1401030, -1386018, -1392757, -1383510, -1364265, -1363741, -1355696]
2141a355696j1394j0049J0698J8026j1069R695o996J2149J2329M553r958J5836
2129a321876k2469J0556K5290j537q299n659K6174n156n229R551J795R25n654
2116a301588p013K5235k1265J4186m15J6935j0108M49J5732J6280l1984J0610
2104a272946K3932J470J876j5702J8566K182R21j931k517L116J1026o883o234
2091a243124K8954L461j4821M498K495J1329M642j6702K0454m1q41R038r45J1029
2077a180574n520J3885k4424K6017n324J4195p646M21N354n123K162R608P040
2064a149929k011M099n368R012r138K2532J0349j1639J9854j7689J501J7205l0466
2051a141688J7001j2453K7394L496J444L347L73J0390j5276j540P700J6285m818
$$ y = [-1355696, -1367090, -1377139, -1366441, -1348415, -1359484, -1349789, -1356785, -1344636, -1332307, -1327754, -1337712, -1321876, -1344345, -1333789, -1308499, -1310036, -1318335, -1323994, -1297820, -1302976, -1308205, -1298654, -1296859, -1295934, -1301588, -1308601, -1283366, -1304631, -1290445, -1290860, -1273925, -1284033, -1283584, -1267852, -1251572, -1283556, -1272946, -1249014, -1247544, -1245668, -1261370, -1242804, -1240622, -1239701, -1241632, -1244149, -1241033, -1230007, -1236890, -1243124, -1214170, -1210709, -1225530, -1221032, -1218537, -1207208, -1202566, -1219268, -1198814, -1198855, -1199696, -1190658, -1191603, -1180574, -1186094, -1172209, -1196633, -1170616, -1175940, -1161745, -1169391, -1168970, -1163616, -1168739, -1166577, -1156969, -1149929, -1151940, -1147841, -1153209, -1144197, -1153335, -1130803, -1120454, -1132093, -1112239, -1129928, -1128427, -1111222, -1141688, -1124687, -1137140, -1109746, -1106250, -1104806, -1101459, -1101086, -1090696, -1105972, -1107512, -1099812, -1083527, -1088345]
2038a088345l908J4972j6108K2293p10l729l658N800L106J3355l278j576J2097
2025a049689j6010j341J0559o394J5065o195J7039O304p646J1139r180J1048k47
2012a025548Q386N694r494K9906k3704m98J2738l234l456P944l939O375M480n689
1998a000039J5894L950L262L220q063L532J279P094K816Q643K2508l3954J3931
1985i55927M858K969o473O264O737q796k914Q243j529K6679j4805J7516M781j3142
1971i25539R346j497l049n14J0275j7550K3620n947p431J6089J1290j4204O930
1958h98181Q670n785k231L06J5992m092K1390r715M477j9229J9565O616r51P392
1944h55776m477q244N454J9642j2269l665K331J3759M635j1220j20K933m216J2953
$$ y = [-1088345, -1092253, -1077281, -1093389, -1071096, -1071806, -1075535, -1079193, -1073393, -1070287, -1056932, -1060210, -1061786, -1049689, -1065699, -1067040, -1056481, -1062875, -1047810, -1054005, -1036966, -1030662, -1038308, -1027169, -1036349, -1025301, -1025548, -1017162, -1011468, -1020962, -991056, -1014760, -1015258, -1002520, -1005754, -1009210, -1001266, -1005205, -998830, -994350, -1000039, -984145, -980195, -976933, -973713, -981776, -978244, -976965, -969871, -967055, -958412, -935904, -969858, -955927, -951069, -948100, -954573, -948309, -941572, -950368, -953282, -945039, -946568, -919889, -934694, -917178, -912397, -925539, -916193, -917690, -920739, -921253, -910978, -928528, -904908, -910855, -918286, -902197, -890907, -905111, -898181, -889511, -895296, -897527, -897221, -881229, -885321, -863931, -873646, -869169, -888398, -868833, -862217, -863168, -855776, -860253, -868497, -863043, -843401, -855670, -859335, -857004, -843245, -838610, -849830, -849950, -847017, -851233, -838280]
1930h38280o535J1556M238K6223r268j9104J5922J7355j0191M844m93q177k542
1917h14452J0505N47q96J3714O887J67M174q279k201L340O697J0715j3979m460
1903g87521J1784L786N481j1643J9917p510P909R584r048l872P382J033j778P305
1889g47191M235o70R363M916N710n63P679j954o311J5123r526m012Q908R169j4129
1874g19253J616PQ337j401L050o199J261K6446K957P209j3693j1163j021J6804
1860f85043l757j056k93N831J9922j2890J8390o392m451l208J6442q550J6220
1847f48835j6795J7344j8077Q108l43J14P624J2767j5056R826J0408N791l240
1834f30364m415R237J842o11j1235R107J2135J300m129O768j809m744R88P317
$$ y = [-838280, -844815, -833259, -829021, -802798, -812066, -831170, -815248, -797893, -808084, -803240, -803733, -811910, -814452, -803947, -803400, -804296, -790582, -783695, -783528, -779354, -787633, -789834, -786494, -779797, -769082, -783061, -787521, -775737, -771951, -766470, -778113, -758196, -765706, -757797, -748213, -757261, -761133, -753751, -752718, -754496, -747191, -742956, -743626, -734263, -729347, -723637, -724200, -716521, -718475, -724786, -709663, -719189, -723201, -714293, -705124, -719253, -717637, -717630, -709293, -710694, -707644, -713843, -712582, -686136, -683179, -675970, -689663, -700826, -701847, -685043, -688800, -689856, -690149, -684318, -664396, -677286, -658896, -665288, -669739, -672947, -656505, -665055, -648835, -665630, -648286, -666363, -658255, -658598, -658484, -650860, -638093, -653149, -643323, -632915, -627124, -630364, -634779, -625542, -623700, -624311, -635546, -626439, -614304, -613004, -617133, -610365, -612174, -616918, -615930, -608613]
1820f08613J0264p535L443P28j8698J735M0129j3587J784p104j950J6193K1551
1807e61660j7716j892R241K453j1922j3939Q243R576J1865q399J6567r36m142
1794e62661O385q998P796Q048j668m423O892N192n887M213R925j986o06N473m136
1779e36441J1944k194O837o373q969r77J8621O012j666k802J348O468L038P46
1765e04408N180O092j920j2181L281K5244j8333n489J5894j1691R470K981J3708
1752d72172n428j1046K654Q160L531l328k639M650J4982m675k255n152L190o659
1738d76187J6444Q285q189J0776R139l528l531J1134j1751M054K452j9834K6924
1725d33812L827k3407K9504J5328k0844p642N815K258K5284k3117Q781O671k0730
$$ y = [-608613, -598349, -605884, -602441, -601713, -620411, -618676, -578547, -592134, -590350, -597454, -599404, -583211, -561660, -579376, -581268, -572027, -569574, -581496, -595435, -587192, -577616, -565751, -574150, -557583, -558519, -562661, -556276, -565274, -557478, -549430, -551098, -555521, -548629, -543437, -549324, -545111, -535186, -537172, -537778, -532305, -536441, -524497, -526691, -519854, -526227, -535196, -536173, -517552, -511540, -513206, -516008, -514660, -508192, -505154, -504408, -499228, -493136, -495056, -507237, -503956, -478712, -497045, -502534, -486640, -498331, -488861, -485880, -472172, -477600, -488646, -485992, -477832, -474301, -477629, -480268, -475618, -460636, -465311, -467566, -472718, -469528, -476187, -459743, -451458, -459647, -448871, -439732, -443260, -446791, -435657, -447408, -443354, -440902, -460736, -433812, -429985, -453392, -423888, -408560, -429404, -437046, -431231, -428973, -403689, -426806, -418025, -411354, -432084]
1712d32084J9282J150j0165R762k893J7543j6559L1121Q629j0455j3389N269J1247
1699c81542j8629j344R37P622k623R527r944O528K4025j3670j1447O332K8640
1686c55588j9957M663L149l9M434j1839O597J9507k4725J1926q053K2101l995
1673c51819r25J966k015J579K2572j0838N543q189p642J3657k3l018J871l725
1659c41006J1737J3380j3284O150J5891j3245o344R422m075O692N039K359j5232
1646c22516J1700J0049J190P901k4224l030M1683j4861j0118Q587r24K8967k7260
1633b92856M036r648n44R853J0226j149J1025K100j3704M836J00j442O471j6791
1619b87487K7785o393n796J0403J773q385j843K8834k5320m745R134J508J1134
$$ y = [-432084, -412802, -411652, -421817, -412055, -414948, -397405, -413964, -382843, -374214, -384669, -398058, -392789, -381542, -400171, -401515, -400578, -392956, -395579, -386052, -395996, -389468, -365443, -379113, -390560, -384228, -355588, -375545, -370882, -367733, -367772, -363338, -375177, -368580, -349073, -373798, -361872, -369925, -347824, -351819, -352744, -350778, -352793, -351214, -328642, -339480, -333937, -342126, -349768, -336111, -336134, -339152, -337281, -341006, -329269, -315889, -329173, -323023, -307132, -320377, -326721, -317299, -321374, -314682, -309643, -307284, -322516, -310816, -300767, -299577, -291676, -315900, -318930, -277247, -292108, -302226, -293639, -294563, -265596, -292856, -288820, -298468, -299012, -289159, -278933, -280082, -269057, -266957, -280661, -275825, -275725, -277167, -270696, -287487, -259702, -266095, -271891, -261488, -259715, -268100, -269943, -241109, -266429, -271174, -262040, -260532, -249398]
1606b49398Q583Q227p711k541J310j0790J3388j0273L877l618K6531k2508k523
1593b47446K4122j3316J6822j0883J340L629J7300m640n317J2196o976J3471j3413
1580b13111J736n111J2842L981j4295j876Q009P861m23J873q152k787R378N413
1566a94662M145O953j1657K0781l4396K1137m082M650J6865j2817J552L441P243
1553a70847j680j4740K0995k936N842P475n247j4170N900J1242j4814Q291L79
1540a64310O444k040J843q637J6506R46o715L485J0365j93P61k840Q739o103j156
1525a42905J7178l1536O342K8652k0797K3700j2420m465m440K6197k4138o952
1513a45584J3290p867K292J4893q565J3509o626j629K5046j3669l733R325j5056
$$ y = [-249398, -240815, -232588, -240299, -242840, -241530, -252320, -238932, -249205, -245328, -248946, -222415, -244923, -247446, -223324, -236640, -219818, -230701, -229361, -225732, -208432, -213072, -218389, -206193, -213169, -199698, -213111, -211375, -216486, -203644, -199663, -213958, -215834, -207825, -199964, -200387, -198514, -206666, -209453, -200075, -194662, -190517, -183564, -195221, -174440, -208836, -187699, -191781, -187131, -170266, -183083, -181531, -178090, -170847, -172527, -187267, -166272, -169208, -163366, -155891, -161138, -175308, -169408, -158166, -172980, -164689, -164310, -157866, -159906, -158063, -166700, -150194, -149248, -155963, -152478, -142113, -142306, -141545, -144385, -135646, -141749, -142905, -125727, -157263, -150921, -122269, -143066, -119366, -131786, -136251, -140691, -114494, -138632, -145584, -132294, -140161, -137869, -122976, -131541, -118032, -124658, -126287, -101241, -114910, -118643, -109318, -124374]
1500a24374J5250q155J5380j3222O849o437m018P788Q182j2591J5644R937l008
1487i2775l058j8463J8746j5290N074j5J2576Q51J107l045o104K391J1621L143
1473h3241k738P087j819j8879K8875o151J3319k3606J6456r213R013j7562j266
1460h9725L4035o34j426k6786N168K7210j4970o928L2545q833j3889N220O267
1447e2746L34j01k0260J6414J011j8883J5051J871J05N738M866L20j0635Q079
1433d8836O228o377k317k38j0946J0092J4173m741O803m338Q731q217k474K7008
1419a5449o552k4414J7135j11J0818j8326L847J545J137R99R710j1195K0522p682
1405a8016l539k218j2019O391J7688N29L890k299j715m305j1658R909K2449j2272
$$ y = [-124374, -109124, -117279, -101899, -115121, -108272, -114709, -118727, -110939, -102757, -115348, -99704, -89767, -92775, -95833, -114296, -95550, -110840, -105766, -105781, -93205, -92354, -91247, -94292, -100396, -98005, -86384, -83241, -85979, -78892, -80711, -99590, -70715, -76866, -63547, -87153, -70697, -79910, -70897, -88459, -89725, -55690, -56324, -57750, -84536, -79368, -52158, -67128, -74056, -41511, -50344, -64233, -59013, -52746, -52412, -52513, -72773, -56359, -55348, -74231, -59180, -57309, -57204, -51466, -46600, -46280, -56915, -48836, -42608, -48985, -51302, -51540, -62486, -52394, -38221, -42962, -36159, -40497, -31766, -39983, -42457, -15449, -22001, -46415, -29280, -29391, -18573, -36899, -33052, -31507, -30370, -29371, -19661, -30856, -10334, -18016, -21555, -23773, -35792, -29401, -11713, -11184, -7294, -9593, -11308, -15613, -27271, -17362, 5087, -7185]
1391g185m816J33J5876j8450j117Q897L503M771k4945K2382j0469J2863o978J6060
1377A0525j0519j2214J4744J3587k1724K0230j4919J1278j4606N068J1905o378
1365F977l572Q157p289J5302k372p407l120J1467o092K78j203J4174m112M575
1351B5763j0155o467K1475j0240l962n146J0171K089j230M45q316J1337l96j2734
1337A2634N939Q332J521K078L6J8687j7003k190R789j189J3658k3272q24J7824
1323D6020j3539J6686j7422M260j3754K8679j3001L615P628P938j9303j3626J1402
1310C5583O951k0213J4524N151Q061J775j4507J6775n521j1727l477L0490p543
1297E6322J050K150j8020p561M430J6135k39n186J7086j3018m698J0570o887o136
$$ y = [-7185, -12001, -11868, 4008, -14442, -15559, -6662, -3159, 1612, -23333, -951, -11420, 1443, -5535, 10525, 6, -12208, 2536, 16123, -5601, 14629, -290, 10988, -3618, 1450, 13355, 6977, 3405, 11562, 4273, 19575, 17203, 9796, 6676, 18143, 12051, 12329, 11126, 25300, 21188, 25763, 15608, 9141, 30616, 20376, 16414, 11268, 21439, 23528, 22298, 22743, 14427, 25764, 25368, 12634, 18573, 26905, 28426, 30504, 30540, 49227, 32224, 30034, 39823, 38634, 52292, 29020, 28196, 46020, 32481, 49167, 31745, 36005, 22251, 50930, 37929, 41544, 49172, 57110, 37807, 24181, 35583, 42534, 22321, 36845, 41996, 50057, 51832, 37325, 54100, 48579, 36852, 33375, 63865, 56322, 57372, 59522, 41502, 33941, 38371, 54506, 54267, 49081, 66167, 53149, 48451, 59021, 52134, 45998]
1283D5998j566K0322j7608K512q48L270j3655J5340J1920j707n26r016O735O698
1269F7869q353q054M353Q837K0227k9802J8010m325J3444j9878L918P854q568
1256F5532M804K971o645l696J7730q784K138L8q202J3930j3819r90J03J4464l455
1241G6119r861M658P08k378j0814M565L769R00K257N740m308J0107J882r434O896
1226H0806J6182j6555n121J0551m584R765p828j098o357j2887P888k403J2789
1213H1148j2426J0832l968l488k89K1278k3953K0418L376o212j3246K051K7494
1200A03015r711k4504L7373l0945J8666p449J6577l2126J1152o329K394L684n77
1187H1220j2100J7368n102k650M308K518J428j3369J1289L883M468P11j2243j720
$$ y = [45998, 44432, 64754, 47146, 49658, 48810, 52080, 38425, 53765, 65685, 63978, 63452, 54436, 61171, 67869, 59516, 51462, 55815, 64652, 84879, 55077, 73087, 68762, 82206, 62328, 66246, 74100, 65532, 70336, 73307, 66662, 62966, 80696, 71912, 74050, 74088, 65886, 79816, 65997, 65007, 65110, 79574, 76119, 66258, 70916, 71624, 69246, 58432, 62997, 66766, 67666, 69923, 75663, 71355, 81462, 83344, 73910, 80806, 96988, 80433, 75312, 85863, 81279, 91044, 83216, 82118, 75761, 62874, 70762, 68359, 81148, 68722, 79554, 75586, 72098, 71809, 93087, 69134, 89552, 92928, 86716, 73470, 75521, 103015, 93304, 68800, 106173, 75228, 93894, 86445, 103022, 70896, 82048, 75719, 78113, 81797, 81220, 69120, 86488, 81386, 78736, 83044, 85562, 86990, 73621, 84910, 88793, 93261, 93972, 81729, 80009]
1173H0009J4964j0069N252j2969N708r15Q979n455K1798j6255j4553O52O253O749
1159I0148L278j3679J140O198q638J6660O645j6017p129Q187n954J1386o539r68
1145H4718o984J1461j076J2972j4886J21q984M115J1385m239k045j174r643J6283
1131I2024J0751j3563O093Q67j0703J0033l988J016J986l86n891m360j3917K8709
1117I8671j9379J4960j5621J7361k0078J7309n916N24M979q388l283j691J0715
1104I0163Q102r636m54L67K231j5349J1241j4789N389K5254k0122J4476k4138
1091G2735R563j333R237j920l077J863J2333k9978K3174j0328J3207j1405J550
1078H5621L044j3508k990J8253j1681J205j004Q274N715o350j3806p473K4010
$$ y = [80009, 94973, 84904, 90156, 77187, 82895, 81980, 90959, 85504, 107302, 91047, 76494, 77146, 83399, 90148, 93426, 79747, 80887, 87085, 78447, 95107, 101752, 85735, 78606, 86793, 80839, 92225, 85686, 84718, 77734, 89195, 88119, 101091, 86205, 86326, 77342, 81457, 92842, 88603, 86558, 85384, 75741, 92024, 102775, 89212, 95305, 96172, 85469, 95502, 91514, 92530, 94516, 94130, 88239, 83879, 69962, 98671, 79292, 94252, 78631, 95992, 75914, 93223, 87307, 87831, 92810, 84422, 81139, 79448, 90163, 98265, 88629, 88175, 88542, 90773, 75424, 86665, 71876, 77265, 102519, 82397, 96873, 72735, 82298, 80965, 90202, 88282, 85205, 87068, 99401, 69423, 92597, 82269, 95476, 84071, 85621, 88665, 75157, 72167, 90420, 78739, 79944, 78940, 87214, 92929, 86579, 72773, 65300, 89310]
1065H9310R568j7773L329j0185K0159j7299j256j349r43p339J7399Q074j1114
1052H0581j7815K6897j2878J5404r433j7831J9587J215P859j9811J1382R010p764
1039H6403Q062k852j6113O126l832K526k495L775m20K3525k5325j6857J7592q931
1025G1184P663p368L763J1983l717j2485N420m429j6007J7718j6948J9652P784
1012H4213r565M686j6420o306L2986j5137k336j62M331n075N538L644k900j1671
998F5826p901K2870p558R724r733n241M331k2725J9758o43p504n086J5541p672
984F3987P317j9809l116J8806Q178j2847J7509j7433O819L511j0673P419L747
971G3415j4012M145P301j4968j6852K4405k9745L5801o710P176l542m287M287
$$ y = [89310, 98878, 81105, 84434, 74249, 94408, 77109, 75853, 74504, 73561, 66222, 83621, 91695, 80581, 62766, 89663, 76785, 92189, 82756, 64925, 84512, 85727, 93586, 73775, 85157, 94167, 86403, 94465, 91613, 75500, 81626, 77794, 80320, 77825, 81600, 81180, 104705, 79380, 62523, 80115, 71184, 78847, 71479, 75242, 87225, 83508, 71023, 76443, 72014, 56007, 73725, 56777, 76429, 84213, 74648, 79334, 62914, 56608, 89594, 74457, 72121, 71959, 76290, 71215, 76753, 80397, 77497, 65826, 57925, 80795, 73237, 82961, 73228, 67987, 72318, 49593, 69351, 68708, 61204, 56118, 71659, 63987, 71304, 51495, 48379, 67185, 75363, 62516, 80025, 62592, 69411, 72922, 62249, 69668, 73415, 59403, 63548, 70849, 55881, 39029, 63434, 33689, 69490, 62780, 69956, 66414, 62127, 66414]
958F6414l897r227J2075n652N173j1287k214K162k875M040p364J7643K253j1667
944E5577R649p909j2794J1687p603L279N55m847J1087m769k01M755J1212k5399
930D4279r263J2460J059l794K3088l1710J2656O525k842J3755k3993K3988o301
917E9907m388j2759L966J8130l4716K1676q744P0p180J3641Q953j6845L567j4814
903C0464K1675k2676r64J4178k067k145J0163j3282J2473N83j5895J2552Q701
890E3760k3897J444k708J5995K524j6216p596n713J4413J090M805j818J732j6508
876B1307Q93o333J6710p383J1504K2573l6196J5554Q38L822j5830N687L631q093
862B8684K2693j9838j1400J2610j3904j513Q792j1186J3428k313r661K1967j5806
$$ y = [66414, 62517, 53290, 65365, 59713, 64886, 53599, 51385, 53547, 50672, 54712, 47348, 64991, 67244, 55577, 65226, 57317, 44523, 56210, 48607, 51886, 52441, 47594, 58681, 53912, 53711, 58466, 69678, 44279, 35016, 47476, 48535, 44741, 67829, 36119, 48775, 55300, 52458, 66213, 42220, 66208, 59907, 55519, 42760, 46726, 64856, 30140, 51816, 43072, 43142, 35962, 49603, 58556, 41711, 45278, 30464, 52139, 29463, 28499, 42677, 40610, 38465, 48628, 35346, 47819, 48402, 32507, 45059, 53760, 29863, 31307, 28599, 44594, 47118, 30902, 23306, 17593, 32006, 33096, 37901, 36083, 37815, 21307, 22200, 15867, 32577, 25194, 36698, 59271, 23075, 38629, 39467, 43289, 27459, 33146, 36777, 28684, 51377, 31539, 20139, 32749, 18845, 17332, 26124, 14938, 28366, 26053, 16392, 38359, 22553]
849B2553Q070j8458m630K3761k7848R582N129N300j1136K0343k6997J5997O766
836B8432j06j1570J086P764p013O700n093k5630M910K7111k472P063l0513K4759
822B5428p363k2436L462N412k865J3238k194L592p290J0579l1987K0775M809p20
808A2440M870k842k2287O076Q527n165K1376j2627j6655m939K4349j0052l429
795c58R303n597L501j9067r32J2879J0416l0939J6119N094l867r032O308L297
781b875N501o706J464p136l373k473K2308j3519r860Q744p429J5309J6345k6855
767a0555J350l93j157J180k46n388J9520j4379R35N190j4325R819M522M276j3664
752a3315O065n086j773q435K0132K476j9215J7709j1928j6935J0818N012K081
$$ y = [22553, 30623, 12165, 7535, 31296, 3448, 13030, 18159, 23459, 12323, 32666, 5669, 21666, 28432, 28326, 16756, 17842, 25606, 18593, 25293, 20200, -5430, -520, 26591, 24119, 31182, 669, 25428, 18065, -4371, -909, 4503, 1638, 14876, 12682, 16274, 8984, 19563, -12424, 8351, 13160, 12440, 17310, 14468, -7819, -1743, 6784, 1619, 22995, 10368, -6287, -11226, 13123, 3071, -358, 8945, 3348, 6849, -12218, -13150, -271, 10145, -20794, -4675, 419, -3448, -12480, -6172, -2875, 2626, -4080, -2616, -9752, -13125, -15598, 6710, -6809, -16669, -7925, -15354, -45, 16300, -10555, -9205, -9598, -10755, -9575, -9821, -15209, 4311, -10068, -9133, -3943, -18268, -8449, -3927, 349, -13315, -7250, -12336, -14109, -22544, -2412, 64, -19151, -1442, -13370, -30305, -19487, -14475, -12394]
739a2394J0899p671L422k8016K8773j5038k354j806o118M658J4037Q833o334j3569
725b2678r423O053j1005K3322o478o544J6018k5459J9448k2823Q673O16J3547
712a6733j9974J5930J260j283j4895P230j454n808m548J2213M598j057J691j7389
698d0219R320j2229J7303J1564j7110L595r360o31J5801O51k1847M278L013N929
684b9942n992j0439J9685j8759R582k915m952K1371k2840K311L282j6287J2451
671d3444K615o82j104j4961p177K2579P791j3885P573l940Q757j5378L101j144
657d9299Q168M417j8642m480K7357N519k1965M287j780k57r792Q236o225Q025
643d6431o366q36j1508O496Q875K678j7200m046J7081l82J7309j4207j6586J690
$$ y = [-12394, -1495, -9166, -5744, -33760, -4987, -20025, -22379, -24185, -30303, -25645, -11608, -2775, -9109, -22678, -32101, -26048, -37053, -13731, -20209, -26753, -10735, -36194, -16746, -39569, -30896, -30280, -16733, -36707, -20777, -19517, -20800, -35695, -28465, -29919, -35727, -40275, -28062, -23464, -24521, -22830, -40219, -30899, -43128, -25825, -14261, -31371, -27776, -37136, -37767, -21966, -21315, -43162, -38884, -35871, -29942, -35934, -46373, -26688, -45447, -35865, -38780, -43732, -22361, -45201, -42890, -39608, -55895, -43444, -40829, -41511, -42615, -57576, -64753, -42174, -34383, -48268, -40695, -44635, -35878, -51256, -48155, -49299, -41131, -36714, -55356, -59836, -32479, -26960, -48925, -44638, -46418, -46675, -56467, -48231, -54456, -46431, -52797, -53633, -65141, -58645, -49770, -47092, -64292, -68338, -51257, -51639, -34330, -48537, -65123, -63433]
629f3433R791R50N9J0000k7646K4635j0668M064M413o545n969j0582Q525j0622
615g3028J0854o131J0408O264p153j0760K6746k3868k79l418J5233j1782J4446
602e2468j7296J2932j1816K066K347j3178J3105o415K619j5151J1966j0772J2158
589f9903m912M270j0185J4306l207Q231j5005k91K1739j1797Q896P50j3721n838
575g6667K0078p188n347q744n913K453J2850j4557K2851k0924r94n123J1774O52
561g4799r963J2709m956j022p211K883r087K4830k7235J1420p008J5268j7569
548i1740m897O861J1112j3826J069j019k998P893J1451j9929J2530q027J4826
535g6694k3141J9469j2047J2792j5011M915j3177K1825o174n119R191j7160K2287
$$ y = [-63433, -53642, -52692, -52633, -42633, -70279, -45644, -56312, -52248, -47835, -54380, -60349, -70931, -62406, -73028, -62174, -68305, -57897, -51633, -58786, -69546, -42800, -66668, -66947, -70365, -55132, -66914, -52468, -69764, -56832, -68648, -66582, -64235, -77413, -64308, -70723, -68104, -83255, -71289, -82061, -69903, -74815, -70545, -80730, -66424, -69631, -61400, -76405, -76696, -54957, -66754, -57858, -57108, -70829, -76667, -56589, -63777, -69124, -77868, -83781, -81328, -68478, -83035, -60184, -81108, -82102, -87225, -75451, -74799, -84762, -72053, -77009, -78031, -85242, -82359, -91446, -66616, -93851, -82431, -89439, -74171, -91740, -96637, -89776, -78664, -92490, -91421, -92440, -95438, -87545, -76094, -96023, -83493, -91520, -76694, -99835, -80366, -92413, -79621, -94632, -89717, -102894, -81069, -87243, -92362, -83171, -100331, -78044]
$$ [...]
##END NTUPLES=NMR SPECTRUM
##END=
