##TITLE=abcd
##JCAMPDX= 6.0         $$ Bruker NMR JCAMP-DX V2.0
##DATA TYPE= NMR SPECTRUM
##DATA CLASS= NTUPLES
##ORIGIN= UXNMR, Bruker Analytische Messtechnik GmbH
##OWNER= root
$$ XWIN-NMR		Version 3.5
$$ Thu Oct 16 12:05:40 2025 Russian Standard Time (UT+4h)  servis@DPX200
##.OBSERVE FREQUENCY= 200.131235884673
##.OBSERVE NUCLEUS= ^1H
##.ACQUISITION MODE= SIMULTANEOUS
##.ACQUISITION SCHEME= undefined
##.AVERAGES= 32
##.DIGITISER RES= 18
##SPECTROMETER/DATA SYSTEM= spect
##.PULSE SEQUENCE= zg
##.SOLVENT NAME= DMSO
##.SHIFT REFERENCE= (INTERNAL, DMSO, 0, 16.4885)
##AUDIT TRAIL= $$ (NUMBER, WHEN, WHO, WHERE, WHAT)
$$ ##TITLE= Audit trail, XWIN-NMR		Version 3.5
$$ ##JCAMPDX= 5.01
$$ ##ORIGIN= Bruker BioSpin GmbH
$$ ##OWNER= servis
$$ F:\spectra/data/av/nmr/H1/1/pdata/1/auditp.txt
$$ ##AUDIT TRAIL=  $$ (NUMBER, WHEN, WHO, WHERE, WHAT)
(   1,<2025-10-16 12:05:04.12 +0400>,<servis>,<DPX200>,
      <created by zg, POWCHK disabled, PULCHK disabled
       configuration hash MD5:
       00 E9 B6 7A A2 85 ED C7 34 08 36 98 17 FE 4E 26
       data hash MD5: 32K
       B9 93 B1 73 57 76 B0 37 51 0B CB 87 B0 E0 86 9C>)
(   2,<2025-10-16 12:05:05.82 +0400>,<servis>,<DPX200>,
      <Start of raw data processing
       efp BC_mod = 2 LB = 0.05 FT_mod = 6 PKNL = 1 PHC0 = -271.6701 PHC1 = 2.101565 SI = 16K 
       data hash MD5: 16K
       7F 9D 16 B9 AB 62 AC EE D0 59 C2 93 59 5B 84 4B>)
$$ ##END=
$$ 
$$ hash MD5
$$ 66 80 F5 83 FD 3D 59 5B E5 E9 FD 88 25 CA 52 82
##$RELAX= 
##$RELAX= 
##$RELAX= 
##$RELAX= 
##$RELAX= 
##$RELAX= 
##$RELAX= 
##$RELAX= 
$$ Bruker specific parameters
$$ --------------------------
##$DU= <F:\spectra>
##$EXPNO= 1
##$NAME= <H1>
##$PROCNO= 1
##$TYPE= <nmr>
##$USER= <av>
##$AMP= (0..31)
100 100 100 100 100 100 100 100 100 100 100 100 100 100 100 100 100 100 
100 100 100 100 100 100 100 100 100 100 100 100 100 100 
##$AQSEQ= 0
##$AQ_mod= 1
##$AUNM= <au_zg>
##$AUTOPOS= <>
##$BF1= 200.13
##$BF2= 200.13
##$BF3= 200.13
##$BF4= 200.13
##$BF5= 500.13
##$BF6= 500.13
##$BF7= 500.13
##$BF8= 500.13
##$BYTORDA= 1
##$CFDGTYP= 0
##$CFRGTYP= 5
##$CHEMSTR= <none>
##$CNST= (0..31)
1 1 145 1 1 1 1 1 1 1 1 1 1 1 1 1 1 1 1 1 1 1 1 1 1 1 1 1 1 1 1 1 
##$CPDPRG= <>
##$CPDPRG1= <>
##$CPDPRG2= <>
##$CPDPRG3= <>
##$CPDPRG4= <mlev>
##$CPDPRG5= <mlev>
##$CPDPRG6= <mlev>
##$CPDPRG7= <mlev>
##$CPDPRG8= <mlev>
##$CPDPRGB= <>
##$CPDPRGT= <>
##$D= (0..31)
0 2 0 0 0 0 0 0 0 0.06 0 0 0 0 0 0 0.0002 0 0 0 0 0 0 0 0 0 0 0 0 0 0 
0 
##$DATE= 1760601903
##$DBL= (0..7)
120 120 120 120 120 120 120 120 
##$DBP= (0..7)
150 150 150 150 150 150 150 150 
##$DBP07= 0
##$DBPNAM0= <>
##$DBPNAM1= <>
##$DBPNAM2= <>
##$DBPNAM3= <>
##$DBPNAM4= <>
##$DBPNAM5= <>
##$DBPNAM6= <>
##$DBPNAM7= <>
##$DBPOAL= (0..7)
0.5 0.5 0.5 0.5 0.5 0.5 0.5 0.5 
##$DBPOFFS= (0..7)
0 0 0 0 0 0 0 0 
##$DE= 6
##$DECBNUC= <off>
##$DECIM= 32
##$DECNUC= <off>
##$DECSTAT= 4
##$DIGMOD= 1
##$DIGTYP= 9
##$DL= (0..7)
0 120 120 120 120 120 120 120 
##$DP= (0..7)
150 150 150 150 150 150 150 150 
##$DP07= 0
##$DPNAME0= <>
$$ [...]
##$SUBNAM4= <"">
##$SUBNAM5= <"">
##$SUBNAM6= <"">
##$SUBNAM7= <"">
##$SUBNAM8= <"">
##$SUBNAM9= <"">
##$SW= 20.6817932712277
##$SWIBOX= (0..15)
0 0 3 0 0 0 0 0 0 0 0 0 0 0 0 0 
##$SW_h= 4139.07284768212
##$TD= 32768
##$TD0= 1
##$TE= 0
##$TE2= 300
##$TE3= 300
##$TEG= 300
##$TL= (0..7)
0 120 120 120 120 120 120 120 
##$TP= (0..7)
150 150 150 150 150 150 150 150 
##$TP07= 0
##$TPNAME0= <>
##$TPNAME1= <>
##$TPNAME2= <>
##$TPNAME3= <>
##$TPNAME4= <>
##$TPNAME5= <>
##$TPNAME6= <>
##$TPNAME7= <>
##$TPOAL= (0..7)
0.5 0.5 0.5 0.5 0.5 0.5 0.5 0.5 
##$TPOFFS= (0..7)
0 0 0 0 0 0 0 0 
##$TUNHIN= 0
##$TUNHOUT= 0
##$TUNXOUT= 0
##$USERA1= <user>
##$USERA2= <user>
##$USERA3= <user>
##$USERA4= <user>
##$USERA5= <user>
##$V9= 5
##$VALIST= <valist>
##$VCLIST= <CCCCCCCCCCCCCCC>
##$VD= 0
##$VDLIST= <DDDDDDDDDDDDDDD>
##$VPLIST= <PPPPPPPPPPPPPPP>
##$VTLIST= <TTTTTTTTTTTTTTT>
##$WBST= 1024
##$WBSW= 30
##$XGAIN= (0..3)
0 0 0 0 
##$XL= 0
##$YL= 0
##$YMAX_a= 138094
##$YMIN_a= -114266
##$ZGOPTNS= <>
##$ZL1= 120
##$ZL2= 120
##$ZL3= 120
##$ZL4= 120
##$ABSF1= 0
##$ABSF2= 0
##$ABSG= 0
##$ABSL= 0
##$ALPHA= 0
##$AQORDER= 0
##$ASSFAC= 0
##$ASSFACI= 0
##$ASSFACX= 0
##$ASSWID= 0
##$AUNMP= <proc_1d>
##$AZFE= 0.1
##$AZFW= 0.1
##$BCFW= 0
##$BC_mod= 2
##$BYTORDP= 0
##$COROFFS= 0
##$CY= 18.4799938201904
##$DATMOD= 1
##$DC= 0
##$DFILT= <>
##$DTYPP= 0
##$F1P= 9.9274215381318
##$F2P= -0.165520771350173
##$FCOR= 1
##$FTSIZE= 16384
##$FT_mod= 6
##$GAMMA= 0
##$GB= 0
##$INTBC= 1
##$INTSCL= 4.127829e-11
##$ISEN= 128
##$LB= 0.05
##$LEV0= 0
##$LPBIN= 0
##$MAXI= 10000
##$MC2= 0
##$MEAN= 0
##$ME_mod= 0
##$MI= 50
##$NCOEF= 0
##$NC_proc= -8
##$NLEV= 6
##$NOISF1= 3.799351
##$NOISF2= 2.8
##$NSP= 0
##$NTH_PI= 0
##$NZP= 0
##$OFFSET= 16.48848
##$PC= 4
##$PHC0= -271.6701
##$PHC1= 2.101565
##$PH_mod= 1
##$PKNL= yes
##$PPARMOD= 0
##$PSCAL= 4
##$PSIGN= 0
##$REVERSE= no
##$SF= 200.130005582386
##$SI= 16384
##$SIGF1= 3
##$SIGF2= 2
##$SINO= 400
##$SIOLD= 16384
##$SREGLST= <1H.CDCl3>
##$SSB= 0
##$STSI= 16384
##$STSR= 0
##$SW_p= 4139.07284768211
##$SYMM= 0
##$S_DEV= 0
##$TDeff= 32768
##$TDoff= 0
##$TI= <>
##$TILT= no
##$TM1= 0
##$TM2= 0
##$TOPLEV= 0
##$USERP1= <user>
##$USERP2= <user>
##$USERP3= <user>
##$USERP4= <user>
##$USERP5= <user>
##$WDW= 1
##$XDIM= 16384
##$YMAX_p= 413057171
##$YMIN_p= -3036418
$$ End of Bruker specific parameters
$$ ---------------------------------
##NTUPLES= NMR SPECTRUM
##VAR_NAME=  FREQUENCY,     SPECTRUM/REAL,   SPECTRUM/IMAG
##SYMBOL=    X,             R,               I
##VAR_TYPE=  INDEPENDENT,   DEPENDENT,       DEPENDENT
##VAR_FORM=  AFFN,          ASDF,            ASDF
##VAR_DIM=   16384,         16384,           16384
##UNITS=     HZ,            ARBITRARY UNITS, ARBITRARY UNITS
##FACTOR=    0.252644378177508, 1,           1
##FIRST=     3299.83951724647, 0,            0
##LAST=      -839.233330435636, 0,           0
##MIN=       -839.233330435636, -3036418,    0
##MAX=       3299.83951724647, 413057171,    0
$$ Real data points
##PAGE= N=1
##DATA TABLE= (X++(R..R)), XYDATA
$$ [...]
9665E53428N2355l01240M28465k03916J77688p40456k50267K40955L56576J53854
$$ 553428 605783 304543 733008 529092 706780 -33676 -283943 -42988 313588 467442
9655D67442L94918m92869M15364l58569k18733k9714K84304j30823N02404R866
$$ 467442 862360 369491 784855 426286 207553 177839 462143 331320 833724 843590
9645H43590K73276r74500k304K07180k15820J99314M66331m41152k27888O85509
$$ 843590 1116866 142366 140062 347242 131422 330736 797067 355915 128027 813536
9635H13536J24098n44102j31373J91948k34919N25205o10473P9013M98650k5914
$$ 813536 937634 393532 262159 454107 219188 744393 133920 212933 711583 685669
9625F85669k59775m992L67573r72328K00516M81173N6448o74293Q36594Q9959
$$ 685669 425894 420902 788475 -183853 16663 497836 554284 -120009 716585 806544
9615H06544n88406L7475N67445m11736J9221N6543J6627J24590q1131k93272M57259
$$ 806544 218138 255613 823058 411322 430543 487086 503713 628303 547172 253900 711159
9604G11159l77216o41206P34629L46091O73031j197355l14194k75453Q56615j32732
$$ 711159 333943 -307263 427366 773457 1446488 249133 -65061 -340514 516101 383369
9594C83369m22990K93429N05559o95023J00413N61200j10539P70252j011755j34115
$$ 383369 -39621 253808 759367 64344 164757 725957 615418 1385670 373915 239800
9584B39800J004407l29397k18712o20502Q69468q6332J37179p06066j50701l66837
$$ 239800 1244207 914810 696098 75596 945064 858732 995911 289845 139144 -227693
9574b27693Q98412p2735N17402J89693j405174P98020q51823j9326N83802m06190
$$ -227693 670719 597984 1115386 1305079 -100095 697925 -153898 -173224 410578 4388
9564D388k09010R02706N9865r80543R43159n99049L70208k95125j92437R29452
$$ 4388 -204622 698084 757949 -222594 720565 121516 491724 196599 4162 933614
9554I33614n43101p5088o68354k02848N39454K57288J27409k57681K58126r3901
$$ 933614 390513 315425 -352929 -555777 -16323 240965 368374 110693 368819 274918
9544B74918N86412r86075J88092J43781K23323k5672P69375q47305M79622p03005
$$ 274918 861330 -124745 63347 207128 430451 404779 1174154 326849 806471 103466
9534A03466J5562L70529r86341O85056L11229m80529j95759k71282J110217r32855
$$ 103466 119028 489557 -496784 188272 499501 18972 -176787 -448069 662148 -270707
9524b70707r6788J091246L64066p75709L10652m01551M85330l47705r2913j22966
$$ -270707 -367495 723751 1087817 312108 622760 221209 706539 358834 265921 142955
9514A42955j96676L32515N9510J37906j52152Q21630l36877o48402M52958J41252
$$ 142955 -53721 278794 338304 476210 324058 1145688 808811 160409 613367 754619
9504G54619K37111o27974m77486N71865P7372j05720q19119Q46050q824p7232
$$ 754619 991730 363756 -113730 458135 535507 429787 -389332 456718 447894 370662
9494C70662N14468m47016M12186m47176r76617J127341l24L22675p64307O70909
$$ 370662 885130 438114 850300 403124 -573493 553848 553524 876199 111892 782801
9484G82801O347j18005R31219j131423K12331P43172j194278J60293K55528K21129
$$ 782801 789148 671143 1602362 470939 683270 1426442 232164 392457 647985 869114
9474H69114p30803L97738p62787M98951L90915l56552k68933O74539j9388j80546
$$ 869114 138311 536049 -226738 272213 663128 306576 37643 712182 692794 512248
9464E12248l31532r7918r1172O66801m84257j04274P31061j26044M32597m35420
$$ 512248 180716 82798 -8374 658427 174170 69896 800957 674913 1107510 672090
9454F72090m57817r1211m23086J080177p78927J09968l06748M56575N1502l2566
$$ 672090 214273 123062 -300024 780153 1226 111194 -195554 261021 312523 279957
9444B79957o4183J26929J082370q37671l11233K42409k08243k83660Q24434m53325
$$ 279957 215774 342703 1425073 587402 276169 518578 310335 26675 851109 397784
9434C97784M199l30762k9454k20001M3676J23227O03038K13690o61691Q1105J81208
$$ 397784 401983 71221 41767 -178234 -134558 -11331 591707 805397 143706 224811 406019
9423D06019j69598R1268O06684l12296k66915o48707R47174j28490k28454M17909
$$ 406019 236421 327689 934373 622077 355162 -293545 653629 525139 296685 714594
9413G14594J74914m66228j22768L95676J29878l26354o28719K47683M61394Q02586
$$ 714594 889508 423280 300512 696188 826066 499712 -129007 118676 580070 1382656
9403A382656o69185l45508K06972J20191p0025K51824j249586J308323p50186
$$ 1382656 713471 367963 574935 695126 625101 876925 -372661 935662 185476
9394A85476J51309J163372p35911o20523O30577K3965m16738P08750n65559J21403
$$ 185476 336785 1500157 764246 143723 774300 798265 381527 1090277 524718 646121
9384F46121j62333J4060j57429O50681j77881k33347M9684k49340l03220J99021
$$ 646121 483788 497848 340419 991100 813219 579872 629556 380216 76996 276017
9374B76017o05509Q96542O34014n97294r16980P01802q15397J163554o04918Q8154
$$ 276017 -329492 567050 1201064 603770 -313210 388592 -426805 736749 131831 219985
9364B19985O73921K84823n70553k02967m45913R45926K40328j012955O46510o30787
$$ 219985 893906 1178729 608176 405209 -40704 905222 1145550 132595 779105 148318
9354A48318Q26756m20603m08040j90220L75260l8860N08472r3568m95956m0864
$$ 148318 975074 554471 146431 -43789 331471 292611 801083 707515 211559 170695
9344A70695O34133o09937l90579Q16800l0830K19668j87331m11831M59548q29751
$$ 170695 804828 194891 -195688 621112 590282 809950 622619 210788 670336 -159415
9334a59415O83375p29887N9833L74573Q8273P42435j95074j44080m17753L38758
$$ -159415 523960 -205927 -146094 228479 316752 1059187 864113 720033 302280 641038
9324F41038k25806L29950p65370N93191M2827n11776K3646J085268j242922R49695
$$ 641038 415232 745182 -20188 573003 615830 104054 127700 1212968 -29954 919741
9314I19741o5800m25005l68926R48019q59237L9951m02255j9920R60165j56331
$$ 919741 853941 428936 60010 1008029 148792 188743 -213512 -233432 726733 570402
9304E70402q26495J039072n40542M76527n89943M53501k2839P57229j300214j12174
$$ 570402 -256093 782979 242437 718964 129021 582522 559683 1316912 16698 -95476
9294i5476P88470p70411N38405n23800P69382K14838r21745R32538J62462j89445
$$ -95476 692994 -77417 460988 -62812 706570 921408 -337 932201 1094663 905218
9284I05218r16668j42580M49591p65543P18755N83926j17370k49343N84462n21500
$$ 905218 -11450 -154030 295561 -469982 248773 832699 715329 465986 1050448 528948
9274E28948P30951m61028l13422j180650R72228M3933L49334k03350M13305o69052
$$ 528948 1259899 798871 485449 -695201 277027 320960 670294 466944 880249 211197
9264B11197j15135j44080P49725M35263r45534K83921l75298j23229J92097k91347
$$ 211197 96062 -48018 701707 1136970 191436 475357 100059 -23170 168927 -122420
9254a22420N88322R4450Q8437m20081O83283m78156j73690P10106n45705m08455
$$ -122420 465902 560352 648789 228708 911991 433835 260145 970251 424546 16091
9244A6091k31402L63726K13229Q43641j202628L63401j56077N20803j89861K94099
$$ 16091 -215311 148415 361644 1205285 2657 366058 209981 730784 540923 835022
9234H35022n62465P38369L65629j135982m4331P23804l85482J61401k65181K98900
$$ 835022 272557 1010926 1376555 240573 196242 920046 534564 695965 430784 729684
9224G29684n07198J74418L65503l80944n6203M22290q08642P45258r18845K96784
$$ 729684 222486 396904 762407 381463 325260 747550 -61092 684166 -234679 62105
9214F2105J74250P14719n69259l12913j55882N15145n6837n3893M78997K22945
$$ 62105 236355 951074 381815 68902 -86980 428165 371328 317435 796432 1019377
9204A019377n13890K39748o44878N05242O4152l95982K15873K38915k86852K72429
$$ 1019377 505487 745235 100357 605599 669751 273769 489642 728557 441705 714134
9194G14134m5554l61524N4091Q88832j311925Q00946k5006q14627R24513k48533
$$ 714134 668580 307056 361147 1249979 -61946 739000 713994 -100633 823880 575347
9184E75347J0747r18922q17623J385798N72417K77496l82374k61317r7643k26106
$$ 575347 586094 -332828 -1150451 235347 807764 1085260 702886 441569 343926 117820
9174A17820K91087N645M35327q05272M35578Q2286J75363m36492P12068p20279
$$ 117820 408907 414552 849879 44607 480185 562471 737834 301342 1013410 293131
9164B93131m76569o9322N15587P8039K05133L93745m48263N23396o50057O52869
$$ 293131 -183438 -252760 262827 340866 545999 939744 491481 1014877 364820 1017689
9154A017689o04925k67506L73820O35044j78808K73600j001261M9928J85627k98041
$$ 1017689 412764 145258 519078 1154122 975314 1248914 247653 297581 483208 185167
9144A85167O7582N62931j090008J773864q53034L883j06991k09884J36107Q5198
$$ 185167 252749 815680 -274328 1499536 646502 650385 543394 333510 469617 554815
9134E54815N92589m16615j03526l51146P53477j051204j6381P11205m15617J90995
$$ 554815 1147404 730789 627263 276117 1029594 -21610 -37991 673214 257597 448592
9124D48592l88920O95659R702Q0849n73276N99792j62394k42604m25361J00094
$$ 448592 59672 755331 765033 845882 272606 872398 710004 467400 42039 142133
9114A42133n4153Q95689o3177p63400R24779o29290M31400p58154L52987K34219
$$ 142133 87980 983669 920492 157092 1081871 452581 883981 125827 478814 713033
9104G13033m2465m46618J93494Q00207r12402K88157Q9467r65240R81687o36835
$$ 713033 670568 223950 417444 1217651 305249 593406 682873 -282367 699320 62485
9094F2485l1752J58739K47236p85775J384923j79303L12842k12752l45752k87392
$$ 62485 30733 189472 436708 -349067 1035856 856553 1169395 956643 610891 323499
9084C23499J57454J01236k57535M94709l67759o13K3614m62286P05188n40124
$$ 323499 480953 582189 324654 819363 451604 450991 474605 12319 717507 177383
9074A77383O93290j2906o03948L13480M50667m84975p15195M31641j46788K35496
$$ 177383 870673 857767 253819 567299 1017966 532991 -182204 249437 102649 338145
9064C38145N18063k40631j28175N41750r01766N09604p48011R02830Q31573q34331
$$ 338145 856208 615577 487402 1029152 127386 636990 -111021 791809 1623382 789051
9054G89051l36678J47966p76441R04681J45177j106259O62436k22393j75789O47067
$$ 789051 452373 600339 -176102 728579 873756 -232503 429933 207540 31751 678818
9044F78818J5471l24692N58016o75491m25776P33632J29961o8970j27935K01672
$$ 678818 694289 369597 927613 252122 -173654 559978 689939 620969 493034 694706
9034F94706r00724N41404N28152r01066K05815K62561L83916o55420k0738J60934
$$ 694706 -206018 335386 863538 -37528 168287 430848 814764 159344 138606 299540
9024B99540Q84753o23676p86063M43918R24805o96848l18771P62698m71487m32270
$$ 299540 1184293 560617 -225446 218472 1143277 446429 127658 890356 418869 -13401
9014a3401M49639q8245O15882p00947j34382P30162p85908N12553L45779j05258
$$ -13401 436238 347993 963875 262928 128546 858708 72800 585353 931132 825874
9004H25874n64527n5457K42929Q3011L2034K97839p99578K96378K78919O77199
$$ 825874 261347 205890 448819 531830 563864 861703 62125 358503 637422 1314621
8994A314621j071614n57977O22799L80503o27959L11215m02415Q90878o52146
$$ 1314621 243007 -314970 307829 688332 60373 371588 -30827 860051 207905
8985B07905J080107o73882P8113L99925n28579J20031R27520j445955M27514k53310
$$ 207905 1288012 614130 692243 1092168 563589 683620 1611140 165185 592699 339389
8975C39389O89784n99543o08423M20831J40776P691K12918k64148n4157k92368
$$ 339389 1029173 429630 -178793 242038 382814 390505 603423 339275 285118 -7250
8965g250k79426R00312j89659j63435K82874N63937m13672r60032J046245j004947
$$ -7250 -286676 613636 423977 260542 543416 1107353 693681 -266351 779894 -225053
8955b25053J59107J269794j123553R21806j21232k91321j20200j87982J21078
$$ -225053 -65946 1203848 80295 1002101 880869 589548 469348 281366 402444
8946D02444o21060K49027k9362O44284P83913n83534J0178j37496k53872J42373
$$ 402444 -218616 30411 1049 645333 1429246 845712 855890 718394 464522 606895
8936F06895L16188K44676o23069j29430J15484J2345p07952P86566N2949n4572
$$ 606895 923083 1167759 544690 415260 530744 543089 -164863 621703 674652 620080
8926F20080O0190j045035J599900J35895q42461k9240m00005R47676m69949l56776
$$ 620080 680270 -364765 1235135 1371030 528569 499329 99324 1047000 577051 220275
8916B20275l23727q7385o03544J034745j82356N98010k33257J07545r6630J3335
$$ 220275 -103452 -190837 -794381 240364 58008 656018 422761 530306 433676 447011
8906D47011q77199K24307O23296K59247q6668l11554L16045K66099L2280p73464
$$ 447011 -430188 -205881 417415 676662 589994 278440 594485 860584 892864 119400
8896A19400J84488O79996o21489l10805q3194M21109J41245o2705Q7210l43577
$$ 119400 303888 983884 362395 51590 -31604 389505 530750 468045 555255 211678
8886B11678J84265K72630n03261Q7208L49056q17109O34417L27780j086929K99478
$$ 211678 395943 668573 165312 252520 601576 -215533 418884 746664 -340265 -40787
8876d0787K42962O34306o32799j63155r6987K45168K36338M42160k44885n73242
$$ -40787 202175 836481 203682 40527 -56460 188708 425046 867206 622321 49079
8866D9079p0169J103587n84784M44941p81856q8235J55970Q64330q21257m95553
$$ 49079 -21090 1082497 497713 942654 160798 72563 228533 1092863 271606 -223947
8856b23947J653834q13174l12484N47101r24003J73008J05859J9940K75235O00527
$$ -223947 1429887 616713 304229 851330 -72673 100335 206194 226134 501369 1101896
8846A101896j34982m197q01700j08605N06865m49527J200365o64001N31810r20420
$$ 1101896 966914 962717 161017 52412 559277 109750 1310115 646114 1177924 257504
8836B57504K23724n70443J43504p73078J042241K92756o42281K2203L79662L86882
$$ 257504 481228 -89215 54289 -718789 323452 616208 -26073 -3870 375792 762674
8826G62674q59123P07512R156m6967o23028N8723O95232k89075J58405L481j02628
$$ 762674 -96449 611063 620219 573252 -49776 8947 704179 415104 573509 576990 474362
8815D74362M40680k83752M15888j445429Q38873n35544P56546j12611l31388j62754
$$ 474362 915042 631290 1047178 -398251 440622 -94922 661624 549013 217625 54871
8805E4871j79380O21413M04331p54406K75757J83019K36742j89606j94545o31639
$$ 54871 -124509 496904 901235 146829 422586 605605 842347 652741 458196 -173443
8795a73443O75898m16957M48500k60650j60765R80248o77552n1022N76295o36051
$$ -173443 502455 85498 533998 273348 112583 1092831 415279 364257 940552 304501
8785C04501o5923k7791R9200L84506l24426Q20993q38653K66727J67914q08009
$$ 304501 238578 210787 309987 694493 370067 1191060 352407 619134 787048 -20961
8775b0961n25784J403333m72903Q49556r38977N05458j34797L29937n31254J66349
$$ -20961 -546745 856588 383685 1233241 294264 799722 664925 994862 463608 629957
8765F29957p16597M89182q10437P52308J33219L41869o01506M49509l18901N54427
$$ 629957 -86640 402542 -407895 344413 477632 819501 217995 667504 348603 903030
8755I03030k0572J85374m04332o81370Q92770o28517P74711m03168L14432n20788
$$ 903030 882458 1067832 663500 -17870 874900 246383 1021094 617926 932358 411570
8745D11570N8393j23248L75726K8702o26094N71282m60724P65834j075696R16870
$$ 411570 469963 346715 722441 751143 125049 696331 235607 1001441 -74255 842615
8735H42615n33442P21097k62452k02689J76753o33950M43885n25270M41651R09273
$$ 842615 309173 1030270 767818 565129 741882 107932 551817 26547 468198 1377471
8725A377471o78076l13460O32274l97881j66347J421810r11365K45314j053565
$$ 1377471 699395 385935 1018209 620328 453981 1875791 964426 1209740 156175
8716A56175r7725Q8078K3782j84105L85898R17933j657696R01034L79282j040145
$$ 156175 58450 146528 170310 -13795 372103 1290036 -367660 533374 912656 -127489
8706a27489N71087K79136m23393n96182J366958k77499J21348R44486j955874
$$ -127489 443598 722734 299341 -296841 1070117 792618 913966 1858452 -97422
8697i7422N26186J146151l98860q42769N691J90796O04973K42488m69879N2317
$$ -97422 428764 1574915 1176055 333286 338977 529773 1134746 1377234 907355 959672
8687I59672N27966q19288M72953j38955m21456k62927j49886M42702l33624N06541
$$ 959672 1487638 668350 1141303 1002348 580892 317965 168079 610781 277157 783698
8677G83698p9577M37925m92593j48812N7112l21575j70566j46855J93205J72802
$$ 783698 704121 1142046 649453 500641 557753 236178 65612 -81243 111962 284764
8667B84764k87302k5225J058343k72863j37766q5217l65657M20545m66895r7462
$$ 284764 -2538 -27763 1030580 757717 619951 534734 169077 589622 122727 25265
8657B5265N09626M12379p40003K57566M02131k16613m54135K40209N5141k05684
$$ 25265 534891 947270 207267 464833 866964 650351 196216 436425 491566 285882
8647B85882m6366q6943P21798j36216r1493j45670m27788L27527M25242M12721
$$ 285882 239516 152573 874371 738155 646662 500992 73204 400731 825973 1238694
8637A238694m60278k70900R29993r82110K45496k06666m43820J50285L73803o25624
$$ 1238694 778416 507516 1437509 455399 700895 494229 50409 200694 574497 -51127
8627e1127R7520O01176o35075R39506k05857p006l8344O4645o49779J061582j211831
$$ -51127 46393 647569 12494 952000 746143 739137 700793 765438 115659 1177241 -34590
8616c4590L68083M01037m24469N37659K03286l63006n61973k28382N09433Q9104
$$ -34590 333493 734530 310061 847720 1051006 688000 126027 -102355 407078 496182
8606D96182n075Q7993J69289q5717l2759n60219M24419K5010k52384l7647p3390
$$ 496182 491107 579100 748389 662672 629913 69694 494113 519123 266739 229092 155702
8595A55702l2491n46230J210753o86055n6657N74228K78984r63368K67667o5069
$$ 155702 123211 -423019 787734 101679 45022 619250 898234 -65134 202533 137464
8585A37464O87955m0108n40418j2127L88223L17505j93460r1176m18035K11083
$$ 137464 825419 785311 244893 232766 620989 938494 745034 653858 235823 446906
8575D46906J143470j054819n67687O40022l81913J055152o78401j3475L56118
$$ 446906 1590376 535557 -32130 607892 225979 1281131 602730 589255 945373
8566I45373J72956r03118J98200J99503r76404M73988K81879m55901Q70645o16849
$$ 945373 1118329 215211 413411 612914 -363490 110498 392377 -63524 807121 190272
8556A90272N36959J36795J7053n9007k48676p81889J270159r40080m1885R41729
$$ 190272 727231 864026 881079 822072 573396 -208493 1061666 121586 79701 1021430
8546A021430p76824k23417R31165r95498P05521J28548m39690Q74701q84301M02868
$$ 1021430 244606 21189 952354 -43144 662377 790925 351235 1225936 341635 744503
8536G44503k30089l550832O466491n639757K332946M94352m45827m46600J006762
$$ 744503 514414 -3036418 3430073 -2209684 123262 617614 171787 -274813 731949
8527G31949k38566L51276j26319N84517j158688N35721q31522P50182j50987P9315
$$ 731949 493383 844659 718340 1302857 144169 679890 -151632 598550 447563 526878
8517E26878q3346L69663l57089L3196q5079N19733N72187n49666o88183N45702
$$ 526878 443532 813195 456106 489302 404223 923956 1496143 946477 258294 803996
8507H03996j38964r305r3583k02571O70428l48411j39803J24479K35821k21061
$$ 803996 665032 655727 562144 359573 1030001 681590 541787 666266 902087 681026
8497F81026o25134J98322J167783j346955K45269M99848j3787k11979M59757o77836
$$ 681026 55892 254214 1421997 75042 320311 820159 806372 594393 1054150 376314
8487C76314J40384Q5944j03387M22249o39323j67337O59991o74054n66148P52569
$$ 376314 516698 602642 499255 921504 282181 114844 774835 100781 -465367 287202
8477B87202R04945q29762m06519R96248j22225K84502L19687j050404o13014R61932
$$ 287202 1192147 362385 -44134 952114 829889 1114391 1434078 383674 -229340 732592
8467G32592M43047n95970m1399k18680L9231K30551J56871K19490j082759Q12134
$$ 732592 1175639 579669 538270 319590 358821 589372 746243 965733 -117026 695108
8457F95108k20462q65487M01658L19044J06351j07492j28808N55512K53120m73976
$$ 695108 474646 -390841 10817 329861 436212 328720 199912 755424 1008544 534568
8447E34568J78823J98955o44372K60421p28912O17596n2264J121285o28482n93778
$$ 534568 713391 912346 267974 528395 -200517 417079 364815 1486100 857618 263840
8437B63840L55993j78497r7516L83889M28760n53359j32636L48078o61633L20604
$$ 263840 619833 441336 343820 727709 1156469 603110 470474 818552 156919 477523
8427D77523j67311J02401q2694K66124n73868j67970J148630n42848O89296r11778
$$ 477523 310212 412613 329919 596043 22175 -145795 1002835 459987 1149283 237505
8417B37505j47851O19067j39452P6414p8718M60566q41070K72655k99448n59295
$$ 237505 89654 708721 569269 645683 566965 1027531 186461 459116 159668 -399627
8407c99627J66441O96157m26986M5630q7847R21963m38421N68570m03291R33010
$$ -399627 -233186 462971 35985 81615 -6232 915731 477310 1045880 642589 1575599
8397A575599l32468r88872K78572Q08912o96600M1935j79822J232492j194703
$$ 1575599 1243131 254259 532831 1341743 645143 687078 507256 1739748 545045
8388E45045j25534K60431k20444N83075m38810j89935Q817M38195L1197o49220
$$ 545045 419511 679942 459498 1042573 603763 413828 422645 860840 892037 242817
8378B42817L85120j012461R48378J43169q49574J149858m2408n68964O15988j029074
$$ 242817 627937 -384524 563854 707023 -142551 1007307 964899 395935 1011923 -17151
8368a7151N7008j74826O40973P75012o78736L45436l98853P00893m09217P3783
$$ -17151 39857 -134969 506004 1281016 602280 947716 548863 1249756 840539 914322
8358I14322l3689n42484N46780j121094N83229J73842k11679L47322P33352o35987
$$ 914322 880633 338149 884929 -236165 347064 520906 309227 656549 1389901 753914
8348G53914p05577O62161J56055k94656l61488K23657k87225N04620j83784q1042
$$ 753914 48337 710498 866553 571897 210409 434066 146841 651461 467677 386635
8338C86635p7374m08878J083676k95079L42176q21675R23680j80251J51389J40313
$$ 386635 309261 -99617 984059 688980 1031156 209481 1133161 952910 1104299 1244612
8328A244612j166651N06480M74471K99941r09385O1498J03019j90976n14306J079330
$$ 1244612 77961 584441 1058912 1358853 449468 510966 613985 423009 -91297 988033
8318I88033l36627K89710k34553K67779m55246r944J40969J38663o56345M64872
$$ 988033 651406 941116 706563 974342 519096 509152 650121 788784 132439 597311
8308E97311M48667l2193n25489O00454j6772n41888K81103k51041Q21474j597655
$$ 597311 1045978 1013785 488296 1088750 1071978 530090 811193 560152 1381626 -216029
8298b16029J330492k76061l75189j26400N39765k82289N2933o43053P28178k67681
$$ -216029 1114463 838402 463213 336813 876578 594289 647222 4169 732347 464666
8288D64666m72785J373680p95023P87423k72337l27345k59285j02135M29657j63536
$$ 464666 -8119 1365561 570538 1357961 1085624 758279 498994 396859 826516 662980
8278F62980N97967q20247L2339j9782K81425O5639N60940q04455l39929O46221
$$ 662980 1260947 440700 473039 453257 734682 800321 1361261 556806 216877 863098
8268H63098m99619M60296j32433K02662l35774l26289K08897P86112o24698J04189
$$ 863098 363479 823775 691342 894004 558230 231941 440838 1226950 602252 706441
8258G06441l16058n45658J633979j351726J35854L35541l72981M49455l14793
$$ 706441 390383 -155275 1478704 126978 262832 598373 225392 674847 360054
8249C60054L96878m87300O81880o39665q07591R70445M43678K56436j034341l85983
$$ 360054 756932 269632 951512 311847 -495744 474701 918379 1174815 140474 -245509
8239b45509P83676p10369P263R08049J38383O4121q39774j05415P74855l53615
$$ -245509 538167 -172202 -164939 743110 881493 945614 105840 425 775280 421665
8229D21665r7908J95525k25515K70766P48652j176637O71843O3264j63220k68137
$$ 421665 323757 519282 293767 564533 1313185 136548 808391 871655 708435 440298
8219D40298o5542m6362O59641Q4613k42103P64486j325459J92891P96314N8290
$$ 440298 374756 328394 988035 1072648 830545 1595031 269572 462463 1258777 1317067
8209A317067m81832J2946k9038L05171o05969k8790n01237P12534L37762n7475
$$ 1317067 835235 848181 819143 1124314 518345 489555 -11682 700852 1038614 981139
8199I81139j070490N22326r8733R95800P3256j811846N84758j357646J480875
$$ 981139 -89351 432975 334242 1330042 1403298 -408548 176210 -1181436 299439
8190B99439R55895j62652j047562J334586j47086P35087j736906M95735K65291
$$ 299439 1255334 1092682 45120 1379706 1232620 1967707 230801 726536 991827
8181I91827p43158R59187J81920j135574O1364N24161M98598n05653j172422J251489
$$ 991827 248669 1207856 1389776 254202 315566 839727 1338325 832672 -339750 911739
8171I11739j19208J43924l74324M74278m16779K7424J8026P71596l96112j303167
$$ 911739 792531 936455 562131 1036409 619630 647054 665080 1436676 1040564 -262603
8161b62603O27685k2737K32330M14905p13207J127077j163405O56148N19112n82565
$$ -262603 365082 342345 574675 989580 276373 1403450 240045 896193 1415305 832740
8151H32740k0032Q0501N82433j054533K96089l01452M40271J15329j02035N7891
$$ 832740 812708 893209 1475642 421109 717198 415746 856017 971346 869311 927202
8141I27202j07871j86195k93593L81346K03057K14705p99268L24269k81514O63714
$$ 927202 819331 633136 339543 720889 923946 1138651 339383 663652 382138 1045852
8131A045852j970o62989J25100P59767p64664O30710q04596j67993J154663r85447
$$ 1045852 1043882 380893 505993 1265760 501096 1131806 327210 159217 1313880 328433
8121C28433N15296o1932j69384j36809J27150J4543m44298N43598K34379M6148
$$ 328433 843729 781797 612413 475604 602754 617297 172999 716597 950976 997124
8111I97124K21706r86667O99385l7527n03812J172905n75907p38241R02976r13870
$$ 997124 1218830 232163 931548 894021 390209 1563114 987207 248966 1151942 238072
8101B38072N98830L2690L5613N11133k93789j07726k00195J04605l78065l28853
$$ 238072 836902 869592 905205 1416338 1122549 1014823 814628 919233 541168 212315
8091B12315j76603J44942K0691P40958n17829n46850M25024J023174p62860r6439
$$ 212315 35712 180654 201345 942303 424474 -122376 302648 1325822 562962 466523
8081D66523O68460n32904k75362L11305k1058l3662O03163l91801n55214Q86746
$$ 466523 1134983 602079 326717 638022 616964 583302 1186465 794664 239450 1126196
8071A126196n85536k90503o0678J020391j380788R27599r50224J174436l24414
$$ 1126196 540660 250157 189479 1209870 -170918 756681 -193543 980893 656479
8062F56479L40781n20114O00976P9239n99526P279k38197k82291Q13170k35162
$$ 656479 997260 477146 1078122 1157361 557835 565114 326917 44626 857796 622634
8052F22634J47314n73340J20817M30882q1395K43161l47541j47542O14116r69194
$$ 622634 769948 196608 317425 748307 666912 910073 562532 414990 1029106 59912
8042E9912L30856K92054J20844J1560p49754J242592k20184m67265l6448R66840
$$ 59912 390768 682822 803666 815226 65472 1308064 1087880 620615 584167 1551007
8032A551007r54535l97825M49808N93272o52773N66386k63333K28996q6322R5304
$$ 1551007 596472 198647 648455 1241727 588954 1155340 892007 1121003 1034681 1129985
8022A129985P6111l03695o12190J022725p88454O89514r29269P69702M09446j055226
$$ 1129985 1206096 902401 290211 1312936 524482 1213996 284727 1054429 1463875 408649
8012D08649R98958l44670l62996k27185l0187K08339K88735J51873J63111k08470
$$ 408649 1407607 1062937 699941 472756 442569 650908 939643 1091516 1254627 1046157
8002A046157j094219J471426k99528j69761m87737L63341P1295J94303r93961
$$ 1046157 -48062 1423364 1123836 954075 466338 829679 900974 1095277 101316
7993A01316j1172L91231O26025r84118J71596L81894K5458K42856l6569l77140
$$ 101316 90144 481375 1107400 123282 294878 676772 702230 945086 908517 531377
7983E31377J89560Q5718J58121k64052o98094K56271M8074J11160o20758R50664
$$ 531377 720937 806655 964776 700724 2630 258901 306975 418135 -202623 748041
7973G48041L75459m97460L22013n26438R36212R857m23587j84757n8852m53166
$$ 748041 1123500 626040 948053 421615 1357827 1367684 944097 759340 700488 247322
7963B47322J123322n79347O72523q03157R07376r5221q93531N447N99467m07539
$$ 247322 1370644 791297 1463820 660663 1568039 1472818 579287 584734 1184201 776662
7953G76662J58193n07696O8337N37825l79186l4639j48140L92961m01272j86543
$$ 776662 934855 427159 495496 1033321 654135 619496 471356 864317 463045 276502
7943B76502J74631N75623n73335N01485k61047j4963L18053K59993n9841M85251
$$ 276502 451133 1026756 453421 954906 693859 678896 996949 1256942 1197101 1682352
7933A682352j247092k87726L29590L54101N46818p18917K35778Q3579k74476L46350
$$ 1682352 435260 147534 477124 831225 1378043 659126 894904 978483 704007 1050357
7923A050357j54714j43753M08473o3816n99159L95221N6292m81714P40341j031827
$$ 1050357 895643 751890 1160363 1096547 497388 892609 948901 467187 1207528 175701
7913A75701O37529K71191K99000l16089n33825J06789K32283o1481N93441q56185
$$ 175701 813230 1084421 1383421 1067332 533507 640296 872579 811098 1404539 548354
7903E48354M45963N78229n07120o76821K41282Q93309m86978l24907r5957P81259
$$ 548354 994317 1572546 1065426 388605 629887 1523196 1036218 711311 615354 1396613
7893A396613N47781r02472K33927J05495L90172k82164q60448K03773N77304P64703
$$ 1396613 1944394 1041922 1275849 1381344 1771516 1489352 628904 832677 1409981 2174684
7883B174684q10895j89723J300521q67197N04456k29550J64809R23693l09342
$$ 2174684 1363789 1174066 2474587 1607390 2111846 1882296 2047105 2970798 2661456
7874B661456J01814L537R8521L72617n27574k66277N71384l3234k45157P59894
$$ 2661456 2763270 2766807 2865328 3237945 2710371 2444094 3015478 2982244 2737087 3496981
7864C496981p34188j37641P28365j77682L28240J85172m8793N32894k93181j11822
$$ 3496981 2762793 2625152 3353517 3175835 3504075 3689247 3640454 4173348 3880167 3768345
7854C768345N71064k37057Q3086j29029M81563k601192K740475k75626J058974
$$ 3768345 4339409 4102352 4185438 4056409 4537972 1936780 4677255 4401629 5460603
7845E460603j581629L01917J66636q45797n30405M72824m80374n1372q22626j65666
$$ 5460603 3878974 4180891 4347527 3501730 2971325 3444149 2963775 2912403 2089777 1924111
7835A924111N11579r4338L20597o71075l2911Q6017K56523o86244k19556J4228
$$ 1924111 2435690 2341352 2661949 1990874 1957963 2043980 2300503 1614259 1394703 1408931
7825A408931m95433L50989j33827N42125m96322Q5157m3387o33950R53312m44611
$$ 1408931 913498 1264487 1130660 1672785 1176463 1261620 1218233 584283 1537595 1092984
7815A092984N88809j027316O03620l98519O22310q55645M4813J30438Q1236o07399
$$ 1092984 1681793 654477 1258097 859578 1481888 626243 671056 801494 882730 275331
7805B75331K23152O19966p6962o45682O11425O9458m84635K73932j55519O47339
$$ 275331 498483 1118449 1041487 395805 1007230 1076688 592053 865985 710466 1357805
7795A357805J185821j938302L85507k48689N61428R2699l11839m50473M66971
$$ 1357805 2543626 605324 990831 742142 1303570 1396269 1084430 633957 1100928
7786A100928k02939m72276R84877J8473k08381N27764n90366l96628n04116j57065
$$ 1100928 897989 425713 1410590 1429063 1220682 1748446 1158080 761452 257336 100271
7776A00271R01118R42974j011541l18343M89622J28881k56888j7418m3628L71381
$$ 100271 1001389 1944363 932822 614479 1104101 1232982 976094 958676 915048 1286429
7766A286429K28131k11810j05678j89390P64031m04268k05454J99255M22274j134515
$$ 1286429 1514560 1302750 1197072 1007682 1771713 1367445 1161991 1361246 1783520 649005
7756F49005R68250m44158j58632n604J394399j249833O92050m16174p09946J17550
$$ 649005 1617255 1173097 1014465 1008861 2403260 1153427 1845477 1429303 719357 836907
7746H36907J0415R03799o66847j60538K46907j39041J07148n1100o71988P20197
$$ 836907 847322 1751121 1084274 923736 1170643 1031602 1138750 1087650 415662 1135859
7736A135859J42399q74409J053996q19859J137923k58015m80391L62363r0737
$$ 1135859 1278258 403849 1457845 637986 1775909 1517894 1037503 1399866 1309129
7727A309129N07029J80198p79624n9501N01681n57526Q9831M13074o36210N94750
$$ 1309129 1816158 1996356 1216732 1157231 1658912 1101386 1191217 1604291 968081 1562831
7717A562831k9813j327302K92432J288096o33481n93439J019073j059912K84809
$$ 1562831 1533018 205716 498148 1786244 1152763 559324 1578397 518485 803294
7708H03294L30038K25718Q31075q42863P284M51889l25891Q38780p24387r0137
$$ 803294 1133332 1359050 2190125 1347262 1354546 1806435 1480544 2319324 1594937 1504800
7698A504800l01573Q5807N34556j223384R88751k24450K84776O40329j319095
$$ 1504800 1203227 1289034 1823590 600206 1588957 1364507 1649283 2289612 970517
7689I70517P37371k05219n78273L21374J44432p23423k75024J194800K09159j30815
$$ 970517 1707888 1502669 924396 1245770 1390202 666779 391755 1586555 1795714 1664899
7679A664899R0494p09026O22103j97495m42243k77480m01072J294362k28223j33050
$$ 1664899 1755393 1046367 1668470 1470975 1028732 751252 350180 1644542 1416319 1283269
7669A283269M15695P19005r43000l8071k12178l51903J0208Q81363j54084j60506
$$ 1283269 1698964 2417969 1474969 1436898 1224720 872817 883025 1764388 1610304 1449798
7659A449798l63575J60770l97588m89441R99123K83417l42394L75480L47946l46750
$$ 1449798 1086223 1246993 849405 359964 1359087 1642504 1300110 1675590 2023536 1676786
7649A676786l49326p30493O65787P28829q91786N95186k03570N67937n48397J16392
$$ 1676786 1327460 596967 1262754 1991583 1099797 1694983 1491413 2059350 1510953 1627345
7639A627345l9797r57580N77567J71219K00957P41974p19228o49086N76600J85113
$$ 1627345 1587548 629968 1207535 1378754 1579711 2321685 1602457 953371 1529971 1715084
7629A715084j86504o13150N50609k20073J44149l54489R33184o02498Q43239m73700
$$ 1715084 1528580 915430 1466039 1245966 1390115 1035626 1968810 1366312 2209551 1735851
7619A735851J50967j65241m31298l0783K21366Q39323o52782J10851n24668O97067
$$ 1735851 1886818 1721577 1290279 1259496 1480862 2320185 1667403 1778254 1253586 1950653
7609A950653o89962J146373m67603K96262J97969q92638L63987K05771l52985
$$ 1950653 1260691 2407064 1939461 2235723 2433692 1541054 1905041 2110812 1757827
7600A757827O13895j021620M35329J09675o73573J007470Q4072n48071K93549
$$ 1757827 2371722 1350102 1785431 1895106 1221533 2229003 2313075 1765004 2058553
7591B058553l00222p2514J060278p84030J27997o8862Q8671l6933j27459n16116
$$ 2058553 1758331 1685817 2746095 1962065 2090062 2021200 2109871 2072938 1945479 1429363
7581A429363L47332L10391M91833n73994J94362P86998j461661m5579M61235M25358
$$ 1429363 1776695 2087086 2578919 2004925 2199287 2986285 1524624 1479045 1940280 2365638
7571B365638l27562M81m7204K66482m01038O08311m10601m87102N07892J329403
$$ 2365638 2038076 2038557 1991353 2257835 1856797 2465108 2054507 1567405 2075297 3404700
7561C404700o59913l82310o1029j77473J03831J046302q08090q52511O33179M09358
$$ 3404700 2744787 2362477 2301448 2123975 2227806 3274108 2466018 1613507 2246686 2656044
7551B656044L1396n29481L13445P27354o24649n3404n05707J044911o33714R88815
$$ 2656044 2687440 2157959 2471404 3198758 2574109 2520705 2014998 3059909 2426195 3415010
7541C415010q62184J58028p27723J091613j48210k78379l79912L28623J100528
$$ 3415010 2552826 2710854 1983131 3074744 2926534 2648155 2268243 2596866 3697394
7532C697394o28915o2030j06062N05368j25988J72003m93900l9362O19380J6386
$$ 3697394 3068479 3006449 2900387 3405755 3279767 3451770 2957870 2918508 3537888 3554274
7522C554274m86313O81234k03596P89877q68340m95866O41003K8681J054672k30995
$$ 3554274 3067961 3749195 3545599 4335476 3467136 2971270 3612273 3640954 4695626 4464631
7512D464631o17625N37207L00218R2123k77211J32390K17110J69885j89718J270839
$$ 4464631 3847006 4384213 4684431 4776554 4499343 4631733 4848843 5018728 4829010 6099849
7502F099849l68048L7474k11088N40436K8028M98431N0873M04679o04711N58633
$$ 6099849 5731801 5769275 5558187 6098623 6126651 6625082 6675955 7080634 6475923 7034556
7492G034556Q93937o53548Q40068k76128K82268P33236R19224n76009J414277
$$ 7034556 7928493 7274945 8115013 7838885 8121153 8854389 9773613 9197604 10611881
7483A0611881L0207j62268R93971M64027L01367O93106J314199M40961J76880
$$ 10611881 10642088 10479820 11473791 11937818 12239185 12932291 14246490 14687451 14864331
7474A4864331M11935Q72676O33798N80353J562389L43062L68061J136212P51500
$$ 14864331 15276266 16148942 16782740 17363093 18925482 19268544 19636605 20772817 21524317
7465B1524317R55663J098553Q99590J440639K21298J751842P14612Q53429K402398
$$ 21524317 22479980 23578533 24478123 25918762 26140060 27891902 28606514 29459943 31862341
7456C1862341R87951R20066O99359J461048J117491K36490P55764J497375J452980
$$ 31862341 32850292 33770358 34469717 35930765 37048256 37284746 38040510 39537885 40990865
7447D0990865J424448R13050Q17696L55970M07840J295463J371122j50115J505794
$$ 40990865 42415313 43328363 44146059 44502029 44909869 46205332 47576454 47426339 48932133
7438D8932133O44518j71101N51543R55181p7743R19005P74007o57652N15191K47715
$$ 48932133 49576651 49405550 49957093 50912274 50834531 51753536 52527543 51869891 52385082 52632797
7428E2632797O0301M43848M97054L38893N22810k14048P31153P56898J09454Q29665
$$ 52632797 52693098 53136946 53634000 53972893 54495703 54281655 55012808 55769706 55879160 56708825
7418E6708825P64733p84009J308862N49102Q28035Q5754R17421P4642J47805R41830
$$ 56708825 57473558 56689549 57998411 58547513 59375548 59461302 60378723 60453365 60601170 61543000
7408F1543000J340090j146894M8517k93006N17215j036460J092744k84357j032644
$$ 61543000 62883090 61736196 61784713 61491707 62008922 60972462 62065206 61780849 60748205
7399F0748205m09353l02504o5245q88833M22041n12664o99204m35466L06901m64672
$$ 60748205 60338852 60036348 59971103 59082270 59504311 58991647 58292443 57856977 58163878 57699206
7389E7699206k9268q74427k92669N71783p37801K17963J362474L1541o41757R74333
$$ 57699206 57669938 56795511 56502842 57074625 56336824 56554787 57917261 57948802 57307045 58281378
7379E8281378j77648O48200N94650J185474n60822P76506J82602J62692L70553
$$ 58281378 58103730 58751930 59346580 60532054 59971232 60747738 60930340 61093032 61463585
7370F1463585J009382j60740J160554k93312j85180m24756l18859L31479j22155
$$ 61463585 62472967 62312227 63472781 63179469 62994289 62569533 62250674 62582153 62459998
7361F2459998k89492p58903o4522l28122m67338j23157r312j610070K37388m84914
$$ 62459998 62170506 61411603 61347081 61018959 60551621 60428464 60419152 58809082 59046470 58561556
7351E8561556k98475o00606o78048o70730q10713n73239r68759j227028j58075
$$ 58561556 58263081 57662475 56984427 56313697 55502984 54929745 53960986 52733958 52575883
7342E2575883j152296j311594p12681n13682j832467l38666j123688j323008J45911
$$ 52575883 51423587 50111993 49399312 48885630 47053163 46714497 45590809 44267801 44413712
7333D4413712j398311j049550m69205j535694r13541M34280k98007j631299q07709
$$ 44413712 43015401 41965851 41496646 39960952 39047411 39481691 39183684 37552385 36744676
7324C6744676j090018l08556k7624j117875n00966j127674K05670r97945q41790
$$ 36744676 35654658 35346102 35318478 34200603 33699637 32571963 32777633 31779688 30937898
7315C0937898j754017j556758j188453m00600j770164j144020P6089j510105r79436
$$ 30937898 29183881 27627123 26438670 26038070 24267906 23123886 23199975 21689870 20710434
7306B0710434m17215j811501o40099r3655j444098N39799p34926o50090p02915
$$ 20710434 20293219 18481718 17841619 17747964 16303866 16843665 16108739 15458649 14755734
7297A4755734K11219j113539p31813K63243o50820l8803o999O20204r56545j221436
$$ 14755734 14966953 13853414 13121601 13384844 12734024 12695221 12688222 13308426 12351881 11130445
7287A1130445k52043l14495n7655m74181P16936N52994n09861j54792p5386j919465
$$ 11130445 10878402 10563907 10506252 10032071 10749007 11302001 10792140 10637348 10561962 8642497
7277H642497P82423l08859j97865n34815P50088K76267n37419k47984N28790j284282
$$ 8642497 9424920 9116061 8918196 8383381 9133469 9409736 8872317 8624333 9153123 7868841
7267G868841J51949L02802j846l69671K22755o30325L68388q09299O07174m39581
$$ 7868841 8020790 8323592 8321746 7952075 8174830 7544505 7912893 7103594 7710768 7271187
7257G271187L590J233Q39897j502270P7805K32539r75436N73120R59470m69590
$$ 7271187 7274777 7276010 8115907 6613637 6691442 6923981 5948545 6521665 7481135 7011545
7247G011545r7658l49769k80857j24148Q7240n6902M76149J46749m49975k26801
$$ 7011545 6913887 6564118 6283261 6159113 6246353 6189451 6665600 6812349 6362374 6135573
7237F135573J79108q20104J289139r04055L43498o15205L92682m55959M55555
$$ 6135573 6314681 5494577 6783716 5879661 6223159 5607954 6000636 5544677 6000232
7228F000232r0327j11180r6989P32881j77369n26027m38732L58933J089041j367084
$$ 6000232 5909905 5798725 5701736 6434617 6257248 5731221 5292489 5651422 6740463 5373379
7218E373379J131008r18573k69841N21661K50737m93389M11686M37745J32681
$$ 5373379 6504387 5585814 5315973 5837634 6088371 5594982 6006668 6444413 6577094
7209F577094p64872M92758j79124O35588j187348N34550n53378K07700K47778
$$ 6577094 5812222 6304980 6125856 6761444 5574096 6108646 5555268 5762968 6010746
7200F010746n29600N38368O16861m63769N19010j274652j39283P52108m48089
$$ 6010746 5481146 6019514 6636375 6172606 6691616 5416964 5277681 6029789 5581700
7191E581700j05961o55482K32201K41754k57426n32077Q17626j347422M80890
$$ 5581700 5475739 4820257 5052458 5294212 5036786 4504709 5322335 3974913 4455803
7182D455803K71457p14839o36371J073015M19939n0905n79456L5476J72348j75880
$$ 4455803 4727260 4012421 3376050 4449065 4869004 4818099 4238643 4274119 4446467 4270587
7172D270587J634091r56313J23794n52828n68543J485441q39163p27644L67007
$$ 4270587 5904678 4948365 5072159 4519331 3950788 5436229 4597066 3869422 4236429
7163D236429L48807p12543K59460Q04246q9108l16356O14388j299357P84439P76326
$$ 4236429 4585236 3872693 4132153 4936399 4847291 4530935 5145323 3845966 4630405 5406731
7153E406731r48365k00753m92636J11431N15373q9520J28713K58176R8532j62043
$$ 5406731 4458366 4257613 3764977 3876408 4391781 4302261 4430974 4689150 4787682 4625639
7143D625639K4530q7690j52229Q31944Q9899n77259M59500o50748J070921n70104
$$ 4625639 4650169 4562479 4410250 5242194 5332093 4754834 5214334 4563586 5634507 5064403
7133E064403m00706R52677j468407M48525L10289J040552j337062J055559l4267
$$ 5064403 4663697 5616374 4147967 4596492 4906781 5947333 4610271 5665830 5631563
7124E631563j49997K59564l78611N40472o62079j22703O96970M78749r3503P5793
$$ 5631563 5481566 5741130 5362519 5902991 5240912 5118209 5815179 6293928 6200425 6276218
7114F276218r5649R6694J80647L17083N40721p28584j73340K61784M75494L87559
$$ 6276218 6180569 6277263 6457910 6774993 7315714 6587130 6413790 6675574 7151068 7538627
7104G538627K68303R7065l90450J5236P43553j85994j09170P08313j58203r3963
$$ 7538627 7806930 7903995 7513545 7528781 8272334 8086340 7977170 8685483 8527280 8433317
7094H433317M61388n73550J66741O80057O26254k59371j50049L03013M78198m16423
$$ 8433317 8894705 8321155 8487896 9167953 9794207 9534836 9384787 9687800 10165998 9749575
7084I749575O97906L53328k43940J53373J249589r23176L09488P46927j99171
$$ 9749575 10447481 10800809 10556869 10710242 11959831 11036655 11346143 12093070 11893899
7075A1893899J030956q86799J347170j6132j58993N45013j03078J163441m84225
$$ 11893899 12924855 12038056 13385226 13369094 13210101 13755114 13652036 14815477 14331252
7066A4331252Q54360k02902j30888N55049O76920L2591J067726L4809Q2337M36818
$$ 14331252 15185612 14982710 14851822 15406871 16083791 16116382 17184108 17218917 17301254 17738072
7056A7738072K20052O46021Q76682m03804Q57339J91472j68147M59288J01090
$$ 17738072 17958124 18604145 19480827 19077023 19934362 20125834 19957687 20416975 20518065
7047B0518065m66325R90012m24425l45593P68394L70554j26149N4272l10115j08087
$$ 20518065 20051740 21041752 20617327 20271734 21040128 21410682 21284533 21338805 21028690 20920603
7037B0920603j9927R14840m47036P17098p45116J138040N3092J036754k05166
$$ 20920603 20900676 21815516 21368480 22085578 21340462 22478502 22531594 23568348 23363182
7028B3363182K79926J049849l53723N84767P34314M68608j30876J285437j20851
$$ 23363182 23643108 24692957 24339234 24924001 25658315 26126923 25996047 27281484 27160633
7019B7160633J25039n66161Q21511r0777P29740Q40456o75090m22207J58357p59126
$$ 27160633 27285672 26719511 27541022 27450245 28179985 29020441 28345351 27923144 28081501 27322375
7009B7322375P89019j128621Q73653j205080K85008j99890m64873L76538N36038
$$ 27322375 28111394 26982773 27856426 26651346 26936354 26736464 26271591 26648129 27184167
7000B7184167J08849L87766q25023J131487L79949m7058J033859j79861N59119
$$ 27184167 27293016 27680782 26855759 27987246 28367195 28320137 29353996 29174135 29733254
6991B9733254O00416l14940J930794N77921p5102J578525J36406R77343P78172
$$ 29733254 30333670 30018730 31949524 32527445 32452343 34030868 34167274 35144617 35922789
6982C5922789J125872J173098Q13814N46856J047601O88811J235283J190961P36426
$$ 35922789 37048661 38221759 39035573 39582429 40630030 41318841 42554124 43745085 44481511
6973D4481511M78249K003304P94926J036208O5057J735989J009938N76088K87123
$$ 44481511 44959760 46963064 47757990 48794198 48859255 50595244 51605182 52181270 52468393
6964E2468393J155714M82999P00897J336890J702458J68941J241646J993815l08699
$$ 52468393 53624107 54107106 54808003 56144893 57847351 58016292 59257938 61251753 60943054
6955F0943054J778002m76467K119925J781549O41269J040402R65126J442997O87440
$$ 60943054 62721056 62244589 64364514 66146063 66787332 67827734 68792860 70235857 70923297
6946G0923297J855090l31537J751148P18184M48341O94119K09883P21078O83146
$$ 70923297 72778387 72446850 74197998 74916182 75364523 76058642 76268525 76989603 77672749
6937G7672749J25850L40233N12026j68736J186227N09432r0593R08735L78074
$$ 77672749 77798599 78138832 78650858 78482122 79668349 80177781 80087188 80995923 81373997
6928H1373997K88051K40006O38061J09006N21158M98564P11221J157697j81677
$$ 81373997 81662048 81902054 82540115 82649121 83170279 83668843 84380064 85537761 85356084
6919H5356084j19553J58159O43365J41974O0915k74459p3692o12318l83817p79068
$$ 85356084 85236531 85394690 86038055 86180029 86240944 85966485 85892793 85280475 84896658 84117590
6909H4117590R6349n06862j2035p62824l84906L91510r90911K21842k46796p73376
$$ 84117590 84213939 83707077 83695042 82932218 82547312 82938822 81947911 82169753 81922957 81149581
6899H1149581m62751l73428M12179l06202J126953o88747n72230P66252J7838
$$ 81149581 80686830 80313402 80725581 80419379 81546332 80857585 80285355 81051607 81069445
6890H1069445J67312N61538k97731L37889M92297J56550K47177j98109l67960
$$ 81069445 81236757 81798295 81500564 81838453 82330750 82487300 82734477 82536368 82168408
6881H2168408N64602K34315P59811n73613R52479J70786P05467R19751M2623r2003
$$ 82168408 82733010 82967325 83727136 83153523 84106002 84276788 84982255 85902006 85944629 85852626
6871H5852626J56498P1642P69376L8838l07791R51101J213616l82208J284282
$$ 85852626 86009124 86080766 86850142 86888980 86581189 87532290 88745906 88363698 89647980
6862H9647980O733N5909J46843N47460K05743L90887P30119k58505J058702R59537
$$ 89647980 89654713 89710622 89857465 90404925 90610668 91001555 91731674 91473169 92531871 93491408
6852I3491408k34625P30395M54827R1252o10418J211255Q50817n84388L70336
$$ 93491408 93256783 93987178 94442005 94533257 93922839 95134094 95984911 95400523 95770859
6843I5770859m4275m95657M84552n89839N19251k72777J075329k12083P78812
$$ 95770859 95726584 95230927 95715479 95125640 95644891 95372114 96447443 96235360 97014172
6834I7014172R76101J005985J340105J452192J140637J645694J654708L499673
$$ 97014172 97990273 98996258 100336363 101788555 102929192 104574886 106229594 109729267
6826A09729267K543872K759973N255998M023277M218917N136614O890242N579783
$$ 109729267 112273139 115033112 120289110 124312387 128531304 133667918 140558160 146137943
6818A46137943M249308O069977O605818M168675N046338O784567O032889O917780
$$ 146137943 150387251 156457228 163063046 167231721 172278059 179062626 185095515 192013295
6810A92013295R646120P488017Q651880R471951R469236P126468J1391347P710468
$$ 192013295 201659415 209147432 217799312 227271263 236740499 243866967 255258314 262968782
6802B62968782J0273395J0321434J0275438R933467J0406366J1436610J0371131
$$ 262968782 273242177 283563611 293839049 303772516 314178882 325615492 335986623
6795C35986623J1723139J2053085J0138388J0603523J1164326Q970207O537452
$$ 335986623 347709762 359762847 369901235 380504758 391669084 400639291 407176743
6788D07176743N880428j477142n374434j2051298j8014711k4838628l0765876
$$ 407176743 413057171 411580029 406205595 394154297 376139586 351300958 320535082
6781C20535082l2544612k7674585k1627664j8459715j4581659j2121038r841797
$$ 320535082 287990470 260315885 238688221 220228506 205646847 193525809 183684012
6774A83684012p194297p025807n660756n741297m695616l661686l753223k994173
$$ 183684012 176489715 169463908 163803152 158061855 153366239 149704553 145951330 142957157
6766A42957157l369945l233822k666026k260924l013216k425246k881990k522672
$$ 142957157 139587212 136353390 133687364 131426440 128413224 125987978 123105988 120583316
6758A20583316j610888k019321j905592j519918k553967j472242j522333j851243
$$ 120583316 118972428 116953107 115047515 113527597 110973630 109501388 107979055 106127812
6750A06127812j256467j142758n29851j803193l10930p88272m6997k31619m77386
$$ 106127812 104871345 103728587 103198736 101395543 101084613 100296341 100249344 100017725 99540339
6741I9540339l80721k99150J70527j548298K16758p19057j061353L80265k42972
$$ 99540339 99159618 98860468 99030995 97482697 97699455 96980398 95919045 96299310 96056338
6732I6056338j438304J05037R2610j000611q16330p81287n9547j609589n27805
$$ 96056338 94618034 94723071 94815681 93815070 92998740 92217453 92157906 90548317 90020512
6723I0020512r86856P5806o55189Q6010J72250o70541O9336p70398J53517L82322
$$ 90020512 89033656 89109462 88454273 88540283 88712533 88041992 88111328 87340930 87494447 87876769
6713H7876769j23369k1433m61232R70946r4340k11372l98041j89795k97312m43712
$$ 87876769 87753400 87731967 87270735 88241681 88147341 87935969 87537928 87348133 87050821 86607109
6703H6607109m76025m15666j316228j14889j029771o47226j171036q30299j178770
$$ 86607109 86131084 85715418 84399190 84284301 83254530 82607304 81436268 80605969 79427199
6694G9427199r49899j77889j121219j150432r46272l22079p17201r67953n56217
$$ 79427199 78477300 78299411 77178192 76027760 75081488 74759409 74042208 73074255 72518038
6685G2518038j222925j74083k74463j260840N9204j359682l71521m21397q64917
$$ 72518038 71295113 71121030 70846567 69585727 69644931 68285249 67913728 67492331 66627414
6676F6627414k94593j581652j579511j159624o99559j259954j488816q11708j734460
$$ 66627414 66332821 64751169 63171658 62012034 61312475 60052521 58563705 57751997 56017537
6667E6017537k086703r02669j324836j461348j644276q35586m92930j347667j277591
$$ 56017537 53930834 53028165 51703329 50241981 48597705 47762119 47269189 45921522 44643931
6658D4643931o10958j370571m12106p09815j173906q32251j038494p1336j347412
$$ 44643931 44032973 42662402 42250296 41540481 40366575 39534324 38495830 38424494 37077082
6649C7077082k02965j363996j80166k066043J63212j069716n11829q09035r84673
$$ 37077082 36874117 35510121 35329955 33263912 33427124 32357408 31845579 31036544 30051871
6640C0051871p51156J59570j814950q01951m85068n02249j299253j98721o54021
$$ 30051871 29300715 29460285 27645335 26843384 26358316 25856067 24556814 24358093 23704072
6631B3704072j010956j87295q62759j38910j079817K79179o64363o70872K60423
$$ 23704072 22693116 22505821 21643062 21504152 20424335 20703514 20039151 19368279 19628702
6622A9628702j554037Q88065k09151j7602j000469p25506l32188l41754O66500
$$ 19628702 18074665 18962730 18753579 18735977 17735508 17010002 16677814 16336060 17002560
6613A7002560m14052j152464M01614k68603l77574J33328l44680r9499j486664
$$ 17002560 16588508 15436044 15837658 15569055 15191481 15324809 14980129 14880630 13393966
6604A3393966k5763N15559n16235k5862l90359k1367J29213m29650j81843o5417
$$ 13393966 13368203 13883762 13367527 13341665 12951306 12929939 13059152 12629502 12447659 12382242
6594A2382242m07454j68586M06283m31925Q43413j190854m46628o78944O83020
$$ 12382242 11974788 11806202 12212485 11780560 12623973 11433119 10986491 10307547 10990567
6585A0990567N21691o20316L96771O7122j641776J337816q06639J99193n32153
$$ 10990567 11512258 10891942 11288713 11355835 9714059 11051875 10245236 10444429 9912276
6576I912276R9071p79727R16943j126113k3678L35448m37156j82369K57676k43888
$$ 9912276 10011347 9231620 10148563 9022450 8998772 9334220 8897064 8714695 8972371 8728483
6566H728483Q85126q65164M13878j128755J78627M62239j021044P51706j91949
$$ 8728483 9613609 8748445 9162323 8033568 8212195 8674434 7653390 8405096 8213147
6557H213147K66796n28290L67385n85713L10625k38623K2212k50301J89501m55249
$$ 8213147 8479943 7951653 8319038 7733325 8043950 7805327 7827539 7577238 7766739 7311490
6547G311490N1040o29640N13011M68625j275577n00207Q86924n05216R45621m05857
$$ 7311490 7362530 6732890 7245901 7714526 6438949 5938742 6825666 6320450 7266071 6860214
6537F860214k58198P7012J67394n24103J18012N2381k2110l68638K21444N17567
$$ 6860214 6602016 6679028 6846422 6322319 6440331 6492712 6470602 6101964 6323408 6840975
6527F840975p38072m0070M36170o93575p49050P7398J321436p15962O17446l71910
$$ 6840975 6102903 6062833 6499003 5805428 5056378 5133776 6455212 5739250 6356696 5984786
6517E984786n9695o78968N56279o5951l9782M2618n57019J35261M0500j40080
$$ 5984786 5925091 5246123 5802402 5736451 5696669 5739287 5182268 5317529 5358029 5217949
6507E217949m77618L34936n9979q2877j34610K1464Q91866r50300M60755q77203
$$ 5217949 4740331 5075267 5015288 4932411 4797801 4819265 5711131 4760831 5221586 4344383
6497D344383M35556p19615O28029O08578l82379J858M93539j070581P03764q98530
$$ 4344383 4779939 4060324 4688353 5296931 4914552 4916410 5409949 4339368 5043132 4144602
6487D144602O54726M3566Q3621o68981L11624l71875R58847j23270m02668j74729
$$ 4144602 4799328 4842894 4926515 4257534 4569158 4197283 5156130 5032860 4630192 4455463
6477D455463k60904M90538j4764m98603L76968k06874l8363N87555j006057O1040
$$ 4455463 4194559 4685097 4670333 4171730 4548698 4341824 4303461 4891016 3884959 3945999
6467C945999k43014K15972N27809n36695L06088m10190j12745J33340q92840J478336
$$ 3945999 3702985 3918957 4446766 3910071 4216159 3805969 3693224 3826564 2933724 4412060
6457D412060o60069p48322P33276L6826m79040K83406J36143L47208J1602l13353
$$ 4412060 3751991 3003669 3736945 3773771 3294731 3578137 3714280 4061488 4073090 3759737
6447C759737m9359l68104N83251n50731L12906N20403j013548J40851k34219j32378
$$ 3759737 3710378 3342274 3925525 3374794 3687700 4208103 3194555 3335406 3101187 2968809
6437B968809j90301N64666o9758o56623J688402k111101P54281J96450M91788
$$ 2968809 2778508 3343174 3273416 2616793 4305195 2194094 2948375 3144825 3636613
6428C636613l26609l65778M43564j07342L61301p68076R9219Q17928q87657J26208
$$ 3636613 3310004 2944226 3387790 3280448 3641749 2873673 2972892 3790820 2903163 3029371
6418C029371K97357n26850N61900P01454o73346l94295K83937j126225O49062
$$ 3029371 3326728 2799878 3361778 4063232 3389886 2995591 3279528 2153303 2802365
6409B802365P60296o87075n71088N34112J048897n51459M34212m02214q85092
$$ 2802365 3562661 2875586 2304498 2838610 3887507 3336048 3770260 3368046 2482954
6400B482954J167447n70612p0495k54189K01343J5948M74269l50659l81115M91715
$$ 2482954 3650401 3079789 3009294 2755105 2956448 2972396 3446665 3096006 2714891 3206606
6390C206606l8090N11123o22892J77655Q96905r2801k84592j85288J6324L46677
$$ 3206606 3168516 3679639 3056747 3234402 4131307 4038506 3753914 3568626 3584950 3931627
6380C931627m81985k56340Q33485j007508Q67356Q46412j196205P62400L46640
$$ 3931627 3449642 3193302 4026787 3019279 3886635 4733047 3536842 4299242 4645882
6371D645882j544688P28959K21505j002918P37108K81529q85968k78678N7833
$$ 4645882 3101194 3830153 4051658 3048740 3785848 4067377 3181409 2902731 2960564
6362B960564o67244N08553p5586k47290o4986K24010j49137k10725O02996l99893
$$ 2960564 2293320 2801873 2726287 2478997 2414011 2638021 2488884 2278159 2881155 2481262
6352B481262j37035J37181J75973p66428m2326K66086k08747Q4980n6284O975
$$ 2481262 2344227 2481408 2657381 1890953 1848627 2114713 1905966 1990946 1934662 1941637
6342A941637m68271R62095J20920j361046P63740n45783J96916K26977l02113
$$ 1941637 1473366 2435461 2556381 1195335 1959075 1413292 1610208 1837185 1535072
6333A535072M89721j315430J442604j079461P21433J75618k80468K25306j78449
$$ 1535072 2024793 709363 2151967 1072506 1793939 1969557 1689089 1914395 1735946
6324A735946n23220N23896Q1235q54779P71849k53320j67346Q78099o01483n3172
$$ 1735946 1212726 1736622 1817857 963078 1734927 1481607 1314261 2192360 1590877 1537705
6314A537705J48113j0885K73706J40952j217414N51618R72252o71873j580187
$$ 1537705 1685818 1674933 1948639 2089591 872177 1423795 2396047 1724174 143987
6305A43987J520012m4683o51878O02845n91299N9992O78710P4621q35973n19373
$$ 143987 1663999 1619316 967438 1570283 978984 1038976 1717686 1792307 956334 436961
6295D36961Q13676P6963K11330l15022K23855M7022K69442j2727L23543j173326
$$ 436961 1250637 1327600 1538930 1223908 1447763 1494785 1764227 1751500 2075043 901717
6285I01717K23681k11212J56589L6605k1596P79576k84913Q39210j332704j79736
$$ 901717 1125398 914186 1070775 1107380 1085784 1865360 1580447 2419657 1086953 907217
6275I07217O5951m82352M15483J223157o52176o66672R33111j55120m55130n08817
$$ 907217 973168 490816 906299 2129456 1477280 810608 1743719 1588599 1133469 624652
6265F24652R23910q41416P90480j129810J639886j054225j64086O45272j05961
$$ 624652 1548562 707146 1497626 367816 2007702 953477 789391 1434663 1328702
6256A328702m46877N46922K3478M26187n25135k62992k77147k24399N35331j93196
$$ 1328702 881825 1428747 1452225 1878412 1353277 1090285 813138 588739 1124070 930874
6246I30874J5411J46521k34917O43227n63449J35613M56979m42860l79735R65811
$$ 930874 946285 1092806 857889 1501116 937667 1073280 1530259 1087399 707664 1673475
6236A673475j093936O24136l06812L58931p34692L88256L4507J83633K58273K19698
$$ 1673475 579539 1203675 896863 1255794 521102 909358 943865 1127498 1385771 1605469
6226A605469j62652L6862j13312r86923L5106N54747j52065L18339r1663j51358
$$ 1605469 1442817 1479679 1366367 379444 414550 969297 817232 1135571 1043908 892550
6216H92550O17717l72346P90727q16759Q0901N710j221k33718j40290P93651n23214
$$ 892550 1510267 1137921 1928648 1111889 1192790 1198500 1197279 963561 823271 1616922 1093708
6205A093708O14855m99736p425M39089Q8709q38173m00197O65426J12425m61841
$$ 1093708 1708563 1208827 1201402 1640491 1729200 891027 490830 1156256 1268681 806840
6195H06840N52606r7412m82775q3260P2034P99855m23850M09376j376180O40490
$$ 806840 1359446 1262034 779259 695999 768033 1567888 1144038 1553414 177234 817724
6185H17724O11480k98013k90912n01916Q78960r12439L71543k2903M71003j65323
$$ 817724 1429204 1131191 840279 338363 1217323 304884 676427 653524 1124527 959204
6175I59204m77731M32254j35437K02458k54091J078730j83365k32369o64468K99605
$$ 959204 481473 913727 778290 980748 726657 1805387 1622022 1389653 725185 1024790
6165A024790n25171J91847k28518L59589L22533l56012n7251L83989n45025N18503
$$ 1024790 499619 691466 462948 822537 1145070 789058 731807 1115796 570771 1089274
6155A089274J16670o17918R52822m79760L09556l15049p7185L984j85632K66158
$$ 1089274 1205944 588026 1540848 1061088 1370644 1055595 978410 982394 796762 1062920
6145A062920r7696N73272Q6090o63009m75542L03791j97315K08408j91454K79125
$$ 1062920 965224 1538496 1624586 961577 486035 789826 592511 800919 609465 888590
6135H88590J34455J77371L6323n72160m30640L73194L86727r54165P69830k49669
$$ 888590 1023045 1200416 1236739 664579 233939 607133 993860 39695 809525 559856
6125E59856L96333j54745q63040J10544R81864N12987N12421j296330J76427P4593
$$ 559856 956189 801444 -61596 48948 1030812 1543799 2056220 759890 936317 1010910
6115A010910K76756K22522l30761K47555R3582K58340j873712N36823l6771K71994
$$ 1010910 1287666 1510188 1179427 1426982 1520564 1778904 -94808 442015 405244 677238
6105F77238k17991k00182J482379r13566L65757m82788L74046K24266p61483m86605
$$ 677238 459247 259065 1741444 827878 1193635 710847 1084893 1309159 547676 61071
6095F1071J179761j039324M19566M09868j65505n70651Q36372k42847J92960q40966
$$ 61071 1240832 201508 621074 1030942 865437 294786 1131158 888311 1081271 240305
6085B40305J034805n24652o2171K2385P21589l13594n40235R771j49184J33265
$$ 240305 1275110 750458 688287 710672 1432261 1118667 578432 588203 439019 572284
6075E72284K30823m56383N55090n25724O07681L69467J29390m81555n71931O63899
$$ 572284 803107 346724 901814 376090 983771 1353238 1482628 1001073 429142 1093041
6065A093041K1972o43786N79510k40300J28036M81449p52467o0813j54609L44832
$$ 1093041 1115013 471227 1050737 810437 938473 1419922 667455 606642 452033 796865
6055G96865j77955M55520p60819R40346o184j042713P51879n7851j91948j64907
$$ 796865 618910 1074430 313611 1253957 1247773 205060 956939 899088 707140 542233
6045E42233N29146r1146q7328l46365J37333L892R5895k9273O13409o01123N10752
$$ 542233 1071379 980233 892905 546540 683873 687765 783660 754387 1367796 766673 1277425
6034A277425L43136k89442j405899R46998k84105K29535J95634j07917j42078
$$ 1277425 1620561 1331119 -74780 872218 588113 817648 1013282 905365 763287
6025G63287m06077L2646P11646m73193o5394J23782O81841n02900L09685r63079
$$ 763287 357210 389856 1101502 628309 562915 686697 1368538 865638 1175323 212244
6015B12244N93302J38495L95663p44020K84753j47654J50682N0548n78824o87990
$$ 212244 805546 944041 1339704 595684 880437 732783 883465 934013 355189 -332801
6005c32801J037440N80320l98845R8168k98208k3755M03378l50307j36708J15480
$$ -332801 704639 1284959 886114 984282 686074 662319 1065697 715390 578682 694162
5995F94162j43800R78582n0950p78156J1745K71195M9677M08892p75845k11907
$$ 694162 550362 1528944 1477994 699838 711583 982778 1032455 1441347 665502 453595
5985D53595M60541p34699L53144J94364L06406m26259K3754L5281k26298M20693
$$ 453595 914136 179437 532581 726945 1033351 607092 630846 666127 439829 860522
5975H60522K58484n45760J22652L65248L83236j87909j520542k4837Q46386M11553
$$ 860522 1119006 573246 695898 1061146 1444382 1256473 -264069 -288906 557480 969033
5965I69033K19882j76972n28454N74761K13144r59499M60499J38541K58063j167150
$$ 969033 1188915 1011943 483489 1058250 1271394 311895 772394 910935 1168998 1848
5955A848N11951P3718L8503k41448K58984n3466N55458n69339M53425m24079L37218
$$ 1848 513799 587517 626020 384572 643556 590090 1145548 576209 1029634 605555 942773
5944I42773l30924L39266n31701P94799p25564O36312q17179o83190J075534m58865
$$ 942773 611849 951115 419414 1214213 488649 1124961 307782 -375408 700126 241261
5934B41261J73877J45648p1906j44849J090833k47089m37428l87786K39462j95748
$$ 241261 415138 560786 488880 344031 1434864 1187775 750347 362561 602023 406275
5924D06275l01373J032736l58934n0347l54584L9714L98062Q70458j217872J81577
$$ 406275 104902 1137638 778704 728357 373773 413487 811549 1682007 464135 645712
5914F45712m70867Q05135k69335J27071J52460K6924n12535K26587k92443l55090
$$ 645712 174845 979980 710645 837716 990176 1017100 504565 731152 438709 83619
5904H3619R82935j091810Q67565K18947l95133m03434N58744m25381J45634K13006
$$ 83619 1066554 -25256 842309 1061256 666123 262689 821433 396052 541686 754692
5894G54692j080348J402213o87745L28636k19118M44043n73564M95337m31616
$$ 754692 -325656 1076557 388812 717448 498330 942373 368809 864146 432530
5885D32530O5106K4090N49451k1566q85766O24521n79014M49317K74417M12648
$$ 432530 497636 521726 1071177 1049611 163845 788366 209352 658669 933086 1345734
5875A345734o85929k27603J98969M95236m52792R78598j566979K34746M69778
$$ 1345734 659805 432202 631171 1126407 673615 1652213 85234 319980 789758
5866G89758l01713O0266j50184M25282k51503J60508N61929o72652R23489m25582
$$ 789758 488045 548311 398127 823409 571906 732414 1294343 621691 1545180 1119598
5856A119598L4282j11227j88919k43500Q69086m78140m96869L3822L09025M26889
$$ 1119598 1153880 1042653 853734 610234 1479320 1001180 504311 538133 847158 1274047
5846A274047j322184J646302l38219l37850k24442m35587P34672o04654L17964
$$ 1274047 -48137 1598165 1259946 922096 697654 262067 996739 392085 710049
5837G10049Q7096J59277m80925l43713J059035n31838O7716j86341J1260J58522
$$ 710049 797145 956422 475497 131784 1190819 658981 726697 540356 551616 710138
5827G10138p65172J30595R74923n54618K59079J28562l33230J27024N23933q44633
$$ 710138 -55034 75561 1050484 495866 754945 883507 550277 677301 1201234 356601
5817C56601j09273N67396m8863J46735M19327m33449K02071j80644p4913n08691
$$ 356601 247328 814724 765861 912596 1331923 898474 1100545 919901 844988 336297
5807C36297M20715k36517M61455N88781n98508n68928j81509K14541R48089o77479
$$ 336297 757012 520495 981950 1570731 972223 403295 221786 436327 1384416 706937
5797G06937m84071N17403k08498K1656R95385j373602J357954p87084L62722p5670
$$ 706937 222866 740269 531771 553427 1548812 175210 1533164 746080 1108802 1033132
5787A033132r95250N33936O32741q46383O01744j2506l35902m68715k1555o2029
$$ 1033132 37882 571818 1204559 358176 959920 947414 611512 142797 121242 59213
5777E9213N26214n4376k08874l51117J60218R59189j335466R05948p31163Q36696
$$ 59213 585427 531051 322177 -28940 131278 1090467 -244999 660949 -70214 766482
5767G66482j78134N20385n4679p17124O08893M85958r53368L67262M44687j397045
$$ 766482 588348 1108733 1054054 336930 945823 1431781 478413 845675 1290362 -106683
5757a06683Q49910k95123L74332L55282j49561j90936k81188J56382o51533N74230
$$ -106683 743227 448104 822436 1177718 1028157 837221 556033 712415 60882 635112
5747F35112k44295J77122R4353j90770k8772O72991J45968Q6015J3420j37407
$$ 635112 390817 567939 662292 471522 442750 1115741 1261709 1347724 1361144 1223737
5737A223737l18693n21666R23770j01770m98045Q6108L3732k90336N576N24741
$$ 1223737 905044 383378 1307148 1205378 707333 793441 827173 536837 542413 1067154
5727A067154j4874r66436J059103l05650m49787J50111J469931j202600j26266
$$ 1067154 1052280 85844 1144947 839297 389510 539621 2009552 806952 680686
5718F80686o12030O44784N41948j86749P6344r06234R15349q8949O8132q40850
$$ 680686 68656 713440 1255388 1068639 1144983 238749 1154098 1065149 1133281 292431
5708B92431Q05970M6358J67236m12724o29822R49483M37246r32068K12590O5887
$$ 292431 1098401 1144759 1311995 899271 269449 1218932 1656178 724110 936700 1002587
5698A002587n4536K32507n53008l7708K94948k82008K14522J00832K27280l48580
$$ 1002587 948051 1180558 627550 589842 884790 602782 817304 918136 1145416 796836
5688G96836j12198J254913n22734n00439q1548L75060o79477R09606N37382j314476
$$ 796836 684638 1939551 1416817 916378 834830 1209890 530413 1440019 1977401 662925
5678F62925J39526n7644J039458j533853N57634k96679K83386j11140N40632r20821
$$ 662925 802451 744807 1784265 250412 808046 511367 794753 683613 1224245 303424
5668C03424L98329j42740P88792n78672J40414k7224o64302Q2091P21647k28439
$$ 303424 701753 559013 1347805 769133 909547 882323 218021 300112 1021759 793320
5658G93320j63519M01199K69476Q3999p74087N73167n43817R64853q38155K82179
$$ 793320 629801 1031000 1300476 1384475 610388 1183555 639738 1604591 766436 1048615
5648A048615n75264J35729N21892o06182J02180L09281O1898m76684o26532N09197
$$ 1048615 473351 609080 1130972 524790 626970 936251 998149 521465 -105067 404130
5638D04130L04969m52374J028332K46681n55520j015870O76442J10405J49921
$$ 404130 709099 256725 1285057 1531738 976218 -39652 636790 747195 897116
5629H97116l09654M01887l24966L61133J42995l95117N8781o21831N72040M72547
$$ 897116 587462 989349 664383 1025516 1168511 773394 832175 210344 782384 1254931
5619A254931o31482N94177r09793K99910j19522q0243R99008m88051L51110p06048
$$ 1254931 623449 1217626 307833 607743 488221 407978 1406986 918935 1270045 563997
5609E63997m705J57807K34372o02594J72108L79943l75706K88957R2948N07173
$$ 563997 559292 717099 951471 348877 520985 900928 525222 814179 907127 1414300
5599A414300q67629O04245p99022J030622m54248k50577K86803K5738l12546K12615
$$ 1414300 546671 1150916 351894 1382516 928268 677691 964494 990232 677686 890301
5589H90301L984M93542j077892Q42075p73600J32716J79320P95972o80044k47860
$$ 890301 894285 1387827 309935 1152010 378410 511126 690446 1486418 806374 558514
5579E58514J08938n364N25685j065309Q43974r84530P32394J25750m49641L64933
$$ 558514 667452 662088 1187773 122464 966438 -18092 714302 840052 390411 755344
5569G55344L00736k14822l90547p17261J172958L1345k60320j6265l64974M85536
$$ 755344 1056080 841258 450711 -266550 906408 937753 677433 661168 296194 781730
5559G81730k0994R68350q37297j98994J1565K33003o510J98627M5937l3137N270
$$ 781730 760736 1729086 891789 692795 704360 937363 930853 1129480 1175417 1142280 1147550
5548A147550m11114j39599O41116k53929m24899K22543j07281j47819k60350L31705
$$ 1147550 736436 596837 1237953 984024 559125 781668 674387 526568 266218 597923
5538E97923O27648l31841l22237J77925J2178p6580O9045k43656L58534L31643
$$ 597923 1225571 893730 571493 749418 761596 685016 754061 510405 868939 1200582
5528A200582o53546j76262J59350P79749m01576m30262L54250l49822P8150n11041
$$ 1200582 547036 370774 530124 1309873 908297 478035 832285 482463 560613 49572
5518D9572J262408n27291L5713R6264n55102J3636N35988N38131o95148k77302
$$ 49572 1311980 784689 820402 916666 361564 375200 911188 1449319 754171 476869
5508D76869M22558k0998k3117j20785k62547M9816O429M26890q43419M87517N52831
$$ 476869 899427 878429 855312 734527 471980 521796 528225 955115 111696 599213 1152044
5497A152044j102830P99451l58505N6719L14106q40548O62922P89197n87401M56885
$$ 1152044 49214 848665 490160 546879 860985 20437 683359 1472556 885155 1342040
5487A342040n7425p70798J85154m5039l703K38142J20967o68435l01297O66505
$$ 1342040 1284615 513817 698971 653932 650229 888371 1009338 340903 39606 706111
5477G06111q0727j26024J85587k82523J63791k27675L84609P8228J5849K85152
$$ 706111 625384 499360 684947 402424 566215 338540 723149 801377 817226 1102378
5467A102378o09465j29338M41376j40284J29028p0290L81476m45605m8595J227920
$$ 1102378 492913 363575 804951 664667 793695 723405 1104881 659276 610681 1838601
5457A838601o59941q73897k20245K93680Q55677o41077N14475p90025n19527R70330
$$ 1838601 1178660 304763 84518 378198 1233875 592798 1107273 317248 -202279 768051
5447G68051L58059m2116l79687L12721O1879l92853L3918M41814n36449j01831
$$ 768051 1126110 1083994 704307 1017028 1078907 686054 719972 1161786 625337 523506
5437E23506K40415n78120J25759J08731N29721k67300k35475K51070Q8564o77065
$$ 523506 763921 185801 311560 420291 950012 682712 447237 698307 786871 109806
5427A09806L83803J63413L71050k75383l08482l43978P27397k03475N42989j137276
$$ 109806 493609 657022 1028072 752689 444207 100229 827626 624151 1167140 29864
5417B9864J168468o22914M44707L08683j086752Q09817m11636o8594J64704k06527
$$ 29864 1198332 575418 1020125 1328808 242056 1051873 640237 571643 736347 529820
5407E29820P84653J1490p01695K50876k63240M129Q48476j376128O72263r22351
$$ 529820 1314473 1325963 624268 875144 611904 616033 1464509 88381 760644 -161707
5397a61707R93732N65483n40998o96263J122985o31818N17935q94493P99602j28282
$$ -161707 832025 1397508 856510 160247 1283232 651414 1169349 274856 1074458 946176
5387I46176J4185p64750J297740n73467k28594K16746L13243q56457P14956N0080
$$ 946176 960361 195611 1493351 919884 691290 908036 1221279 364822 1079778 1129858
5377A129858o41603K81555j49215J64153m32660M28885Q39155j626237k98051
$$ 1129858 488255 769810 620595 784748 352088 780973 1620128 -6109 -304160
5368c04160J015326K84808K31001m60154O8938j74049M43802k87799L1999m97599
$$ -304160 711166 995974 1226975 766821 835759 661710 1105512 817713 849712 352113
5358C52113J60745O17221r7758N27164j580784P68706J08423o6205j6409J93666
$$ 352113 512858 1130079 1032321 1559485 -21299 747407 855830 789625 773216 966882
5348I66882k46582L41443l13432j60795k86408j09231P22383J40009K13481K8112
$$ 966882 720300 1061743 748311 587516 301108 191877 914260 1054269 1267750 1295862
5338A295862m78152N72885j072599Q91066n46087M99872k94254J38355j88416
$$ 1295862 817710 1390595 317996 1209062 662975 1162847 868593 1006948 818532
5329H18532N90777m72563p7916L408J36955N43269q74609j37746l42894R73822
$$ 818532 1409309 936746 858830 862238 999193 1542462 667853 530107 187213 1161035
5319A161035m35830M13250j1800j94353k67115L61694k39835Q59429r69716p74703
$$ 1161035 725205 1138455 1126655 932302 665187 1026881 787046 1646475 676759 -97944
5309i7944J019708m00264j23596M18393l59707K95722J63658J68329k17832P70775
$$ -97944 921764 521500 397904 816297 456590 752312 915970 1084299 866467 1637242
5299A637242q45392P01902o19944l9013L7492p17975O80274r5788N9936K14313
$$ 1637242 791850 1493752 873808 834795 872287 154312 834586 738798 798734 1013047
5289A013047Q3466k13836p2832j58566N178R26487p09129K61038L4261n6836M99011
$$ 1013047 1096513 882677 809845 651279 656457 1582944 873815 1134853 1169114 1112278 1611289
5278A611289m58940M87391m43449n35100O4506q9983O56956o78278Q10857k42096
$$ 1611289 1152349 1639740 1196291 661191 725697 635714 1292670 614392 1425249 1183153
5268A183153P29992q53485j78188P93689m75583K7699k07008m19041r5218Q13035
$$ 1183153 1913145 1059660 881472 1675161 1199578 1227277 1020269 601228 506010 1319045
5258A319045j12484L99910j252761P64364m69241K38638L45721r8287R9321j78852
$$ 1319045 1206561 1606471 353710 1118074 648833 887471 1233192 1134905 1234226 1055374
5248A055374r1844L9195j59761L13561l25167k42357L16068k95603K42361L03521
$$ 1055374 963530 1002725 842964 1156525 831358 589001 905069 609466 851827 1155348
5238A155348l47067j73534N9094J034529l39418O07902j472330J76769L68697
$$ 1155348 808281 634747 693841 1728370 1388952 1996854 524524 701293 1069990
5229A069990j17602L46928J11145n41965m69454O12814l37235M81990J93555J12325
$$ 1069990 952388 1299316 1410461 868496 399042 1011856 674621 1156611 1350166 1462491
5219A462491m66653J31523k15232L6600L79356l00851L15114L00935j150684J02595
$$ 1462491 995838 1127361 912129 948729 1328085 1027234 1342348 1643283 492599 595194
5209E95194O74321k95148O53459j331936J495379l45588j86740k62997l15480
$$ 595194 1269515 974367 1627826 295890 1791269 1445681 1258941 995944 680464
5200F80464J000395j147038K82323M46267m65817k2049J92448K39642J67695o95220
$$ 680464 1680859 533821 816144 1262411 796594 774545 966993 1206635 1374330 679110
5190F79110R3220L24536k43486L37386o6078r7176m32829L36876j44864k1507
$$ 679110 772330 1096866 853380 1190766 1124688 1027512 594683 931559 786695 765188
5180G65188k43503m36536Q59682k97283k12032M66667K85655j74770O19417m64189
$$ 765188 521685 85149 944831 647548 435516 902183 1187838 1013068 1632485 1168296
5170A168296M10252n46655N89689r52259N20930P72349j457418R73448N7343L8447
$$ 1168296 1578548 1031893 1621582 669323 1190253 1962602 505184 1478632 1535975 1574422
5160A574422k73027l87691K25809K11879P7923k933K72002J11415p75316K86265
$$ 1574422 1301395 913704 1139513 1351392 1429315 1426382 1698384 1809799 1034483 1320748
5150A320748k7492R69509r21703q1164P49844l87515o02689Q49655k78936j91453
$$ 1320748 1293256 2262765 1341062 1259898 2009742 1622227 1019538 1869193 1590257 1398804
5140A398804K20398j134614Q57198j20902P45049l15654M04937m96163k88758
$$ 1398804 1619202 484588 1341786 1220884 1965933 1650279 2055216 1559053 1270295
5131A270295L83925L32384j045902K60504L39362o38495J199498j480538J355078
$$ 1270295 1654220 1986604 940702 1201206 1540568 902073 2101571 621033 1976111
5122A976111m49139L32450j19242q25798P73833n84906L38969m86896o32399N67934
$$ 1976111 1526972 1859422 1740180 914382 1688215 1103309 1442278 955382 322983 890917
5112H90917M95352l47500j53840J85189J1285o15392K45454O048K8555J25465
$$ 890917 1386269 1038769 884929 1070118 1081403 466011 711465 717513 746068 871533
5102H71533M32492M51171j317735N43075M42696l75581M10301n88520N69273j73829
$$ 871533 1304025 1755196 437461 980536 1423232 1047651 1457952 869432 1438705 1264876
5092A264876k12374K70430p988j59821k82715N70107k20111P0574o81214J231822
$$ 1264876 1052502 1322932 1314944 1155123 872408 1442515 1222404 1292978 611764 1843586
5082A843586j262479J96684l24096L18909P9007O01035k95452J78109n24374l88321
$$ 1843586 581107 777791 453695 772604 851611 1452646 1157194 1335303 810929 422608
5072D22608J179773K96248j195213P63854l87553J6486m0203L07382k93412j19264
$$ 422608 1602381 1898629 703416 1467270 1079717 1096203 1056000 1363382 1069970 950706
5062I50706M38647p03331R87050m3230p79418P64421r90763K60376N46690o49563
$$ 950706 1389353 686022 1673072 1629842 850424 1614845 624082 884458 1431148 781585
5052G81585K45133K68161j54k85761j00115M01154K59032q51920J14502P77413
$$ 781585 1026718 1294879 1294725 1008964 908849 1310003 1569035 717115 831617 1609030
5042A609030j04289P1055k85365K02213o14401j23150N99378p5050m09268j25533
$$ 1609030 1504741 1575796 1290431 1492644 878243 755093 1354471 1279421 870153 744620
5032G44620J370414o13310m55867M04453l94883q7553P60009M35981r25612j49198
$$ 744620 2115034 1501724 1045857 1450310 1055427 967874 1727883 2163864 1238252 1089054
5022A089054j61659M63067n70830P02813m91185O81264l00528j414543Q47300
$$ 1089054 927395 1390462 819632 1522445 1031260 1712524 1411996 -2547 844753
5013H44753M10171K57181k15417N3534R17805j358416N66948l13328J56428L5831
$$ 844753 1254924 1512105 1296688 1350222 2268027 909611 1476559 1163231 1319659 1355490
5003A355490j19268P56129k78434j198335O20040m56584L04422J64526O94832
$$ 1355490 1236222 1992351 1713917 515582 1135622 679038 983460 1147986 1842818
4994A842818j143980Q7620K9695L15130N98591n10249K31813j92205M8973P04848
$$ 1842818 698838 786458 816153 1131283 1729874 1219625 1451438 1259233 1308206 2013054
4984B013054n18067J61724J879O3375j96564j84394m20900O55612l674l65251
$$ 2013054 1494987 1656711 1658590 1721965 1525401 1341007 920107 1575719 1572045 1206794
4974A206794N24066J90054o36941M7505L84895N80714o31296R3970K67910q80469
$$ 1206794 1730860 1920914 1283973 1331478 1716373 2297087 1665791 1759761 2027671 1147202
4964A147202M6754J037394p61862j85532p53751J168961j201041R62929j81842
$$ 1147202 1193956 2231350 1469488 1283956 530205 1699166 498125 1461054 1279212
4955A279212N33217j46788q75585Q84920l73185n15628Q21363j308833J651957
$$ 1279212 1812429 1665641 790056 1674976 1301791 786163 1607526 298693 1950650
4946A950650j186685J197074j37379n66618L00063j15779M66433m69353Q3527
$$ 1950650 763965 1961039 1823660 1257042 1557105 1441326 1907759 1438406 1521933
4937A521933n978j304190R39435K20294K24856L77164o96012J97904L57874o2750
$$ 1521933 1515955 211765 1151200 1371494 1596350 1973514 1277502 1475406 1833280 1770530
4927A770530j74413l67537o58978L87185R09001j65305k24241q35223J758735
$$ 1770530 1596117 1228580 569602 956787 1865788 1700483 1476242 641019 2399754
4918B399754r56408K99143J4590r6716o59734K46897K74771L49923k2248j419369
$$ 2399754 1443346 1742489 1757079 1660363 1000629 1247526 1522297 1872220 1849972 430603
4908D30603J104473k55453J88158M63513m78352k54184K54444k95504M11667n81064
$$ 430603 1535076 1279623 1467781 1931294 1452942 1198758 1453202 1157698 1569365 988301
4898I88301N56821L08139q3188l94678J46104p49006J027336j33153p18075Q91302
$$ 988301 1545122 1853261 1770073 1375395 1521499 772493 1799829 1666676 948601 1839903
4888A839903j070844P45862m13490k72288J090509o01045j92886M59957M62601
$$ 1839903 769059 1514921 1101431 829143 1919652 1318607 1125721 1585678 2048279
4879B048279m29233l06336Q185J37812j34924M33223q37619L71505P90726r80788
$$ 2048279 1619046 1312710 1320895 1458707 1323783 1757006 919387 1290892 2081618 1100830
4869A100830L45830K3333K5849O82598m13437J3792n46717N09309o368o94061
$$ 1100830 1446660 1469993 1495842 2178440 1765003 1778795 1232078 1741387 1735019 1040958
4859A040958J51863O97564j75187O71902j287142Q93717K37758n31417o11106
$$ 1040958 1192821 1890385 1715198 2387100 1099958 1993675 2231433 1700016 1088910
4850A088910P22232L07960l93173K62346l95603n3881l02605N58607k04739L96510
$$ 1088910 1811142 2119102 1725929 1988275 1592672 1538791 1236186 1794793 1590054 1986564
4840A986564l65963m1370o64761J599403J53853j173639k44661R24781m29128
$$ 1986564 1620601 1579231 914470 2513873 2667726 1494087 1249426 2174207 1745079
4831A745079L23944k05784j33568K96306L11296n38735L39243K44889q09454Q08612
$$ 1745079 2069023 1863239 1729671 2025977 2337273 1798538 2137781 2382670 1573216 2381828
4821B381828o42538K74031o45601J065085K2912k84588m6729j8048N05595l25976
$$ 2381828 1739290 2013321 1367720 2432805 2455717 2171129 2124400 2106352 2611947 2285971
4811B285971L31474o6960n11171J22501L46682k43291j12149l35862Q79151n09124
$$ 2285971 2617445 2550485 2039314 2161815 2508497 2265206 2153057 1817195 2696346 2187222
4801B187222L79645P0449k12071j07121P81707o5447j64387K36410l93470L05185
$$ 2187222 2566867 2637316 2425245 2318124 3099831 3034384 2869997 3106407 2712937 3018122
4791C018122l44872n62170L03495L1158M76445K96551m78806P35847l34717N15431
$$ 3018122 2673250 2111080 2414575 2445733 2922178 3218729 2739923 3475770 3141053 3656484
4781C656484n71447N01298k00273k85368L18159M70760j022263M33245l4731J115531
$$ 3656484 3085037 3586335 3386062 3100694 3418853 3889613 2867350 3300595 3265864 4381395
4771D381395k31057q6622n59707O71702K27485p78240j03678L99718k84767J239632
$$ 4381395 4150338 4063716 3504009 4175711 4403196 3624956 3521278 3920996 3636229 4875861
4761D875861l30298N73902j157802Q70305K1m2317m27106Q33162J23328O74242
$$ 4875861 4545563 5119465 3961663 4831968 4831989 4789672 4362566 5195728 5319056 5993298
4751E993298r63653L16138n4163M6991q74005J079971k07090L57186j62068R31986
$$ 5993298 5029645 5345783 5291620 5338611 4464606 5544577 5337487 5694673 5532605 6464591
4741F464591K72681r12201n39459P46287P0736J115022o49348m38940K31924R56953
$$ 6464591 6737272 5825071 5285612 6031899 6102635 7217657 6568309 6129369 6361293 7318246
4731G318246J10077p92092O71373l99189M20884R3948K56968o95318R00661K58382
$$ 7318246 7428323 6636231 7307604 6908415 7329299 7423247 7680215 6984897 7885558 8143940
4721H143940n56899K44937q34851P20039m66214J083794l92539K13583o16176
$$ 8143940 7587041 7831978 6997127 7717166 7250952 8334746 7942207 8155790 7539614
4712G539614Q96711k89448k85363K91235k29024N27797j62036K14609p3275k5294
$$ 7539614 8436325 8146877 7861514 8152749 7923725 8451522 8289486 8504095 8430820 8405526
4702H405526O1990N47266l3172m14100J398397j488285P15460J42417M05535k65636
$$ 8405526 8467516 9014782 8981610 8567510 9965907 8477622 9193082 9335499 9741034 9475398
4692I475398j146223J511280m98641L16463K76848q22225J280205j127190L5471
$$ 9475398 8329175 9840455 9341814 9658277 9935125 9112900 10393105 9265915 9301386
4683I301386M53645L61510r07219n47592L74170l39950Q79049l68702j243203
$$ 9301386 9755031 10116541 9209322 8661730 9035900 8695950 9574999 9206297 7963094
4674G963094J203388J16521K21171q11866M07362O69297r19646J70697J54404
$$ 7963094 9166482 9283003 9504174 8692308 9099670 9768967 8849321 9020018 9174422
4665I174422L10208r2916N4714k953K13295O283R9847r19561n26042J006228q4436
$$ 9174422 9484630 9391714 9446428 9443475 9656770 9663053 9762900 8843339 8317297 9323525 9239089
4654I239089k69666l35439J106813q11139K02108Q55112j014195j82407R34526
$$ 9239089 8969423 8633984 9740797 8929658 9131766 9986878 8972683 8790276 9724802
4645I724802L8703m85795l27777J90200K09596O44531l66472n29076j13977k78976
$$ 9724802 9763505 9277710 8949933 9140133 9349729 9994260 9627788 9098712 8984735 8705759
4635H705759Q64474k74480M05810N1426j48932O51875o70673P04640n15756P52315
$$ 8705759 9570233 9295753 9701563 9752989 9604057 10255932 9585259 10289899 9774143 10526458
4625A0526458r39704N27035n81187L64977N94556j79447j55240L43938M61099
$$ 10526458 9586754 10113789 9532602 9897579 10492135 10312688 10157448 10501386 10962485
4616A0962485m71944R4556Q71708n22416Q77609M6537L62622j26530n35916J710215
$$ 10962485 10490541 10585097 11456805 10934389 11811998 11858535 12221157 12094627 11558711 13268926
4606A3268926n16789P45601p26613N0155L89244r52120J823440n24914J004118
$$ 13268926 12752137 13497738 12771125 12821280 13210524 12258404 14081844 13556930 14561048
4597A4561048J56295q3773Q76177l40729r3649J011474J322811o58470J052310
$$ 14561048 14717343 14633570 15509747 15169018 15075369 16086843 17409654 16751184 17803494
4588A7803494k5145q12513J258032N47766l30760j30003K213076J43217o8747
$$ 17803494 17778349 16965836 18223868 18771634 18440874 18310871 20523947 20667164 20598417
4579B0598417o3884Q06647J91408O98521R77688J26692L72854j46225R24106J52596
$$ 20598417 20534533 21341180 21532588 22231109 23208797 23335489 23708343 23562118 24486224 24638820
4569B4638820Q81403L47994n7656M43997J057948J22313j13190R32294N69511
$$ 24638820 25520223 25868217 25810561 26254558 27312506 27434819 27321629 28253923 28823434
4560B8823434K60432P14963O62775l96727J319697l04037J19559J081657n6204
$$ 28823434 29083866 29798829 30461604 30064877 31384574 31080537 31200096 32281753 32225549
4551C2225549J331628j9885q3422M60415Q41993l19655J302266l63721K37325
$$ 32225549 33557177 33537292 33453870 33914285 34756278 34436623 35738889 35375168 35612493
4542C5612493Q82505O26920N57331o84752M24306K18640K87754P2101Q48999q42587
$$ 35612493 36494998 37121918 37679249 36994497 37418803 37637443 37925197 37997298 38846297 38003710
4532C8003710O90889P22400o5890n29332m32080M64054N14100k94403O15301N96964
$$ 38003710 38694599 39416999 39351109 38821777 38389697 38853751 39367851 39073448 39688749 40285713
4522D0285713o68357Q00357N05895l4447P64927l31234q1543Q15672K82306M66165
$$ 40285713 39617356 40417713 40923608 40889161 41654088 41322854 41241311 42056983 42339289 42805454
4512D2805454K88953l6801O73590O97597o65257M93556O55830k89084M24841K91007
$$ 42805454 43094407 43057606 43731196 44428793 43763536 44257092 44912922 44623838 45048679 45339686
4502D5339686K10229J46117M12915R02401j473327M48698L07337l79021L3518
$$ 45339686 45549915 45696032 46108947 47011348 45538021 45986719 46294056 45915035 45948553
4493D5948553n38991N86022K09925k563m89034n95169L33289n33152j0046m15249
$$ 45948553 45409562 45995584 46205509 46202946 45713912 45118743 45452032 44918880 44908834 44493585
4483D4493585M46114n44450K67926k75629N91681m71899r7635l76578P33533q73480
$$ 44493585 44939699 44395249 44663175 44387546 44979227 44507328 44409693 44033115 44766648 43893168
4473D3893168P1076j176036M22456j45105l61348n27802O69653K33751j180316
$$ 43893168 43964244 42788208 43210664 43065559 42704211 42176409 42846062 43079813 41899497
4464D1899497j096822j32913p97385M14927J79087r78985o56439L83748j337986
$$ 41899497 40802675 40669762 39872377 40287304 40466391 39487406 38830967 39214715 37876729
4455C7876729J81772n09950k30088j142642N76293o74595n82084J046183j161191
$$ 37876729 38058501 37548551 37318463 36175821 36752114 36077519 35495435 36541618 35380427
4446C5380427N22858k02179q39801O77494r98169N46229j182344Q24760j33100
$$ 35380427 35903285 35701106 34861305 35538799 34540630 35086859 33904515 34729275 34596175
4437C4596175J11817j10468R5692m51407M39565K91243j024769L49787j59803
$$ 34596175 34707992 34597524 34693216 34241809 34681374 34972617 33947848 34297635 34137832
4428C4137832m57299J005309q05115K36735J46687K7002l19488L39123N3197J89981
$$ 34137832 33680533 34685842 33880727 34117462 34264149 34291151 33971663 34310786 34363983 34553964
4418C4553964m65710R7202m53910O9145k71249n50235J009736m54590j89132R95055
$$ 34553964 34088254 34185456 33731546 33800691 33529442 32979207 33988943 33534353 33345221 34340276
4408C4340276q49827l9652L51375p40989j27620J63339M36339p66055j02058M52681
$$ 34340276 33490449 33450797 33802172 33061183 32933563 33096902 33533241 32767186 32665128 33117809
4398C3117809m62657J78764o36503O14655L30003r22306K90075N0321o18689L4544
$$ 33117809 32655152 32833916 32197413 32812068 33142071 32219765 32509840 32560161 31941472 31976016
4388C1976016P80336j157497K0219P8557m1397p64224n0731m68027L98981l86190
$$ 31976016 32756352 31598855 31619074 31697631 31656234 30892010 30841279 30373252 30772233 30386043
4378C0386043j37474j33467k14591J6750M15102j039422K89118o84592j63068
$$ 30386043 30248569 30115102 29900511 29917261 30332363 29292941 29582059 28897467 28734399
4369B8734399p40869N1087k12625R43312j057026p55979J151362q5952r67220
$$ 28734399 27993530 28044617 27831992 28775304 27718278 26962299 28113661 28027709 27060489
4360B7060489j53197j54839j013415J152095r02770J04060n19137N6391l03434
$$ 27060489 26907292 26752453 25739038 26891133 25988363 26092423 25573286 25629677 25326243
4351B5326243R1649L49008r34590j6975j84053m61609L30915l30886m01676P53260
$$ 25326243 25417892 25766900 24832310 24815335 24631282 24169673 24500588 24169702 23768026 24521286
4341B4521286k71972j33896o99733J029316j232364Q68925p06982K40645j387941
$$ 24521286 24249314 24115418 23415685 24445001 23212637 24081562 23374580 23615225 22227284
4332B2227284L68002K18952O4909R250q53097o66289k4193K67816L37669n08944
$$ 22227284 22595286 22814238 22879147 22888397 22035300 21369011 21344818 21612634 21950303 21441359
4322B1441359P50945k74244q15037l85600j30389m2309K95444k32322l76087Q45781
$$ 21441359 22192304 21918060 21103023 20717423 20587034 20544725 20840169 20607847 20231760 21077541
4312B1077541o69320k00988R27762J22032p78798m88009R22771P4982o76934j59701
$$ 21077541 20408221 20207233 21134995 21257027 20478229 19990220 20912991 20987973 20311039 20151338
4302B0151338R37976n76475k08673l56324J016094m25546r66410P09866j10857
$$ 20151338 21089314 20512839 20304166 19947842 20963936 20538390 19571980 20281846 20170989
4293B0170989j38761J83929n66732J56632N32729N4181L28665j30925j28355l08544
$$ 20170989 20032228 20216157 19649425 19806057 20338786 20392967 20721632 20590707 20462352 20153808
4283B0153808K72937L32783l32844m32335J776443k36905j113105J713012m73661
$$ 20153808 20426745 20759528 20426684 19994349 21770792 21533887 20420782 22133794 21660133
4274B1660133K02881k06199K58748K63745R26730M09248k49462j03530J061524
$$ 21660133 21863014 21656815 21915563 22179308 23106038 23515286 23265824 23162294 24223818
4265B4223818n37417k481P90563j07264j0935Q43047j379919N73276l52293Q12150
$$ 24223818 23686401 23683920 24474483 24367219 24356284 25199331 23819412 24392688 24040395 24852545
4255B4852545O54127M5910K70859J327464n62090P20942N21409J170224N1176
$$ 24852545 25506672 25552582 25823441 27150905 26588815 27309757 27831166 29001390 29052566
4246B9052566J75719R28866j03052P06432P37614j280335N58128J20773j110932
$$ 29052566 29228285 30157151 30054099 30760531 31498145 30217810 30775938 30896711 29785779
4237B9785779K64136j289419o59829M10549j93358K39932r1851J341369r87243
$$ 29785779 30049915 28760496 28100667 28511216 28317858 28557790 28465939 29807308 28820065
4228B8820065R80886k29818J250922Q42175J33494q1557J258454j53978L40030
$$ 28820065 29800951 29571133 30822055 31664230 31797724 31716167 32974621 32820643 33160673
4219C3160673K44974J41026P46097l23723r90838j041083j198590p94913m60584
$$ 33160673 33405647 33546673 34292770 33969047 32978209 31937126 30738536 29943623 29483039
4210B9483039r10298j71038o31584k10309L23598p55798J187534o737L8903N21960
$$ 29483039 28572741 28401703 27770119 27559810 27883408 27127610 28315144 28308407 28347310 28869270
4200B8869270N4575l42170J204301k36988K78651m45149L72969K3174J65978j469902
$$ 28869270 28923845 28581675 29785976 29548988 29827639 29382490 29755459 29778633 29944611 28474709
4190B8474709n97758o50074k84455j713500K37947p67278q03311j73073n59469
$$ 28474709 27876951 27226877 26942422 25228922 25466869 24699591 23896280 23723207 23163738
4181B3163738n04936R63394M5507k40131L21374o83699M94158n56272l72600P44686
$$ 23163738 22658802 23622196 23667703 23427572 23748946 23065247 23559405 23003133 22630533 23375219
4171B3375219p94596N63825l77847k07057j22918L83484j139641o21521M4862
$$ 23375219 22580623 23144448 22766601 22559544 22436626 22820110 21680469 21058948 21103810
4162B1103810m76441j10408k6514m26606J68966K18030p47750K60038q82627J4931
$$ 21103810 20627369 20516961 20490447 20063841 20232807 20450837 19703087 19963125 19080498 19095429
4152A9095429P80140O0168j90089j88707j40815j61986R59366p26965K96402m46174
$$ 19095429 19875569 19935737 19745648 19556941 19416126 19254140 20213506 19486541 19782943 19336769
4142A9336769m03764R87459m56513J86177p13080O28757l11140O1379p3904l76791
$$ 19336769 18933005 19920464 19463951 19650128 18937048 19565805 19254665 19316044 19242140 18865349
4132A8865349O71366k15575l27221j21010L33241o14263M47629o9178K05534L96063
$$ 18865349 19536715 19321140 18993919 18872909 19206150 18591887 19039516 18970338 19175872 19571935
4122A9571935k41714n17554J2783M29330O37701o66991k34070m7646O34680L06923
$$ 19571935 19330221 18812667 18825450 19254780 19892481 19225490 18991420 18943774 19578454 19885377
4112A9885377r2347m96404N08805o65740j64957N19477J34619L82263k61582O268
$$ 19885377 19793030 19296626 19805431 19139691 18974734 19494211 19628830 20011093 19749511 19755779
4102A9755779k07978M48407j75153j040697J269846j5068r62487k79964J274091
$$ 19755779 19547801 19996208 19821055 18780358 20050204 20035136 19072649 18792685 20066776
4093B0066776j154856J015360n8262q07755K75848P27859o56367k00763K93766
$$ 20066776 18911920 19927280 19869018 19061263 19337111 20064970 19408603 19207840 19501606
4084A9501606o32408J91383K90910m08515N13102L74930j89294j55470p28130
$$ 19501606 18869198 19060581 19351491 18942976 19456078 19831008 19641714 19486244 18758114
4075A8758114L47574L52147j109475J080576j12328j319393Q22645p1431j66725
$$ 18758114 19105688 19457835 18348360 19428936 19316608 17997215 18819860 18748429 18581704
4066A8581704r84867M00733n72712K77315L597L72539p04589P28799p29036j66644
$$ 18581704 17596837 17997570 17424858 17702173 17705770 18078309 17373720 18102519 17373483 17206839
4056A7206839p62454J06417J12417k35475r2397n03391O15297n99196k64538O81631
$$ 17206839 16444385 16550802 16663219 16427744 16335347 15831956 16447253 15848057 15583519 16265150
4046A6265150o45026P77724j321664O22362k37801k81831o80251Q00907k33149
$$ 16265150 15620124 16397848 15076184 15698546 15460745 15178914 14498663 15299570 15066421
4037A5066421j62641m40188Q16044j051244L87731p6641m55429n82216M09363
$$ 15066421 14903780 14463592 15279636 14228392 14616123 14539482 14084053 13501837 13911200
4028A3911200O72442p89120J82065m19203L63137l07493m06797M12606K25549
$$ 13911200 14583642 13794522 13976587 13557384 13920521 13613028 13206231 13618837 13844386
4019A3844386J42382r01375P44916L3824m19807k58848O18502k40307M96277P9843
$$ 13844386 13986768 13085393 13830309 13864133 13444326 13185478 13803980 13563673 14059950 14139793
4009A4139793m03407J5062m82422q6939Q39753r72081M4410L82251l96637L47323
$$ 14139793 13736386 13751448 13269026 13182087 14021840 13049759 13094169 13476420 13079783 13427106
3999A3427106N1981j04964l58499N95747p29884N8462L91718k33608k86163j33131
$$ 13427106 13479087 13374123 13015624 13611371 12881487 12939949 13331667 13098059 12811896 12678765
3989A2678765J26848Q7968Q6703n63005L80893n62649l67513M62311Q44316l17392
$$ 12678765 12805613 12893581 12980284 12417279 12798172 12235523 11868010 12330321 13174637 12857245
3979A2857245J09723m19008J45182N43473p3699J55990j54671L41734j216355
$$ 12857245 12966968 12547960 12693142 13236615 13162916 13318906 13164235 13505969 12289614
3970A2289614J033856j50126P40759o19855J68454K38776k74310J98377Q56056
$$ 12289614 13323470 13173344 13914103 13294248 13462702 13701478 13427168 13625545 14481601
3961A4481601o90916k38057M37775J76157K8609o27191m06249O38988p38563R59967
$$ 14481601 13790685 13552628 13990403 14166560 14195169 13567978 13161729 13800717 13062154 14022121
3951A4022121o76437J1158k12016r00099R10367l22600l96920l68361k43073p14686
$$ 14022121 13345684 13356842 13144826 12244727 13155094 12832494 12435574 12067213 11824140 11109454
3941A1109454L36580N65367n57144L68939K69l74237M9054l08746L63119j094937
$$ 11109454 11446034 12011401 11454257 11823196 11823465 11449228 11498282 11189536 11552655 10457718
3931A0457718m3060L25666r2962k65311P05065m77694P4046k93240L44728J052438
$$ 10457718 10414658 10740324 10647362 10382051 11087116 10609422 10683468 10390228 10734956 11787394
3921A1787394m76606k43681p5327q28386Q70888O09559q29715O23442J30052p84380
$$ 11787394 11310788 11067107 10991780 10163394 11034282 11643841 10814126 11437568 11567620 10783240
$$ [...]
##END NTUPLES=NMR SPECTRUM
##END=
