##TITLE=abcd
##JCAMPDX= 6.0         $$ Bruker NMR JCAMP-DX V2.0
##DATA TYPE= NMR SPECTRUM
##DATA CLASS= NTUPLES
##ORIGIN= UXNMR, Bruker Analytische Messtechnik GmbH
##OWNER= root
$$ XWIN-NMR		Version 3.5
$$ Thu Oct 16 12:17:33 2025 Russian Standard Time (UT+4h)  servis@DPX200
##.OBSERVE FREQUENCY= 200.131235884673
##.OBSERVE NUCLEUS= ^1H
##.ACQUISITION MODE= SIMULTANEOUS
##.ACQUISITION SCHEME= undefined
##.AVERAGES= 24
##.DIGITISER RES= 18
##SPECTROMETER/DATA SYSTEM= spect
##.PULSE SEQUENCE= zg
##.SOLVENT NAME= CDCl3
##.SHIFT REFERENCE= (INTERNAL, CDCl3, 0, 16.4885)
##AUDIT TRAIL= $$ (NUMBER, WHEN, WHO, WHERE, WHAT)
$$ ##TITLE= Audit trail, XWIN-NMR		Version 3.5
$$ ##JCAMPDX= 5.01
$$ ##ORIGIN= Bruker BioSpin GmbH
$$ ##OWNER= servis
$$ F:\spectra/data/av/nmr/H1/1/pdata/1/auditp.txt
$$ ##AUDIT TRAIL=  $$ (NUMBER, WHEN, WHO, WHERE, WHAT)
(   1,<2025-10-16 12:17:03.89 +0400>,<servis>,<DPX200>,
      <created by zg, POWCHK disabled, PULCHK disabled
       terminated by command 'halt'
       configuration hash MD5:
       00 E9 B6 7A A2 85 ED C7 34 08 36 98 17 FE 4E 26
       data hash MD5: 32K
       E3 A2 76 14 79 C1 93 BA AF A8 A6 12 3D 7C 29 B5>)
(   2,<2025-10-16 12:17:05.78 +0400>,<servis>,<DPX200>,
      <Start of raw data processing
       efp BC_mod = 2 LB = 0.05 FT_mod = 6 PKNL = 1 PHC0 = -271.6701 PHC1 = 2.101565 SI = 16K 
       data hash MD5: 16K
       EC 86 04 47 40 AB 47 C2 D2 2B BE B0 1D F4 16 89>)
$$ ##END=
$$ 
$$ hash MD5
$$ 22 13 B4 78 59 BB 5E 01 87 0B 1A 45 E3 0D 2F 66
##$RELAX= 
##$RELAX= 
##$RELAX= 
##$RELAX= 
##$RELAX= 
##$RELAX= 
##$RELAX= 
##$RELAX= 
$$ Bruker specific parameters
$$ --------------------------
##$DU= <F:\spectra>
##$EXPNO= 1
##$NAME= <H1>
##$PROCNO= 1
##$TYPE= <nmr>
##$USER= <av>
##$AMP= (0..31)
100 100 100 100 100 100 100 100 100 100 100 100 100 100 100 100 100 100 
100 100 100 100 100 100 100 100 100 100 100 100 100 100 
##$AQSEQ= 0
##$AQ_mod= 1
##$AUNM= <au_zg>
##$AUTOPOS= <>
##$BF1= 200.13
##$BF2= 200.13
##$BF3= 200.13
##$BF4= 200.13
##$BF5= 500.13
##$BF6= 500.13
##$BF7= 500.13
##$BF8= 500.13
##$BYTORDA= 1
##$CFDGTYP= 0
##$CFRGTYP= 5
##$CHEMSTR= <none>
##$CNST= (0..31)
1 1 145 1 1 1 1 1 1 1 1 1 1 1 1 1 1 1 1 1 1 1 1 1 1 1 1 1 1 1 1 1 
##$CPDPRG= <>
##$CPDPRG1= <>
##$CPDPRG2= <>
##$CPDPRG3= <>
##$CPDPRG4= <mlev>
##$CPDPRG5= <mlev>
##$CPDPRG6= <mlev>
##$CPDPRG7= <mlev>
##$CPDPRG8= <mlev>
##$CPDPRGB= <>
##$CPDPRGT= <>
##$D= (0..31)
0 2 0 0 0 0 0 0 0 0.06 0 0 0 0 0 0 0.0002 0 0 0 0 0 0 0 0 0 0 0 0 0 0 
0 
##$DATE= 1760602623
##$DBL= (0..7)
120 120 120 120 120 120 120 120 
##$DBP= (0..7)
150 150 150 150 150 150 150 150 
##$DBP07= 0
##$DBPNAM0= <>
##$DBPNAM1= <>
##$DBPNAM2= <>
##$DBPNAM3= <>
##$DBPNAM4= <>
##$DBPNAM5= <>
##$DBPNAM6= <>
##$DBPNAM7= <>
##$DBPOAL= (0..7)
0.5 0.5 0.5 0.5 0.5 0.5 0.5 0.5 
##$DBPOFFS= (0..7)
0 0 0 0 0 0 0 0 
##$DE= 6
##$DECBNUC= <off>
##$DECIM= 32
##$DECNUC= <off>
##$DECSTAT= 4
##$DIGMOD= 1
##$DIGTYP= 9
##$DL= (0..7)
0 120 120 120 120 120 120 120 
##$DP= (0..7)
$$ [...]
##$SUBNAM4= <"">
##$SUBNAM5= <"">
##$SUBNAM6= <"">
##$SUBNAM7= <"">
##$SUBNAM8= <"">
##$SUBNAM9= <"">
##$SW= 20.6817932712277
##$SWIBOX= (0..15)
0 0 3 0 0 0 0 0 0 0 0 0 0 0 0 0 
##$SW_h= 4139.07284768212
##$TD= 32768
##$TD0= 1
##$TE= 0
##$TE2= 300
##$TE3= 300
##$TEG= 300
##$TL= (0..7)
0 120 120 120 120 120 120 120 
##$TP= (0..7)
150 150 150 150 150 150 150 150 
##$TP07= 0
##$TPNAME0= <>
##$TPNAME1= <>
##$TPNAME2= <>
##$TPNAME3= <>
##$TPNAME4= <>
##$TPNAME5= <>
##$TPNAME6= <>
##$TPNAME7= <>
##$TPOAL= (0..7)
0.5 0.5 0.5 0.5 0.5 0.5 0.5 0.5 
##$TPOFFS= (0..7)
0 0 0 0 0 0 0 0 
##$TUNHIN= 0
##$TUNHOUT= 0
##$TUNXOUT= 0
##$USERA1= <user>
##$USERA2= <user>
##$USERA3= <user>
##$USERA4= <user>
##$USERA5= <user>
##$V9= 5
##$VALIST= <valist>
##$VCLIST= <CCCCCCCCCCCCCCC>
##$VD= 0
##$VDLIST= <DDDDDDDDDDDDDDD>
##$VPLIST= <PPPPPPPPPPPPPPP>
##$VTLIST= <TTTTTTTTTTTTTTT>
##$WBST= 1024
##$WBSW= 30
##$XGAIN= (0..3)
0 0 0 0 
##$XL= 0
##$YL= 0
##$YMAX_a= 125432
##$YMIN_a= -79289
##$ZGOPTNS= <>
##$ZL1= 120
##$ZL2= 120
##$ZL3= 120
##$ZL4= 120
##$ABSF1= 0
##$ABSF2= 0
##$ABSG= 0
##$ABSL= 0
##$ALPHA= 0
##$AQORDER= 0
##$ASSFAC= 0
##$ASSFACI= 0
##$ASSFACX= 0
##$ASSWID= 0
##$AUNMP= <proc_1d>
##$AZFE= 0.1
##$AZFW= 0.1
##$BCFW= 0
##$BC_mod= 2
##$BYTORDP= 0
##$COROFFS= 0
##$CY= 18.4799938201904
##$DATMOD= 1
##$DC= 0
##$DFILT= <>
##$DTYPP= 0
##$F1P= 9.9274215381318
##$F2P= -0.165520771350173
##$FCOR= 1
##$FTSIZE= 16384
##$FT_mod= 6
##$GAMMA= 0
##$GB= 0
##$INTBC= 1
##$INTSCL= 4.127829e-11
##$ISEN= 128
##$LB= 0.05
##$LEV0= 0
##$LPBIN= 0
##$MAXI= 10000
##$MC2= 0
##$MEAN= 0
##$ME_mod= 0
##$MI= 50
##$NCOEF= 0
##$NC_proc= -7
##$NLEV= 6
##$NOISF1= 3.799351
##$NOISF2= 2.8
##$NSP= 0
##$NTH_PI= 0
##$NZP= 0
##$OFFSET= 16.48848
##$PC= 4
##$PHC0= -271.6701
##$PHC1= 2.101565
##$PH_mod= 1
##$PKNL= yes
##$PPARMOD= 0
##$PSCAL= 4
##$PSIGN= 0
##$REVERSE= no
##$SF= 200.130005582386
##$SI= 16384
##$SIGF1= 3
##$SIGF2= 2
##$SINO= 400
##$SIOLD= 16384
##$SREGLST= <1H.CDCl3>
##$SSB= 0
##$STSI= 16384
##$STSR= 0
##$SW_p= 4139.07284768211
##$SYMM= 0
##$S_DEV= 0
##$TDeff= 32768
##$TDoff= 0
##$TI= <>
##$TILT= no
##$TM1= 0
##$TM2= 0
##$TOPLEV= 0
##$USERP1= <user>
##$USERP2= <user>
##$USERP3= <user>
##$USERP4= <user>
##$USERP5= <user>
##$WDW= 1
##$XDIM= 16384
##$YMAX_p= 279653718
##$YMIN_p= -1270086
$$ End of Bruker specific parameters
$$ ---------------------------------
##NTUPLES= NMR SPECTRUM
##VAR_NAME=  FREQUENCY,     SPECTRUM/REAL,   SPECTRUM/IMAG
##SYMBOL=    X,             R,               I
##VAR_TYPE=  INDEPENDENT,   DEPENDENT,       DEPENDENT
##VAR_FORM=  AFFN,          ASDF,            ASDF
##VAR_DIM=   16384,         16384,           16384
##UNITS=     HZ,            ARBITRARY UNITS, ARBITRARY UNITS
##FACTOR=    0.252644378177508, 1,           1
##FIRST=     3299.83951724647, 0,            0
##LAST=      -839.233330435636, 0,           0
##MIN=       -839.233330435636, -1270086,    0
##MAX=       3299.83951724647, 279653718,    0
$$ Real data points
##PAGE= N=1
##DATA TABLE= (X++(R..R)), XYDATA
$$ [...]
$$ plain form
12096 100167 78446 192743 178888 -25423 234731 350224 -103705 -49814 -36119 143945
12086 143945 162328 147350 388591 226465 32919 298090 407076 159821 239947 420117
12076 420117 136935 221776 201884 242181 534014 385847 233278 466685 239337 495130
12066 495130 209932 306723 -41130 99472 189599 146014 -97734 228260 15725 241625
12056 241625 391806 169030 343878 174743 392365 228180 130086 367901 -3826 21667
12046 21667 -20398 212416 48040 72018 563167 95843 -240 279549 375685 315041 372889
12035 372889 155013 246837 380502 140608 128846 475008 27400 74125 343290 197149
12025 197149 -65090 254663 219271 256694 290732 323143 194159 440148 94149 192534
$$ packed form
12096A00167k1721J14297j3855k04311K60154J15493m53929N3891J3695J80064
12086A43945J8383j4978K41241j62126j93546K65171J08986k47255Q0126J80170
12076D20117k83182Q4841j9892M0297K91833j48167j52569K33407k27348K55793
12066D95130k85198R6791l47853J40602R0127m3585k43748L25994k12535K25900
12056B41625J50181k22776J74848j69135K17622j64185r8094K37815l71727K5493
12046B1667m2065K32814j64376K3978M91149m67324r6083K79789R6136o0644N7848
12035C72889k17876R1824J33665k39894j1762L46162m47608M6725K69165j46141
12025A97149k62239L19753l5392L7423L4038L2411j28984K45989l45999R8385
$$ plain form
12015 192534 185850 310077 -175771 127624 198860 438182 -27273 447001 346121 190991
12005 190991 283496 38574 478500 477666 362612 293124 268676 90836 256122 141267 -75190
11994 -75190 193110 424199 344416 270621 247055 -27857 149870 499943 113698 51187
11984 51187 349414 285061 275097 310690 406290 457035 102886 242933 269724 116869 310655
11973 310655 364771 372907 57498 76826 196566 57553 325954 356144 -331147 -66202
11963 -66202 248701 249855 112155 -25860 313758 -98344 443924 181173 97192 -163002
11953 -163002 24103 68440 353509 83634 92418 68029 324717 147215 207725 523284
11943 523284 483771 139318 335953 501234 365184 186126 466894 514658 82893 -40035
$$ packed form
12015A92534o684J24227m85848L03395P1236K39322m65455M74274j00880j55130
12005A90991R2505k44922M39926q34j15054o9488k4448j77840J65286j14855k16457
11994g5190K68300K31089p9783p3795k3566k74912J77727L50073l86245o2511
11984E1187K98227o4353r964L5593R5600N0745l54149J40047K6791j52855J93786
11973C10655N4116Q136l15409J9328J19740j39013K68401L0190o87291K64945
11963f6202L14903J154j37700j38015L39618m12102N42268k62751q3981k60194
11953a63002J87105M4337K85069k69875Q784k4389K56688j77502O0510L15559
11943E23284l9513l44453J96635J65281j36050j79058K80768M7764m31765j22928
$$ plain form
11933 -40035 409696 71232 198457 355684 137837 347459 311577 247330 249191 18825
11923 18825 208243 29808 289642 210010 414531 251902 -72594 155990 361072 -210266
11913 -210266 421892 190942 68123 368859 280131 104997 165101 130449 310815 315174
11903 315174 453823 167294 80504 88793 60703 91160 394067 253245 453116 236669
11893 236669 331332 385263 228641 182504 -5303 303128 291217 274316 114228 73875 -105414
11882 -105414 467593 429855 7970 31118 234100 197471 335019 585241 461656 19242
11872 19242 525762 380352 322311 121057 164995 30900 279049 525746 323433 252589
11862 252589 296588 286766 162370 375979 425791 489211 39586 409390 242794 189564 398733
$$ packed form
11933d0035M49731l38464J27225J57227k17847K09622l5882o4247J861k30366
11923A8825J89418j78435K59834p9632K04521j62629l24496K28584K05082n71338
11913b10266O32158k30950j22819L00736q8728j75134O0104l4652J80366M359
11903C15174J38649k86529q6790Q289k8090L0457L02907j40822J99871k16447
11893B36669R4663N3931j56622m6137j87807L08431j1911j6901j60088m0353j79289
11882a05414N73007l7738m21885K3148K02982l6629J37548K50222j23585m42414
11872A9242N06520j45410n8041k01254M3938j34095K48149K46697k02313p0844
11862B52589M3999r822j24396K13609M9812O3420m49625L69804j66596n3230K09169
$$ plain form
11851 398733 128908 12746 222731 158785 554656 452906 209694 193391 156253 156130 -93755
11840 -93755 150300 -23539 -30234 -65461 236398 284061 31563 153183 175191 33482 309080
11829 309080 7395 132300 64197 572349 476730 320859 93532 212030 358486 417189
11819 417189 21040 355149 553800 126509 318962 324200 411456 101784 302529 161189
11809 161189 65284 643547 85663 276096 444294 132197 285874 311563 294207 448408
11799 448408 278038 422602 80432 129189 302880 386554 53725 538130 68721 132968
11789 132968 252300 234723 682334 171412 -25962 238071 364339 11818 208377 22756
11779 22756 449101 430290 297877 352028 18067 462947 235842 278657 196060 27682
$$ packed form
11851C98733k69825j16162K09985o3946L95871j01750k43212j6303l7138j23k49885
11840i3755K44055j73839o695l5227L01859M7663k52498J21620K2008j41709K75598
11829C09080l01685J24905o8103N08152r5619j55871k27327J18498J46456N8703
11819D17189l96149L34109J98651m27291J92453N238Q7256l09672K00745j41340
11809A61189r5905N78263n57884J90433J68198l12097J53677K5689j7356J54201
11799D48408j70370J44564l42170M8757J73691Q3674l32829M84405m69409O4247
11789A32968J19332j7577M47611n10922j97374K64033J26268l52521J96559j85621
11779B2756M26345j8811j32413N4151l33961M44880k27105M2815q2597j68378
$$ plain form
11769 27682 349145 155352 294400 295779 27889 207908 248800 309946 320593 244032 69758
11758 69758 146849 454070 508812 47650 199581 115225 317302 296324 165071 73990 417485
11747 417485 202790 641452 125598 735891 -214047 417927 197222 257631 307155 409722
11737 409722 190776 139983 255247 296754 342880 512935 -39726 289992 289945 48262 225116
11726 225116 447025 295100 479180 258104 204508 134052 346069 450678 520954 -158795
11716 -158795 162755 103184 61305 360531 625232 361194 111379 274828 367338 364867
11706 364867 128138 335539 357542 177742 444724 470978 360461 414898 337795 78115
11696 78115 222888 541332 141688 -152438 433793 -44277 124410 -41996 424918 217920
$$ packed form
11769B7682L21463j93793J39048J379k67890J80019M0892O1146J0647p6561j74274
11758F9758P7091L07221N4742m61162J51931q4356K02077k0978j31253r1081L43495
11747D17485k14695M38662n15854O10293r49938O31974k20705O0409M9524J02567
11737D09722k18946n0793J15264M1507M6126J70055n52661L29718m7k41683J76854
11726B25116K21909j51925J84080k21076n3596p0456K12017J04609P0276o79749
11716a58795L21550n9571m1879K99226K64701k64038k49815J63449R2510k471
11706C64867k36729K07401K2003j79800K66982K6254j10517N4437p7103k59680
11696G8115J44773L18444l99644k94126N86231m78070J68687j66406M66914k06998
$$ plain form
11686 217920 145996 155010 317575 51442 173839 357115 310102 406993 223598 327780
11676 327780 259094 -62766 592905 398328 86967 42395 270190 96054 729907 -22687
11666 -22687 355914 446814 579259 497283 497960 196075 329066 141887 338890 184908 422450
11655 422450 57585 543802 59234 336851 42467 212620 409727 379037 322176 145481
11645 145481 64135 414515 160985 472652 760869 248462 270971 175074 47959 439856
11635 439856 219565 329651 472096 271673 299282 78633 210925 364987 44853 215064
11625 215064 40805 99187 164246 216306 -6601 -243337 41180 236440 343152 353934
11615 353934 49412 320641 330319 246540 351846 282288 578603 600699 415720 154770
$$ packed form
11686B17920p1924R014J62565k66133J22397J83276m7013R6891j83395J04182
11676C27780o8686l21860O55671j94577l11361m4572K27795j74136O33853p52594
11666b2687L78601R0900J32445q1976O77l01885J32991j87179J97003j53982K37542
11655D22450l64865M86217m84568K77617k94384J70153J97107l0690n6861j76695
11645A45481q1346L50380k53530L11667K88217n12407K2509r5897j27115L91897
11635D39856k20291J10086J42445k00423K7609k20649J32292J54062l20134J70211
11625B15064j74259N8382O5059N2060k22907k36736K84517J95260J06712J0782
11615C53934l04522K71229R678q3779J05306o9558K96315K2096j84979k60950
$$ plain form
11605 154770 114077 422503 31190 464335 224743 467223 195282 433375 46248 291026
11595 291026 50371 -46941 495108 282210 57968 246756 -109463 521587 164136 -124540
11585 -124540 267981 256656 375641 15802 420884 492700 443773 358274 286709 -31126
11575 -31126 366387 176138 -157477 358060 119527 362560 254714 201564 399219 184559
11565 184559 87301 212968 29195 241541 409273 433680 280663 361253 262006 277732
11555 277732 8290 46926 193608 607526 478338 403211 192698 346943 574015 131614
11545 131614 487396 340132 1668 316858 243850 99471 302791 273695 611653 126019
11535 126019 163464 449366 213010 414005 252944 446257 153946 67832 109026 -123696
$$ packed form
11605A54770m0693L08426l91313M33145k39592K42480k71941K38093l87127K44778
11595B91026k40655r7312N42049k12898k24242J88788l56219O31050l57451k88676
11585a24540L92521j1325J18985l59839M05082P1816m8927q5499p1565l17835
11575c1126L97513j90249l33615N15537k38533K43033j07846n3150J97655k14660
11565A84559r7258J25667j83773K12346J67732K4407j53017Q0590r9247J5726
11555B77732k69442L8636J46682M13918j29188p5127k10513J54245K27072m42401
11545A31614L55782j47264l38464L15190p3008j44379K03320k9096L37958m85634
11535A26019L7445K85902k36356K00995j61061J93313k92311q6114M1194k32722
$$ plain form
11525 -123696 -30111 -2744 120148 208715 221289 161758 297774 612193 287697 431807
11515 431807 311517 80621 457720 337180 419706 265995 117760 -145286 145931 441940
11505 441940 230104 260786 10285 13051 383165 545302 360340 354198 295147 190088 193546
11494 193546 441359 247843 139805 571947 77085 336035 410845 88959 370345 410109
11484 410109 359748 188417 552467 353012 257541 173573 482025 146331 465969 -107426
11474 -107426 326301 212477 304740 524442 330778 259540 338545 242649 301392 72495
11464 72495 219972 375258 57417 223142 400652 257386 248923 82222 268914 370461
11454 370461 331667 510186 221000 119576 188337 491942 339309 278813 133160 104180
$$ packed form
11525a23696R3585K7367J22892Q8567J2574n9531J36016L14419l24496J44110
11515D31807j20290k30896L77099j20540Q2526j53711j48235k63046K91217K96009
11505D41940k11836L0682k50501K766L70114J62137j84962o142n9051j05059L458
11494A93546K47813j93516j08038M32142m94862K58950P4810l21886K81386L9764
11484D10109n0361j71331L64050j99455r5471q3968L08452l35694L19638n73395
11474a07426M33727j13824R2263K19702j93664p1238P9005r5896N8743k28897
11464G2495J47477J55286l17841J65725J77510j43266q463j66701J86692J01547
11454C70461l8794J78519k89186j01424O8761L03605j52633o0496j45653k8980
$$ plain form
11444 104180 265705 365271 267837 242876 79670 295487 285150 199293 460773 279117
11434 279117 133765 614051 457182 572405 263970 300298 -45814 263182 505833 505390
11424 505390 182791 279742 35066 639632 353119 -33565 81318 204743 -99962 53330
11414 53330 510957 365553 70617 279173 139639 358322 421793 311773 191560 460206
11404 460206 243265 -57049 168028 -32153 123013 454865 -43101 390875 427589 276896
11394 276896 352384 85355 396829 400334 59693 -142637 323573 485287 196864 441934
11384 441934 276931 -27075 -101802 165665 347346 160491 341676 133971 495249 -26333
11374 -26333 -77343 220161 266892 68861 420909 -185945 281413 484945 225978 306457
$$ packed form
11444A04180J61525R9566r7434k4961j63206K15817j0337q5857K61480j81656
11434B79117j45352M80286j56869J15223l08435L6328l46112L08996K42651m43
11424E05390l22599R6951k44676O04566k86513l86684J14883J23425l04705J53292
11414E3330M57627j45404k94936K08556j39534K18683O3471j10020j20213K68646
11404D60206k16941l00314K25077k00181J55166L31852m97966M33976L6714j50693
11394B76896P5488k67029L11474L505l40641k02330M66210J61714k88423K45070
11384D41934j65003l04006p4727K67467J81681j86855J81185k07705L61278n21582
11374b6333n1010K97504M6731j98031L52048o06854M67358K03532k58967Q0479
$$ plain form
11364 306457 241976 157553 186293 391791 638148 318941 538106 227655 162245 183695
11354 183695 252364 437556 -62182 341732 -33728 253579 451376 232144 309948 -89046
11344 -89046 198994 151225 300907 605499 349222 373687 232839 175246 218747 124319 406452
11333 406452 373680 350365 394670 524265 337609 511224 471979 155309 137867 -92483
11323 -92483 105211 155434 153697 262889 148465 483128 275872 692598 393650 187270
11313 187270 389763 205435 -66101 452343 704018 17559 337033 583552 296716 452808
11303 452808 93474 189550 388776 355900 97090 304913 327213 636118 346758 411830
11293 411830 242186 391685 277972 24637 166434 574704 33018 253620 522817 334094
$$ packed form
11364C06457o4481q4423K8740K05498K46357l19207K19165l10451o5410K1450
11354A83695O8669J85192m99738M03914l75460K87307J97797k19232P7804l98994
11344h9046K88040m7769J49682L04592k56277K4465j40848n7593M3501r4428K82133
11333D06452l2772k3315M4305J29595j86656J73615l9245l16670j7442k30350
11323i2483J97694N0223j737J09192j14424L34663k07256M16726k98948k06380
11313A87270K02493j84328k71536N18444K51675o86459L19474K46519k86836J56092
11303D52808l59334R6076J99226l2876k58810K07823K2300L08905k89360O5072
11293D11830j69644J49499j13713k53335J41797M08270n41686K20602K69197j88723
$$ plain form
11283 334094 248124 234059 161585 307893 104565 134216 553581 393602 248715 -137450
11273 -137450 49980 330438 119567 372874 60466 358283 236369 500003 244782 61242
11263 61242 251879 362874 50962 377256 88939 410785 244256 368112 264735 531360
11253 531360 32375 196439 113166 211130 152129 245643 297695 346117 317212 152005 63448
11242 63448 406733 45068 407039 256689 -88733 29274 221977 229801 368759 539089
11232 539089 -39134 282996 390275 168043 147839 259743 220051 348411 486920 153891
11222 153891 62169 200086 85521 209132 145462 146564 425994 384225 141646 226129 528819
11211 528819 290325 336760 161796 650698 529826 418025 504061 336743 179360 350910
$$ packed form
11283C34094q5970j4065p2474J46308k03328K9651M19365j59979j44887l86165
11273a37450J87430K80458k10871K53307l12408K97817j21914K63634k55221j83540
11263F1242J90637J10995l11912L26294k88317L21846j66529J23856j03377K66625
11253E31360m98985J64064q3273R7964n9001R3514N2052M8422k8905j65207q8557
11242F3448L43285l61665L61971j50350l45422J18007J92703P824J38958J70330
11232E39089n78223L22130J07279k22232k0204J11904l9692J28360J38509l33029
11222A53891r1722J37917j14565J23611o3670J102K79430m1769k42579Q4483L02690
11211E28819k38494M6435j74964M88902j20872j11801Q6036j67318j57383J71550
$$ plain form
11201 350910 390453 261592 293924 14514 422119 416621 370781 159019 287032 90392
11191 90392 463042 294963 58680 339153 494115 267861 399606 194554 509550 174054
11181 174054 517729 307659 444947 500777 378871 641278 540596 369345 292023 133190
11171 133190 79247 -69812 463115 272728 244879 406993 247206 648796 314153 264614
11161 264614 370779 228849 10326 357570 63625 307926 378614 261960 156436 430089
11151 430089 224726 129014 361157 334514 132279 112924 367257 315356 329357 49481
11141 49481 528989 780557 225842 356417 358356 385318 399313 414101 6955 630288 326432
11130 326432 407776 423019 197362 68495 237238 183861 284802 328254 282847 192301 282554
$$ packed form
11201C50910L9543j28861L2332k79410M07605n498m5840k11762J28013j96640
11191I0392L72650j68079k36283K80473J54962k26254J31745k05052L14996l35496
11181A74054L43675k10070J37288N5830j21906K62407j00682j71251p7322j58833
11171A33190n3943j49059N32927j90387k7849J62114j59787M01590l34643m9539
11161B64614J06165j41930k18523L47244k93945K44301P0688j16654j05524K73653
11151D30089k05363r5712K32143k6643k02235j9355K54333n1901J4001k79876
11141D9481M79508K51568n54715J30575J939K6962J3995J4788m07146O23333l03856
11130C26432Q1344J5243k25657j28867J68743n3377J00941M3452m5407r0546R0253
$$ plain form
11119 282554 513757 -204251 457052 -138343 249804 80499 168060 371450 478706 203447
11109 203447 57794 290983 -247874 279275 73439 506912 -85861 360685 31311 308448
11099 308448 216335 407881 354356 383910 566528 369976 493359 279682 473155 178693
11089 178693 497603 439928 443301 94841 171088 304249 168543 117209 235575 282721 522332
11078 522332 354032 234532 261988 482290 159742 174918 657925 91250 432966 322930
11068 322930 424871 662716 355801 542961 248116 213571 267885 391851 338160 142152
11058 142152 284085 246215 255279 -110180 306541 212568 295867 198760 324754 197123 167797
11047 167797 457419 91183 111889 339010 506665 178172 212975 394402 808640 142517
$$ packed form
11119B82554K31203p18008O61303n95395L88147j69305Q7561K03390J07256k75259
11109B03447j45653K33189n38857N27149k05836M33473n92773M46546l29374K77137
11099C08448r2113J91546n3525K9554J82618j96552J23383k13677J93473k94462
11089A78693L18910n7675L373l48460P6247J33161j35706n1334J18366M7146K39611
11078E22332j68300j19500K7456K20302l22548J5176M83007n66675L41716j10036
11068C22930J01941K37845l06915J87160k94845l4545N4314J23966n3691j96008
11058A42152J41933l7870R064l65459M16721r3973Q3299r7107J25994j27631k9326
11047A67797K89622l66236K0706K27121J67655l28493L4803J81427M14238o66123
$$ plain form
11037 142517 217118 133889 12655 318841 201017 418379 195479 261020 233295 419588
11027 419588 503120 457517 589523 142353 425168 462717 208067 163430 345524 233801
11017 233801 282598 281010 161539 160799 213270 426838 475085 314950 479589 498060 292508
11006 292508 251040 479828 456922 318169 496422 185306 340112 400253 479886 296270
10996 296270 713587 432400 176918 276254 315418 215572 289531 64624 385774 436844
10986 436844 538362 -139939 271824 120184 150341 439876 490752 286505 338789 289139
10976 289139 413026 359818 281206 222039 64351 37389 319849 306701 405345 290411 348730
10965 348730 287936 -177963 516560 361778 213247 339866 322074 420238 474018 332324
$$ packed form
11037A42517P4601q3229j21234L06186j17824K17362k22900O5541k7725J86293
11027D19588Q3532m5603J32006m47170K82815L7549k54650m4637J82094j11723
11017B33801M8797j588j19471p40N2471K13568M8247j60135J64639J8471k05552
11006B92508m1468K28788k2906j38753J78253l11116J54806O0141P9633j83616
10996B96270M17317k81187k55482R9336L9164r9846P3959k24907L21150N1070
10986D36844J01518o78301M11763j51640L0157K89535N0876k04247N2284m9650
10976B89139J23887n3208p8612n9167j57688k6962K82460j3148R8644j14934N8319
10965C48730o0794m65899O94523j54782j48531J26619j7792R8164N3780j41694
$$ plain form
10955 332324 170376 292222 378166 69592 229210 338091 226017 86723 187049 512365
10945 512365 345826 15754 266501 -18793 41821 361698 460713 100111 557240 240108
10935 240108 646628 327035 284022 262290 221938 944 309735 578543 206861 228889
10925 228889 100654 186404 490065 172375 294128 -20032 383161 206232 386261 405559
10915 405559 372935 68127 73950 436553 390376 241825 290470 351318 224151 284489 251258
10904 251258 338691 484333 304841 50808 283642 319006 220364 -168708 115430 6571
10894 6571 264809 161943 275916 383102 107026 433138 330808 161931 468306 274174
10884 274174 392123 380951 280276 286565 272875 397740 513403 526051 167236 326234
$$ packed form
10955C32324j61948J21846Q5944l08574J59618J08881j12074j39294J00326L25316
10945E12365j66539l30072K50747k85294O0614L19877R9015l60602M57129l17132
10935B40108M06520l19593m3013k1732m0352k20994L08791K68808l71682K2028
10925B28889j28235Q5750L03661l17690J21753l14160M03193j76929J80029J9298
10915D05559l2624l04808N823L62603m6177j48551M8645O0848j27167O0338l3231
10904B51258Q7433J45642j79492k54033K32834L5364r8642l89072K84138j08859
10894F571K58238j02866J13973J07186k76076L26112j02330j68877L06375j94132
10884B74174J17949j1172j00675O289j3690J24865J15663J2648l58815J58998
$$ plain form
10874 326234 531418 482621 446130 391521 587790 286756 405694 326927 365025 344313 397449
10863 397449 380063 306350 82931 374547 403026 236531 237352 599513 384143 31437 403844
10852 403844 474124 448476 220296 281975 274260 562666 361342 49838 81976 262581 84882
10841 84882 342057 425366 212937 403766 176704 293422 249026 401328 267372 70796
10831 70796 407648 357892 544751 184799 465115 291643 363202 132319 154866 307722
10821 307722 165070 368406 333909 442350 293424 304661 485292 299074 236612 473161
10811 473161 278686 415579 96855 215351 328162 62563 468143 325295 295441 316748
10801 316748 436493 487674 258697 317625 82494 259977 574624 537115 299402 462152
$$ packed form
10874C26234K05184m8797l6491n4609J96269l01034J18938p8767L8098k0712N3136
10863C97449j7386p3713k23419K91616K8479j66495Q21L62161k15370l52706L72407
10852D03844P0280k5648k28180O1679p715K88406k01324l11504L2138J80605j77699
10841H4882K57175Q3309k12429J90829k27062J16718m4396J52302j33956j96576
10831G0796L36852m9756J86859l59952K80316j73472P1559k30883K2547J52856
10821C07722j42652K03336l4497J08441j48926J1237J80631j86218o2462K36549
10811D73161j94475J36893l18724J18496J12811k65599M05580j42848k9854K1307
10801C16748J19745N1181k28977N8928k35131J77483L14647l7509k37713J62750
$$ plain form
10791 462152 236049 602375 304098 499156 86944 407390 322833 244214 416871 386156
10781 386156 375502 209791 284210 319029 381510 337515 563337 425218 31629 410973
10771 410973 287779 4317 564804 63332 192323 176716 430751 -88536 366284 367678
10761 367678 371610 141230 261643 331463 331111 414362 443101 423325 410212 671869 233521
10750 233521 301726 445322 73587 112692 535196 305175 524340 349099 366984 356255
10740 356255 445028 366649 275166 561771 280339 164506 246798 499037 567414 358158
10730 358158 138469 387671 683203 728849 330780 263652 -11051 239444 540088 80053
10720 80053 74138 620475 314201 298987 437797 306090 282997 181186 524778 182334
$$ packed form
10791D62152k26103L66326k98277J95058m12212L20446q4557p8619J72657l0715
10781C86156j0654j65711P4419L4819O2481m3995K25822j38119l93589L79344
10771D10973j23194k83462N60487n01472J28991j5607K54035n19287M54820J394
10761C67678L932k30380J20413O9820l52Q3251K8739j9776j3113K61657m38348
10750B33521O8205J43596l71735L9105M22504k30021K19165j75241J7885j0729
10740C56255Q8773p8379r1483K86605k81432j15833Q2292K52239O8377k09256
10730C58158k19689K49202K95532M5646l98069o7128k74703K50495L00644m60035
10720H0053n915N46337l06274j5214J38810j31707k3093j01811L43592l42444
$$ plain form
10710 182334 394190 315579 58747 323024 30182 123629 280185 221929 314158 506130
10700 506130 608489 441855 357754 199420 267946 328434 263998 311932 316977 123120 -31127
10689 -31127 250100 -25072 230078 543623 303130 259795 374084 145087 578192 190694
10679 190694 178575 255318 418240 356866 574433 400086 750129 461250 410042 78572
10669 78572 339045 260641 316336 170295 515227 326643 577798 520634 48559 498076
10659 498076 360308 392292 566925 264597 177193 64320 266322 346008 480105 415011
10649 415011 375374 363992 575942 246322 140942 382816 274507 127085 369610 285861
10639 285861 535263 480093 265665 393015 43223 241437 305316 73843 509108 453812
$$ packed form
10710A82334K11856p8611k56832K64277k92842R3447J56556n8256R2229J91972
10700E06130J02359j66634q4101j58334O8526O0488o4436M7934N045j93857j54247
10689c1127K81227k75172K55150L13545k40493m3335J14289k28997M33105l87498
10679A90694j2119P6743J62922o1374K17567j74347L50043k88879n1208l31470
10669G8572K60473p8404N5695j46041L44932j88584K51155n7164m72075M49517
10659D98076j37768L1984J74633l02328q7404j12873K02002P9686J34097o5094
10649D15011l9637j1382K11950l29620j05380K41874j08309j47422K42525q3749
10639B85861K49402n5170k14428J27350l49792J98214O3879k31473M35265n5296
$$ plain form
10629 453812 655813 207426 348573 444001 604398 650217 276829 198077 418822 319023
10619 319023 352761 405615 331814 319140 438958 156434 371558 227698 229133 171512 609759
10608 609759 300188 286514 85799 85649 407116 446241 627056 468515 688950 505699
10598 505699 229396 402215 8013 430707 325170 562419 118419 217672 441468 283085
10588 283085 326742 411386 476154 330409 421772 216796 233492 283226 469491 307681 185262
10577 185262 480868 -12021 335208 316872 506042 347933 433905 304636 311706 540091
10567 540091 461854 340896 276277 336813 431639 436404 535466 364904 365541 371574 257564 154035
10555 154035 605783 136436 470316 733360 269670 457256 315991 582646 230708 577366
$$ packed form
10629D53812K02001m48387J41147R5428J60397M5819l73388p8752K20745r9799
10619C19023L3738N2854p3801j2674J19818k82524K15124j43860J435n7621M38247
10608F09759l09571j3674k00715j50L21467L9125J80815j58541K20435j83251
10598E05699k76303J72819l94202M22694j05537K37249m44000R9253K23796j58383
10588B83085M3657Q4644O4768j45745R1363k04976J6696M9734J86265j61810j22419
10577A85262K95606m92889L47229j8336J89170j58109Q5972j29269P070K28385
10567E40091p8237j20958o4619O0536R4826M765R9062j70562O37O033j14010j03529
10555A54035M51748m69347L33880K63044m63690J87586j41265K66655l51938L46658
$$ plain form
10545 577366 474189 195381 553714 520459 443069 318670 361313 565164 373818 380189
10535 380189 298083 528710 288880 385170 237384 422658 652772 388223 388197 317769 376610
10524 376610 144783 26201 445730 220807 485872 261627 485966 223767 621687 437256
10514 437256 548621 155444 1025421 379760 459868 257902 357274 377247 255030 271415
10504 271415 358681 231542 491454 279512 185199 578846 590983 223705 234966 592797
10494 592797 385769 496282 372928 441028 418725 348276 435225 395217 135361 175805 71675
10483 71675 209563 402854 466098 338539 437407 510513 656823 519742 372081 544923
10473 544923 617930 228892 31516 278930 737460 336956 168681 485604 267702 65846
$$ packed form
10545E77366j03177k78808L58333l3255p7390j24399M2643K03851j91346O371
10535C80189q2106K30627k39830R6290j47786J85274K30114k64549k6p0428N8841
10524C76610k31827j18582M19529k24923K65065k24245K24339k62199L97920j84431
10514D37256J11365l93177Q69977o45661Q0108k01966R9372J9973j22217J6385
10504B71415Q7266j27139K59912k11942r4313L93647J2137l67278J1261L57831
10494E92797k07028J10513j23354O8100k2303p0449Q6949m0008k59856M0444j04130
10483G1675J37888J93291O3244j27559R8868P3106J46310j37081j47661J72842
10473E44923P3007l89038j97376K47414M58530m00504j68275L16923k17902k01856
$$ plain form
10463 65846 424734 362247 574697 234299 169621 440139 408151 656324 505127 598774
10453 598774 403877 292556 95393 476340 370347 419669 707301 478131 271755 157325
10443 157325 297668 226421 517719 385991 645636 587791 440872 521950 438503 373665
10433 373665 201409 489169 216109 431847 414809 480842 508695 544955 203723 566245
10423 566245 88990 424200 426136 536946 485225 593971 319545 623387 35960 209753
10413 209753 454756 452449 430245 402915 26513 454521 438385 337065 295714 575560 533553
10402 533553 160958 107755 500512 155852 357552 572897 491618 152871 539579 776048
10392 776048 389206 532844 357791 731741 401402 399106 270491 527214 251854 341996
$$ packed form
10463F5846L58888o2487K12450l40398o4678K70518l1988K48173j51197R3647
10453E98774j94897j11321j97163L80947j05993M9322K87632k29170k06376j14430
10443A57325J40343p1247K91298j31728K59645n7845j46919Q1078q3447o4838
10433C73665j72256K87760k73060K15738j7038O6033K7853L6260l41232L62522
10423E66245m77255L35210J936J10810n1721J08746k74426L03842n87427J73793
10413B09753K45003k307k2204k7330l76402M28008j6136j01320m1351K79846m2007
10402E33553l72595n3203L92757l44660K01700K15345q1279l38747L86708K36469
10392G76048l86842J43638j75053L73950l30339k296j28615K56723k75360R0142
$$ plain form
10382 341996 487503 361601 195847 -3054 540462 15707 481837 320899 427550 313645
10372 313645 551135 375917 684804 549218 140352 324828 360364 613814 462556 261344
10362 261344 163193 339806 245889 551170 457573 696815 600183 575854 789850 478574
10352 478574 784528 499026 722754 545723 418284 429262 372105 743245 311309 777163
10342 777163 646907 712521 375752 548373 477416 606781 564141 326408 547726 448060
10332 448060 225621 512949 256287 389583 520929 252468 365289 119621 505732 304177
10322 304177 543630 267066 335542 35004 378349 75925 90874 98996 375030 426516
10312 426516 624118 309146 631152 412304 63974 356126 615482 510422 627924 321200
$$ packed form
10382C41996J45507j25902j65754j98901N43516n24755M66130j60938J06651j13905
10372C13645K37490j75218L08887j35586m08866J84476L5536K53450j51258k01212
10362B61344r8151J76613r3917L05281r3597K39242r6632k4329K13996l11276
10352D78574L05954k85502K23728j77031j27439J0978n7157L71140m31936M65854
10342G77163j30256O5614l36769J72621p0957J29365m2640k37733K21318r9666
10332D48060k22439K87328k56662J33296J31346k68461J12821k45668L86111k01555
10322C04177K39453k76564O8476l00538L43345l02424J4949Q122K76034N1486
10312D26516J97602l14972L22006k18848l48330K92152K59356j05060J17502l06724
$$ plain form
10302 321200 17192 349351 77207 239632 282600 448103 215952 268760 183331 132654
10292 132654 461676 416798 273127 426759 518240 388091 151275 664879 861588 584085
10282 584085 643557 657755 525392 649748 695106 418101 444409 698674 254557 757326
10272 757326 519784 632700 434095 430467 445822 976405 567304 364764 668123 741217
10262 741217 706856 427958 790612 592379 625297 401717 639376 653304 766596 258814
10252 258814 470596 468564 671985 259972 775647 696228 763299 756024 638851 665286 741836
10241 741836 623872 745936 646686 714878 624806 342299 482435 141046 644875 231267
10231 231267 367230 451741 765107 703779 433825 507126 237230 452684 464690 609588
$$ packed form
10302C21200l04008L32159k72144J62425M2968J65503k32151N2808q5429n0677
10292A32654L29022m4878j43671J53632R1481j30149k36816N13604J96709k77503
10282E84085N9472J4198j32363J24356M5358k77005K6308K54265m44117N02769
10272G57326k37542J12916j98605l628J5355N30583m09101k02540L03359P3094
10262G41217l4361k78898L62654j98233L2918k23580K37659J3928J13292n07782
10252B58814K11782k032K03421m12013N15675p9419O7071p275j17173K6435P6550
10241G41836j17964J22064r9250O8192r0072k82507J40136l41389N03829m13608
10231B31267J35963Q4511L13366o1328k69954P3301k69896K15454J2006J44898
$$ plain form
10221 609588 609201 519211 504587 384170 272981 220668 332877 448073 460436 369762 550284
10210 550284 756430 773028 797318 381101 663595 418467 390259 538252 -23572 494574
10200 494574 659406 711661 244862 591355 500118 777753 490507 512057 818248 515856
10190 515856 710223 545216 372922 324280 589667 719398 470584 616186 782459 437610
10180 437610 797311 667614 594090 698132 419265 637835 377084 521066 631813 500814
10170 500814 782237 703063 891910 763574 994511 183468 786473 643289 963688 892114
10160 892114 905625 537970 828412 834787 822469 922224 1132797 639755 1039956 1115721 1279682
10149 1279682 714194 1498673 1533032 1609567 1329322 1872471 2188919 2222093 2382337 2603339
$$ packed form
10221F09588l87q9990j4624j20417j11189n2313J12209J15196J2363r0674J80522
10210E50284K06146J6598K4290m16217K82494k45128k8208J47993n61824N18146
10200D94574J64832N2255m66799L46493r1237K77635k87246K1550L06191l02392
10190E15856J94367j65007j72294m8642K65387J29731k48814J45602J66273l44849
10180D37610L59701j29697p3524J04042k78867K18570k60751J43982J10747j30999
10170E00814K81423p9174J88847j28336K30937q11043O03005j43184L20399p1574
10160H92114J3511l67655K90442O375j2318R9755K10573m93042M00201P5765J63961
10149A279682n65488P84479L4359P6535k80245N43149L16448L3174J60244K21002
$$ plain form
10139 2603339 2576312 2506218 2378040 2448537 2066027 2281232 1775009 1647690 1441674 1164334
10129 1164334 1221265 1244697 854113 1269253 1345240 1156031 1120567 958462 740121 804626
10119 804626 809817 1063081 1013646 820873 756052 584927 841953 565517 671906 879408
10109 879408 502979 525094 603801 606007 625024 706612 479835 563879 576698 676170 791675
10098 791675 568565 507292 704933 755100 674927 759539 786690 503804 544152 467871 815933
10087 815933 695565 618260 778334 419266 559925 392215 524375 827034 534459 530410
10077 530410 769352 741321 768918 346073 855903 669363 644188 769765 515340 1003040
10067 1003040 790258 886688 678920 717939 749332 831711 575696 786620 457059 588376
$$ packed form
10139B603339k7027p0094j28178P0497l82510K15205n06223j27319k06016k77340
10129A164334N6931K3432l90584M15140P5987j89209l5464j62105k18341O4505
10119H04626N191K53264m9435j92773o4821j71125K57026k76436J06389K07502
10109H79408l76429K2115P8707K206J9017Q1588k26777Q4044J2819R9472J15505
10098G91675k23110o1273J97641N0167q0173Q4612K7151k82886M0348p6281L48062
10087H15933j20368p7305J60074l59068J40659j67710J32160L02659k92575m049
10077E30410K38942k8031K7597m22845N09830j86540k5175J25577k54425M87700
10067A003040k12782R6430k07768L9019L1393Q2379k56015K10924l29561J31317
$$ plain form
10057 588376 578672 504717 761354 521987 637182 730260 815420 614485 460299 641223
10047 641223 819772 454736 692346 801915 481580 461187 782185 611781 486398 1230244
10037 1230244 473369 423104 785345 831301 601336 682189 696931 867913 722233 721326 353938
10026 353938 660794 996468 535705 878822 802199 676370 761520 647335 857296 739596
10016 739596 181207 715310 788208 500697 712373 617457 619959 454553 909145 540182
10006 540182 841270 556949 579306 303464 652330 780040 875234 471356 812210 607854
9996 607854 689473 694255 860677 990878 1084409 590933 1017210 770415 761948 836337 707485
9985 707485 665008 843013 770899 748930 901106 670020 761250 667889 634701 900523 715029
$$ packed form
10057E88376r704p3955K56637k39367J15195R3078Q5160k00935j54186J80924
10047F41223J78549l65036K37610J09569l20335k0393L20998j70404j25383P43846
10037A230244p56875n0265L62241M5956k29965Q0853J4742J70982j45680r07l67388
10026C53938L06856L35674m60763L43117p6623j25829Q5150j14185K09961j17700
10016G39596n58389N34103P2898k87511K11676r4916K502j65406M54592l68963
10006E40182L01088k84321K2357k75842L48866J27710R5194m03878L40854k04356
9996F07854Q1619M782J66422J30201R3531m93476M26277k46795q467P4389j28852
9985G07485m2477J78005p2114k1969J52176k31086R1230r3361l3188K65822j85494
$$ plain form
9974 715029 547886 1074224 626984 643537 639869 831218 509863 673964 562287 498115
9964 498115 841703 749177 696534 301171 602996 899153 748550 505665 632384 486202
9954 486202 909400 641820 590637 754114 708526 861661 577354 478286 672740 716881
9944 716881 615552 572304 1021368 793997 502911 709127 628189 815902 970393 901347
9934 901347 1153333 762700 727860 522994 718686 833722 480120 630002 676390 800361
9924 800361 974523 909569 623719 827477 661299 773595 595656 966398 1084687 1024835
9914 1024835 846115 736928 715184 925648 557657 840399 1053631 881117 988413 1208058
9904 1208058 838404 916838 1040278 830087 1149539 836697 582037 743993 915553 873421
$$ packed form
9974G15029j67143N26338m47240J6553l668J91349l21355J64101j11677o4172
9964D98115L43588r2526n2643l95363L01825K96157j50603k42885J26719j46182
9954D86202M23198k67580n1183J63477m5588J53135k84307r9068J94454M4141
9944G16881j01329m3248M49064k27371k91086K06216q0938J87713J54491o9046
9934I01347K51986l90633l4840k04866J95692J15036l53602J49882M6388J23971
9924H00361J74162o4954k85850K03758j66178J12296j77939L70742J18289n9852
9914A024835j78720j09187k1744K10464l67991K82742K13232j72514J07296K19645
9904A208058l69654P8434J23440k10191L19452l12842k54660J61956J71560m2132
$$ plain form
9894 873421 838003 845481 906272 738283 1083286 806544 814337 1131865 1074007 813446 767218
9883 767218 1054349 1136300 1470777 1178881 1108018 1193955 970178 897131 730338 1195743
9873 1195743 1109624 1217327 1131233 891390 1042452 1138752 1344445 1175125 908996 1241545
9863 1241545 978699 1113477 835474 1004306 1031170 1110098 1059097 1542901 1138320 1472657
9853 1472657 1308005 1318072 939205 1147202 1470102 1311726 1120541 1172193 1113827 1803502
9843 1803502 1468697 1098654 1424802 1413947 1364497 1438260 1822644 1481728 1416852 1350451
9833 1350451 1566835 1271768 1259511 1413220 1606161 1160139 1184548 1656202 1579006 1284811
9823 1284811 1619834 1967275 1459948 1608329 1785639 1599252 1654676 1718719 2110820 2028564
$$ packed form
9894H73421l5418P478O0791j67989L45003k76742P793L17528n7858k60561m6228
9883G67218K87131Q1951L34477k91896p0863Q5937k23777p3047j66793M65405
9873A195743q6119J07703q6094k39843J51062R6300K05693j69320k66129L32549
9863A241545k62846J34778k78003J68832K6864P8928n1001M83804m04581L34337
9853A472657j64652J0067l78867K07997L22900j58376j91185N1652n8366O89675
9843A803502l34805l70043L26148j0855m9450P3763L84384l40916o4876o6401
9833A350451K16384k95067j2257J53709J92941m46022K4409M71654p7196k94195
9823A284811L35023L47441n07327J48381J77310j86387N5424O4043L92101q2256
$$ plain form
9813 2028564 1796016 1700774 1588296 1783801 1811831 2341897 2004141 2110102 2175517 2063417
9803 2063417 2089345 2287639 2293144 2079257 2512912 2322130 2276395 2542612 2346898 2671914
9793 2671914 2650423 2833834 2658381 2769689 3143460 3028258 2981390 3210146 3142280 3415419
9783 3415419 3375716 3426906 3465132 4115815 4167509 3958939 4205149 4385148 4572650 4603874
9773 4603874 5114525 4966266 5242984 5490539 5635598 5900508 6212998 6242372 6373182 6765620
9763 6765620 7076275 7313876 7903442 8053313 8585730 8937178 9446722 9632363 9828599 10597096
9753 10597096 11085947 11741992 11935401 12598534 13117287 13128124 13512818 13349425 14152934 14499958
9743 14499958 14950145 15273766 15848831 15962265 16561069 16832356 17044022 17568715 17601457 17516039
$$ packed form
9813B028564k32548r5242j12478J95505K8030N30066l37756J05961O5415j12100
9803B063417K5928J98294N505k13887M33655j90782m5735K66217j95714L25016
9793B671914k1491J83411j75453J11308L73771j15202m6868K28756o7866K73139
9783C415419l9703N1190L8226O50683N1694k08570K46210J79999J87502L1224
9773D603874N10651j48259K76718K47555J45059K64910L12490K9374J30810L92438
9763F765620L10655K37601N89566J49871N32417L51448N09544J85641J96236P68497
9753A0597096M88851O56045J93409O63133N18753J0837L84694j63393Q03509L47024
9743A4499958M50187L23621N75065J13434N98804K71287K11666N24693L2742q5418
$$ plain form
9733 17516039 17729443 17857676 17903547 17756229 17768092 17938208 18019938 18126896 18361465 18486159
9723 18486159 18476049 18777228 18527114 19019624 19306533 19263966 19418478 19896419 20004786 20034310
9713 20034310 20808999 20552164 21001117 21208962 21959878 22131401 21937072 22036465 22134161 22160417
9703 22160417 22419435 22280604 22284160 22364310 21864287 21690525 21481701 21106610 20767857 20663639
9693 20663639 20409610 20304694 19880481 19598761 19677115 19214505 19285499 18752282 18808058 18854114
9683 18854114 19005060 18373914 18030015 18544342 18575412 18624271 18722303 19159790 19124309 19211881
9673 19211881 19277288 19624687 19737494 20104979 20273862 20189182 19943541 20088654 20032902 20055416
9663 20055416 20067624 20190226 19860529 19838025 19444385 19793446 19226575 19515796 19375010 19309328
$$ packed form
9733A7516039K13404J28233M5871j47318J1863J70116Q1730J06958K34569J24694
9723A8486159j0110L01179k50114M92510K86909m2567J54512M77941J08367K9524
9713B0034310P74689k56835M48953K07845P50916J71523j94329R9393R7696K6256
9703B2160417K59018j38831L556Q0150n00023j73762k08824l75091l38753j04218
9693B0663639k54029j04916m24213k81720P8354m62610P0994n33217N5776M6056
9683A8854114J50946o31146l43899N14327L1070M8859R8032M37487l5481Q7572
9673A9211881O5407L47399J12807L67485J68883q4680k45641J45113n5752K2514
9663B0055416J2208J22602l29697k2504l93640L49061n66871K89221j40786o5682
$$ plain form
9653 19309328 19130175 19315714 19304408 19525373 19641306 19129153 19400071 19466534 19575661 19562953
9643 19562953 19307095 19793526 18945798 19148926 18948424 18395879 17931586 17393566 16714980
9634 16714980 16345851 15523612 15228832 14910007 14285375 14061639 13906612 13659804 13417198
9625 13417198 13065216 13172434 13235194 13172310 13234746 12951552 12901672 12782057 13000773 12480918
9615 12480918 12542965 12700286 12372293 11591468 11943192 11639890 11248915 10972490 10814949 10390824
9605 10390824 9980948 9153916 8913271 8303242 8126534 7627157 7503587 7389392 6944304
9596 6944304 6434595 6070850 5647516 5697528 5727137 5769934 5482049 5440931 4912785 4908465 4785586
9585 4785586 4761021 4620798 4495747 4584778 4287692 4225800 4205922 3859258 4204257 3927804
$$ packed form
9653A9309328j79153J85539j1306K20965J15933n12153K70918O6463J09127j2708
9643A9562953k55858M86431q47728K03128k00502n52545m64293n38020o78586
9634A6714980l69129q22239k94780l18825o24632k23736j55027k46808k42606
9625A3417198l51982J07218O2760o2884O2436k83194m9880j19615K18716n19855
9615A2480918O2047J57321l27993p80825L51724l03302l90975k76425j57541m24125
9605A0390824m09876q27032k40645o10029j76708m99377j23570j14195m45088
9596F944304n09709l63745m23334N0012K9609M2797k87885m1118n28146m320j22879
9585D785586k4565j40223j25051Q9031k97086o1892j9878l46664L44999k76453
$$ plain form
9575 3927804 3674316 3751883 4022379 3718211 3853137 3517925 3487850 3372392 3591726 3229169
9565 3229169 3333434 3254459 3291502 3223544 2818670 3016173 3052349 3010893 3028839 2834844 3020906
9554 3020906 2887520 2924974 2727280 2844723 2630516 2295690 2750144 2391941 2746159 2691700
9544 2691700 2393739 2463588 2390583 2473671 2308093 2405254 2711391 1981634 2338835 2176826
9534 2176826 2501492 2247392 2481175 2481760 2152425 2415590 2151840 2112715 2323262 2428630
9524 2428630 2261041 2075385 2066568 2248177 1921454 1933293 2239588 2183206 2035689 2374747
9514 2374747 2328682 2325413 2111123 2515190 2530082 2207159 2365590 2125273 2221770 2512279
9504 2512279 2521437 2442254 2806185 3031873 2938743 3047027 3181975 3295700 3187771 3355035
$$ packed form
9575C927804k53488P7567K70496l04168J34926l35212l0075j15458K19334l62557
9565C229169J04265p8975L7043o7958m04874J97503L6176m1456J7946j93995J86062
9554C020906j33386L7454j97694J17443k14207l34826M54454l58203L54218n4459
9544B691700k97961O9849p3005Q3088j65578R7161L06137p29757L57201j62009
9534B176826L24666k54100K33783N85l29335K63165k63750l9125K10547J05368
9524B428630j67589j85656q817J81609l26723J1839L06295n6382j47517L39058
9514B374747m6065l269k14290M04067J4892l22923J58431k40317R6497K90509
9504B512279R158p9183L63931K25688r3130J08284J34948J13725j07929J67264
$$ plain form
9494 3355035 2676322 2550065 2586652 2128345 2184246 2600423 2015230 2139984 1933272 2387155
9484 2387155 2180103 1861539 1876744 2251332 2009321 2037677 2082932 2122969 1751651 1925136
9474 1925136 1833096 1963755 1988806 2050460 1768355 1767518 1869006 1585993 1630241 1810117 1680167
9463 1680167 1817036 1817571 2034927 1519751 1538488 1881976 1665737 1817678 1584127 1573276
9453 1573276 1821127 1471240 1752600 1704546 1506359 1761645 1843899 1857756 2078425 1694493
9443 1694493 1784749 1671917 1771275 1817479 2038718 1867542 1944853 1850958 1967746 1931185 2101858
9432 2101858 2176960 1679984 1895911 1838158 2092749 2083363 2141045 2410663 1947497 2118624
9422 2118624 1857706 2113587 1903538 2458170 2345654 1969465 1872083 2176727 2395741 2234807
$$ packed form
9494C355035o78713j26257L6587m58307N5901M16177n85193J24754k06712M53883
9484B387155k07052l18564J5205L74588k42011K8356M5255M0037l71318J73485
9474A925136r2040J30659K5051O1654k82105q37J01488k83013M4248J79876j29950
9463A680167J36869N35K17356n15176J8737L43488k16239J51941k33551j0851
9453A573276K47851l49887K81360m8054j98187K55286Q2254J3857K20669l83932
9443A694493R0256j12832R9358M6204K21239j71176P7311r3895J16788l6561J70673
9432B101858P5102m96976K15927n7753K54591r386N7682K69618m63166J71127
9422B118624k60918K55881k10049N54632j12516l76189r7382L04644K19014j60934
$$ plain form
9412 2234807 2098496 2585292 2274959 2522461 2389293 2463012 2524550 2831737 2855207 2633192
9402 2633192 2419970 2499096 2495902 2756802 2605575 2797817 2755191 2882207 2945334 3246544
9392 3246544 3343089 3077964 3275574 3415696 3460618 3318174 3607651 3842343 3453141 3726532
9382 3726532 3672174 3788655 3941173 3852850 3863379 3781945 3590738 3913805 3757433 4054106
9372 4054106 4001366 4182903 3930455 3948803 4123505 4326950 4044607 4016844 4404653 4499106
9362 4499106 4573252 4884592 4992603 4944199 5379100 5422043 5413382 5823229 5840214 6222202 6542052
9351 6542052 6597141 6699002 6847444 6962289 7103141 7536656 7113470 7079515 7350477 7328664
9341 7328664 7196866 7422403 6988381 6949408 7191597 6713888 7318542 6867126 6790715 6883957
$$ packed form
9412B234807j36311M86796l10333K47502j33168P3719O1538L07187K3470k22015
9402B633192k13222P9126l194K60900j51227J92242m2626J27016O3127L01210
9392C246544R6545k65125J97610J40122M4922j42444K89477K34692l89202K73391
9382C726532n4358J16481J52518q8323J0529q1434j91207L23067j56372K96673
9372D054106n2740J81537k52448J8348J74702K03445k82343k7763L87809R4453
9362D499106P4146L11340J08011m8404M34901M2943q661M09847J6985L81988L19850
9351F542052N5089J01861J48442J14845J40852M33515m23186l3955K70962k1813
9341G328664j31798K25537m34022l8973K42189m77709O04654m51416p6411R3242
$$ plain form
9331 6883957 7073493 7049776 7234743 7460381 7132554 7631631 7861306 7783855 8190892 8040561
9321 8040561 8652394 8733349 8833653 9530180 9732886 10253822 10443280 10552291 11026905 11186587
9311 11186587 10932371 11118381 11166904 11070237 11244327 10970484 10711456 10518268 10422303 10593327
9301 10593327 10172530 9960351 10321976 9874874 10349131 9670482 10183865 10073608 10311596
9292 10311596 10598753 10350609 10409662 10473607 10774121 10852784 10989508 11501892 11597448 11779526
9282 11779526 11888126 12236079 12721998 12961695 12883299 13690066 13757432 14202651 14711646 14818549
9272 14818549 15481478 15891412 16281697 16856030 16940871 17102812 17364867 17731495 18298874 18533057
9262 18533057 18195710 18698508 18809301 19143982 18973840 19269053 19696310 20557692 20772945
$$ packed form
9331F883957J89536k3717J84967K25638l27827M99077K29675p7451M07037j50331
9321H040561O11833Q0955J00304O96527K02706N20936J89458J09011M74614J59682
9311A1186587k54216J86010M8523r6667J74090k73843k59028j93188r5965J71024
9301A0593327m20797k12179L61625m47102M74257o78649N13383j10257K37988
9292A0311596K87157k48144N9053O3945L00514P8663J36724N12384R5556J82078
9282A1779526J08600L47953M85919K39697p8396Q06767O7366M45219N08995J06903
9272A4818549O62929M09934L90285N74333Q4841J61941K62055L66628N67379K34183
9262A8533057l37347N02798J10793L34681j70142K95213M27257Q61382K15253
$$ plain form
9253 20772945 21528071 21707443 22468746 23022391 23677190 24180606 24795133 25583451 26157192
9244 26157192 26376086 26989350 26885839 27206687 27281529 27218934 27303864 27410755 27310287 27072456
9234 27072456 27095282 27222759 27238967 27218367 27030178 27492159 27322361 27224316 27348697 27808459
9224 27808459 28066175 28301977 28637831 29123198 29560270 29872480 30736038 31034438 31020772 31257099
9214 31257099 31788878 31892988 32083358 32432334 32343511 32468657 32407771 31793605 31564794 31211084
9204 31211084 30919981 30049743 30017234 29653371 29239333 28848259 28972630 28874250 28666925 28639559
9194 28639559 28356702 29033275 28609544 28551553 28399512 28270880 28194976 28349686 27844544 27846031
9184 27846031 27531963 27875416 27712280 27744458 27438863 27379695 27551662 27452969 27480948 27495274
$$ packed form
9253B0772945P55126J79372P61303N53645O54799N03416O14527P88318N73741
9244B6157192K18894O13264j03511L20848P4842o2595Q4930J06891j00468k37831
9234B7072456K2826J27477J6208k0600j88189M61981j69798r8045J24381M59762
9224B7808459K57716K35802L35854M85367M37072L12210Q63558K98400j3666K36327
9214C1257099N31779J04110J90370L48976q8823J25146o0886o14166k28811l53710
9204C1211084k91103q70238l2509l63863m14038l91074J24371r8380k07325k7366
9194B8639559k82857O76573m23731n7991j52041j28632p5904J54710n05142J487
9184B7846031l14068L43453j63136L2178l05595n9168J71967r8693K7979J4326
$$ plain form
9174 27495274 27526401 27906749 27988377 28184200 28033465 28503189 28725266 29147315 29058463 28963652
9164 28963652 29655601 29356195 29385530 29620930 29589754 29826726 29977334 30247859 30283773 30799091
9154 30799091 31066640 31351348 31348519 31946479 32350661 32885147 33120039 33567155 33819526 34181147
9144 34181147 34187144 34109568 34363737 34360397 34391540 34446321 34295902 34585857 34583699 34496339 34781449
9133 34781449 34268148 34454489 34218774 34453069 34293861 34481883 34626775 35035113 35222658
9124 35222658 35666852 36047712 36355545 37095142 37940832 38495131 39258457 39912596 40748153
9115 40748153 42013112 42629820 43687575 45087002 46321064 47440139 49217882 50984308
9107 50984308 53175585 55321616 57875420 61238764 64265168 68410584 72670015 78233646
$$ packed form
9174B7495274L1127L80348Q1628J95823j50735M69724K22077M22049q8852r4811
9164B8963652O91949k99406K9335K35400l1176K36972J50608K70525L5914N15318
9154C0799091K67549K84708k829N97960M04182N34486K34892M47116K52371L61621
9144C4181147N997p7576K54169l340L1143N4781j50419K89955k158q7360K85110
9133C4781449n13301J86341k35715K34295j59208J88022J44892M08338J87545
9124C5222658M44194L80860L07833P39597Q45690N54299P63326O54139Q35557
9115D0748153J264959O16708J057755J399427J234062J119075J777743J766426
9107E0984308K191277K146031K553804L363344L026404M145416M259431N563631
$$ plain form
9099 78233646 84169701 89682300 95303733 100958732 108190130 115715885 125580737 138354596
9091 138354596 156581424 181416832 210789494 235537838 254983912 270571219 279653718
9084 279653718 276112759 249828859 214690458 185292557 163528208 147152305 133518274
9077 133518274 121171233 110529314 101671271 94080986 88130029 83402295 78818059 75338484
9069 75338484 72053344 69051266 66524000 64088706 61785472 59868754 58020350 56363533
9061 56363533 54782160 53271697 52002438 50476444 49028511 47800352 46360502 45062746
9053 45062746 43778191 42031381 41449296 40361778 39461928 38826304 38057502 37534514 37196230
9044 37196230 36850289 36361751 36144584 36274340 35958738 35998211 35725658 36038530 35774449 35646768
$$ packed form
9099G8233646N936055N512599N621433N654999P231398P525755R864852J2773859
9091A38354596J8226828K4835408K9372662K4748344J9446074J5587307R082499
9084B79653718l540959k6283900l5138401k9397901k1764349j6375903j3634031
9077A33518274j2347041j0641919q858043p590285n950957m727734m584236l479575
9069G5338484l285140l002078k527266k435294k303234j916718j848404j656817
9061E6363533j581373j510463j269259j525994j447933j228159j439850j297756
9053D5062746j284555j746810n82085j087518q99850o35624p68802n22988l38284
9044C7196230l45941m88538k17167J29756l15602L9473k72553L12872k64081j27681
$$ plain form
9034 35646768 35737343 35678174 35738031 35322184 35149739 34696420 34395904 33793144 33041433 33010127
9024 33010127 32192825 31546928 31083494 31052843 30758524 30143269 29864598 30058454 29922403 29629341
9014 29629341 29388087 29440018 29799409 29424512 29695679 29641401 29837826 30584416 30723266 30959085
9004 30959085 31053911 31348895 31262873 31286232 31337837 31285474 31039099 30475867 30289479 29704360
8994 29704360 29218977 28244333 27815181 27176156 27185076 26377413 26446182 25987572 25675667 25565086
8984 25565086 25459619 25185509 25173621 24752306 25318412 24720530 24771161 24704350 24652702 24832595
8974 24832595 25014654 24973848 24458703 24595871 24211771 23655165 23311721 22702675 22360948 21548413
8964 21548413 20267350 19746888 19319107 18328614 18227559 17848257 17448663 16528985 16454489
$$ packed form
9034C5646768R0575n9169N9857m15847j72445m53319l00516o02760p51711l1306
9024C3010127q17302o45897m63434l0651k94319o15255k78671J93856j36051k93062
9014B9629341k41254N1931L59391l74897K71167n4278J96425P46590J38850K35819
9004C0959085R4826K94984q6022K3359N1605n2363k46375n63232j86388n85119
8994B9704360m85383r74644m29152o39025Q920q07663O8769m58610l11905j10581
8984B5565086j05467k74110j1888m21315N66106n97882N0631o6811n1648J79893
8974B4832595J82059m0806n15145J37168l84100n56606l43444o09046l41727q12535
8964B1548413j281063n20462m27781r90493j01055l79302l99594r19678p4496
$$ plain form
8955 16454489 15906998 15502037 15113045 15038290 14863546 14515940 14199095 14408478 14116453 13952068
8945 13952068 13497828 13289789 13151950 13220772 12547582 12152514 12261719 11922155 11222718 11047630
8935 11047630 10796537 10272649 9514660 9599242 9500930 8923745 8604180 8420492 8302479 8057120
8925 8057120 7320776 7591082 7560599 7064433 6728120 7083350 6477237 6611047 6462223 6040284
8915 6040284 5940499 6165749 5906663 5748390 5700254 5476649 5326697 5434760 5429109 5084477
8905 5084477 5104066 5035606 5124105 4669937 4408629 4298030 4345315 4207869 4567669 4086897
8895 4086897 4133529 4186044 3826843 4328537 4203641 3795568 3783150 3666968 3790976 4036165
8885 4036165 3687410 3690878 3603292 3513076 3483667 3605515 3445741 3338440 3546182 3332069
$$ packed form
8955A6454489n47491m04961l88992p4755j74744l47606l16845K09383k92025j64385
8945A3952068m54240k08039j37839O8822o73190l95068J09205l39564o99437j75088
8935A1047630k51093n23888p57989Q4582r8312n77185l19565j83688j18013k45359
8925H057120p36344K70306l0483m96166l36313L55230o06113J33810j48824m21939
8915F040284r9785K25250k59086j58273m8136k23605j49952J08063n651l44632
8905E084477J9589o8460Q8499m54168k61308j10599M7285j37446L59800m80772
8895D086897M6632N2515l59201N01694j24896m08073j2418j16182J24008K45189
8885D036165l48755L468q7586r0216k9409J21848j59774j07301K07742k14113
$$ plain form
8875 3332069 3217165 3116333 3070713 2721550 2733617 2890789 2774430 2931125 2921363 2922312 2903976
8864 2903976 2524395 2638857 2523518 2684745 2729002 2422377 2520823 2342814 2306432 2393244
8854 2393244 2338698 2595978 2591261 2003338 2430349 2342282 2220815 2107476 2257354 2194293
8844 2194293 2050797 1838712 2046881 1981501 2211430 2156618 2178818 1794754 1702496 1910088
8834 1910088 2007900 1795150 1831447 2118883 2064755 1426882 1629337 1714390 2025728 1296782
8824 1296782 1675407 1694160 1782303 1853973 1428061 1398385 1704053 1826737 2014003 1183915
8814 1183915 1646409 1485445 1751020 1748947 1550579 1566238 1241597 1693662 1669376 1585479
8804 1585479 1567680 1620250 1584128 1747863 1581279 1485900 1453382 1155106 1251368 1485361 1279365
$$ packed form
8875C332069j14904j00832m5620l49163J2067J57172j16359J56695r762R49j8336
8864B903976l79581J14462j15339J61227M4257l06625R8446j78009l6382Q6812
8854B393244n4546K57280m717n87923M27011q8067j21467j13339J49878o3061
8844B194293j43496k12085K08169o5380K29929n4812K2200l84064r2258K07592
8834A910088R7812k12750L6297K87436n4128o37873K02455Q5053L11338p28946
8824A296782L78625J8753Q8143P1670m25912k9676L05668J22684J87266q30088
8814A183915M62494j60964K65575k073j98368J5659l24641M52065k4286q3897
8804A585479j7799N2570l6122J63735j66584r5379l2518k98276R6262K33993k05996
$$ plain form
8793 1279365 1542700 1446330 1655541 1391068 1348851 1468609 1479803 1306596 1482679 1471339
8783 1471339 1379856 1338216 1521145 1389734 1082706 1396372 1381562 1309251 1509353 1113365
8773 1113365 1269323 1521162 1495538 1340628 1563282 1352160 1422342 1011588 1292895 864928
8763 864928 1226360 1049507 1470666 1353046 1417286 1318485 1379110 1486972 1268302 1359734
8753 1359734 1245506 1226442 1204895 926845 1087026 1082842 1051493 1030175 917296 1545930 1311048
8742 1311048 831345 753540 1093838 1065300 953376 1053021 1116218 893586 1128143 1011427
8732 1011427 978686 1059131 1089374 729144 1204132 1243746 832407 1016429 964571 1290133
8722 1290133 1469735 1168453 1205570 960095 1091271 942545 1104202 1287793 1373008 1223658
$$ packed form
8793A279365K63335r6370K09211k64473m2217J19758J1194j73207J76083j1340
8783A471339r1483m1640J82929j31411l07028L13666j4810p2311K00102l95988
8773A113365J55958K51839k5624j54910K22654k11122P0182m10754K81307m27967
8763H64928L61432j76853M21159j17620O4240r8801O0625J07862k18670R1432
8753A359734j14228j9064k1547k78050J60181m184l1349k1318j12879O28634k34882
8742A311048m79703p7805L40298k8538j11924R9645O3197k22632K34557j16716
8732A011427l2741Q0445L0243l60230M74988L9614m11339J84022n1858L25562
8722A290133J79602l01282L7117k45475J31176j48726J61657J83591Q5215j49350
$$ plain form
8712 1223658 790182 740866 1078541 1020323 1224874 955314 858035 904102 1150595 972398
8702 972398 697412 609938 1062808 835576 1064404 933864 894456 629990 847357 945453
8692 945453 1151639 769250 998485 694566 994389 1120317 1153989 1218787 1186662 1011917
8682 1011917 1283516 1221044 1210984 1488659 1528069 1236542 1474998 1392239 1660849 1676989
8672 1676989 1839346 2170677 2269170 2115389 2396701 2127905 1517180 1732282 1348498 1338190
8662 1338190 1176429 1386490 1273713 974269 532954 630266 823635 858028 854287 760827
8652 760827 801796 728298 380275 967510 545633 718687 691434 908756 624978 601424
8642 601424 728249 642301 473323 454378 910920 449793 754212 705174 611668 826905
$$ packed form
8712A223658m33476m9316L37675n8218K04551k69560r7279M6067K46493j78197
8702I72398k74986q7474M52870k27232K28828j30540l9408k64466K17367R8096
8692I45453K06186l82389K29235l03919K99823J25928L3672O4798l2125j74745
8682A011917K71599o2472j0060K77675L9410k91527K38456q2759K68610J6140
8672A676989J62357L31331R8493j53781K81312k68796o10725K15102l83784j0308
8662A338190j61761K10061j12777k99444m41315R7312J93369L4393l741r3460
8652G60827M0969p3498l48023N87235m21877J73054k7253K17322k83778k3554
8642F01424J26825q5948j68978j8945M56542m61127L04419m9038r3506K15237
$$ plain form
8632 826905 642749 555634 697685 521365 404989 575513 627141 354565 205025 276802
8622 276802 635048 286256 534606 359487 566167 350928 707335 360643 464404 96548
8612 96548 203871 531093 373425 553621 567608 502009 31520 240410 207490 352943
8602 352943 427386 485384 633616 331755 510630 898426 72486 191356 165010 614379
8592 614379 221073 183269 27785 125849 105557 256944 523958 90644 205447 408346
8582 408346 211675 237945 160091 178892 173800 378121 158018 285836 -4011 426632 203461
8571 203461 419523 294151 129967 277773 -77303 120267 42085 96283 472339 301729
8561 301729 242253 464198 233926 359834 202406 479949 91329 311313 196589 129395
$$ packed form
8632H26905j84156q7115J42051j76320j16376J70524N1628k72576j49540P1777
8622B76802L58246l48792K48350j75119K06680k15239L56407l46692J03761l67856
8612I6548J07323L27222j57668J80196J3987o5599m70489K08890l2920J45453
8602C52943P4443N7998J48232l01861J78875L87796q25940J18870k6346M49369
8592F14379l93306l7804j55484R8064k0292J51387K67014m33314J14803K02899
8582D08346j96671K6270p7854J8801n092K04321k20103J27818k89847M30643k23171
8571B03461K16062j25372j64184J47806l55076J97570p8182N4198L76056j70610
8561C01729n9476K21945k30272J25908j57428K77543l88620K19984j14724o7194
$$ plain form
8551 129395 29070 229843 -26891 -12617 177587 241027 82225 48467 119108 57803 7921
8540 7921 -10388 -167529 68068 -344706 -90865 -102344 -965283 -1270086 1236094 708105
8530 708105 363712 122431 613370 347812 498504 231104 346001 112498 112839 17606
8520 17606 491617 301147 205327 173663 254142 453096 186254 132293 -48466 -54579 37271
8509 37271 210146 -40858 -223408 221535 211314 310483 267616 190191 26412 147239 65242
8498 65242 230351 143196 220494 270207 238140 354874 398279 90102 10064 215497 66683
8487 66683 93968 383377 445452 461693 87800 298456 319243 104034 18366 18551 18576 314451
8475 314451 140300 21009 10310 570175 136685 -88588 67068 279266 398124 491173
$$ packed form
8551A29395j00325K00773k56734J4274J90204O3440j58802l3758P0641o1305m9882
8540G921j8309j57141K35597m12774K53841j1479q62939l04803K506180n27989
8530G08105l44393k41281M90939k65558J50692k67400J14897k33503L41r5233
8520A7606M74011j90470r5820l1664Q0479J98954k66842n3961j80759o113R1850
8509C7271J72875k51004j82550M44943j0221R9169m2867p7425j63779J20827q1997
8498F5242J65109q7155P7298M9713l2067J16734M3405l08177q0038K05433j48814
8487F6683K7285K89409O2075J6241l73893K10656K0787k15209q5668J85K5K95875
8475C14451j74151j19291j0699N59865m33490k25273J55656K12198J18858R3049
$$ plain form
8465 491173 269113 315331 -42043 51168 149982 188662 192279 531574 322527 158537 478796
8454 478796 -38597 11878 -82019 44696 145136 123651 -20839 -108616 252702 319557 272421
8443 272421 219060 -86219 451261 239530 -128358 -147988 -17939 81488 241112 296154
8433 296154 252086 192158 -23305 188204 -142711 9536 35457 195693 155511 317389
8423 317389 221432 183971 345461 165753 34740 233494 488310 554446 413677 211410
8413 211410 56572 355445 237047 -178096 317414 168664 436570 205378 214934 369163
8403 369163 -75048 380138 149125 173784 190051 341860 211491 211684 -195402 240445 -98495
8392 -98495 138687 -5320 256361 176945 135147 56979 51259 100429 132413 -118992 200339
$$ packed form
8465D91173k22060M6218l57374R3211R8814L8680L617L39295k09047j63990L20259
8454D78796n17393N0475r3897J26715J00440k1485j44490q7777L61318O6855m7136
8443B72421n3361l05279N37480k11731l67888j9630J30049R9427J59624N5042
8433B96154m4068n9928k15463K11509l30915J52247K5921J60236m0182J61878
8423C17389r5957l7461J61490j79708j31013J98754K54816O6136j40769k02267
8413B11410j54838K98873j18398m15143M95510j48750K67906k31192R556J54229
8403C69163m44211M55186k31013K4659J6267J51809j30369J93m07086M35847l38940
8392i8495K37182j44007K61681p9416m1798p8168n720M9170L1984k51405L19331
$$ plain form
8381 200339 52186 190234 14541 265919 187907 164435 300854 -226264 286990 -91154
8371 -91154 309512 91456 325895 -127598 438434 496181 70320 33448 302260 80646
8361 80646 -8003 420483 275948 193599 70050 156575 -59004 68386 211971 390482
8351 390482 382728 -149871 239693 -30207 -23657 336185 197617 1673 245924 177722 -215589
8340 -215589 180392 -227769 40631 -121751 117114 312022 135608 56880 115987 18683
8330 18683 541032 123841 361159 180434 182142 59443 219984 -92817 360866 10506
8320 10506 256673 -32953 56910 148335 160032 124455 24707 125927 252646 -79296 -237586
8309 -237586 33477 347539 196280 325624 2784 94709 77986 -137792 88174 182082
$$ packed form
8381B00339j48153J38048j75693K51378p8012k3472J36419n27118N13254l78144
8371i1154M00666k18056K34439m53493N66032N7747m25861l6872K68812k21614
8361H0646q8649M28486j44535q2349j23549Q6525k15579J27390J43585J78511
8351C90482p754n32599L89564k69900O550L59842j38568j95944K44251o8202l93311
8340b15589L95981m08161K68400j62382K38865J94908j76414p8728N9107r7304
8330A8683N22349m17191K37318j80725J708j22699J60541l12801M53683l50360
8320A0506K46167k89626Q9863R1425J1697l5577r9748J01220J26719l31942j58290
8309b37586K71063L14062j51259J29344l22840R1925j6723k15778K25966R3908
$$ plain form
8299 182082 480074 350911 109772 416501 -8530 132785 17228 225898 -93913 343440
8289 343440 14904 204274 -11250 113307 -69242 -26994 12725 -86884 255349 67195
8279 67195 19364 542312 -141742 163656 105301 197785 218595 159828 -72887 321680 285023
8268 285023 -55390 153120 340651 483136 120564 64941 -170510 403046 -5337 335686
8258 335686 -26579 107769 232642 51605 56361 247467 153776 -83785 206868 -20499
8248 -20499 -115634 219073 403160 218002 500912 -193554 311304 21228 126677 221645
8238 221645 69655 98237 136885 210168 80606 44451 -121578 -525 11824 92783 39077
8227 39077 360083 3055 -243401 109463 -37370 87252 327420 -132993 51672 -104030
$$ packed form
8299A82082K97992j29163k41139L06729m25031J41315j15557K08670l19811M37353
8289C43440l28536J89370k15524J24557j82549M2248L9719r9609L42233j88154
8279F7195m7831N22948o84054L05398n8355R2484K0810n8767k32715L94567l6657
8268B85023l40413K08510J87531J42485l62572n5623k35451N73556m08383L41023
8258C35686l62265J34348J24873j81037M756J91106r3691k37561K90653k27367
8248b0499r5135L34707J84087j85158K82910o94466N04858k90076J05449R4968
8238B21645j51990K8582L8648P3283j29562l6155j66029J21053J2349Q0959n3706
8227C9077L21006l57028k46456L52864j46833J24622K40168m60413J84665j55702
$$ plain form
8217 -104030 36250 6752 181655 397919 238652 55689 224927 64550 -169121 134236
8207 134236 256583 -150790 35338 667974 156587 175681 -189748 478669 -42904 -96981
8197 -96981 259547 252998 -46031 790290 595618 753156 727283 742992 211947 -99222 420990
8186 420990 -68941 -37379 337672 139970 207888 126538 -25981 88005 280108 191160
8176 191160 247113 140230 253499 554267 284172 64268 -58745 348795 229932 215847
8166 215847 -185548 49284 428019 330343 -28653 161658 -119845 161230 138825 453212
8156 453212 490315 97374 289124 191201 -46643 56451 7408 -86727 30020 452592
8146 452592 101712 40351 450345 89668 189390 -53971 188527 799701 489034 8336
$$ packed form
8217a04030J40280k9498J74903K16264j59267j82963J69238j60377k33671L03357
8207A34236J22347m07373J86128O32636n11387J9094l65429O68417n21573n4077
8197i6981L56528o549k99029Q36321j94672J57538k5873J5709n31045l11169N20212
8186D20990m89931L1562L75051j97702O7918q1350j52519J13986J92103q8948
8176A91160N5953j06883J13269L00768k70095k19904j23013M07540j18863j4085
8166B15847m01395K34832L78735r7676l58996J90311k81503K81075k2405L14387
8156D53212L7103l92941J91750r7923k37844J03094m9043r4135J16747M22572
8146D52592l50880o1361M09994l60677R9722k43361K42498O11174l10667m80698
$$ plain form
8136 8336 76717 216630 74592 -164719 252833 237079 4477 124649 387800 455395 133797
8125 133797 380871 330836 191801 537698 257243 208100 -77161 -352660 202657 751282
8115 751282 113585 240542 221398 312069 364882 196426 157429 125738 139125 299443 197340
8104 197340 -31713 55359 233828 292113 395358 330520 -44977 143319 271038 -34981
8094 -34981 253167 154424 204902 9633 317621 305456 195999 273210 167423 27311 335226
8083 335226 41878 462137 357974 357915 124735 499898 94166 327948 221871 114396
8073 114396 51852 282784 97097 61036 215780 260181 -79288 -8228 125897 361198
8063 361198 327055 104704 279534 252606 77524 622141 100227 136621 328251 324390 136114
$$ packed form
8136H336O8381J39913j42038k39311M17552j5754k32602J20172K63151O7595l21598
8125A33797K47074n0035j39035L45897k80455m9143k85261k75499N55317N48625
8115G51282o37697J26957j9144R0671N2813j68456l8997l1691J3387J60318j02103
8104A97340k29053Q7072J78469N8285J03245o4838l75497J88296J27719l06019
8094c4981K88148r8743N0478j95269L07988j2165j09457P7211j05787j40112L07915
8083C35226k93348M20259j04163n9k33180L75163m05732K33782j06077j07475
8073A14396o2544K30932j85687l6061J54744M4401l39469P1060J34125K35301
8063C61198l4143k22351J74830k6928j75082N44617n21914L6394J91630l861j88276
$$ plain form
8052 136114 231934 300347 436058 -24052 184782 134435 144333 382853 269265 261813 413630
8041 413630 317884 8350 258103 -68720 207188 337353 442719 2680 472505 187017
8031 187017 110914 126567 318473 14793 198130 89525 205154 224362 377201 209993
8021 209993 238886 355268 101606 99589 418823 263998 330803 74623 495314 181274
8011 181274 252188 373254 100311 295064 356848 223497 141461 501933 138265 245456
8001 245456 349522 333509 204651 323015 414383 584757 408391 752396 250256 222639
7991 222639 195395 270175 185790 265681 431864 349139 417928 -171542 -98920 338177 182968
7980 182968 542520 375774 319828 455133 419052 290557 320009 393910 516914 -45196
$$ packed form
8052A36114R5820O8413J35711m60110K08834n0347R898K38520j13588p452J51817
8041D13630r5746l09534K49753l26823K75908J30165J05366m40039M69825k85488
8031A87017p6103J5653J91906l03680J83337j08605J15629J9208J52839j67208
8021B09993K8893J16382k53662k017L19234j54825O6805k56180M20691l14040
8011A81274P0914J21066k72943J94753O1784j33351q2036L60472l63668J07191
8001B45456J04066j6013j28858J18364R1368J70374j76366L44005n02140k7617
7991B22639k7244P4780q4385P9891J66183q2725O8789n89470P2622M37097j55209
7980A82968L59552j66746n5946J35305l6081j28495K9452P3901J23004n62110
$$ plain form
7970 -45196 17130 430286 419324 485718 240652 21997 245144 504903 194710 214006 105995
7959 105995 260587 134659 293932 490995 265032 295471 115631 198113 327791 59291
7949 59291 183938 229858 221771 197743 198463 452907 108857 219199 24238 350215 192733
7938 192733 424636 413378 190186 362679 69240 320884 147470 102284 -241777 355489
7928 355489 341317 283699 532187 285319 188432 151090 252216 135902 471829 466177 28829
7917 28829 359493 150708 361132 239036 151874 41178 -91278 187296 62748 263354
7907 263354 300065 141696 143026 264274 162560 88767 46257 426692 -22295 229890 -173827
7896 -173827 -27201 -77681 89258 200322 396296 354119 120168 420884 304129 47004
$$ packed form
7970d5196O2326M13156j0962O6394k45066k18655K23147K59759l10193J9296j08011
7959A05995J54592j25928J59273J97063k25963L0439j79840Q2482J29678k68500
7949E9291J24647M5920q087k4028P20K54444l44050J10342j94961L25977j57482
7938A92733K31903j1258k23192J72493k93439K51644j73414m5186l44061N97266
7928C55489j4172n7618K48488k46868r6887l7342J01126j16314L35927n652m37348
7917B8829L30664k08785K10424j22096q7162j10696j32456K78574j24548K00606
7907B63354L6711j58369J330J21248j01714p3793m2510L80435m48987K52185m03717
7896a73827J46626n0480J66939J11064J95974m2177k33951L00716j16755k57125
$$ plain form
7886 47004 223217 -188319 31969 311505 17133 299404 71149 515213 268454 356803
7876 356803 466338 228885 451071 -110166 453168 323511 357444 260766 241026 277345
7866 277345 -3986 335009 221552 13736 557128 246924 155670 32589 -99733 416183
7856 416183 -20241 125662 -198149 -181549 -810410 2518477 789516 494788 397899 705492
7846 705492 230149 227983 610140 224749 401561 647109 -9598 104434 516807 366798
7836 366798 432707 551534 52074 153169 233430 56632 499711 280859 339626 311135
7826 311135 304370 8177 -23863 83091 -182617 203192 210154 404515 215925 98853 463569
7815 463569 112719 -31444 190957 317854 -10510 307846 379077 513085 39129 630989
$$ packed form
7886D7004J76213m11536K20288K79536k94372K82271k28255M44064k46759Q8349
7876C56803J09535k37453K22186n61237N63334j29657L3933r6678j9740L6319
7866B77345k81331L38995j13457k07816N43392l10204r1254j23081j32322N15916
7856D16183m36424J45903l23811J6600o28861L328887j728961k94728r6889L07593
7846G05492m75343k166L82157l85391J76812K45548o56707J14032M12373j50009
7836C66798O5909J18827m99460J01095Q0261j76798M43079k18852N8767k8491
7826C11135o765k96193l2040J06954k65708L85809O962J94361j88590j17072L64716
7815D63569l50850j44163K22401J26897l28364L18356P1231J34008m73956N91860
$$ plain form
7805 630989 353861 313527 247294 3619 -48723 531983 205745 404134 -89985 -129010
7795 -129010 142866 524113 203141 334437 200825 4085 145666 292501 159427 264407
7785 264407 53734 291466 -111143 386844 433048 242313 217846 299822 131886 161993
7775 161993 362171 232220 379425 185485 413140 445546 50756 389114 240780 363304
7765 363304 241848 633430 143569 550300 236505 341483 421525 106909 465395 645239
7755 645239 471836 334880 240236 221100 247825 -144018 627854 368401 441361 178281
7745 178281 92335 186713 153640 436392 77152 319649 349855 288453 -38381 485789 442236
7734 442236 297782 184973 339702 335533 86156 267779 278277 -7120 138294 351314
$$ packed form
7805F30989k77128m0334o6233k43675n2342N80706l26238J98389m94119l9025
7795a29010K71876L81247l20972J31296j33612j96740J41581J46835j33074J04980
7785B64407k10673K37732m02609M97987M6204j90735k4467Q1976j67936L0107
7775A61993K00178j29951J47205j93940K27655L2406l94790L38358j48334J22524
7765C63304j21456L91582m89861M06731l13795J04978Q0042l14616L58486J79844
7755F45239j73403j36956r4644j9136K6725l91843P71872k59453P2960k63080
7745A78281q5946R4378l3073K82752l59240K42497L0206o1402l26834N24170m3553
7734D42236j44454j12809J54729m169k49377J81623J0498k85397J45414K13020
$$ plain form
7724 351314 163486 355248 308390 -168742 335939 341647 201559 172990 311711 309907 355918
7713 355918 279462 131946 175 83736 533266 498606 -12380 328663 514896 320401
7703 320401 306102 380965 306253 63382 -104905 302190 235975 87259 307648 101375
7693 101375 102628 422229 230200 297913 375705 239024 491679 -20580 318108 354024 306125
7682 306125 463047 413678 47744 439008 396513 209357 191426 65647 38369 239940
7672 239940 136465 244611 400406 133691 488583 -37409 434749 586588 262787 486776
7662 486776 -24034 155142 316023 259142 -19593 420504 457380 277718 458977 429992
7652 429992 312307 350419 277877 72114 382916 206137 236478 580071 283907 523630
$$ packed form
7724C51314j87828J91762m6858m77132N04681N708j40088k8569J38721j804M6011
7713C55918p6456j47516j31771Q3561M49530l4660n10986L41043J86233j94495
7703C20401j4299P4863p4712k42871j68287M07095o6215j48716K20389k06273
7693A01375J253L19601j92029O7713P7792j36681K52655n12259L38688L5916m7899
7682C06125J56922m9369l65934L91264m2495j87156j7931j25779k7278K01571
7672B39940j03475J08146J55795k66715L54892n25992M72158J51839l23801K23989
7662D86776n10810J79176J60881n6881k78735M40097L6876j79662J81259k8985
7652D29992j17685L8112p2542k05763L10802j76779L0341L43593k96164K39723
$$ plain form
7642 523630 -96176 58464 442482 65408 377630 653472 357266 357799 373992 399409 181233
7631 181233 495405 597377 251925 328650 228261 149396 296908 484167 163879 180953
7621 180953 -16041 259853 390101 499777 176928 235092 513601 395450 628469 367962
7611 367962 105617 379109 314328 43022 251592 294823 177696 71172 231840 334127
7601 334127 256793 458241 445787 208196 310190 498304 307638 -10649 109688 513966
7591 513966 410617 116678 230490 119414 283302 749880 190141 508348 541312 248130
7581 248130 18468 -68528 164197 418572 212500 508850 396272 375107 427608 298605
7571 298605 321143 277644 376569 379462 266166 626899 734605 102508 304314 460613 473905
$$ packed form
7642E23630o19806J54640L84018l77074L12222K75842k96206N33J6193K5417k18176
7631A81233L14172J01972l45452P6725j00389p8865J47512J87259l20288J7074
7621A80953j96994K75894J30248J09676l22849N8164K78509j18151K33019k60507
7611C67962k62345K73492o4781k71306K08570M3231j17127j06524J60668J02287
7601C34127p7334K01448j2454k37591J01994J88114j90666l18287J20337M04278
7591E13966j03349k93939J13812j11076J63888M66578n59739L18207L2964k93182
7581B48130k29662q6996K32725K54375k06072K96350j12578k1165N2501j29003
7571B98605K2538m3499R8925K893j13296L60733J07706o32097K01806J56299J3292
$$ plain form
7560 473905 438600 585528 344648 492567 380360 480421 383430 477430 571286 267663
7550 267663 464744 216349 535150 371666 192839 396100 184676 524088 577397 293907
7540 293907 120524 14939 289138 403491 310195 466499 267203 433818 663932 53878
7530 53878 575604 486139 348326 303909 6654 296522 474294 632825 64482 245441
7520 245441 367442 388865 363141 426984 276790 453434 490493 376615 279282 368724 616635
7509 616635 777622 507204 333413 647240 281124 353729 475989 368796 181241 204289
7499 204289 184073 598500 287280 438507 274487 50439 299335 397676 473075 589615
7489 589615 -85885 777246 480290 260363 613878 386590 756863 521975 -189365 255299
$$ packed form
7560D73905l5305J46928k40880J47919j12207J00061r6991R4000R3856l03623
7550B67663J97081k48395L18801j63484j78827K03261k11424L39412N3309k83490
7540B93907j73383j05585K74199J14353r3296J56304j99296J66615K30114o10054
7530E3878N21726q9465j37813m4417k97255K89868J77772J58531n68343J80959
7520B45441J22001K1423k5724O3843j50194J76644L7059j13878r7333Q9442K47911
7509F16635J60987k70418j73791L13827l66116P2605J22260j07193j87555K3048
7499B04289k0216M14427l11220J51227j64020k24048K48896R8341P5399J16540
7489E89615o75500Q63131k96956k19927L53515k27288L70273k34888p11340M44664
$$ plain form
7479 255299 361533 151494 441914 509472 485441 295203 385841 460223 218360 231042 481444
7468 481444 508178 717536 429650 340061 402688 278981 331582 239058 731648 497828 265137
7457 265137 270296 389110 547771 656547 596354 753823 471052 434240 694406 542581
7447 542581 722895 557224 709030 652662 587694 380675 630246 589588 407775 147853
7437 147853 408983 417549 674903 473862 370042 364527 563365 583699 492402 488396 700601
7426 700601 994733 172893 995365 191401 582050 843367 546042 331063 459548 651029
7416 651029 631537 441152 817467 374287 455824 2162 229764 549920 500820 573216
7406 573216 549652 516666 779358 167671 441173 537015 198694 296629 577820 463878
$$ packed form
7479B55299J06234k10039K90420O7558k4031j90238R0638P4382k41863J2682K50402
7468D81444K6734K09358k87886q9589O2627j23707N2601r2524M92590k33820k32691
7457B65137N159J18814J58661J08776o0193J57469k82771l6812K60166j51825
7447E42581J80314j65671J51806n6368o4968k07019K49571m0658j81813k59922
7437A47853K61130Q566K57354k01041j03820n515J98838K0334r1297m006K12205
7426G00601K94132q21840Q22472q03964L90649K61317k97325k14979J28485J91481
7416F51029j9492j90385L76315m43180Q1537m53662K27602L20156m9100P2396
7406E73216k3564l2986K62692o11687K73502R5842l38321R7935K81191j13942
$$ plain form
7396 463878 201982 581481 326335 655542 295890 251170 420111 448440 516512 561369
7386 561369 511733 517870 355869 369718 564918 874810 635938 558880 684229 456937 661972
7375 661972 671471 360132 261797 132052 410224 355892 706206 899598 395550 282523
7365 282523 288477 454538 352463 167908 288989 370293 638429 433216 281241 518963
7355 518963 308460 305523 515745 518388 393263 452113 317002 321426 168233 576875 253122
7344 253122 464759 538454 570032 418770 280159 826091 308847 412858 460537 458266 420995
7333 420995 530090 322059 422036 504844 401765 240199 497895 329439 525792 179943
7323 179943 370630 747876 430243 311022 773156 322620 511972 729645 362701 472463
$$ packed form
7396D63878k61896L79499k55146L29207l59652m4720J68941K8329O8072M4857
7386E61369m9636O137j62001J3849J95200L09892k38872p7058J25349k27292K05035
7375F61972R499l11339r8335j29745K78172n4332L50314J93392n04048j13027
7365B82523N954J66061j02075j84555J21081Q1304K68136k05213j51975K37722
7355E18963k10503k937K10222K643j25125N8850j35111M424j53193M08642l23753
7344B53122K11637P3695L1578j51262j38611N45932n17244J04011M7679k271l7271
7333D20995J09095k08031R9977Q2808j03079j61566K57696j68456J96353l45849
7323A79943J90687L77246l17633j19221M62134m50536J89352K17673l66944J09762
$$ plain form
7313 472463 719729 375538 249184 634917 601565 516436 661047 363849 496209 454659
7303 454659 543475 428761 596808 711024 892249 778435 521955 459973 781876 424145
7293 424145 190453 593171 645024 470100 753921 589686 362070 518150 923667 496751
7283 496751 363581 581901 392649 377084 867930 637740 541855 369946 740989 625013
7273 625013 593713 384643 455971 589977 630732 614846 662152 507884 819235 720157 656330
7262 656330 292019 533711 528739 510534 544584 706230 796883 560210 366726 471393 359454
7251 359454 576463 426833 613552 423338 181559 613197 536055 486904 463910 711504
7241 711504 743725 453043 442514 362736 462780 713077 544949 236926 442032 235881
$$ packed form
7313D72463K47266l44191j26354L85733l3352q5129J44611k97198J32360m1550
7303D54659Q8816j14714J68047J14216J81225j13814k56480o1982L21903l57731
7293D24145k33692M02718N1853j74924K83821j64235k27616J56080M05517m26916
7283D96751j33170K18320j89252j5565M90846k30190r5885j71909L71043j15976
7273F25013l1300k09070P1328J34006M0755j5886M7306j54268L11351r9078o3827
7262F56330l64311K41692m972j8205L4050J61646R0653k36673j93484J04667j11939
7251C59454K17009j49630J86719j90214k41779M31638p7142m9151k2994K47594
7241G11504L2221k90682j0529p9778J00044K50297j68128l08023K05106k06151
$$ plain form
7231 235881 387993 265573 407457 719669 758234 774358 445986 701537 729885 633248
7221 633248 749946 577745 687737 190675 425292 742113 711069 560282 398484 640777
7211 640777 576621 512637 163457 279493 827431 330302 686303 966318 708659 90237
7201 90237 432627 602832 514770 335406 366267 410639 496153 773223 695861 400619 749463
7190 749463 494107 580434 677227 300152 395973 700941 384462 374321 461262 790836 493126
7179 493126 700455 793738 629953 704135 870953 576202 736209 487856 681298 461458
7169 461458 569286 638602 583882 389015 567444 468594 934280 705639 521694 678176
7159 678176 682444 487094 661590 492810 321813 790167 415733 539726 318351 464850
$$ packed form
7231B35881J52112j22420J41884L12212L8565J6124l28372K55551K8348r6637
7221F33248J16698j72201J09992m97062K34617L16821l1044j50787j61798K42293
7211F40777o4156o3984l49180J16036N47938m97129L56001K80015k57659o18422
7201I0237L42390J70205q8062j79364L0861M4372Q5514K77070p7362k95242L48844
7190G49463k55356Q6327R6793l77075R5821L04968l16479j0141Q6941L29574k97710
7179D93126K07329R3283j63785P4182J66818k94751J60007k48353J93442k19840
7169D61458J07828O9316n4720j94867J78429r8850M65686k28641j83945J56482
7159F78176M268j95350J74496j68780j70997M68354l74434J23993k21375J46499
$$ plain form
7149 464850 1023833 851374 731333 1062065 541865 574332 820244 667916 649770 681246
7139 681246 990320 449934 693928 946940 1011620 651584 920797 437995 534291 471937
7129 471937 607606 938967 835835 819761 654291 704410 578717 666866 799569 680942
7119 680942 1111018 529425 843608 556031 796995 458730 731347 1037297 846872 958581
7109 958581 682009 579698 788285 606203 904748 519482 657138 894023 1113483 1042954
7099 1042954 809592 1079393 877803 818634 572411 1036834 1011923 845074 1090928 1162012
7089 1162012 964392 1469630 1295792 858819 657098 736638 849482 967039 1176958 1037943
7079 1037943 971072 762424 943262 1571924 1281726 1136263 934426 1001245 1262144 1329075
$$ packed form
7149D64850N58983j72459j20041L30732n20200L2467K45912j52328j8146L1476
7139F81246L09074n40386K43994K53012O4680l60036K69213m82802R6296o2354
7129D71937J35669L31361j03132j6074j65470N0119j25693Q8149J32703j18627
7119F80942M30076n81593L14183k87577K40964l38265K72617L05950j90425J11709
7109I58581k76572j02311K08587j82082K98545l85266J37656K36885K19460p0529
7099A042954k33362K69801k01590n9169k46223M64423k4911j66849K45854P1084
7089A162012j97620N05238j73838m36973k01721P9540J12844J17557K09919j39015
7079A037943o6871k08648J80838O28662k90198j45463k01837O6819K60899O6931
$$ plain form
7069 1329075 1511723 1470319 1202336 1250309 729026 1443511 1461965 1354086 1625392 1540222
7059 1540222 1333612 1634700 1774892 1761682 1545934 1453889 1630047 1523766 1969511 1603098
7049 1603098 1974269 1969398 1667204 1540834 1907522 1816086 2015194 1619356 2151700 1725195
7039 1725195 1982339 1849172 1951757 2029354 2056523 2282604 1860876 2341465 2356360 2327217
7029 2327217 2387969 1872906 2344821 2346929 2603983 2247040 2396498 2576104 2647650 2468815
7019 2468815 2257737 2484722 2671349 2830138 2527884 2501916 2611420 2479463 2675645 2833975
7009 2833975 2786937 2568527 2792084 3088039 2671196 2600637 3088385 3010842 2475796 3071021
6999 3071021 2871792 2974008 3046480 3169480 3130900 3285614 3172897 3071036 3130984 3247630
$$ packed form
7069A329075J82648m1404k67983M7973n21283P14485J8454j07879K71306q5170
7059A540222k06610L01088J40192j3210k15748r2045J76158j06281M45745l66413
7049A603098L71171m871l02194j26370L66688r1436J99108l95838N32344m26505
7039A725195K57144j33167J02585P7597K7169K26081m21728M80589J4895k9143
7029B327217O0752n15063M71915K108K57054l56943J49458J79606P1546j78835
7019B468815k11078K26985J86627J58789l02254k5968J09504j31957J96182J58330
7009B833975m7038k18410K23557K95955m16843p0559M87748p7543n35046N95225
6999C071021j99229J02216P2472J23000l8580J54714j12717j01861N9948J16646
$$ plain form
6989 3247630 3333479 3741063 3370109 3347461 3542132 3336333 3446259 3585344 3423790 3298622
6979 3298622 3490753 3287734 3120419 3354836 3261815 3161248 3307193 3366955 3364182 3041600
6969 3041600 3540303 3472433 3093433 3213965 3143564 3305865 3306426 3408379 3214742 2990531
6959 2990531 3311149 3346847 3315655 3331696 3282968 3384829 3414754 3629759 3416469 3247671
6949 3247671 3439265 3187824 3741585 3220152 3430626 3385290 3464323 3308636 3424180 3269714
6939 3269714 3830941 3535803 3270273 3645485 3249566 3335886 3397057 3420989 3150767 3183980
6929 3183980 3289495 3475588 3467079 3628546 3699179 3392719 3557736 4000314 3897450 3759289
6919 3759289 3994364 3683128 3499788 3621744 3682423 3880065 3820350 3981064 3975815 3990796
$$ packed form
6989C247630Q5849M07584l70954k2648J94671k05799J09926J39085j61554j25168
6979C298622J92131k03019j67315K34417r3021j00567J45945N9762k773l22582
6969C041600M98703o7870l79000J20532p0401J62301N61J01953j93637k24211
6959B990531L20618L5698l1192J6041m8728J01861K9925K15005k13290j68798
6949C247671J91594k51441N53761n21433K10474m5336P9033j55687J15544j54466
6939C269714N61227k95138k65530L75212l95919Q6320O1171K3932k70222L3213
6929C183980J05515J86093q509J61467P0633l06460J65017M42578j02864j38161
6919C759289K35075l11236j83340J21956O0679J97642n9715J60714n249J4981
$$ plain form
6909 3990796 3926022 4193500 4060789 4096299 4350347 4238251 4266032 4054916 4556263 4438066
6899 4438066 4870169 4473370 4735615 4860096 4521327 4532232 5032546 5177041 5242123 5287142
6889 5287142 5435409 5089326 5310833 5613685 5534573 5956112 5977324 5914213 5993903 6207119
6879 6207119 6227226 6642859 6407718 6720998 6851604 6861246 6912585 7366083 7507717 7993860
6869 7993860 7741355 7970891 7987380 7937247 8239073 8308182 8432653 8860780 8811489 8769492
6859 8769492 9111041 8883737 9554322 9228146 9342464 9761212 9926377 9623292 10394097 10272420
6849 10272420 10436055 10707863 10745963 10738738 11221200 11183320 11383680 11279602 11991583 11535163
6839 11535163 11891710 12192645 12367876 12227466 12844054 12931356 12663743 12835905 12956203 12857232
$$ packed form
6909C990796o4774K67478j32711L5510K54048j12096K7781k11116N01347j18197
6899D438066M32103l96799K62245J24481l38769J0905N00314J44495O5082M5019
6889E287142J48267l46083K21507L02852p9112M21539K1212o3111P9690K13216
6879F207119K0107M15633k35141L13280J30606R642N1339M53498J41634M86143
6869G993860k52505K29536J6489n0133L01826O9109J24471M28127m9291m1997
6859H769492L41549k27304O70585l26176J14318M18748J65165l03085P70805j21677
6849A0272420J63635K71808L8100p225M82462l7880K00360j04078P11981m56420
6839A1535163L56547L00935J75231j40410O16588Q7302k67613J72162J20298r8971
$$ plain form
6829 12857232 12924616 12827084 12772289 12804445 13114181 12804802 12695259 12569854 12486726 13085823
6819 13085823 12970389 12720012 12668122 12916438 12742874 13095603 12974946 13145322 13292826 13219516
6809 13219516 13802019 13095093 13532511 13601587 13966680 14058478 14250646 14512048 14590134 14825123
6799 14825123 14976246 15306138 15139454 15519335 15557751 15451444 15627348 15956286 15699142 15358135
6789 15358135 15720715 15630227 15750010 15760979 15684078 15514518 15410090 15525778 15692330 15559016
6779 15559016 15535722 15599282 15148737 15545447 15330181 15735793 15390620 15943070 16132883 15874815
6769 15874815 15961254 15925000 16174084 15894982 15822614 16332626 15669856 15897058 15472066 15344187
6759 15344187 15324398 15267266 14936684 14716008 14414184 14207664 14163181 13609966 13895321 13335162
$$ packed form
6829A2857232O7384r7532n4795L2156L09736l09379j09543j25405q3128N99097
6819A3085823j15434k50377n1890K48316j73564L52729j20657J70376J47504p3310
6809A3219516N82503p06926M37418O9076L65093R1798J92168K61402P8086K34989
6799A4825123J51123L29892j66684L79881L8416j06307J75904L28938k57144l41007
6789A5358135L62580r0488J19783J0969p6901j69560j04428J15688J66552j33314
6779A5559016k3294O3560m50545L96710k15266M05612l45173N52450J89813k58068
6769A5874815Q6439l6254K49084k79102p2368N10012o62770K27202m24992j27879
6759A5344187j9789n7132l30582k20676l01824k06520m4483n53215K85355n60159
$$ plain form
6749 13335162 13420999 13128181 12961661 12846935 12686906 12821474 12452569 12252361 12212547 12199601
6739 12199601 12338431 12115882 11879857 11753267 11745720 12021658 11909419 11820795 11923421 11511472
6729 11511472 12088036 11544825 11652468 11662231 11729216 11870196 11641045 11774089 11922307 12165956
6719 12165956 11735615 11876666 11774255 11850270 11680879 11815245 11537795 11539341 11732901 11852977
6709 11852977 11078550 11272522 11435669 11686977 11343710 11444332 11311799 11245287 11331911 11134665
6699 11134665 11389394 11214273 11216745 11196345 11149731 11340525 11261520 11360072 11531704 11291759
6689 11291759 10872824 10859324 11270155 10892255 11172355 11148745 11304774 10853341 10920001 10938526
6679 10938526 10827176 10811579 10764404 10543408 10890758 10923209 10523953 10750694 10589726 10459525
$$ packed form
6749A3335162Q5837k92818j66520j14726j60029J34568l68905k00208l9814j2946
6739A2199601J38830k22549k36025j26590p547K75938j12239q8624J02626m11949
6729A1511472N76564n43211J07643R763O6985J40980k29151J33044J48218K43649
6719A2165956m30341J41051j02411P6015j69391J34366k77450J546J93560J20076
6709A1852977p74427J93972J63147K51308l43267J00622j32533o6512Q6624j97246
6699A1134665K54729j75121K472k0400m6614J90794p9005R8552J71632k39945
6689A1291759m18935j3500M10831l77900K80100k3610J56029m51433O6660J8525
6679A0938526j11350j5597m7175k20996L47350L2451l99256K26741j60968j30201
$$ plain form
6669 10459525 10215140 9995339 10277686 10003881 10266022 10155330 9960969 9945320 9846582 9959677
6659 9959677 9484110 9685579 9415854 9457818 9593151 9228949 9103606 9099266 9194231 8894492
6649 8894492 8586193 9116207 8826420 8527076 8895121 8628280 8909528 8417773 8432109 8642034
6639 8642034 8326613 8765835 8553438 8472077 8321815 8313315 8526466 8275076 8290563 8357289
6629 8357289 8056930 8386088 7827797 7835317 8033667 7881746 8148945 7874983 7665818 7672752
6619 7672752 7792877 7936915 7379327 7411220 7607004 7762419 7726026 7273141 7258111 7761437
6609 7761437 7583103 7548467 7360367 7172391 6950253 7229450 7349713 7406690 7422419 6786377
6599 6786377 7447638 7349233 7343592 7384681 7335712 7423022 7538562 7422999 7557900 7351395 7527251
$$ packed form
6669A0459525k44385k19801K82347k73805K62141j10692j94361j5649r8738J13095
6659I959677m75567K01469k69725M1964J35333l64202j25343m340R4965k99739
6649H894492l08299N30014k89787k99344L68045k66841K81248m91755J4336K09925
6639H642034l15421M39222k12397q1361j50262q500K13151k51390J5487O6726
6629H357289l00359L29158n58291P520J98350j51921K67199k73962k09165O934
6619G672752J20125J44038n57588L1893J95784J55415l6393m52885j5030N03326
6609G761437j78334l4636j88100j87976k22138K79197J20263N6977J5729o36042
6599F786377O61261r8405n641M1089m8969Q7310J15540j15563J34901k06505J75856
$$ plain form
6588 7527251 7425891 7336729 7084218 7335412 7074188 7022814 7028552 7575422 7175746 7616431
6578 7616431 7633478 7412595 7342483 7472948 7827725 7789596 8111578 8127852 8098030 8422677
6568 8422677 9101035 9063255 9110784 9538016 9630683 9104891 8801590 9021144 8473501 8853579
6558 8853579 8378177 8614847 8670018 8586372 8766360 8863443 9168279 9334270 9393372 9676351
6548 9676351 10227658 10612939 11560985 12024531 12812416 13480152 13594549 13558071 13912366 13222067
6538 13222067 12496307 11871874 11494023 11306132 10791842 10555880 10374754 10167492 10423438
6529 10423438 10359096 10484543 10624860 10537211 10956458 11441819 11826565 12922820 13748598 14416476
6519 14416476 15600804 15687118 16146296 16126162 15177613 14314316 13233131 12623772 11648027
$$ packed form
6588G527251j01360q9162k52511K51194k61224n1374N738N46870l99676M40685
6578G616431J7047k20883p0112J30465L54777l8129L21982J6274k9822L24647
6568H422677O78358l7780M7529M27232R2667n25792l03301K19554n47643L80078
6558H853579m75402K36670N5171q3646J79988R7083L04836J65991N9102K82979
6548I676351N51307L85281R48046M63546P87885O67736J14397l6478L54295o90299
6538A3222067p25760o24433l77851j87891n14290k35962j81126k07262K55946
6529A0423438o4342J25447J40317q7649M19247M85361L84746J096255Q25778O67878
6519A4416476J184328Q6314M59178k0134r48549q63297j081185o09359r75745
$$ plain form
6510 11648027 11564533 10914434 10799709 10509418 10698892 10128753 10373359 10208999 10417365 10300832
6500 10300832 10435210 11073280 11690764 12393506 12682174 13226496 13578958 13918127 13608742
6491 13608742 13331554 12976827 11486808 11090972 10438445 10218094 9736380 9547625 9031774
6482 9031774 8801289 8349932 8727099 8897920 8474328 8689760 8375655 8872090 8839825 9191912
6472 9191912 9031542 9127767 9217162 9299906 9702408 8986615 8409215 8369290 8103838 7700802
6462 7700802 7605057 7606898 7110753 7097323 7105817 6915609 6777116 6720404 6897831 6776222 6572972
6451 6572972 6907267 6469508 6613546 6583473 6783414 6637614 6505056 6704776 6649749 6691931
6441 6691931 6598839 6559728 6411509 6262965 6597808 6339871 6561117 6641916 6362318 6370431
$$ packed form
6510A1648027q3494o50099j14725k90291J89474n70139K44606j64360K08366j16533
6500A0300832J34378O38070O17484P02742K88668N44322L52462L39169l09385
6491A3608742k77188l54727j490019l95836o52527k20351m81714j88755n15851
6482I031774k30485m51357L77167J70821m23592K15432l14105M96435l2265L52087
6472I191912j60370R6225Q9395Q2744M02502p15793n77400l9925k65452m03036
6462G700802r5745J841m96145j3430Q494j90208j38493n6712J77427j21609k03250
6451F572972L34295m37759J44038l0073J99941j45800j32558J99720n5027M2182
6441F691931r3092l9111j48219j48544L34843k57937K21246Q0799k79598Q113
$$ plain form
6431 6370431 6238469 6547121 6290470 6487733 6651342 6256859 6077293 6241533 6415145 6319548
6421 6319548 6262000 6316071 6410781 6287758 5966407 6396530 6141306 6164902 6357905 6013689
6411 6013689 6245944 6404964 6414257 6129950 6473173 6377880 6491107 6258374 6466693 6065189
6401 6065189 6356404 6430718 6211776 6314353 6333674 6272094 6423807 6485395 6520257 6259169
6391 6259169 6463326 6512636 6279225 6384139 6622519 6521868 6798517 6329288 6555251 6495446
6381 6495446 6459920 6458082 6722799 6522793 6301078 6630986 6480538 6479106 6570426 6366935 6286606
6370 6286606 6367991 6637712 6396310 6545783 6486259 6479381 6271623 6259927 6603788 6211004
6360 6211004 6601235 6377377 6209252 6157862 6166533 6054606 6213847 5943888 6088118 6023671
$$ packed form
6431F370431j31962L08652k56651J97263J63609l94483j79566J64240J73612r5597
6421F319548n7548N4071R4710j23023l21351M30123k55224K3596J93003l44216
6411F013689K32255J59020R293k84307L43223r5293J13227k32733K08319m01504
6401F065189K91215P4314k18942J02577J9321o1580J51713O1588L4862k61088
6391F259169K04157M9310k33411J04914K38380j00651K76649m69229K25963n9805
6381F495446l5526j838K64717k00006k21715L29908j50448j432R1320k03491q0329
6370F286606Q1385K69721k41402J49473n9524o878k07758j1696L43861l92784
6360F211004L90231k23858j68125n1390Q671j11927J59241k69959J44230o4447
$$ plain form
6350 6023671 6270036 6362757 6002530 5937151 5671332 5832953 5838076 6017832 5941892 6004259 6127450
6339 6127450 5792663 5586113 5944331 5765004 5586016 5164933 5562098 5404168 5359783 5430623
6329 5430623 5483049 5618506 5592591 5408322 5257275 5333157 5050322 5533939 5340002 5337995
6319 5337995 4913045 5319423 5015673 4904642 5148197 5281044 5050930 5585181 5190292 4955324
6309 4955324 4688853 4857967 5195667 5148416 4938151 5427934 5178325 4882682 5176870 4923894
6299 4923894 5079751 5183403 5031244 5181041 4892484 5056015 5130674 4833547 5233911 4869109
6289 4869109 5033611 5012815 4861832 4838245 5001166 5117750 4494598 4480830 4613859 4489951
6279 4489951 4674009 4495119 4389206 4634522 4581777 4697972 4900923 4520844 4520312 4661195
$$ packed form
6350F023671K46365R2721l60227o5379k65819J61621N123J79756p5940O2367J23191
6339F127450l34787k06550L58218j79327j78988m21083L97165j57930m4385P0840
6329E430623N2426J35457k5915j84269j51047P5882k82835M83617j93937k007
6319E337995m24950M06378l03750j11031K43555J32847k30114N34251l94889k34968
6309D955324k66471J69114L37700m7251k10265M89783k49609k95643K94188k52976
6299D923894J55857J03652j52159J49797k88557J63531P4659k97127M00364l64802
6289D869109J64502k0796j50983k3587J62921J16584o23152j3768J33029j23908
6279D489951J84058j78890j05913K45316n2745J16195K02951l80079n32J40883
$$ plain form
6269 4661195 4517719 4456262 4636287 4618722 4453383 4758939 4682372 4704625 4740262 5477257
6259 5477257 5195492 5109388 5156970 5389950 5214198 5583073 5513945 5375576 5403033 5040007
6249 5040007 5655319 5318869 5465972 5363062 5115009 5303684 4997291 4922425 4757736 4790065
6239 4790065 4545390 4659521 4674527 4740350 4194758 4422347 4328090 4565960 4468981 4783512
6229 4783512 4342168 4118783 4127919 4229302 4053436 3936126 3740963 3879897 3724208 3836196
6219 3836196 3857246 4175182 3741523 4149912 3707205 3821418 4152902 4051525 3937580 3796580
6209 3796580 3829403 3784356 4113576 3918889 3964791 3844062 3687169 4085531 3960823 3659413
6199 3659413 4326534 3859486 3888495 4190050 3996871 4088074 4113340 3890194 4550064 3997817
$$ packed form
6269D661195j43476o1457J80025j7565j65339L05556p6567K2253L5637P36995
6259E477257k81765q6104M7582K32980j75752L68875o9128j38369K7457l63026
6249E040007O15312l36450J47103j02910k48053J88675l06393p4866j64689L2329
6239D790065k44675J14131J5006O5823n45592K27589r4257K37870r6979L14531
6229D783512m41344k23385R136J01383j75866j17310j95163J38934j55689J11988
6219C836196K1050L17936m33659M08389m42707J14213L31484j01377j13945j41000
6209C796580L2823m5047L29220j94687M5902j20729j56893L98362j24708l01410
6199C659413O67121m67048K9009L01555j93179R1203K5266k23146O59870n52247
$$ plain form
6189 3997817 4255203 4413661 4956599 4596383 4541016 4598226 4748410 4967832 4637698 5008866
6179 5008866 5039676 5100115 4896035 4903762 5132184 4844658 5020454 5103801 5071119 4900787 5026896
6168 5026896 4331758 4987628 4851346 5019982 4916909 5439311 5282747 5473897 5039117 4846355
6158 4846355 4926858 5068521 5050122 4881855 4870499 5047521 4661018 4991142 4833182 4786363
6148 4786363 4814902 4834237 4767143 4738227 4709780 4520330 4872062 4539403 4710895 4840130
6138 4840130 4853428 5083074 4868358 4494745 4650627 4818833 4571278 4914244 4788397 4986348
6128 4986348 4515503 4511759 4729195 4865646 4769009 4412964 4827234 4889744 4733915 4668656
6118 4668656 4976784 4799934 4672376 5097794 5000983 5168870 5172844 5061488 5371806 5157440
$$ packed form
6189C997817K57386J58458N42938l60216n5367N7210J50184K19422l30134L71168
6179E008866L0810O0439k04080P727K28422k87526J75796Q3347l2682j70332J26109
6168E026896o95138O55870j36282J68636j03073N22402j56564J91150m34780j92762
6158D846355Q0503J41663j8399j68267j1356J77022l86503L30124j57960m6819
6148D786363K8539J9335o7094k8916k8447j89450L51732l32659J71492J29235
6138D840130J3298K29646k14716l73613J55882J68206k47555L42966j25847J97951
6128D986348m70845l744K17436J36451r6637l56045M14270O2510j55829o5259
6118D668656L08128j76850j27558M25418r6811J67887L974j11356L10318k14366
$$ plain form
6108 5157440 4920610 5046488 4981561 4879871 5045318 4741945 5487449 5050923 5254887 4912779
6098 4912779 4944199 4996360 5418614 5341377 4614034 4942560 5054266 5068947 5067840 5111088 5215602
6087 5215602 4990480 5422840 4949460 4913494 5263886 5216430 4972878 5145477 5308370 4927585
6077 4927585 5211940 5016117 5059964 5338679 5040031 5131941 5106930 5135479 5508074 5185073
6067 5185073 5139473 5539849 5341381 5454950 5587228 4910410 5317422 5245465 5361324 5029427
$$ packed form
6108E157440k36830J25878o4927j01690J65447l03373P45504m36526K03964l42108
6098D912779L1420N2161M22254p7237p27343L28526J11706J4681j107M3248J04514
6087E215602k25122M32360m73380l5966L50392m7456k43552J72599J62893l80785
6077D927585K84355j95823M3847K78715k98648R1910k5011K8549L72595l23001
6067E185073m5600M00376j98468J13569J32278o76818M07012p1957J15859l31897
$$ [...]
##END NTUPLES=NMR SPECTRUM
##END=
