##TITLE=abcd
##JCAMPDX= 6.0         $$ Bruker NMR JCAMP-DX V2.0
##DATA TYPE= NMR FID
##DATA CLASS= NTUPLES
##ORIGIN= UXNMR, Bruker Analytische Messtechnik GmbH
##OWNER= root
$$ XWIN-NMR		Version 3.5
$$ Mon Oct 13 14:38:22 2025 Russian Standard Time (UT+4h)  servis@DPX200
##.OBSERVE FREQUENCY= 200.131235884673
##.OBSERVE NUCLEUS= ^1H
##.DELAY= (6, 6)
##.ACQUISITION MODE= SIMULTANEOUS
##.ACQUISITION SCHEME= undefined
##.AVERAGES= 32
##.DIGITISER RES= 18
##SPECTROMETER/DATA SYSTEM= spect
##.PULSE SEQUENCE= zg
##.SOLVENT NAME= D2O
##.SHIFT REFERENCE= (INTERNAL, D2O, 0, 16.5164)
##AUDIT TRAIL= $$ (NUMBER, WHEN, WHO, WHERE, WHAT)
$$ ##TITLE= Audit trail, XWIN-NMR		Version 3.5
$$ ##JCAMPDX= 5.01
$$ ##ORIGIN= Bruker BioSpin GmbH
$$ ##OWNER= servis
$$ F:\spectra/data/av/nmr/H1/1/audita.txt
$$ ##AUDIT TRAIL=  $$ (NUMBER, WHEN, WHO, WHERE, WHAT)
(   1,<2025-10-13 14:37:07.57 +0400>,<servis>,<DPX200>,
      <created by zg, POWCHK disabled, PULCHK disabled
       configuration hash MD5:
       00 E9 B6 7A A2 85 ED C7 34 08 36 98 17 FE 4E 26
       data hash MD5: 32K
       B9 18 FD A4 E9 63 79 BE BF FF BB 5A E4 7C BD 2B>)
$$ ##END=
$$ 
$$ hash MD5
$$ FB 45 9E 19 C4 6C 50 BB 3F 05 04 C2 36 B9 35 6B
##$RELAX= 
##$RELAX= 
##$RELAX= 
##$RELAX= 
##$RELAX= 
##$RELAX= 
##$RELAX= 
##$RELAX= 
$$ Bruker specific parameters
$$ --------------------------
##$DU= <F:\spectra>
##$EXPNO= 1
##$NAME= <H1>
##$PROCNO= 1
##$TYPE= <nmr>
##$USER= <av>
##$AMP= (0..31)
100 100 100 100 100 100 100 100 100 100 100 100 100 100 100 100 100 100 
100 100 100 100 100 100 100 100 100 100 100 100 100 100 
##$AQSEQ= 0
##$AQ_mod= 1
##$AUNM= <au_zg>
##$AUTOPOS= <>
##$BF1= 200.13
##$BF2= 200.13
##$BF3= 200.13
##$BF4= 200.13
##$BF5= 500.13
##$BF6= 500.13
##$BF7= 500.13
##$BF8= 500.13
##$BYTORDA= 1
##$CFDGTYP= 0
##$CFRGTYP= 5
##$CHEMSTR= <none>
##$CNST= (0..31)
1 1 145 1 1 1 1 1 1 1 1 1 1 1 1 1 1 1 1 1 1 1 1 1 1 1 1 1 1 1 1 1 
##$CPDPRG= <>
##$CPDPRG1= <>
##$CPDPRG2= <>
##$CPDPRG3= <>
##$CPDPRG4= <mlev>
##$CPDPRG5= <mlev>
##$CPDPRG6= <mlev>
##$CPDPRG7= <mlev>
##$CPDPRG8= <mlev>
##$CPDPRGB= <>
##$CPDPRGT= <>
##$D= (0..31)
0 2 0 0 0 0 0 0 0 0.06 0 0 0 0 0 0 0.0002 0 0 0 0 0 0 0 0 0 0 0 0 0 0 
0 
##$DATE= 1760351826
##$DBL= (0..7)
120 120 120 120 120 120 120 120 
##$DBP= (0..7)
150 150 150 150 150 150 150 150 
##$DBP07= 0
##$DBPNAM0= <>
##$DBPNAM1= <>
##$DBPNAM2= <>
##$DBPNAM3= <>
##$DBPNAM4= <>
##$DBPNAM5= <>
##$DBPNAM6= <>
##$DBPNAM7= <>
##$DBPOAL= (0..7)
0.5 0.5 0.5 0.5 0.5 0.5 0.5 0.5 
##$DBPOFFS= (0..7)
0 0 0 0 0 0 0 0 
##$DE= 6
##$DECBNUC= <off>
##$DECIM= 32
##$DECNUC= <off>
##$DECSTAT= 4
##$DIGMOD= 1
##$DIGTYP= 9
##$DL= (0..7)
0 120 120 120 120 120 120 120 
##$DP= (0..7)
150 150 150 150 150 150 150 150 
##$DP07= 0
##$DPNAME0= <>
##$DPNAME1= <>
##$DPNAME2= <>
##$DPNAME3= <>
##$DPNAME4= <>
##$DPNAME5= <>
##$DPNAME6= <>
##$DPNAME7= <>
##$DPOAL= (0..7)
0.5 0.5 0.5 0.5 0.5 0.5 0.5 0.5 
##$DPOFFS= (0..7)
0 0 0 0 0 0 0 0 
##$DQDMODE= 0
##$DR= 18
##$DS= 0
##$DSLIST= <SSSSSSSSSSSSSSS>
##$DSPFIRM= 0
$$ [...]
##$SUBNAM0= <"">
##$SUBNAM1= <"">
##$SUBNAM2= <"">
##$SUBNAM3= <"">
##$SUBNAM4= <"">
##$SUBNAM5= <"">
##$SUBNAM6= <"">
##$SUBNAM7= <"">
##$SUBNAM8= <"">
##$SUBNAM9= <"">
##$SW= 20.6817932712277
##$SWIBOX= (0..15)
0 0 3 0 0 0 0 0 0 0 0 0 0 0 0 0 
##$SW_h= 4139.07284768212
##$TD= 32768
##$TD0= 1
##$TE= 0
##$TE2= 300
##$TE3= 300
##$TEG= 300
##$TL= (0..7)
0 120 120 120 120 120 120 120 
##$TP= (0..7)
150 150 150 150 150 150 150 150 
##$TP07= 0
##$TPNAME0= <>
##$TPNAME1= <>
##$TPNAME2= <>
##$TPNAME3= <>
##$TPNAME4= <>
##$TPNAME5= <>
##$TPNAME6= <>
##$TPNAME7= <>
##$TPOAL= (0..7)
0.5 0.5 0.5 0.5 0.5 0.5 0.5 0.5 
##$TPOFFS= (0..7)
0 0 0 0 0 0 0 0 
##$TUNHIN= 0
##$TUNHOUT= 0
##$TUNXOUT= 0
##$USERA1= <user>
##$USERA2= <user>
##$USERA3= <user>
##$USERA4= <user>
##$USERA5= <user>
##$V9= 5
##$VALIST= <valist>
##$VCLIST= <CCCCCCCCCCCCCCC>
##$VD= 0
##$VDLIST= <DDDDDDDDDDDDDDD>
##$VPLIST= <PPPPPPPPPPPPPPP>
##$VTLIST= <TTTTTTTTTTTTTTT>
##$WBST= 1024
##$WBSW= 30
##$XGAIN= (0..3)
0 0 0 0 
##$XL= 0
##$YL= 0
##$YMAX_a= 142893
##$YMIN_a= -102652
##$ZGOPTNS= <>
##$ZL1= 120
##$ZL2= 120
##$ZL3= 120
##$ZL4= 120
##$ABSF1= 10
##$ABSF2= 0
##$ABSG= 5
##$ABSL= 3
##$ALPHA= 0
##$AQORDER= 0
##$ASSFAC= 0
##$ASSFACI= 0
##$ASSFACX= 0
##$ASSWID= 0
##$AUNMP= <proc_1d>
##$AZFE= 0.1
##$AZFW= 0.1
##$BCFW= 1
##$BC_mod= 2
##$BYTORDP= 0
##$COROFFS= 0
##$CY= 19
##$DATMOD= 1
##$DC= 2
##$DFILT= <>
##$DTYPP= 0
##$F1P= 11.0000007629395
##$F2P= -0.999999237060547
##$FCOR= 0.5
##$FTSIZE= 0
##$FT_mod= 4
##$GAMMA= 1
##$GB= 1
##$INTBC= 1
##$INTSCL= 1
##$ISEN= 128
##$LB= 0.05
##$LEV0= 0
##$LPBIN= 0
##$MAXI= 10000
##$MC2= 0
##$MEAN= 0
##$ME_mod= 0
##$MI= 0
##$NCOEF= 0
##$NC_proc= 0
##$NLEV= 6
##$NOISF1= 0
##$NOISF2= 0
##$NSP= 1
##$NTH_PI= 0
##$NZP= 0
##$OFFSET= 16.51637
##$PC= 1
##$PHC0= -195.1067
##$PHC1= 2.101565
##$PH_mod= 0
##$PKNL= yes
##$PPARMOD= 0
##$PSCAL= 4
##$PSIGN= 0
##$REVERSE= no
##$SF= 200.13
##$SI= 16384
##$SIGF1= 0
##$SIGF2= 0
##$SINO= 400
##$SIOLD= 16384
##$SREGLST= <1H.CDCl3>
##$SSB= 0
##$STSI= 0
##$STSR= 0
##$SW_p= 4139.07284768211
##$SYMM= 0
##$S_DEV= 0
##$TDeff= 0
##$TDoff= 0
##$TI= <>
##$TILT= no
##$TM1= 0
##$TM2= 0
##$TOPLEV= 0
##$USERP1= <user>
##$USERP2= <user>
##$USERP3= <user>
##$USERP4= <user>
##$USERP5= <user>
##$WDW= 1
##$XDIM= 8192
##$YMAX_p= 0
##$YMIN_p= 0
$$ End of Bruker specific parameters
$$ ---------------------------------
##NTUPLES= NMR FID
##VAR_NAME=  TIME,          FID/REAL,        FID/IMAG
##SYMBOL=    X,             R,               I
##VAR_TYPE=  INDEPENDENT,   DEPENDENT,       DEPENDENT
##VAR_FORM=  AFFN,          ASDF,            ASDF
##VAR_DIM=   16384,         16384,           16384
##UNITS=     SECONDS,       ARBITRARY UNITS, ARBITRARY UNITS
##FACTOR=    0.0002416,     1,               1
##FIRST=     0,             0,               0
##LAST=      3.9581328,     0,               0
##MIN=       0,             -102652,         0
##MAX=       3.9581328,     142893,          0
$$ Real data points
##PAGE= N=1
##DATA TABLE= (X++(R..R)), XYDATA
0@%%%%%%%%%%%%%%%%%%%jL3o4O4o4O4o5O6r7J28j29J30j62J94k15K47k67L00l56
38a94L88m20M84n48O05o65P38q09Q82r77J078j183J307j438J585j749J929k138
56a125K373k638K943l301L734m259M910n750O881q490J0961j5349K5457r1590
70g5243k7409J48907O105l3826q842N8219J5789k4014l0880o603l7758n3461k2540
83i1556L4589K6443n811m752M3465N9663L3089q791k7470l8160l3994j9042m780
96c7107j3028j4656R306L3908J7866l857J7925N8961L9597l3278o8366k7374J1686
109h417q725m1425k0714K4339L1226J1933J9665M1334K2920k4826l2969P365K4882
122D6588j8017o4051n0461L257L5522K9854J5815J2885J4636J5329J2526J254
$$ plain form
0 0 0 0 0 0 0 0 0 0 0 0 0 0 0 0 0 0 0 0 0 -1 32 -32 32 -32 32 -33 33 -64 64 -65 65 -97 97 -118 129 -138 162 -194
38 -194 194 -226 258 -290 315 -350 388 -421 461 -516 562 -621 686 -752 833 -916 1013 -1125
56 -1125 1248 -1390 1553 -1748 1986 -2273 2637 -3113 3768 -4722 6239 -9110 16347 -75243
70 -75243 -102652 46255 52360 18534 9692 67911 83700 59686 28806 22203 -15555 -69016 -91556
83 -91556 -56967 -30524 -36335 -41087 2378 62041 95130 86339 58869 20709 -13285 -32327 -37107
96 -37107 -50135 -64791 -55485 -21577 -3711 -7568 10357 69318 108915 75637 7271 -20103 -8417
109 -8417 -17142 -58567 -79281 -54942 -23716 -11783 7882 49216 72136 47310 14341 21706 46588
122 46588 28571 -35480 -85941 -82684 -47162 -17308 -1493 11392 26028 41357 53883 55137
134E5137j7465k7690k1505j3195j4971j4158J354J8020J8167J3541K2174L0935
146E0344J5465j4150k4695j3745j1820k6213k6834p65K0651J0822o277N290L4538
159A2611M0000J1877j6453k0401j2277j2767j9264j8625j0513k354N915J7680
171b4571K6841K4174J1102k51k415l96l990j5448k7044k7513j3147N815J5499
184c1344J3805J1729J6115J9192J2804K85p614j0204j4459k0949k0296r959J382
197c9513N721P377J3392K1010K0617J1461J135n134j0243j6211j9613j5621p992
210c3614k352P17O111J4535K0579J8626J0837K664l177q421j3719j7228j6138
223b0580j1420n296J491Q900J4635J6478J3948R949O223J160o375j3882j7389
$$ plain form
134 55137 37672 9982 -11523 -24718 -39689 -53847 -52493 -34473 -16306 -2765 19409 50344
146 50344 65809 51659 26964 13219 1399 -24814 -51648 -52413 -31762 -20940 -27217 -21927 12611
159 12611 52611 64488 48035 27634 15357 2590 -16674 -35299 -45812 -48166 -42251 -24571
171 -24571 2270 26444 37546 37295 34880 34484 30494 15046 -11998 -39511 -52658 -46843 -31344
184 -31344 -17539 -5810 10305 29497 42301 42586 34972 24768 10309 -10640 -30936 -40895 -39513
197 -39513 -33792 -26415 -13023 7987 28604 40065 41200 36066 25823 9612 -10001 -25622 -33614
210 -33614 -35966 -35249 -29138 -14603 5976 24602 35439 38103 34926 26505 12786 -4442 -20580
223 -20580 -32000 -37296 -35805 -26905 -12270 4208 18156 28105 34328 35488 29113 15231 -2158
236b158j5526j0701n587P7O610J2220J4858J4491J1874P732P28p547j3034j3732
250C05j1919j0277q963m021M868J2995J5768J3909J0379P020J842m947j0343j2243
264D373j2573j2181j0085l270O137J2356J2438J0343R315R224N534k368r951j3212
278F080j3431j1910q648k079N293Q952Q526R082J1848J2601O508m496j1811j1693
292D822q944q267r063o770N5P428J1265J2478J1989R219L466l464p297p634q301
307I82j0899j1666o915J969Q151Q913Q693J0770J1195N935k782p420o474o626
321C826j0967j3192p761K422Q689Q466P105Q060Q730O729K598k397p683j2359
335B266j3168q324k023J713K304L169O667J1692J2976Q043j076p687p395m588
$$ plain form
236 -2158 -17684 -28385 -33972 -33895 -27285 -15065 -207 14284 26158 33890 34618 27071 14037 305
250 305 -11614 -21891 -30854 -34875 -30007 -17012 -1244 12665 23044 30064 31906 26959 16616 4373
264 4373 -8200 -20381 -30466 -33736 -27599 -15243 -2805 7538 16853 26077 31611 29243 19292 6080
278 6080 -7351 -19261 -27909 -29988 -24695 -15743 -7217 1865 13713 26314 32822 28326 16515 4822
292 4822 -4122 -12389 -21452 -28222 -28167 -20739 -9474 3004 14993 24212 27678 24214 16917 9283 982
307 982 -9917 -21583 -28498 -26529 -18378 -9465 -772 9998 21193 27128 24346 16926 10452 3826
321 3826 -7141 -20333 -28094 -25672 -16983 -8517 -1412 6648 15378 22107 24705 22308 14625 2266
335 2266 -10902 -19226 -21249 -19536 -17232 -14063 -7396 4296 17272 25315 24239 16552 9157 4569
349D569n962j0461j0287k796N581P704O650Q224J0164P197P23l444m241o455j0583
364c417j0192m461j45j20J255P855J3949J0861K265j955o04j52m401r843j1570
379a0675q648k850M028P790O247L275M854R135Q380P12p356r401p931o252m645
394a3337j963m48pL182R877J3103P142j137l047l45j393p734j1332p388j536P11
410a5652J760M538P264P140N740M864K478k865p380p063m457m511o211m012K132
425a6235P141P888O312M651L009J099j13j687n545r793r085k928K152K251Q00
440a0083L059P614Q733N220Q85k035m193n700n452m115m059m278j363M218P786
455c763O658L730K993L258J395k669n844o733n941m146j555P87K062K981N095
$$ plain form
349 4569 -1393 -11854 -22141 -24937 -19356 -11652 -5002 3222 13386 20583 21306 17862 13621 7166 -3417
364 -3417 -13609 -18070 -18215 -18335 -17080 -9225 4724 15585 17850 15895 15291 15139 10738 895 -10675
379 -10675 -19323 -22173 -18145 -10355 -4108 -833 4021 13156 21536 22248 14892 5491 -2440 -8692 -13337
394 -13337 -15300 -15748 -15755 -12573 -2696 10407 17549 16412 13365 13020 11627 3893 -7439 -14827 -16363 -15652
410 -15652 -13892 -9354 -2090 5050 10790 15654 18132 15267 7887 824 -3633 -8144 -14355 -18367 -16235
425 -16235 -9094 -1206 5106 9757 12766 13865 13752 12065 6520 -3273 -12358 -15286 -13134 -10883 -10083
440 -10083 -7024 590 9323 14543 15428 13393 9200 3500 -1952 -6067 -10126 -14404 -15767 -11549 -3763
455 -3763 2895 6625 9618 12876 14271 11602 5758 -975 -6916 -11062 -12617 -11830 -9768 -6787 -1692
470a692P042N976K075j457k699l025m354n850n460l212l17K477M602N482M660
485D248L377K769J909p57m265o171n427l550k229j146O99L088M899N522M792K964
501A0722N15j644k887l733m609m891l662j152J448L081L926M396M286L355J581
516A0732n26k686m276m778m054k758j450L5K010L800M748M375L037J461k28k017
532G425l291m173m221l422j876R7K003L276L915L949L326J990K49j626l049l910
548F62m003l296j903l51J311K735L713L976L340K031M44j150k548l460l807l305
564e611k205o76R78K452L366L630L188K206R02o85k218l247l650l206k181q70
580g827N04J897K953L542L313K307R65m77j748k787l332l157k388j201K55J681
$$ plain form
470 -1692 5350 11326 13401 11944 9245 6220 1866 -3984 -9444 -12656 -12973 -10496 -5894 -412 4248
485 4248 7625 10394 12303 11546 7281 1110 -4317 -7867 -10096 -11242 -10543 -7455 -2556 2966 7758 10722
501 10722 11237 9593 6706 2973 -1636 -6527 -10189 -11341 -9893 -6812 -2886 1510 5796 9151 10732
516 10732 10206 7520 3244 -1534 -5588 -8346 -9796 -9761 -7751 -3951 797 5172 8209 9670 9442 7425
532 7425 4134 -39 -4260 -7682 -9558 -9461 -7458 -4182 -267 3682 7008 8998 9247 7621 4572 662
548 662 -3341 -6637 -8540 -8891 -7580 -4845 -1132 2844 6184 8215 8659 7509 4961 1501 -2306 -5611
564 -5611 -7816 -8492 -7514 -5062 -1696 1934 5122 7328 8230 7545 5327 2080 -1570 -4776 -6957 -7827
580 -7827 -7323 -5426 -2473 1069 4382 6689 7654 7177 5429 2642 -690 -3847 -6235 -7436 -7181 -5500
596e500K735L160L023K367J356j3j513k625l109k940k349j401j08J274K410L010
612b23L018K391J325J35j084k079k785l025k584j445k17J066K021K636K822K447
628D419J571M82q24j968k685k783k350j513n25O25J693K475K713K468J687O59
644F144o27j706k354k556k295j696p53L24J491K295K662K343J621O87k95j246
660D039j992k434k462j870q76K74J346J991K298K215J750R39K1j031j903k363
676e8k316j765r16RR47J763K155K161J770J105K24q21j805k246k158j624r15k21
694d711N91J362J960K294J989J183J30q32j467j781j858j742j317n79N03J480
710b795K043K034J628J000L89l18j065j638j994j963j373m27M62J269J643J766
$$ plain form
596 -5500 -2765 395 3418 5785 7141 7128 5615 2990 -119 -3059 -5408 -6809 -6917 -5643 -3233 -223
612 -223 2795 5186 6511 6646 5562 3483 698 -2327 -4911 -6356 -6573 -5507 -3486 -850 1972 4419
628 4419 5990 6472 5648 3680 995 -1788 -4138 -5651 -6176 -5551 -3858 -1383 1330 3798 5485 6144
644 6144 5517 3811 1457 -1099 -3394 -5090 -5843 -5519 -4028 -1733 929 3272 4893 5580 5285 4039
660 4039 2047 -387 -2849 -4719 -5595 -5321 -3975 -1984 314 2529 4279 5218 5239 4208 2305 -58
676 -58 -2374 -4139 -5055 -5046 -4099 -2336 -181 1980 3750 4855 5079 4258 2453 207 -1951 -3575 -4490 -4711
694 -4711 -4120 -2758 -798 1496 3485 4668 4798 3966 2499 718 -1140 -2882 -4199 -4778 -4275 -2795
710 -2795 -752 1282 2910 3910 4299 3981 2916 1278 -716 -2679 -4052 -4479 -4017 -2748 -1105 661
726F61J637J252N79j29r57j588k022j831j165l96K08Q25J305J743J748J417P87
743D074l8r79j677j725j410j023p73k70N74J411J731J724J398P20n5p94j136j326
761D26j551j506r91j19O66J175J527J644J238O28J40k26p19j494j845j477q01
778c285j68M02J022J436J371J102R14O54r4j085j560j445j122q93m89J38Q49J169
796a084J358J457J217M38m18q90j036j199j305j026m69j2M81R94J547J574R59
813B586L69l5m72j037j421j268r04o62k55N63J200J331R99Q44P91M00l32j047
831A650j282j317j214p64%O44Q42R35J125J170Q42K07l51p19j039j286j154p55
849b466l26J75O75J198J396J146O56J79k19o19r66j140r92q06n58k3O15J035J259
$$ plain form
726 661 2298 3550 4129 4000 3043 1455 -567 -2398 -3563 -3959 -3751 -2926 -1621 122 1870 3287 4074
743 4074 4036 3057 1380 -345 -1755 -2778 -3551 -3821 -3247 -1836 -105 1619 3017 3737 3682 2888 1752 426
761 426 -1125 -2631 -3622 -3741 -3075 -1900 -373 1271 2509 3137 3277 3051 2332 838 -1007 -2484 -3285
778 -3285 -3453 -3051 -2029 -593 778 1880 2794 3448 3354 2269 709 -736 -1858 -2751 -3240 -3102 -2253 -1084
796 -1084 274 1731 2948 3386 2968 2078 1042 -157 -1462 -2488 -2957 -2969 -2488 -1494 53 1627 2586
813 2586 2955 2920 2448 1411 -10 -1278 -2182 -2844 -3099 -2536 -1336 -5 994 1838 2629 3029 2697 1650
831 1650 368 -949 -2163 -2927 -2927 -2283 -1441 -506 619 1789 2631 2838 2487 1768 729 -557 -1711 -2466
849 -2466 -2792 -2617 -1942 -744 652 1798 2454 2633 2414 1795 829 -311 -1303 -2109 -2667 -2690 -2075 -1040 219
868B19J125Q70M97o0o64j074j165j001p91l89rM79P57R50J100J084O79O2n14q97
888A258j076j223r83m56R6M11O74R84J210R05L87O9r8n16j026j258r95o32m02
907b671K26R54J327J107N44M13L68l1o26r94j030r68p56l14L18N91O93R24J258
926A333R83L03m25p29q49j004r06m86j44j58J32P30J345J166O32K59J27l88r95
945I26j203q22m87m96k40M28J021J038P43O01N09J46l23o47p85j033j110p08L0
964b412P04Q41P90P50O22M72L21m2n92j117j174o91k93j03j5M84R17J062Q52O01
984A977L03k67q62r62o77m73n23m94r5N15Q86R71R23O82K81l20o13o91o49p38
1004h26p39n18k2O20Q90Q76O66M48L47J65k25o29r61j032p82l64J53N92O69O13
$$ plain form
868 219 1344 2214 2711 2651 1987 913 -252 -1253 -2044 -2433 -2442 -1963 -1206 -256 844 1928 2607 2669 2155 1258
888 1258 182 -1041 -2024 -2480 -2384 -1973 -1299 -315 895 1800 2187 2256 2158 1642 616 -642 -1637 -2269 -2671
907 -2671 -2445 -1491 -164 943 1487 1900 2268 2237 1611 617 -413 -1381 -2137 -2451 -2133 -1542 -849 75 1333
926 1333 2316 2619 2194 1465 616 -388 -1294 -1780 -1924 -2082 -1950 -1220 125 1291 1923 2182 2309 1921 926
945 926 -277 -1099 -1586 -2082 -2322 -1894 -873 165 908 1509 2018 2164 1841 1194 409 -624 -1734 -2442 -2412
964 -2412 -1708 -867 -77 673 1295 1767 2088 2046 1454 337 -837 -1528 -1821 -1924 -1939 -1455 -538 524 1376 1977
984 1977 2280 2013 1151 189 -488 -961 -1484 -1978 -2073 -1558 -672 299 1222 1904 2185 1865 1252 561 -88 -826
1004 -826 -1565 -2083 -2105 -1485 -595 281 947 1395 1742 1907 1682 1053 92 -940 -1722 -2086 -1933 -1341 -672 -59
1024e9N71O68O07K88l05p49r44q21o03l69j07K25M94P04Q31Q89O12J38m41p77
1044H52o52n12n43o25m45M2N83Q32R17P71M74Q6k40l99m90o97q77p30k77K09N07
1065a214O26O89P22N67L41K6l29o18q40q04o37l52J14M45N72O02O00O70N47J99
1085A926l58o86q15p72n37l12l6J52L67O04R44R03M34q6l90m42m73o36p72n95
1105a580l01K18N77P28P56O08M34K01n2l55o25q40p69n05j76Q5L50N74P79P69
1125H76N28K09k2k63n30p83q65n84k40J07L31M69O36P16O71M55Q7l63o46p25o62
1146e98n28l78j41J32M86P83Q58O32K55O8j42l50o54q04p46m28j35J56M58O53
1166d23P29O56N02K57j15m76o86p31n93m82k38mL89O23P51O83N72K66m7l74o15
$$ plain form
1024 -59 512 1180 1787 2075 1770 1021 77 -744 -1347 -1716 -1823 -1598 -1104 -400 431 1320 1932 2070 1629 852
1044 852 200 -312 -855 -1480 -1925 -1883 -1300 -468 449 1220 1694 1780 1540 1141 651 -46 -923 -1653 -1930 -1721 -1214
1065 -1214 -588 101 823 1390 1731 1757 1428 810 -30 -834 -1471 -1823 -1709 -1264 -692 -90 510 1180 1727 1926
1085 1926 1568 882 67 -705 -1242 -1554 -1590 -1438 -1071 -467 477 1380 1814 1728 1338 896 423 -213 -985 -1580
1105 -1580 -1881 -1663 -1086 -358 398 1006 1440 1641 1589 1234 609 -231 -1000 -1505 -1681 -1596 -1246 -672 107 876
1125 876 1404 1613 1591 1328 798 15 -850 -1434 -1674 -1567 -1236 -767 -131 585 1256 1711 1798 1435 789 64 -598
1146 -598 -1126 -1504 -1645 -1513 -1027 -244 614 1246 1501 1569 1427 1077 423 -381 -1127 -1555 -1690 -1534 -1076 -423
1166 -423 306 962 1464 1721 1606 1130 444 -287 -880 -1362 -1600 -1604 -1215 -592 159 842 1414 1680 1633 1259 644
1187F44o83p11n68k99K8L13N67O86P02N78L41N7k86n13p10p23o84l32o2K47N24
1208h84O90P33N74L45R1r3m28o79p80o61m34j62J95N13O08O39O40O09K76k14o07
1229I71o55n64n35m98k93J3K85N78Q50Q51N21N1j80k23l95p25q75o05j79J16K99
1250a192M96O26O52N26M33K09k44p21p72o31n15m16j78L26O18O22O07N87M30J27
1270A590j74l44n78q63q29m22O2K37J89N13R03R07M16K0k08m04n57o19n41n06
1290a208m48j46M28Q64Q30M92M18L51R8l18o94p81p08n28k49J05K54L94N52Q60
1310E66P87L46q0k87m02o47q72p22l29j6K33N34O86O78N24M06L17jn50r06p67
1331e02n18l61l05NM36P81Q57P42M63R4j97l89m55o48q35o96l18J38M28O29P32
$$ plain form
1187 644 -39 -750 -1318 -1617 -1589 -1276 -709 -23 679 1257 1598 1655 1369 856 146 -577 -1261 -1593 -1655 -1408 -884
1208 -884 -194 539 1113 1458 1549 1456 1028 349 -431 -1092 -1526 -1688 -1493 -980 -372 267 907 1516 1792 1578 971
1229 971 316 -248 -783 -1281 -1574 -1561 -1276 -698 152 1003 1524 1575 1395 1172 777 52 -823 -1428 -1607 -1491 -1192
1250 -1192 -696 -70 582 1108 1541 1750 1506 785 13 -618 -1133 -1549 -1727 -1401 -783 -161 446 1033 1463 1590
1270 1590 1416 1072 494 -369 -1198 -1620 -1558 -1321 -1132 -619 284 1191 1607 1627 1419 1015 458 -161 -702 -1208
1290 -1208 -1656 -1802 -1374 -510 320 812 1230 1581 1679 1361 667 -114 -822 -1350 -1599 -1494 -1240 -846 -294 566
1310 566 1353 1699 1619 1332 930 283 -589 -1311 -1640 -1656 -1423 -889 -203 475 999 1405 1722 1721 1171 265 -502
1331 -502 -1020 -1381 -1686 -1681 -1245 -464 393 1135 1598 1692 1495 1106 651 3 -832 -1528 -1846 -1708 -1280 -651 81
1352H1P63N97K90K2l73o75q04p15n33l29r3K36O12Q62P69N94L85J56k01o49q32
1373A63q50o79l67o4K69N09P26P89P59N12J43k12n97p49q02p41n17k21J77N37
1393a215Q04Q50P38N18K06j39m56p28q55p87n88l00O3M87P65R22P81N58K93l3
1413A884l94p37r10q43o12l20J4M12O56Q55Q76P36M26km66p09q11q48p16m73n5
1434b037L76P07Q53Q53P36M65J27l12o48r08r62p41m24j18K08O08Q76R99Q30M75
1454A963J31k84n90p99r06q70o23k19K37O67Q62Q76Q23O25K86j30o11q76r86q21
1474a245o00k69J05M72Q44J023R27O40K67q9n23p51r88r44p40l77J05N50P51R29
1494H7R35P66L96Km44q40r80r70p19m06l9M00P85R86J014P63M32M0l97p13r43
$$ plain form
1352 81 844 1441 1731 1753 1380 705 -99 -814 -1347 -1676 -1769 -1533 -921 -59 710 1304 1689 1845 1644 995 163
1373 163 -687 -1366 -1733 -1797 -1528 -1019 -293 496 1255 1767 1910 1698 1101 352 -450 -1191 -1708 -1929 -1752 -1215
1393 -1215 -411 439 1177 1695 1901 1762 1306 578 -277 -1064 -1652 -1952 -1889 -1402 -637 285 1066 1624 1917 1884
1413 1884 1490 753 -157 -1000 -1612 -1932 -1918 -1506 -850 5 881 1617 2043 2041 1575 866 55 -793 -1509 -1982 -2037
1434 -2037 -1661 -954 -101 752 1488 1953 2080 1768 1120 212 -750 -1491 -1915 -2033 -1825 -1217 -341 658 1488 1963
1454 1963 2094 1810 1220 421 -485 -1355 -1978 -2197 -1960 -1293 -431 445 1268 1893 2179 2049 1438 562 -424 -1245
1474 -1245 -1845 -2114 -2009 -1537 -693 330 1257 1897 2164 2075 1552 801 -187 -1131 -1871 -2248 -2143 -1593 -842 87
1494 87 1022 1788 2184 2186 1742 902 -78 -1048 -1767 -2173 -2212 -1812 -1027 -41 973 1736 2168 2208 1811 1098 155
1515A55r82q61m78q5L59P51R32R77Q27N47J53k95p33r93j034q45n00j45K32O29
1535a389R38J083R36N94J23l10o45q09r94r29p27l03K67P27R57R92P95O17L61
1554B284n0n66j026j117r32o07k05R1M41Q39J067J145P36K68j91n81p53r07j048
1573a112q46m56J09O02Q73R72R13P70M97R7n15r37j109r56o76l92j30L12P85J144
1593e5J157P69L46l7k91o24r37j188j012n60Q4N10O87Q45R38R56O92K75m24r05
1613A226j042r66p23n13l20R7P14J126J220Q70M54P4j52m96q86j212j093o62j28
1632b412L74N99P97R50J067Q23L39k95p41r27r50q45p46m33nO11J067J201R37
1651A411N19K45Q1l53q99j239j162o55k49J32M19P69J034J060R13M73j00o21q69
$$ plain form
1515 155 -827 -1688 -2166 -2251 -1892 -1141 -209 768 1595 2142 2295 2000 1267 274 -760 -1605 -2105 -2250 -2018 -1389
1535 -1389 -451 632 1568 2162 2285 1975 1330 521 -473 -1402 -2129 -2432 -2165 -1438 -481 511 1306 1923 2284
1554 2284 2234 1668 642 -475 -1407 -2014 -2219 -2128 -1687 -848 219 1364 2100 2368 2177 1596 843 -64 -1112
1573 -1112 -1958 -2414 -2305 -1703 -830 142 1055 1825 2322 2419 1904 967 -142 -1098 -1774 -2166 -2296 -1984 -1199 -55
1593 -55 1102 1871 2217 2180 1889 1265 328 -860 -1872 -2432 -2348 -1838 -1151 -306 632 1588 2280 2555 2131 1226
1613 1226 184 -782 -1505 -2018 -2338 -2241 -1527 -401 819 1689 2143 2217 2065 1569 683 -529 -1622 -2284 -2412
1632 -2412 -2038 -1439 -642 308 1375 2198 2537 2242 1501 574 -376 -1221 -1967 -2400 -2405 -1794 -727 474 1411
1651 1411 1930 2175 2256 1903 1004 -235 -1397 -2052 -2301 -2169 -1750 -981 53 1113 2026 2499 2399 1778 909
1670I09r46q96q49o07n1N26Q95J049R52P66M80J37k92q04j145j188p88l34r5K39
1690b042O74J071J194Q78M73Q5l27p31r46j024q86o89k82L70Q95J046R06Q39O36
1709B140L47k57p69j028j059q66o09k20J72N85R20J145J050O34J97k01n97r16
1727F68j112r39o59l09J29N90R30J048R00O96M73l6o48r74j047r39p53m05P1N93
1747a723R08J014R35P62M10k5m75q17j006j014q39m56k0M97Q32J060J012P62M53
1766B270M3m60p72r90r82p99n16j66M15P81R92J036Q59N69R4m23p93r57r95q02
1786a596n60j57L23P10R18R99Q77O16K10k57o88r78j063r37n61j35K96O56Q52
1805d75R62R00O47K67k09o34q57j005q85p03k74J28O13Q98J040R16O45K52j46
$$ plain form
1670 909 -37 -933 -1782 -2389 -2440 -1914 -1019 30 982 1748 2228 2365 2073 1269 124 -1064 -1852 -2186 -2281 -2042
1690 -2042 -1368 -297 897 1775 2248 2333 2006 1275 329 -695 -1581 -2270 -2552 -2182 -1287 -241 665 1504 2140
1709 2140 2487 2230 1461 433 -626 -1492 -2101 -2321 -2149 -1564 -644 501 1551 2185 2382 2181 1584 668
1727 668 -444 -1383 -2042 -2351 -2222 -1632 -702 346 1246 1942 2415 2379 1731 757 -290 -1229 -1982 -2387 -2316 -1723
1747 -1723 -815 199 1134 1896 2306 2281 1806 989 -17 -1031 -1870 -2326 -2346 -1849 -1017 43 1055 1817 2270
1766 2270 2313 1853 1081 91 -891 -1690 -2206 -2372 -1957 -1176 -184 852 1711 2280 2374 1951 1158 201 -794 -1596
1786 -1596 -2156 -2313 -1990 -1280 -362 637 1514 2130 2340 2083 1395 417 -646 -1583 -2144 -2279 -1983 -1327 -475
1805 -475 487 1387 2034 2301 2092 1458 601 -404 -1289 -1992 -2266 -2138 -1525 -627 413 1329 1974 2226 2080
1824B080n47p95r63r40p18l56Q1M99Q34J013R90O86L54p6m87q12r60r49o97l63
1844b126j4M45P34R59R54P31M64M5m10p52r68r77p84m33L4M03O74Q70R10Q18M98
1865B075J02l20o99r07r87p93m58j53K37O52R44J054P76M16J07k06n93q46r41
1884e40q25n79k42K55O57Q40Q75Q29O22K65k06o38q18q91q28n95k54J12N37Q08
1904f16R52Q58N56K60k4m41q00j019q98n60k26O9L84P06R23Q96O75L74m9n28p73
1925G19q29p61o87m67n4M54Q07Q96P74O35L75Q9l16o49r08r27p14l48kL10N61
1946a042Q29R40P84M19K2l15o08q03q13p42n22j75K83O86Q12Q49O73M96K15j82
1966A806o32q55q87p21m58j58J36M99P71R59P82M94J74j88m89p17q43q07n99k51
$$ plain form
1824 2080 1533 738 -225 -1165 -1883 -2239 -2158 -1659 -825 188 1178 1864 2218 2142 1655 843 -117 -1066 -1763 -2126
1844 -2126 -2140 -1695 -961 -2 952 1683 2147 2192 1782 1030 62 -915 -1699 -2132 -2098 -1695 -1021 -151 759 1577 2075
1865 2075 2177 1857 1158 251 -736 -1529 -1987 -2140 -1903 -1251 -307 747 1523 1939 2046 1840 1247 401 -540
1884 -540 -1365 -1944 -2186 -1931 -1274 -434 441 1270 1892 2157 1951 1313 495 -396 -1224 -1819 -2073 -1961 -1424 -616
1904 -616 336 1194 1750 2010 1986 1545 745 -274 -1172 -1732 -1958 -1889 -1505 -799 124 1020 1695 2069 2020 1492 719
1925 719 -110 -871 -1558 -2025 -2079 -1625 -818 78 852 1487 1862 1951 1635 986 78 -849 -1563 -1911 -1913 -1603 -1042
1946 -1042 -213 727 1511 1930 1952 1637 1029 226 -587 -1329 -1851 -2026 -1743 -1057 -245 604 1277 1773 1988 1806
1966 1806 1174 319 -568 -1289 -1747 -1905 -1769 -1270 -499 460 1242 1736 1910 1722 1233 516 -327 -1134 -1733 -1984
1986a984J79N34P34Q00P31O19L18q6m80p43q69p55n61k50K1L80O81R10Q27N69
2006A575K85p6l57o41q38q09o03l64rL63O83P80P70O55L84O5l94o79p33p44o71
2027a358m13o6L29N88P73P97O53L98Q2k26n19p71q76p16l79q5K74N06P42Q10O36
2048A179M67J68j77n47p69p51o68m70k19J44N40P00P77P39N21J75k19m83o39p63
2068b95o59n60k46J23M20O67P88P59N24J98q5m09o31p66p36n25k60N0L83O36P18
2089I4P14N43L49Kl44o36p80p47n54k85J5L39N76P01P02N71L43P1k67n99p27p21
2111f40n72l82p4K50N71P13P63N93L48Nk67m49o19o98o64m15j33J94M83P27P38
2132D72O30M06J21j66m63o72p16o22l96j84J60L96O20P17O43M73K34r3m48o49
$$ plain form
1986 -1984 -1805 -1271 -537 263 994 1613 1931 1845 1365 622 -247 -1002 -1563 -1813 -1792 -1412 -731 179 1006 1575
2006 1575 1860 1784 1427 786 -52 -861 -1464 -1828 -1837 -1474 -791 -11 759 1414 1798 1863 1469 790 57 -687 -1358
2027 -1358 -1771 -1837 -1508 -920 -147 650 1303 1701 1783 1557 1038 267 -609 -1325 -1704 -1789 -1515 -1009 -267 543 1179
2048 1179 1646 1814 1637 1090 321 -430 -1098 -1568 -1787 -1643 -1103 -403 374 1113 1634 1809 1590 1107 468 -295
2068 -295 -954 -1514 -1760 -1637 -1217 -550 238 997 1521 1719 1634 1225 594 -172 -908 -1433 -1693 -1643 -1260 -624 94
2089 94 808 1351 1700 1702 1358 722 -58 -805 -1359 -1644 -1629 -1290 -714 -13 689 1260 1603 1674 1407 808 81 -640
2111 -640 -1212 -1594 -1668 -1418 -847 -134 629 1222 1570 1575 1308 859 240 -458 -1122 -1537 -1670 -1476 -993 -266 472
2132 472 1102 1508 1629 1463 1000 328 -388 -1010 -1406 -1590 -1430 -1034 -414 303 946 1419 1653 1560 1112 463
2152D63p42o57m37j70J00L51O10O54O12N20K64n5l36n90o77o95n11k53J9L39N53
2173f38P21O80M87K44m0k56n10o22o96n11l50q2K80N36P04O92N56K70N9k29m89
2194H06o70o73n20l43r0J90M42O22P01N57L89J55j98m82o50o90n39m00r1J74L91
2215i19N58O67O19M12J47j14l86n84o99n94m22j77Q5L47O17O99O02L61J99k0l00
2236A098n65o81n83m55k78pL91N68O16N98M65K97j6l75m71n94o11n33k93L5K56
2257a138M25O28O83N01L07oj86n10o44o32m92k51r7J59M38O58O35M86L54J28j70
2278A276m78n80o01n59l65j57K04M61N31N92N75L99J53j50l80n21o45o26l73j39
2298a383R1L43N55O51N88L66J71l4l11n41o72n73m01k31L0L41N10N84N77M67K89
$$ plain form
2152 463 -279 -936 -1373 -1543 -1443 -1092 -482 172 784 1304 1568 1513 1177 587 -90 -785 -1296 -1549 -1530 -1191 -638
2173 -638 83 763 1250 1494 1454 1198 688 66 -630 -1141 -1491 -1573 -1293 -757 -53 639 1195 1465 1524 1295 806
2194 806 136 -537 -1057 -1400 -1490 -1300 -858 -236 465 1022 1411 1566 1368 886 236 -454 -993 -1393 -1484 -1310 -919
2215 -919 -361 306 925 1337 1484 1370 984 400 -299 -893 -1315 -1492 -1407 -1060 -443 256 858 1219 1418 1398 1098
2236 1098 533 -148 -731 -1186 -1464 -1471 -1080 -512 104 702 1167 1464 1448 1073 602 8 -603 -1136 -1429 -1394 -1138
2257 -1138 -713 -85 598 1099 1406 1400 1214 704 60 -572 -1064 -1315 -1412 -1253 -815 -157 478 964 1318 1446 1276
2278 1276 798 218 -383 -942 -1307 -1464 -1260 -799 -268 324 899 1298 1451 1301 921 400 -245 -871 -1244 -1383
2298 -1383 -1292 -949 -394 257 845 1211 1382 1348 1037 496 -176 -749 -1150 -1381 -1351 -1010 -500 84 661 1128 1417
2319A417k0l44n18n75n51m77k96J4K61M97N91N81M71K79K9j85m60o08o37m80k57
2340a268o2J91M32N72O22M89L15Q2j76m28n31o17n33l37j33J65M16N50N81N16
2360H46L65J47j27l76n31o21n24l44j51P3L22N05O40N63L88J83j17k83m95n65
2380a02n88m13k06L9L09M93N89N42M28K48k1k69m90n96n55m44k19l6K30M52N85
2401b4N57M54K72M1k41m20n74n43m96k85p3J93M41N10O15M59L23Q1j39m07n51
2422A93n74m47l66j12J30L72N54N79M90L44J34p4l54n28n81n29l70j58Q2L44M96
2443c75N55N42L95J78m7l09n12n68n38l71k21K7K65M54N82N71L95K32l0k24m64
2464E37n42n38m44k73m1K66M25N58N53M53K76K2j95l96n36n67m74k94n5J61L92
$$ plain form
2319 1417 1397 1053 535 -40 -591 -1068 -1364 -1350 -1089 -592 -1 580 1051 1330 1359 1174 714 106 -531 -1011 -1268
2340 -1268 -1330 -1139 -707 -135 487 976 1291 1373 1197 769 238 -379 -912 -1249 -1382 -1217 -801 -251 330 846
2360 846 1211 1358 1231 855 324 -297 -821 -1165 -1316 -1243 -921 -416 224 787 1175 1358 1241 958 463 -102
2380 -102 -690 -1103 -1309 -1270 -961 -468 121 663 1091 1339 1318 1049 559 -37 -592 -1036 -1255 -1291 -1061 -609 -24
2401 -24 533 987 1259 1300 1059 639 65 -478 -974 -1259 -1332 -1139 -698 -188 427 886 1209 1290 1151 744 193
2422 193 -381 -828 -1194 -1306 -1176 -804 -250 329 819 1163 1297 1223 869 341 -240 -769 -1139 -1297 -1215 -871 -375
2443 -375 180 722 1117 1295 1248 939 427 -141 -679 -1050 -1271 -1244 -979 -525 57 628 1023 1255 1225 1001 537
2464 537 -5 -543 -987 -1260 -1301 -1035 -610 -52 501 954 1230 1252 1057 661 125 -442 -916 -1210 -1265 -1104 -712
2485g12N56N62M70L01J00j58l70m79n90n16l36j08J30L86M99N24N23L35J52r2
2505A177l37n18n71n11l48j37N7K93M83N73N27L61K04n4k81m53n52n63l62k40
2525a252M5K53M40N80N31L99K18J1k40m35n12n69m23k45n4K32M32N48N27M17K98
2546A201N6j96l99n39n51m57k72p2J74L50N15N48M59L28J05j51l78n11n50m54
2566g94l35j08J50L09M94N40M95L61J14q0l39m51n55m97l46j72M6L17M98N59M60
2587F66L50K00m8k41m88n37n03l99j81L0K52L99N30N11M37J93j7k22l99n09n19
2608d95m33k57J1J86M07N34N07M18K53O6j94l93n13n20l82k42j17J49L36N14N36
2629C71M45L01N8j50l20m58n34m69l33q1J41L22M62M78M69L23J42q4l17m88n14
$$ plain form
2485 -712 -156 406 876 1177 1277 1119 749 270 -320 -836 -1172 -1280 -1150 -764 -265 259 782 1117 1269 1177
2505 1177 840 322 -249 -760 -1108 -1245 -1188 -895 -412 161 688 1049 1253 1199 918 465 -87 -650 -1012 -1252
2525 -1252 -1207 -954 -514 66 597 996 1214 1225 985 550 38 -531 -954 -1199 -1253 -1021 -589 -41 486 903 1201
2546 1201 1257 1061 662 123 -428 -885 -1157 -1229 -1055 -705 -190 358 817 1145 1250 1099 721 210 -340 -794
2566 -794 -1129 -1237 -1087 -778 -284 256 751 1112 1226 1146 807 356 -199 -696 -1042 -1214 -1168 -851 -353 206 666
2587 666 1016 1216 1168 927 439 -98 -601 -1000 -1181 -1151 -899 -500 30 541 978 1171 1154 932 533 24 -495
2608 -495 -928 -1185 -1174 -988 -581 -47 460 878 1131 1197 1003 610 97 -423 -805 -1047 -1164 -1015 -679 -165 371
2629 371 816 1117 1175 1025 705 247 -287 -756 -1089 -1170 -1029 -707 -245 233 702 1025 1167 1083 766 278 -236
2650b36m27l16j60N1K47M56N33M91L02J57l7k41m06m93m73l77j70L2K44L81M78
2671C6M70L74K26J6k47l98m38m83l77k29k7J49L83M82M95L66J85Q0j32l22m74
2692A35n11m18k21p1J60L16L92M78M21K86Q2j01l38m14m41m04k74j28N9L07M20
2713b65N01L92K72J36q0k20m13m56m24k94j57L0K65L78M40M31K99J96n5k06l59
2734D11m65m03l35k04LK04L37M22M07L62K31Pj65l28m40m30l26k25m3J59K86L93
2756a42M41L73K37N7j26k92l76m33l43k53j09O9L03L99M42L33K50J08o7k12l88
2777B71m01m03k90j16Q7K13L26M01L71L10J62m2k03l46l90l87l01j62kJ96K94
2798d12M19L65L20J81J2j56k90l91m03l32j55l3J08L02L51M14L49K18L0j34k51
$$ plain form
2650 -236 -663 -979 -1139 -1088 -841 -385 148 639 941 1098 1061 820 414 -79 -552 -929 -1099 -1067 -823 -442 36
2671 36 506 880 1106 1122 875 477 39 -444 -821 -1050 -1077 -928 -545 -63 432 798 983 1063 931 609 135
2692 135 -376 -794 -1015 -1086 -926 -610 -218 260 681 967 1049 948 610 196 -245 -649 -923 -1051 -992 -685 -265
2713 -265 236 628 900 1036 956 736 323 -133 -557 -851 -1008 -978 -713 -335 105 536 835 1031 976 770 411
2734 411 -54 -457 -792 -996 -993 -789 -452 -30 377 739 970 977 812 484 44 -386 -712 -937 -980 -821 -535 -142
2756 -142 299 672 909 966 840 548 172 -261 -604 -857 -966 -897 -594 -195 247 580 830 938 871 659 271
2777 271 -130 -533 -823 -939 -852 -639 -313 88 459 769 931 889 686 340 -50 -437 -738 -900 -902 -706 -412
2798 -412 7 372 692 873 885 729 439 48 -355 -687 -842 -875 -767 -465 -114 300 649 867 897 763 512
2819E12l43l96l15k54r1P6K79L86L53L28K05J41p2k04l62m08l38k54j24Q6J54
2840f41L38L57L79K72J16l3k07k93l42l56l03j41RJ86L07L61L47K51J95L8j64
2861F76k71l71l58k52k02k8R4K50L59L56L14K05M3j03k25l32l58l13k38o6J00
2882g20K20K98L53L23K24J21p6k12l19l41l16k35j38N3J85L02L56L00K48J42j3
2903G55j65k95k91l46k88j39lJ73K56L23L39K88J79j1j23k50l36l28k70j85j7
2924g34J01K03L32L20L07K01P3j32k23l10l33k96j97p8O3J94K81L58L12K05R6
2945G43n9j69k89l09l34k42j01M6J91K39L40L24K46J03j1j72k01l27l05l09j50
2966g46J2J33K61L14L00K67J55M0j15k40l19l21k52j72n3Q4J64L20L34L12J92
$$ plain form
2819 512 169 -227 -542 -796 -887 -811 -532 -146 207 535 740 881 809 605 243 -165 -503 -757 -881 -795 -641
2840 -641 -303 54 433 705 821 788 581 288 -54 -410 -713 -854 -845 -659 -352 9 356 607 802 840 676
2861 676 405 34 -324 -576 -778 -806 -712 -462 -103 253 567 772 815 712 487 155 -203 -516 -754 -820 -720
2882 -720 -500 -202 151 474 698 819 743 531 212 -129 -445 -680 -818 -765 -580 -278 78 378 626 768 755
2903 755 590 295 4 -342 -630 -769 -772 -599 -343 -20 319 607 786 775 652 402 66 -262 -532 -717 -734
2924 -734 -633 -430 -98 222 529 730 803 671 448 138 -195 -491 -688 -766 -703 -509 -228 130 442 647 743
2945 743 684 515 226 -83 -417 -659 -760 -714 -523 -284 56 380 626 729 718 546 345 18 -287 -596 -746
2966 -746 -734 -601 -340 -26 274 541 696 736 621 381 62 -259 -511 -683 -736 -652 -488 -168 166 478 670
2987F70O0j08j76k89l26k99k03n6N6J72K62L30L06K37R4l8j72k67l36l10k25j02
3009g20nJ49K70L32L40K37P9J2j09k32l31l23k76j62jJ30K30L29K91K53J83L9
3031G15r0k50l01l22k59j80q8R9K14K89L66L04J81N4o2k04k94l16k88k11q7N4
3053f76J63K93L31L17K14J41o1j88k47l45l18k57j19K4J79K62L34K80K68J30P
3074G32j38k62l19l46k81j60J5J27K31L19L27K86J83L4j36k30l03l28k88j95l0
3095g62P2K27L18L67L01J90K1n4j94l25l36k92j93q2M0J90L01L38K95K41J33q7
3117G09j84k98l32k79k90j23O3J69K90L16L28K47J34k2j42k62l32l72k70j10K4
3138g36J22K39L67L32K71J37L6j23k82l04l52k45j79n4J20K65L06L34L12J63N5
$$ plain form
2987 670 730 622 446 157 -169 -468 -671 -727 -671 -499 -237 93 399 636 730 692 520 253 -83 -393 -618 -720
3009 -720 -725 -576 -306 26 366 603 682 694 585 353 22 -301 -577 -739 -740 -610 -380 -51 240 493 676 715
3031 715 625 375 74 -248 -507 -687 -775 -676 -462 -173 193 497 678 732 670 466 172 -144 -432 -643 -730 -676
3053 -676 -513 -220 111 428 642 783 722 534 287 -58 -376 -633 -752 -728 -549 -287 47 327 595 725 732
3074 732 594 332 13 -333 -614 -774 -759 -632 -401 -82 245 531 714 748 612 382 79 -249 -537 -732 -762
3095 -762 -690 -463 -145 222 523 713 734 680 486 161 -175 -467 -660 -742 -702 -512 -211 127 422 663 796 709
3117 709 525 227 -105 -384 -674 -797 -734 -565 -275 41 369 616 750 728 586 324 -8 -380 -650 -760 -736
3138 -736 -614 -375 -8 324 595 732 768 645 363 59 -293 -538 -717 -771 -651 -386 -80 254 566 729 784
3159G84j00k16l26l34l30j92n9R5J91K86L92L31J89N7o2j95l05l62l16k43p3N5
3181g33J73L21L42L06K48J03j0j55l40l41l27k63q9L2J29K85L32L48K87J58j6
3202G90j57k76l30l47k91j49MJ43K44L41L36K93J68K6j08k66l60l41k52k14m9
3223g95J08K18L39L41L25J76Q0j02k16l20l56l34j78q5P5K03L14L46L49K29Q1
3244G98l4j85l20l90l21k24j18M9J94K89L80L24K55J20l5j77l19l47l38k63j40
3265h02J0J94K83L34L63K62J54k2j42k93l51l47k84j43k7J30K87L41L63K82J98
3286G90L1j61k38l44l77k96j71m8J27K60L30L46L17K13O7q9k58l43l49l30k29
3307g52n3P6J77L77L49L51K03J05p6k43k84l91l45k34r9N2K20L20L45L45K50J36
$$ plain form
3159 784 684 468 142 -192 -522 -714 -773 -678 -487 -201 191 522 711 768 706 511 206 -156 -472 -715 -788 -733
3181 -733 -560 -239 103 409 657 760 750 595 255 -86 -413 -676 -765 -733 -604 -319 13 361 648 806 790
3202 790 633 357 27 -320 -611 -760 -756 -613 -369 -28 308 601 769 795 687 421 61 -280 -532 -746 -795
3223 -795 -687 -469 -130 211 536 712 792 690 474 154 -202 -536 -714 -799 -724 -521 -207 139 488 717 798
3244 798 764 579 259 -131 -452 -676 -794 -745 -551 -262 118 442 697 817 782 605 286 -61 -399 -662 -802
3265 -802 -792 -598 -315 19 382 644 798 776 634 341 -10 -357 -641 -784 -811 -681 -394 -53 310 592 790
3286 790 821 660 422 78 -299 -595 -766 -814 -687 -427 -97 249 566 779 846 757 499 156 -193 -523 -752
3307 -752 -805 -729 -552 -175 174 525 728 833 757 514 230 -161 -506 -740 -839 -787 -567 -247 98 443 693 829
3329H29k7k23l13l50l36k88j26L7J62L14L58L73K60J53j0j64k90l48l82k90j50
3350h11oJ72K54L56L88L07J77qj35k90l83l67k76k17l5J24L07L41L79L19J79N1
3372H26j00k50l54l78l28k11m6Q8K66L22L93L39K09J01q8k83l18l62l43k51p6
3393h44Q0J94L70L75L47K42R2m4k20l25l85l77k38j01K6K19L01L88L33K76J50
3414H59k9k18l14l62l87k94j31K1K01L01L80L35L13J46J5j69k91l59l70l23j55
3435h31j6J52K54L86L84L27K10lj23l13l40l83l28j86l7J36K51L58L79L24J87
3456G88P5j07k71l57l73k99k49l7O6K37L62L62L50K34Q0q0k35l39l80l69k38j08
3478h88Q7K24L08M15L25K67J26m4k11l23l80l77k51j18K4J63L48M03L41K60J66
$$ plain form
3329 829 802 579 266 -84 -420 -708 -834 -797 -635 -321 37 410 670 823 813 649 359 11 -371 -661 -811
3350 -811 -817 -645 -391 -35 353 660 837 829 694 404 21 -346 -622 -839 -874 -750 -443 -102 277 596 775 826
3372 826 726 476 122 -256 -584 -795 -841 -753 -487 -165 228 567 776 877 789 506 188 -174 -517 -768 -844
3393 -844 -764 -570 -200 175 522 764 856 812 592 267 -118 -495 -733 -834 -808 -589 -288 100 433 709 859
3414 859 830 612 298 -64 -451 -745 -876 -855 -654 -353 27 362 675 821 836 667 376 17 -353 -676 -831
3435 -831 -847 -695 -441 -55 329 656 866 863 740 427 87 -296 -624 -810 -847 -711 -460 -102 277 601 788
3456 788 863 756 485 128 -245 -544 -793 -830 -764 -527 -165 197 547 781 861 781 546 207 -173 -542 -780 -888
3478 -888 -801 -577 -269 146 471 738 864 820 609 286 -94 -471 -722 -840 -816 -653 -305 98 439 699 865
3499H65k5j89l12l76l88k83j56LJ88K96L69L77K96J52J7j48l04l62l71k92j86
3520h29l9J38K88L91L69L02J95L4j21k84l31m15l27j72j0P5K54L30L96L53K08
3541H05O8j02k56l51l80l35k21r2O7K76L14M07L42K08R9n4k28l56l74l41k72r9
3563h75N3K05L27L94L72K65J02l1k27k91l68l71l08j34O0J98K87M10L41L13J39
3584H61Pj66l22l94l79k87j61j5J56K90L79L83L07J88Nj34l14l45m07l19j68m3
3606h78J24K86L56L89L09K14N6r1k95l78l79l28k04o8Q8K83L61L91L29K21Q1p3
3628G94k54l49l76l64k23j17R5K43L32M07L09K79J14q2k14l47l63l69k49j34K6
3649h42K11L28L91L75K58J34k7j90l04l88l72l07j51M1J85K66L84M06K94J47n
$$ plain form
3499 865 840 651 339 -37 -425 -708 -864 -861 -673 -377 -8 369 665 817 834 686 382 20 -351 -643 -829
3520 -829 -868 -730 -442 -51 318 620 815 849 728 444 113 -302 -629 -801 -811 -736 -482 -152 244 597 805
3541 805 873 771 515 164 -216 -551 -772 -864 -797 -521 -207 200 542 750 849 795 567 211 -163 -504 -776 -875
3563 -875 -822 -617 -290 104 476 741 843 812 585 294 -74 -445 -753 -887 -827 -629 -342 68 409 722 861
3584 861 868 702 380 -14 -393 -680 -841 -856 -700 -410 -31 352 659 847 852 718 404 59 -348 -667 -835 -878
3606 -878 -754 -468 -112 277 586 800 856 765 470 92 -287 -615 -819 -887 -799 -516 -155 236 565 786 867 794
3628 794 540 191 -185 -549 -772 -889 -794 -551 -219 188 497 776 890 808 594 247 -116 -485 -734 -868 -842
3649 -842 -631 -303 88 463 721 855 828 638 334 -54 -426 -733 -884 -843 -658 -392 -8 398 692 839 834
3670H34j49l06l75l87k72j90l5J92K85L57L85L32J60L5j31k63l68l90l37j69o1
3691h53J09K69L65L77L31K15N2j08k64l53l67l37k38j01J10K57L64L63L43K38
3711G72P3o7k10l64l88l32k34j29P9K23L42L91L45K54R3k5j90l35l70l66k69j34
3733h41KK10L24L70L63K84J54j1j79l04l78l79k78j71mJ61K83L59L87K83J98R
3755H42j40k91l65l89k82k30MJ48K56L65L76L07J96P1j35k71l41l62l22j96p2
3776h31Q3K45L63L65L49K07P7o6k43l46l87l55k14q6P6K11L17L75L64K39J09n3
3798G99k38k89l69l46k59j53L3J84L14L94L35K70J19J6j68l07l64l94k65j15J6
3819g87J44K65L51M28K61J64j5j30k47l81l76k92j57n6J22K92L52L69K82J87M8
$$ plain form
3670 834 685 379 4 -383 -655 -845 -880 -688 -403 -46 339 671 831 866 735 472 104 -286 -623 -792 -853
3691 -853 -744 -475 -110 267 598 813 865 757 493 140 -227 -564 -802 -903 -793 -536 -172 191 534 772
3711 772 845 778 568 204 -184 -516 -750 -879 -800 -577 -235 156 501 755 848 823 633 298 -72 -438 -707 -841
3733 -841 -839 -629 -305 65 428 712 866 855 676 372 -6 -385 -663 -834 -838 -677 -394 -35 352 635 833 842
3755 842 702 411 46 -343 -625 -855 -851 -703 -447 -82 294 601 797 868 733 462 121 -241 -563 -759 -831
3776 -831 -748 -503 -140 225 574 781 858 792 549 203 -184 -539 -753 -839 -763 -552 -235 140 504 743 852 799
3798 799 561 272 -97 -443 -702 -855 -822 -638 -324 70 405 675 794 810 642 335 -29 -423 -688 -803 -787
3819 -787 -643 -378 -27 401 662 826 811 681 434 53 -323 -615 -772 -828 -706 -414 -62 307 589 776 824
3840H24r9k55l59l93l13j72o3J01K33L01M02L63J80M5r4j84l27l80l54k21o0O4
3862g61K33K82L90L46J91J49qk26l60l40l31k07j56pK02L26L61L62K57J11k7j63
3884F24k72l69l79k88j30K9J64K60L39L68K77J59J5j16l14l42l66k72j62m6R4
3905g27K83M09L27L02J61N5q5k56l64l42l43j59o3R7K33L22L42L34K57M0p5k36
3927E12l35l33l22k29j27O5K28L31L83L00K10J23l0k08l41l48l37k29j42M5J69
3948f15L38L39L15K65J57k8j71k84l46l46k89j45%J68K86L68L29L02J66K7j48
3969F88k88l42l79k61j77m5J41K54L41L51K94J93L8j01k52l30l62l22k05l7R1
3990g10K64L05L34L29K24M1p3k06l48l30l13k26j24J03K00L18L18L70K38O5k2
$$ plain form
3840 824 725 470 111 -282 -595 -767 -830 -729 -496 -195 207 570 750 795 701 517 190 -190 -544 -765 -825 -761
3862 -761 -528 -246 144 490 681 830 822 596 236 -104 -435 -642 -798 -805 -603 -277 84 446 703 814 787 624
3884 624 352 -17 -396 -684 -814 -785 -621 -361 -22 346 623 782 797 681 367 25 -341 -613 -775 -821 -727
3905 -727 -444 -35 292 594 755 810 725 469 105 -237 -580 -739 -802 -705 -472 -150 192 526 783 823 748 512
3927 512 177 -156 -478 -707 -834 -769 -541 -210 173 473 683 806 776 568 227 -121 -458 -687 -829 -784 -615
3948 -615 -277 62 377 642 799 771 600 316 -30 -376 -665 -810 -810 -642 -356 12 341 643 809 836 688
3969 688 400 58 -321 -582 -759 -804 -663 -409 -68 283 577 770 808 707 455 125 -237 -559 -764 -801 -710
3990 -710 -446 -141 193 522 746 787 714 508 160 -170 -483 -709 -833 -730 -530 -212 106 476 714 779 757
4011G57j93l06l51l16k48j26O0J50L18L41L22K61J18j6j65k64l61l36k76j50j3
4032g94J86K59L47L42K68J46J9j44k65l61l20k61j75j6J30K39L29L20L02J73K9
4053G53r6k35l08l42k81k12n5R0K31L23L49L17K15M7p7k34l20l09l22k26o0N2
4075g00K14K94L49K90K32Q4m1j95k75l54l09k52j03N8J42K83L40L15K49J29k4
4096G26j65k88l12l10k76j15jJ63K13L62L47K44J51pr2k66l20l34k62j78j5J28
4118f07K10L38L24K66J92M8j23k32l16l24k71k05l1P0K24K87L42L02J67O7n3k22
4140D53k91l28l09k09o8N7K15K54L72K71K42J01p5j69k77l32k96k30j18K8J71
4161e38K85L26L01K32J21pj55k63l43l17k25j23LJ52K14L26L32K69J11K1j23k52
$$ plain form
4011 757 564 258 -93 -409 -657 -783 -723 -573 -255 86 408 669 787 771 606 342 -19 -355 -631 -781 -794
4032 -794 -608 -349 -2 340 608 754 773 629 364 3 -317 -578 -753 -769 -639 -400 -71 249 551 724 753
4053 753 657 422 114 -228 -509 -721 -776 -686 -455 -132 217 534 749 796 719 485 165 -144 -466 -692 -752 -700
4075 -700 -486 -192 157 447 679 763 722 527 252 -102 -411 -663 -766 -708 -566 -283 57 372 621 750 726
4096 726 561 273 -39 -349 -625 -740 -741 -578 -365 -3 344 588 739 732 640 374 54 -280 -542 -720 -735 -607
4118 -607 -397 -59 265 531 723 771 648 416 100 -224 -495 -700 -731 -661 -437 -150 192 494 661 728 675 453
4140 453 162 -166 -475 -684 -752 -695 -480 -226 146 417 659 760 685 516 239 -93 -389 -619 -737 -709 -538
4161 -538 -253 73 374 606 727 720 565 302 -41 -358 -583 -706 -703 -551 -337 -11 321 590 701 722 599 347
4183C47l05l28k50j60l3J07K58L03L23K38J61L8j03k20k76l30k61j66l8Q5K16
4204c94K87L08K86J72O2q9j96k59l04l13j76q1O1J83K86K98K82J81J16k8k04k75
4226B03l18k71k14j10M3J54K45L26K83K39R4k5j32k53k98l18k28j10k0J73K54
4247b83K93K86K33J71j9j30k42l15k65k28j50j5J16K28K73K74K71J46M8j19k05
4268C68k82k89k64j81k3R2J87K74L02K24J97M2p5j76k67k89k52j87o4M3K12K42
4290a66K93K73J90N3k7j92k28k77k60j86j03L5J47K24L03K62J91J22l6j48k23
4311B47k50k90k12j18K0J13K40K57K84K09J09Nj32k07k58k69k37j48J9J11J85
4332c22K55K66K41J16K5q2j78k31k81k32j40p3J18J84K33K56K52J43N9r4j40k40
$$ plain form
4183 347 42 -286 -536 -696 -729 -622 -364 -61 262 500 661 699 596 376 100 -230 -491 -657 -695 -610 -394
4204 -394 -107 201 487 659 721 632 436 177 -127 -440 -616 -697 -636 -453 -167 131 413 594 710 682 478 203
4226 203 -115 -386 -600 -710 -667 -513 -268 58 341 580 674 649 517 264 -34 -352 -580 -690 -710 -537 -283
4247 -283 10 296 529 700 681 551 309 -6 -271 -499 -649 -664 -548 -320 -47 227 498 644 692 573 368
4268 368 86 -203 -467 -648 -671 -579 -392 -118 184 408 605 647 572 396 129 -160 -412 -599 -663 -620 -408 -166
4290 -166 127 400 590 643 616 424 196 -81 -341 -527 -630 -595 -448 -224 79 341 532 654 618 470 247
4311 247 -3 -293 -505 -623 -603 -490 -250 7 291 500 609 614 482 275 17 -252 -489 -637 -618 -507 -322
4332 -322 -67 199 440 556 581 499 321 90 -191 -423 -563 -636 -518 -334 -101 155 407 550 609 515 375 135
4354A35k66k52j50n1N9J49K34K63K29J87O4o0j46k16k63k41j51r2J3J22K18K74
4376E9K40J77O9%j16k10k33k66j91q9k7J43K01K21K65J74J43k0p4j89k43k31j96
4399c93j23k4P5J81K35K59J86J37K0m3j96k31k44k12j32m5N7J62K27K17K18J46
4421D77N3l4j35k73k00k25j60o8O2J42J91K46K02J86Q0l2j53j92k26k09j91p4
4443e33L4J17J96K52K11J56J03k9q9j84j95k72j66j01MR7J51K43K24J77J09qq3
4466D14j47k27k18k17j10l6R1J75J77K59J96J02N0p9j41k03k29k05j33j2K9J48
4488c16K06J94K29J26P3k4j42j80k55j74j62o3M6R8K03J95K15J44Q1nj11j96k19
4511c7j95j87o0LR3J87J77K21J83P1K8j17j53k13k10j62j05qP9J45K13K02J81
$$ plain form
4354 135 -131 -383 -533 -584 -525 -376 -142 121 350 537 601 541 395 179 -84 -325 -476 -568 -555 -433 -215 59
4376 59 299 476 545 545 429 219 -14 -280 -471 -560 -587 -444 -243 -22 243 417 560 540 466 277 34 -197 -393
4399 -393 -516 -540 -465 -284 -49 210 396 533 553 510 314 83 -161 -373 -505 -550 -493 -331 -104 113 331 477
4421 477 530 496 361 88 -112 -337 -497 -565 -503 -361 -170 76 278 464 544 512 359 167 -59 -268 -459 -533
4443 -533 -499 -382 -186 66 277 433 536 507 418 234 39 -233 -399 -500 -496 -399 -248 -5 219 396 505 497 414
4466 414 267 40 -178 -395 -505 -541 -450 -275 -98 161 357 459 509 430 289 86 -143 -348 -481 -493 -464 -316
4488 -316 -110 84 313 439 512 488 346 166 -89 -263 -425 -488 -442 -344 -141 54 269 413 494 489 378 182 -37
4511 -37 -232 -419 -479 -476 -383 -196 -19 202 385 456 484 367 214 1 -209 -371 -476 -484 -405 -260 -47 155 336
4534C36R7L2n4j45j94k03j77j18k6N7J37J75K18J78J22M6m7j21k10j96j88j46
4556d27l4O1R4K07J76J99J29O2n4r6j67k17j91j31p4K3R0J85J79J98J43N2J3n8
4580C62j62k14j85j62r7JJ04J57J79K11J37J14L2p3j59j83j98j44j54RO3J15K12
4603c5J45J78J49K6p4j20j71j89j90j25m0L2J06J58J90K29J33K9j5j24j89j50
4625d7j92j39o2M6R4J53J86J81J52N6jq2j67j84j79j35j09J6Q4J38K10J66J54
4648C39P9J2p4j36j76j95j77j14lR1J03J93J94J54P8N5p2j13k23j50j82r7k2N0
4672c86J29J56J73J87J24N5m8j01j99j50j72j34p0L2J31J22K22J69J21N7k2j16
4694B80j09j97j78j47o5K5N3J55J98J76J46O2kp9j38j79j78j49r7k2Q4J23J77
$$ plain form
4534 336 433 465 411 266 72 -131 -308 -426 -452 -395 -258 -83 135 313 435 481 434 313 103 -93 -281 -427
4556 -427 -461 -400 -306 -99 77 276 405 467 413 317 150 -67 -258 -389 -463 -440 -350 -165 14 212 355 407 420 362
4580 362 200 -14 -199 -361 -458 -457 -353 -196 -17 194 331 445 477 404 245 62 -136 -280 -434 -425 -362 -247 -35
4603 -35 110 288 437 463 389 269 98 -91 -281 -406 -446 -414 -308 -150 40 269 402 431 416 292 103 -47
4625 -47 -239 -378 -440 -394 -300 -147 39 220 372 428 427 345 178 -6 -185 -320 -429 -413 -329 -191 19 185 339
4648 339 418 430 356 220 44 -151 -328 -442 -445 -354 -251 -58 136 290 368 423 351 238 15 -135 -317 -414 -436 -386
4672 -386 -257 -101 72 259 383 438 390 289 90 -60 -232 -366 -436 -404 -273 -151 71 240 361 418 396 280
4694 280 171 -26 -204 -351 -416 -391 -338 -183 15 191 337 399 397 318 180 1 -177 -326 -423 -445 -361 -238 -61
4717f1J95J46R1L7n6j24j96j60j70j22j7P8J16J49K03J76J09M2o1q5j82j82j79
4740b53j06n6L7Q5K09J46J73J29N1Nj54j40j73j81j29n9j1Q8J68J68J80J56P2
4763D05k8q7j33j90j70j56q4J6R3J24J73K11J38O8N3p8j43j69j74j65p8j6N8J10
4787b22J75J94J35J06N4m9j35j48j88j84j23m4O4J08J46J94J58J34L7m1q6j68
4809A17j98j70j31n6L4J33J36J54K04J17P2l5n6j65j82j61j60n5oQ6J68J66J75
4832A87J25J13Lp6j60j91j67j60p8oO3J39J66K06J44J06Kn0j50j76j87j71q7l8
4856d43O1J02J99J69J73J25K9m8j15j63j72j84j13m3L6Q4J99J85J79J35M1k6q6
4879C24j80j72j86j48n3J5Q7J78J62J87J65L8Mr5j50j90j87j47p9jQ4J41J92J90
$$ plain form
4717 -61 134 280 371 408 352 228 32 -128 -298 -420 -437 -359 -243 -94 109 285 394 436 375 290 108 -74 -253
4740 -253 -359 -415 -378 -293 -84 62 235 364 415 420 266 126 -47 -228 -357 -416 -427 -339 -171 -3 177 333 405
4763 405 377 290 157 -33 -203 -359 -443 -427 -334 -210 -37 174 312 380 433 355 212 43 -131 -296 -374 -390 -332 -222
4787 -222 -47 147 282 388 442 393 258 110 -78 -262 -385 -429 -365 -257 -111 83 241 375 412 371 285 117
4809 117 -81 -251 -382 -438 -404 -271 -135 19 223 340 412 377 321 156 -26 -187 -347 -402 -408 -322 -154 12 187
4832 187 312 425 428 352 192 1 -166 -326 -404 -410 -347 -208 -42 164 308 414 416 366 216 40 -147 -318 -405 -443
4856 -443 -382 -280 -81 88 261 386 415 367 252 89 -83 -267 -380 -423 -387 -303 -104 81 260 395 436 410 324
4879 324 144 -28 -214 -362 -415 -400 -313 -135 27 214 379 417 421 326 176 -14 -201 -348 -427 -428 -344 -203 -11 179
4903A79J34Q1L0p6j59j56k01j44j20l0P6J38J84J83J53J20L7m2j48j52k06j44
4925b63j13l9K1J37J69J86J77J41M9o8j06j75j65j93j37n6K0J30J39K38J28J44
4947C64P0Jj22j68j92j67j63o6J5P6J65J93J68J81Q0or7j37j89j77j59r5k6R6
4971c55J43J90J98J56J24L4r5j54j68k27j45j07l7P2J31K00J75J65J24K0o0j22
4993B62j89j87j62j38q1P2J38J51K04J93J18M0l0j03j65j96j98j19q3L0J06J80
5015a57J98J78J49J04m4p0j80k20j64j56j09L7Q4J63K16J92J55R2j2p7j60j88
5037C1k10j89n7k6P7J25K10K12J58R7L4q7j42j96k20j54r8m3N2J49K29J75J86
5060C13J05N5n3j39j97k02j71j26m6N2J16J89K52J33J37M4j8j37j64k09k00j55
$$ plain form
4903 179 313 394 424 348 189 33 -168 -312 -432 -462 -386 -248 -64 119 272 392 429 387 239 87 -119 -263
4925 -263 -376 -415 -394 -257 -88 98 275 416 465 397 291 116 -49 -242 -379 -435 -415 -285 -146 92 220 364
4947 364 434 435 313 145 -47 -214 -377 -443 -428 -352 -187 6 174 355 435 429 332 195 6 -171 -330 -425 -451 -355
4971 -355 -212 -22 176 332 456 490 395 241 73 -154 -299 -406 -443 -371 -240 -40 135 300 424 444 384 262
4993 262 73 -114 -276 -414 -495 -423 -285 -134 70 263 381 421 391 288 123 -73 -271 -390 -473 -443 -337 -157
5015 -157 41 219 368 472 428 358 178 -42 -206 -362 -471 -434 -350 -187 29 221 376 468 456 379 219 31
5037 31 -179 -368 -425 -451 -374 -249 -39 173 331 428 462 375 233 37 -183 -337 -435 -478 -426 -277 -48 127 313
5060 313 418 473 420 281 84 -118 -289 -415 -461 -409 -293 -104 148 281 418 462 444 307 143 -66 -266 -421
5082d21o6M6J19J66J86K27J56N1k9j10j87j84k22j44o6QR7J67K20J80J63P3Pr9
5106C38j68j68k06j65j11J8R2J51K11J98J65J32kp3j40k28j76j88q6p0P5J60J90
5129e1K12J62J07N6n4j55k00k09j76j23n2M9J37K14J80J82J26Q0n7j49j57k19
5151i7j76j51m8L3J13J65K16K13J31P0Kj03k15k01k01j45o7jJ16J65K25K04J70
5174D18N1L9j17j78j87k26j59j11kQ9J36K26K14J51R6K0n6j73j95k08j90r1j9
5197d72N5J46J94K34J53J36L8o3j51j68k21j88j22k5K6J39K04J81K19J17N3n1
5219D34j20j94j82j94j24r6L6J30J83K20J64J59P5l7r7k01k00k01j55p9J6Q8J91
5242a84K12J94J51J02lj12j65j95k04j81q1lR6J41K07K21J74J07Lq1j67j86k13
$$ plain form
5082 -421 -487 -441 -322 -156 30 257 413 464 435 325 138 -46 -268 -412 -478 -470 -373 -206 14 194 357 430 437 338
5106 338 170 2 -204 -369 -480 -462 -370 -219 -8 190 355 487 485 412 272 44 -132 -320 -406 -476 -401 -241 -51
5129 -51 161 323 430 486 432 277 77 -132 -308 -431 -483 -434 -297 -83 97 279 405 485 428 279 122 -97
5151 -97 -273 -424 -472 -439 -326 -161 55 268 399 469 471 368 153 -48 -249 -394 -461 -462 -346 -181 44 248 418
5174 418 469 508 391 213 26 -200 -359 -470 -472 -383 -247 -21 193 344 440 460 404 231 36 -172 -362 -453 -472
5197 -472 -417 -271 -77 157 310 446 484 421 270 102 -119 -307 -429 -454 -428 -289 -85 96 315 432 485 434
5219 434 314 120 -62 -256 -380 -476 -440 -310 -127 93 257 416 491 454 357 156 -44 -245 -400 -479 -463 -375 -184
5242 -184 28 222 373 475 472 360 195 0 -204 -385 -466 -469 -373 -232 -25 196 370 477 480 399 232 46 -167
5265a67j83q0k4Q4J33K07J85K04J02L2n4j56j74k30j89j41j7N7J06K19J90J71
5287B75J49L2l4j28j78k18j88j41m0K4J20J77K34J73J57N9j9j57j68j78k10j50
5309d09m3J2J14J86J73J97J58R2l6r1j56j87k15j78p8J0R2J38K20J89J69Q5np8
5333C59j38k17k06j69q6k7N8J80J87K12J62J19J7o8j51j91j72j82j22j9O4J26
5355b64J80K09J79J27L3m6j18j78j95j89j45o0M5J51J61K10J53J62N5m2j22j76
5377A30j77k09j57m9J7J06J73K13J74J44P3j6q5j57k04j99j51p2J3P0J54K22K14
5400B27J34R7Jq6j47k03j83j59j12qP2J77J74J71J80Q3L9p8j38j80j91j89q3k3
5424d25N0J26J68K04J68J08J4k9j30j80j84j75j20m8J8J54J62J86J87J16M9qj09
$$ plain form
5265 -167 -350 -430 -454 -370 -237 -30 155 359 461 493 439 283 109 -121 -310 -451 -468 -411 -305 -86 104 275
5287 275 424 456 422 294 116 -102 -290 -431 -471 -447 -327 -150 84 257 414 473 454 297 129 -49 -259 -409
5309 -409 -452 -440 -326 -140 33 230 388 480 444 353 197 10 -205 -383 -461 -451 -359 -221 -1 188 357 442 437 359
5333 359 221 4 -202 -371 -457 -484 -426 -246 -59 153 315 434 451 383 232 41 -131 -313 -435 -454 -390 -264
5355 -264 -84 125 304 431 464 418 300 122 -73 -262 -407 -467 -422 -271 -110 100 253 415 470 428 306 130
5377 130 -47 -256 -413 -462 -445 -339 -166 47 221 365 438 422 337 180 -24 -223 -374 -446 -433 -363 -209 13 227
5400 227 361 458 459 373 226 23 -160 -319 -431 -439 -367 -190 -16 155 335 418 457 379 241 61 -130 -319 -402 -425
5424 -425 -375 -249 -81 123 291 399 413 384 254 74 -110 -285 -405 -453 -435 -281 -119 67 254 370 419 411 302
5447C02j67j80j93j22n8J4Q9J70J94J86J69K8k5p6j43j88j92j54o8oR6J83J56
5470A5J77J63P3mq8j41j93j78j46r3j4N8J55J74K11J38P0K6n7j08j75k05j50j07
5494c99m4Q0J23J63J94J64J19K3m6j33j57j76j74j05l6K4J20J58J97J58J03O0
5516D16l9p9j73j98j73j32l7J0J04J42J92J49J66M7J1j07j42j76j95j16p1j2Q5
5539c28J46J95J78J21Q4j4p2j37j67j63j45o8l2P3J54J63J55J74J03Pq1j26j83
5562C7j58j76q3j2M2J42J52J85J10J27K6m5j18j72j55j77r8n0L5J28J52J77J52
5585B21J34L6m1r3j56j76j47j15n1oJ21J42J65J88J09P3l8p7j38j81j42j54m4
5608c70j7J03J15J75J91J23P7k2p6j47j50j85j38q1K9N0J55J38J65J37Q4Qo2j17
$$ plain form
5447 302 135 -45 -238 -360 -418 -404 -315 -145 49 235 404 432 407 331 188 0 -192 -346 -414 -420 -324 -141 15
5470 15 192 355 428 424 336 195 2 -176 -322 -415 -429 -371 -216 -42 169 307 377 403 346 238 63 -142 -292 -399
5494 -399 -443 -363 -240 -77 117 281 400 423 377 244 87 -89 -263 -368 -404 -380 -260 -102 95 253 356 416
5516 416 377 298 125 -73 -246 -378 -415 -405 -301 -159 33 182 348 395 406 299 157 -19 -214 -330 -401 -413 -328
5539 -328 -182 13 191 312 396 382 310 173 6 -157 -302 -370 -402 -329 -175 -12 143 317 420 427 346 220 37
5562 37 -121 -297 -380 -392 -350 -208 -56 129 239 366 392 347 229 57 -98 -275 -373 -423 -388 -260 -108 69 221
5585 221 355 391 350 257 101 -75 -222 -337 -388 -394 -273 -131 34 222 331 404 366 289 151 -30 -172 -326 -370
5608 -370 -387 -284 -169 6 197 320 397 375 299 152 2 -183 -321 -402 -373 -323 -168 -30 135 272 356 364 302 185
5632A85j38j83j51o9j9M6J23J55J67J41J05K2k6j26j55j68j66p7m2M1J08J42J69
5655H4J51J00K9l8j12j47j53r7j04n6NN7J40J73J74J27jj6r7j37j09j48j09r5
5679c79J6N9J58J86J21J04M0J1m6j11j37j42j74m1J3P1J26J07J63J18P7Rn0j08
5703A91j35k00r3p9RL2R0J11J57J51R9J7p2j11j51j21j26q5m0K2Q9J99J48J13
5727B15J05%m4q5j12j29j41j25k9M1Q3J34J42J37Q6P3op3j57j64j31q4l2K3J8
5752b55R4J65J93J05J9Kq8j03j47j34j39o5k1J07J33J29J27Q0J20Kl5j25j74j42
5776a52j30m1J3J7J12J30J69J39Q9j3m7j00j26j36j30r2m5O1J33J39J13J29N2
5799B84L6j2r0j40j44j59r0K0MP5J21J69J37J09K5q6p1r8j39j25j34p2M8R3J13
$$ plain form
5632 185 47 -136 -287 -356 -375 -329 -206 -51 116 257 362 384 358 232 77 -91 -257 -334 -376 -335 -227 -85 84
5655 84 235 335 364 326 214 67 -86 -183 -287 -343 -338 -281 -141 32 206 333 332 316 219 82 -27 -175 -284 -379
5679 -379 -363 -304 -146 40 161 265 305 316 270 159 22 -120 -294 -335 -322 -251 -125 -18 145 263 340 349 299 191
5703 191 56 -144 -237 -316 -307 -275 -185 -74 83 234 333 350 278 167 16 -105 -231 -316 -356 -334 -245 -46 102 215
5727 215 320 320 276 191 79 -50 -191 -316 -345 -304 -221 -87 55 192 278 351 345 272 115 -49 -180 -264 -296 -273 -255
5752 -255 -161 4 197 302 321 323 235 132 -15 -149 -288 -353 -374 -267 -134 -5 122 202 322 324 289 164 -10 -152
5776 -152 -282 -323 -310 -293 -181 -51 118 257 346 333 286 186 60 -76 -206 -298 -343 -282 -149 -10 103 232 284
5799 284 320 308 218 78 -66 -225 -315 -295 -291 -216 -95 74 211 320 345 259 188 90 -49 -174 -308 -380 -332 -239 -126
5824a26J63J16R6O4J0p5j49j36j48o7m0j3O1Q1J64J70Q9O3j9m7j19r6j67j07j15
5849c47J8P7J29R8J50Q6R4M4p3j44j31j52j03m9k3K3R5J58J49J36O8j3l2r1j25
5874D2j18j84o6k5R1R6R8J21J51R5N1n9j12r9j41j00p7q1K3O5J55J68J20M8L3
5899B95no5j18j60j64q4k0J2O4J13J38J44J15M1l9p9j00j14j00j42o0j6R4J36
5923a14J23J04J01O9L3m1j28j58j34r0m4l0L6J18J47J40J30N5oo6p1j23j42j28
5947b19q8j3Q0R9J09J15J23P5L8l2j36j49j12r9o6o2K3R6J58J31J22N6N3j5p4
5972B13j46j56j16o8RK4K7J23J45J39R8K6l2q6r7j19j34j18n8L4R1J02J40J14
5996A55O8O4K3o8j38j35j41p0l0l4O5R0J47J62Q0J7qk4r0j06j68j02p1K5P8N5
$$ plain form
5824 -126 37 153 249 313 323 248 99 -37 -185 -252 -292 -305 -244 -163 1 171 260 323 304 257 138 42 -125 -232 -347
5849 -347 -329 -252 -123 -25 125 211 305 349 276 132 1 -151 -254 -303 -326 -303 -208 -50 99 235 303 290 258 167 42
5874 42 -76 -260 -326 -351 -260 -164 -66 55 206 301 352 293 181 82 -59 -159 -236 -317 -294 -229 -74 94 214 262 295
5899 295 290 225 107 -53 -217 -301 -321 -309 -245 -132 6 150 265 306 267 188 88 -26 -126 -268 -328 -344 -250 -114
5923 -114 9 113 214 283 316 275 147 -11 -145 -235 -279 -309 -273 -155 -8 132 262 317 311 245 174 51 -91 -219
5947 -219 -307 -320 -240 -141 -32 83 206 281 319 287 151 2 -110 -209 -275 -337 -314 -218 -60 71 193 249 302 287 213
5972 213 67 -89 -205 -273 -264 -240 -213 -90 55 194 292 318 286 200 103 -16 -150 -268 -326 -292 -201 -99 41 155
5996 155 223 287 310 242 104 -31 -172 -242 -272 -306 -241 -151 -4 158 238 255 247 223 133 27 -141 -243 -314 -289 -211 -156
6022a56J58R9J23P8Jl9j10j08j29q9o5m8K7J18J32J24Q8O8K3j3p8j31j71j04p6
6047b78qK1P9J02J38J42P5K6p8p0p0j43j26q1o0O4P6J22R3R8J05P9qj05j05j40
6073e2j16o0o5lQ0J23J48J27O1K8K5o5r9j40j37r9pmL8R8J05J22J18Q8l1r4p8
6100A11j22r4j09p2l7N3J24J40Q8J07P2Ok9j06j01j59o3n4m2N0P6J39J18J22P1
6125B89jm7m8j02j24j48p0n1P3J07P0J50Q3Q8N3l3j04j24j16r3p6m8j5P7J31J33
6151E4J04O3K2M0q3j01j52j19m6n5L7L5J08P5J66J16M6k5q3q1j23j08r6q8kP5
6177b21J04J20J17P7O9Rk6j13j49j11p3n0j8L1O5J34J38R5N6k1l3n6j21r1j38
6202b06q0J2N7M6R6J28J17J17k3j7q8j21r9r1o0n2K4N0J34J24R6P5L2nn9j05j35
$$ plain form
6022 -156 2 101 224 302 303 264 154 46 -83 -172 -237 -285 -258 -140 -8 116 204 272 295 282 204 73 -98 -202 -278
6047 -278 -286 -265 -186 -84 54 196 271 297 219 149 79 -64 -190 -271 -331 -267 -191 -69 24 122 227 306 298 193 88 -52
6073 -52 -168 -228 -293 -296 -216 -93 55 182 243 271 296 231 132 -8 -145 -244 -251 -255 -217 -119 -14 108 226 314 283 189 111
6100 111 -11 -105 -214 -286 -323 -270 -146 -6 82 189 261 267 238 132 31 -128 -191 -245 -287 -237 -161 -22 96 218 289
6125 289 288 241 193 91 -33 -181 -251 -302 -229 -122 -52 98 181 269 322 289 185 61 -55 -148 -224 -272 -287 -210 -79 54
6151 54 158 221 243 283 200 99 -53 -172 -218 -273 -236 -201 -93 -18 148 264 310 285 202 121 -2 -110 -206 -294 -296 -221
6177 -221 -117 3 120 197 266 275 249 136 -13 -124 -197 -247 -265 -234 -169 -35 103 198 254 233 200 144 23 -68 -206
6202 -206 -286 -274 -217 -171 -75 53 170 287 264 247 159 38 -61 -152 -212 -264 -240 -190 -56 68 164 239 271 266 207 102 -33
6229c3j25o0l3K2L6J10J09J09J10K3l2n6j01j02j15q1m7j9Q6J08Q4R6R9O6J9r7
6255A76q3j16r8o1o0KNO1J47J15J06O3km3n5q9j37j13o6J6M2O1P3J17R9J09Pn7
6283B19q2q5r9j02o9m9J6P3J23R5R4O0K7rn5p5j49r9p0KqN2Q5J02J28J27Rl9q1
6312A41l2j03j01r1p9J4O7J01R2P7P3P6K4l7j28p0j31p0m5nQP0J40P2P6N9J9m7
6340A70l3j05j45q6n5OM2L2J22Q5J09J00J9n8o2j07p9q4q5j7qQ7J10J08O1P2J1
6367B10Ql0q6r5j47r0kJ1M7R1J04Q6Q2P5l3p7q8o9q9r4o5k2R5P6J03P2P7N5mj2
6397A89q7j24j02o5k2j8L9O0Q2J15J08M0j6Nn7p1j17q7q7l8P3O0R2Q4P6R0L0k7
6425B25r0q1j03p8o4m3jM3J15J05J04O5K3l8l7p5j03r6j07pK0Q0O2M8J22Q2N7
$$ plain form
6229 -33 -158 -218 -251 -229 -193 -83 26 135 245 268 236 180 79 -23 -138 -219 -266 -285 -199 -91 -7 89 188 254 273 176
6255 176 93 -23 -121 -182 -242 -240 -235 -174 -27 88 194 257 255 212 157 68 -69 -182 -248 -232 -190 -129 -56 61 160 269 276 219
6283 219 137 52 -47 -149 -218 -267 -251 -178 -55 40 134 194 221 212 157 82 -67 -166 -236 -234 -242 -190 -105 -3 125 252 261 222 141
6312 141 109 6 -95 -186 -265 -251 -184 -83 9 86 159 235 259 222 94 24 -107 -177 -222 -227 -219 -149 -9 63 139 198 217 170
6340 170 137 32 -113 -199 -254 -248 -206 -174 -52 33 142 242 261 203 141 34 -45 -129 -214 -231 -239 -152 -42 66 127 199 210
6367 210 218 188 102 7 -140 -230 -232 -221 -174 -83 21 107 189 264 231 154 66 -3 -92 -186 -251 -273 -178 -102 1 73 150 205 201 189
6397 189 102 -22 -124 -189 -211 -229 -190 -130 -48 67 175 215 199 204 147 76 -41 -128 -215 -253 -180 -120 -28 56 132 222 252 225
6425 225 135 54 -49 -127 -191 -234 -235 -192 -77 28 132 197 220 182 145 70 -33 -129 -236 -243 -223 -143 -81 -33 89 171 228
6452B28J1o7q6p7j01q8n7K5J6J03R5R6O8M7Rj7n9q4j39o1n2oK4M4P2J16J01M7
6480B08J7l1q1r4o1p5q6p2M4N3J05J15P8L6N9k0m5q5j18j09l7kj6M2Q4J01J05
6507A15Q0L3l4or4o5j16q4p6K2J00N4O5J06N1N3L3l1r8j00r6n3l6m0N3J1J25R1
6535F3J07J6K1k7m0j04r0r4o3j6M4R0O1O5P7Q4L9Np1r5j00m9o0n1j4M3P9J14J01
6564A35O4Rj8k1p6j11q8p7m5L7L3M7Q8Q3N7R4J7q1m5j15r3p1k7j5J9N8J26R6P2
6593A52L2QKn8r7q5j24l6MM5K8O6J09R6Q9K5m7p0r9m6q7o3m9k4O7J02R2O9Q8j0
6623A79K1l9o4j20j08o7l1L5L4P1N6J36Q1L7%o9p5q6n3p5p8k6N1R0J00R1Q1L3
6651B05L9j2j00p5j18j17Ml2M0M0Q6Q0J20R1Lq1m5o7j14q1n9m6K9O2Q7J13P6M9
$$ plain form
6452 228 239 172 86 9 -92 -180 -237 -212 -196 -93 2 98 166 213 222 205 146 62 -77 -138 -190 -196 -172 -128 -56 60 161 208
6480 208 225 194 113 19 -42 -117 -203 -275 -231 -178 -73 42 120 156 215 195 150 65 -53 -162 -199 -201 -217 -175 -91 10 115
6507 115 195 228 194 188 94 29 -87 -171 -247 -225 -125 -71 -6 100 151 204 237 206 108 8 -88 -141 -177 -217 -164 -153 -28 63
6535 63 170 186 207 180 140 36 -54 -148 -211 -227 -183 -93 -32 33 110 194 233 238 167 72 -28 -77 -137 -188 -202 -159 -80 34 135
6564 135 199 208 190 169 93 -18 -106 -183 -228 -191 -158 -111 -23 60 117 211 228 147 102 -13 -106 -177 -204 -219 -200 -142 -16 80 152
6593 152 184 192 194 136 39 -46 -170 -206 -202 -157 -129 -63 46 142 231 256 209 139 40 -6 -93 -156 -205 -229 -162 -60 32 101 189 179
6623 179 200 161 97 -23 -131 -198 -229 -194 -160 -89 -33 103 184 221 221 152 77 -9 -62 -137 -215 -241 -190 -100 0 91 172 205
6651 205 244 232 132 57 -61 -178 -174 -206 -166 -126 -40 40 160 251 254 173 128 61 -53 -134 -193 -239 -210 -148 -61 52 128 177
6679A77L9j4l1q1j28j02n6pJ2M0N5J06R4R2N7ro0r6n6j05n1q2lL1Q9J05Q2O9L6
6708B03L1j6p3r7j42n1m3j4N6L1O8J07J08P5j9l4q0o3j12o6q9l8K4O6J32J10M0
6735A14M5L3K0n8j13p7j27m7mL6K3P9P9J15J01N7n0q2n2j13q5n2q8J2P1J02R5
6762C4J00N6QQJq5j29j07p3m4lP5N8N2J11J10N3J2n2r2q4r4n6p3m1N0Q4J14Q2
6791G5Q4M4K0j8l5r4j12j16o3K3L4M7P4R2R4O5O5l6j00q2j02p1m8n5j9M2J05J44
6819E7O6O3%kj1q0j07j28o8l6N5L2O5P8R6J07O7k8m9j08o9j14k5o3k8L7P9J22
6847HJ37N6K2J0n8l5r0r1j35o2OP4N5Q2P5R0O0M7m4p9r3j32p1l9k3kO8Q4J30J04
6877A54O2K6l1p1o4p6j05j18k3J5J15Q2O6R7M2Q9Jn3j03j34o9p9k6K0lP1J17J07
$$ plain form
6679 177 216 202 171 90 -38 -140 -196 -203 -191 -151 -96 10 104 196 253 244 184 88 32 -73 -124 -206 -209 -178 -89 16 98 167 203
6708 203 234 218 145 48 -94 -145 -188 -202 -146 -115 -47 60 168 243 224 190 110 47 -65 -131 -220 -258 -234 -168 -36 74 114
6735 114 159 192 212 154 41 -36 -163 -210 -214 -178 -155 -76 3 118 219 276 226 144 92 -21 -106 -158 -246 -234 -163 -61 34
6762 34 134 190 198 206 207 122 -7 -114 -187 -231 -234 -159 -101 -49 62 172 225 237 185 93 9 -85 -141 -214 -255 -205 -121 -7 75
6791 75 159 203 223 205 170 76 -36 -152 -215 -192 -158 -111 -37 55 149 214 279 243 143 61 -41 -112 -160 -215 -234 -192 -87 57
6819 57 123 186 186 184 173 93 -14 -142 -210 -246 -191 -159 -94 -16 80 187 254 226 177 69 0 -114 -139 -202 -230 -193 -114 8
6847 8 145 201 223 233 175 140 50 -41 -176 -238 -232 -158 -103 -21 54 144 204 251 207 128 35 -97 -168 -207 -230 -232 -164 -80 50 154
6877 154 216 242 211 140 76 0 -105 -223 -246 -231 -116 -34 32 129 171 260 261 208 105 -29 -98 -177 -203 -183 -186 -115 2 109
6905A09J24Ql0n0p2p3r9j00q0kL1J28J03O8P2L9M9j0r6j20j17q0l9RL1P0Q2R3
6933D8J06Q9Rm0r4o6q8j04o7l1L9O7J05J02R7J6M7j8m8r5j29j06o1j3L3P3N1O4
6961a4J21R8K2J1r9r5j02o5m9l7l0K1J13J09J27N6K9k5l2o2p3j22q8o4L0N5Q4
6988h1J14N8N5J04K4n0j02j09j23m7o0J1J9N5R1J12J23O2j2o6o9p5q7j12q6rL2
7015b28J06R6R6P0L1K9J8o3j00j13r9q5j0N7N3P2J03Q6J08J3j6q7q1q9q4n3n6
7042b26NL7J34R2J06P0Rj9k8p7r4j22j18m9N2O3N5R0J06P7N6J3n3r1j13j04n2
7069a81m9J6J5O6J17J25Q0M3j0l0q7n6r5j02n4l1L8P3J12J07M5P2Pj5m2j01j25
7096f2j07n0OM6N6O1R0Q3R9K7n2q0q0j03m9q0j3nK5J09J12J05O4J9n0Rj08q0p1
$$ plain form
6905 109 233 241 211 161 89 16 -83 -183 -263 -265 -234 -106 -3 65 137 176 225 215 119 -1 -118 -198 -237 -228 -197 -127 -45 48
6933 48 154 243 252 212 118 52 -36 -140 -207 -238 -199 -132 -27 75 172 188 235 217 169 74 -55 -161 -222 -235 -202 -129 -78 -14
6961 -14 107 205 227 238 139 44 -58 -123 -172 -209 -239 -218 -105 4 131 187 216 191 159 97 24 -98 -186 -250 -220 -165 -81
6988 -81 33 91 146 250 274 224 122 13 -110 -157 -217 -206 -187 -132 -41 71 194 256 244 178 109 34 -53 -165 -251 -260 -228
7015 -228 -122 -26 70 140 171 200 218 155 55 -58 -157 -242 -252 -195 -142 -70 33 119 227 240 224 137 56 -33 -117 -170 -226
7042 -226 -221 -184 -50 42 148 218 227 208 180 103 9 -113 -231 -280 -228 -165 -110 -20 86 163 219 232 179 88 -25 -129 -181
7069 -181 -230 -214 -199 -133 -16 109 189 232 222 192 105 49 -46 -148 -202 -233 -195 -122 -10 97 142 214 221 206 164 63 -62
7096 -62 -169 -219 -213 -167 -111 -50 40 123 222 249 197 117 37 -66 -115 -195 -208 -213 -188 -79 33 138 202 221 171 180 72 -8 -79
7125g9j07m3J2Q8R5P3P1O5M7L9o0p7j31j12o0okK9M8R3R8J01O4l0m6p9j04n2j02
7154a67l5m5M5Q1J07J03N1N3j0Lp0p6j13q4o5j2O0O1P8N6R9J03J8or6q8j24n3
7182a26m4ol6R1L2J20J19O3K4m6l8q3p5q2j03n3QN3J26P1Q9N1J1K0Oj07r9j15
7210a29p3j6JO8M3J05N3J01Q6ml3j05j27n8n0m7kJ6L4J09J24R9K5jl2o7o8j34
7238h2l8q1m5M6J02O0J10N7N1J3Kn8r5j02j08l8k4N6K6O2R8J09O5K9pp4p6r7o7
7267a06l6l8k5M7R0J00J28M3J5j1l5o8n2j28j04l4J2O3P7Q6Q7N0M2J4m8k4j27
7294A8j12n0l6l2N2M2O7J03J02O1J5o1n3r4q7p1m0k9JM4J16J22P9L4J7m3l8n3
7322G4q9r4q3j2K1N1J00Q6P0M8L4ol7j04q7j14n9k0M6L2M8R1O3J06O4k6o4q4j01
$$ plain form
7125 -79 -186 -229 -217 -129 -34 39 110 175 222 261 201 124 -7 -119 -179 -185 -187 -158 -110 -17 81 182 246 216 170 91 -13 -65 -167
7154 -167 -202 -247 -202 -121 -14 89 140 193 183 186 116 40 -73 -157 -222 -234 -174 -113 -35 21 120 223 241 235 139 51 -73 -126
7182 -126 -170 -176 -212 -121 -89 31 150 213 237 191 153 70 -5 -87 -190 -243 -235 -182 -56 15 104 155 166 186 192 85 -14 -129
7210 -129 -202 -218 -217 -149 -106 -1 52 153 239 235 202 97 -30 -88 -138 -185 -187 -171 -137 -28 96 195 220 219 187 120 52 -82
7238 -82 -120 -201 -246 -200 -98 -38 72 129 180 193 195 137 42 -60 -168 -206 -230 -174 -148 -86 12 121 186 215 208 134 58 -39 -106
7267 -106 -142 -180 -205 -158 -68 32 160 203 218 207 172 104 52 -76 -180 -214 -202 -139 -62 24 111 161 203 217 169 145 18
7294 18 -94 -144 -180 -212 -160 -118 -51 52 154 215 230 169 116 22 -65 -136 -176 -205 -204 -160 -44 78 157 191 208 165 127 74
7322 74 -15 -109 -192 -204 -183 -132 -32 54 124 172 206 200 163 59 -28 -142 -201 -221 -175 -143 -95 -4 59 165 229 203 139 55 -46
7351d6o9n9m0RL7O4J07Q9Q8M0m1k6o2o4j06o9n0k2N9N6J26O2Q1K2L2j6l3j28j25
7380h4n8o3J9K3O1P8O6R1O8J2nr0p9j08m4n4l8KL9N2J31Q9Q7Nk3n6p4n7r2m8o7
7411b17J3M8Q9J04P1O2J8J1j7p8p7j21q5k8K5M9R0O5N8N8N7K0j9p9j24r1n6j3
7439a67mlN9P6P1J16O6pn5p5q5p0q4l5k9J7O9R3R9J00M1k5Ln7l4r5j20m6k5L7
7469a69O7O3Q6Q8O0MJ8m7q4j02j07m7k8K4L5O9Q3P8P2M5jl4j20p4r0m4k6j3L2
7498a62N5J14P8P7L9j9m2m6o7r8o9n6j0K9Q0J18Q9N1M4rj6k6r1r4j10n2j5N9N9
7527i0Q2O4P2M0L7Mp7r5r7p8m9k5J9N4O6J00O7R1K5j3q3r6n6n0o4n2NK8Q4J18
7557C1R5N9L2j1o3l9r2q1o7p8pN1Q9Q6J01N1M7Ll7m9q3j03j06l1j8N4M4Q6R2P2
$$ plain form
7351 -46 -115 -174 -214 -205 -168 -104 3 92 180 220 179 153 91 27 -79 -148 -198 -220 -161 -105 21 83 164 186 218 202 169 41 -84
7380 -84 -142 -205 -186 -163 -102 -24 42 133 201 213 208 118 39 -69 -113 -167 -205 -203 -164 -112 19 108 195 200 177 121 47 -10 -102 -150 -217
7411 -217 -204 -156 -67 37 108 170 188 199 182 104 27 -94 -179 -207 -182 -133 -43 22 80 138 195 215 196 117 -7 -98 -154 -167
7439 -167 -171 -174 -115 -39 32 148 214 207 152 77 -8 -78 -162 -197 -226 -209 -140 -47 52 152 193 168 171 114 80 -15 -135 -181 -206 -169
7469 -169 -102 -39 47 135 195 199 217 170 86 -16 -123 -170 -198 -174 -139 -70 13 91 163 208 207 173 53 -21 -111 -155 -181 -194 -162
7498 -162 -107 7 85 162 201 182 140 94 27 -71 -140 -196 -206 -177 -97 21 110 161 205 196 180 154 63 -31 -141 -193 -208 -149 -90
7527 -90 -8 56 128 168 205 209 132 37 -60 -138 -187 -212 -193 -139 -73 27 94 185 210 197 114 18 -38 -88 -152 -204 -199 -171 -87 31
7557 31 126 185 217 206 143 104 12 -69 -136 -214 -221 -170 -81 5 106 157 204 207 170 121 38 -65 -171 -202 -220 -166 -122 -36 56 128
7587A28N2J7l0n2j25p1r1j7l0L2M6Q1J06Q4O3J1nn9j00r7k7p7j8JK8J22R0O5P9
7616B06J2m6l6o0n8j11q2m4QM9J10R4P8M8L1j9l6n6r3j23l6n5J4K9R2O3J00P1
7644A50N5J2l9p5r1j02q3l3RL7M9Q4N0J29O6J9k7r4r8p4o8k7j6k9O5R1J03J13
7672A76J6K8j6r3p5p4q7l5o9L0N3P7J01R0N7J1j4m9n6j03q0p6n5J7Q3O6J09O6
7700I8N6L6J8l0q2r3j10o3l4QM7P1P0R8P3P1J5n0j00q8j02n4n4J6K0N1O1J05J05
7729A59L4J6n0q1p8p4n6q6j7O0K3J19J03O6N9Jk9l5r4p2p2r2pj5Q5J05R4O6O3
7758A95K6ln1q5p3j20p5k8QP4O7Q7O2R5J8J3k5j11r9j13o9k0mO6N7O1J09R6M4
7787B02Rm9n7j10j12k6o7NN0L4R5R5P4N4K5l1j01o4q0q0m4k8pQ0R8Q1Q7O0qk8
$$ plain form
7587 128 180 197 167 115 -10 -81 -172 -189 -219 -187 -141 -60 46 130 193 204 199 140 40 -57 -84 -161 -179 -178 -150 -28 62 127 206
7616 206 218 172 136 76 18 -93 -175 -219 -211 -162 -52 42 120 168 199 180 144 88 -5 -128 -164 -219 -205 -176 -84 -21 79 150
7644 150 205 217 178 103 12 -90 -173 -206 -197 -160 -111 -27 23 152 218 237 210 116 18 -56 -124 -151 -167 -196 -131 -40 63 176
7672 176 192 220 204 111 36 -38 -125 -160 -229 -199 -146 -69 32 122 179 190 176 127 71 -32 -112 -188 -243 -226 -143 -77 32 98
7700 98 154 190 208 178 96 3 -107 -170 -204 -196 -149 -78 -8 90 163 234 249 199 99 11 -91 -145 -199 -183 -163 -112 -51 54 159
7729 159 193 209 159 78 0 -74 -130 -216 -233 -173 -150 -31 72 138 197 198 169 134 40 -32 -104 -196 -203 -218 -133 -28 66 132 195
7758 195 221 218 167 82 9 -111 -186 -214 -206 -132 -65 22 84 179 197 210 185 74 -25 -138 -207 -227 -231 -165 -108 -47 62 158 202
7787 202 211 162 105 -5 -117 -143 -210 -205 -155 -121 -26 69 143 197 222 191 90 26 -54 -134 -178 -206 -213 -133 -35 46 133 193 185 157
7817A57m9n7q0r3q7k1J5Q2P5P0R3N7J8l0m1o4q7j04n3j4QM9Q4Q7P6N7N6j7k3o4
7847A00q2j28o5m4K7O2Q9P1O6L8Q7K2o7n4j26q4o9l3MJ2N9P9Q9J12N8k2j5r6p9
7876A1r7m1q1J9J8M8N6J22P0M7J8k6o9p8o7p2n7k9J2M1R9J20O5O9K1l9l8o8q0
7905fp4j02k6K2M6O3J03R3M0PPm1l0r3r8r9rqL3R5P4P0O3J7N1l0p0j09q7p2j9
7936a89%M4N8P3Q0O4O3J4k0n9j21p2p4l7QJ7L9P1J00P6M6M7l2r8n6r8p5k8l3K6
7966a66J0O2J13O9P8J8qq3p4p4q0n0k2K2J3O2R9J05P0O3o1l2p5p0o0p7m3k8O6
7995a53N5J03R6N4K2J1k8p2p6p9q9m8j1M7N0J23Q4O6J4j1k3l9l9j24o7o9j5M3
8023a75P4Q3Q5M5L5J9J4n9q0r1p4p5LK2N3Q8P7R2L6M1j9k4j07o7j15n0k6K2L9
$$ plain form
7817 157 108 51 -29 -122 -209 -230 -215 -133 -58 12 105 162 180 150 109 45 -42 -146 -199 -213 -205 -156 -72 15 91 148 204 187 164 100
7847 100 18 -110 -175 -219 -192 -130 -41 30 96 134 221 243 176 122 -4 -88 -157 -190 -186 -174 -115 -36 53 165 223 201 186 90 11
7876 11 -86 -127 -208 -189 -171 -123 -67 55 125 172 190 164 95 17 -50 -122 -179 -208 -196 -155 -56 64 129 198 219 180 142 74 -6
7905 -6 -80 -182 -208 -186 -140 -77 26 119 159 166 173 132 102 9 -89 -188 -197 -205 -172 -77 -3 67 130 147 198 168 98 -11 -98 -170 -189
7936 -189 -189 -145 -87 -14 66 130 193 207 187 128 7 -65 -139 -176 -168 -151 -112 -41 59 135 181 228 196 98 42 -56 -131 -159 -192 -166
7966 -166 -156 -94 19 88 166 184 176 93 19 -55 -135 -185 -207 -185 -172 -110 -11 94 164 227 166 134 59 -11 -71 -148 -191 -219 -153
7995 -153 -98 5 101 155 177 188 160 88 12 -67 -156 -204 -215 -168 -118 5 89 155 169 158 135 96 57 -67 -134 -203 -218 -175
8023 -175 -101 -18 67 112 147 166 180 121 41 -50 -124 -199 -196 -174 -121 -33 44 136 172 213 194 170 63 -4 -119 -169 -195 -173 -134
8052a34P3O0Q5O8K5J7j5j16o1j34n0pK1J0O8M6R8R2L8Ql4r7r1p3l3m4j5L4L7O5
8082e9J06R5M2Qm9n0n8q4q4k8mJ2L0Q6P7J14L4J7l0o4p0q0p2m1n0J8N8M6J02R4
8112A16N0Kj1n9m5p0p6o2m4j1N1R4N4R7N4L4jm3k1q0p5r4l7mK3P4Q4R5M9J7K6
8143A87l6k9q4j10p1n5J8J8P2R1P3M7M6oJ7o3r0o7j18m7J1L0N5P6Q6N6L9L9m0
8172A45j8r9n3q5p3k9M0O6O7M9R0N1K3J2j1r0q4q9n4m1J4N8M4N0Q5N9M4Moq6r3
8203a0r7n0l8L2J5M1R4O1P6M4L0m1q8p4r1p6k4J5K5N3M6Q4P7O3J8k8m2j04p8n1
8233a18l9JJL5N3J06O9O1L7m6k4j06o4r6qm0KK9M2J11J04P3Omp0q0o3o7m4l4J
8264a72JO2J01R0O8M4k9n4o4n4o1o6m2m3L4Q3Q4J14P6K1jn6m2p8n6q9l8l7K9M7
$$ plain form
8052 -134 -61 -1 84 152 177 194 179 63 2 -132 -182 -189 -168 -158 -90 -44 54 146 184 192 158 61 -30 -103 -136 -180 -195 -161 -124 -59
8082 -59 47 142 184 192 143 93 35 -49 -133 -161 -165 -153 -123 -37 40 154 188 205 175 111 41 -39 -111 -152 -202 -184 -126 -80 22 116
8112 116 166 168 157 98 53 -17 -93 -155 -199 -210 -159 -65 -11 86 140 174 173 130 109 29 -46 -140 -177 -181 -158 -84 0 95 144 161 187
8143 187 151 122 38 -72 -143 -198 -180 -162 -90 1 74 121 167 161 178 115 25 -42 -160 -207 -196 -166 -111 -35 51 107 146 185 145
8172 145 127 28 -25 -110 -183 -212 -172 -106 -39 10 100 151 174 186 175 85 1 -88 -142 -183 -169 -111 -67 -17 68 127 171 175 169 83 -10
8203 -10 -107 -157 -195 -163 -148 -107 -13 48 124 168 198 157 69 -5 -96 -172 -196 -181 -156 -103 -57 27 104 167 185 157 115 11 -67 -118
8233 -118 -157 -156 -155 -120 -67 39 108 169 206 160 136 30 -34 -130 -138 -178 -176 -147 -105 6 110 183 189 185 115 35 -28 -95 -139 -173 -172
8264 -172 -171 -109 -8 82 150 194 165 111 47 -7 -68 -134 -176 -219 -185 -102 -18 96 172 193 192 136 94 16 -40 -129 -167 -204 -175 -128
8294a28J03J12L3O6j4k0o3p2p7p9l1m2K2K8J01Q6Q1K9L1j0m7p4o6p6o0k1k1N7
8322a52R3P8J00L1L5l6j8o8n0o5q8m9mO4P0Q5O0Q4MLm2k7j13n1r4n3JM4P3P1J00
8353H6M0M9k3km5r6p1p8p2k9O1N8R5R9N0K6J2ql9n2j07p7n8lj1Q7Q6J04P4K7M
8384A87rl7o1r7p2j05l6K9M6J11Q5N7L7L1pk3m5r6j00q5n1K7O3Q3Q7Q3RK8J9o
8414A52p9o0j37o6l4L9L9M5J24N4O4K7QNm0j00j10p7n7j2N5P4P0Q8N1M6Jom1r7
8444B6q0j10q1K5K6O6Q7Q6N0N9J1j0j8p9q9j23m6l9M6P9R0L9Q6O3RMn1m7j01q7
8474a09o0n1L6O4P4Q9N4N8L3J1m6n4j07q1r0k5kN6N9J15L5N5N3J8k1p5q5r6j00
8503a92m6J3M2Q1J04O6L5O8K4l2l9r9p3j09m2J4L3O4Q1P2O0K8N0qm6o4j08r8q1
$$ plain form
8294 -128 -25 87 120 186 172 152 89 17 -60 -139 -170 -212 -190 -162 -61 25 106 135 166 156 109 35 -31 -107 -167 -188 -209 -152
8322 -152 -59 19 119 150 185 149 131 63 13 -52 -140 -189 -193 -129 -59 26 86 170 174 177 135 108 -5 -56 -150 -203 -202 -158 -85 -14 86
8353 86 126 175 152 150 105 9 -62 -140 -212 -241 -180 -122 -27 72 122 148 160 152 113 61 -46 -123 -181 -184 -195 -108 -22 82 156 183 187
8384 187 178 141 80 -17 -89 -194 -230 -201 -155 -44 41 98 135 166 159 136 91 -5 -105 -190 -241 -214 -151 -68 19 102 111 139 158 152
8414 152 73 13 -124 -190 -224 -185 -146 -101 23 77 141 168 176 181 141 41 -69 -146 -203 -215 -160 -86 -16 72 123 169 170 164 123 26
8444 26 -54 -164 -245 -220 -194 -128 -41 45 95 154 165 155 137 58 -31 -154 -200 -239 -193 -114 -24 15 101 164 173 177 126 79 -22 -109
8474 -109 -169 -220 -184 -120 -46 43 97 155 188 199 153 99 -8 -89 -179 -204 -206 -150 -91 24 59 114 167 185 164 89 4 -92 -192
8503 -192 -238 -225 -183 -102 2 68 103 171 195 163 124 25 -48 -157 -199 -185 -152 -88 -7 65 125 153 203 195 149 85 -23 -121 -202
8532b02j0L8Q0Q4O5P0N6kj3j5j00p7q7q6k0lO4Q8P8O3O9K8Km5n9o7q7j01m5L5
8562a99M0J00P2J02M8K0K3m9m3q9q3j04l2j8N9P2R8N5R8%J3j1n2r4p1j00n2l1
8590b28M5O7P1J19O4L0K1l9p2m9o9p7r3oK0O3Q8J03N8P3l1Om3n4q0p1r0l5J9O9
8620a21J02Q8P5L4L3l0k0p0j10n8p4m0j3M7P8J16Q6N2Rk4m9n1o6p2q6l6l3N4P2
8649a07J03J06N5J6J9o4n0p9p4o2m8lJ8P6R2J09O3M9n3j5n4n4q0p0n1k0J6L4J06
8678b2Q1R8L0K3k4q3n9r2o1o5j5ML0P4Q3R6R7J3j9p6o9p4q3n0k5K0J8Q0P9Q2R1
8709A82L4j4q2l6r3p0o7k1kK0N7Q6P6Q4M3J2l9j21o4r6m8k3LNO7O4R2P9N7j7l4
8740A34n6q3j07n1l2LL2N0N8O0J01M4K6j0q2n1p8r5k0j3K8M3P7K9J09O1K5Ko5
$$ plain form
8532 -202 -212 -174 -94 -10 55 125 181 179 166 151 51 -26 -113 -199 -219 -222 -158 -70 8 71 140 168 170 125 66 -1 -88 -189 -234 -199
8562 -199 -159 -59 13 115 163 183 206 157 114 25 -58 -162 -194 -212 -153 -81 17 72 170 170 183 172 120 26 -45 -145 -197 -228
8590 -228 -183 -116 -45 74 138 168 189 150 78 29 -40 -117 -210 -216 -196 -133 -45 58 116 189 158 164 121 67 -13 -84 -174 -209 -190 -121
8620 -121 -19 69 144 178 211 181 161 91 -19 -77 -151 -191 -204 -157 -79 37 123 175 184 160 111 60 -6 -78 -164 -200 -233 -179 -107
8649 -107 -4 102 157 173 192 128 78 -1 -75 -137 -185 -188 -170 -94 -2 107 170 219 166 151 97 43 -37 -107 -158 -178 -162 -128 -22
8678 -22 59 157 187 210 186 103 44 -48 -109 -174 -189 -185 -155 -81 2 98 195 208 189 113 44 -30 -113 -163 -188 -168 -150 -70 9 91 182
8709 182 216 202 120 84 -9 -79 -146 -167 -169 -149 -92 -6 70 154 197 209 170 49 -15 -111 -159 -182 -179 -174 -107 -43 49 128 185 168 134
8740 134 78 -5 -112 -163 -195 -192 -160 -110 -52 8 109 153 179 169 87 36 -42 -137 -157 -170 -142 -99 -22 7 116 177 202 204 139
8769A39o7j06q7m7m0L3N9N9Q3M0P5K2nk7m3j08r9n6j5PM3P8Q0N3N4K9K6l1o8q4
8799co7j04k2J5RJ05Q1O1O9L1j7k7j0m5j04p9p5pM8O2O3Q7O4M3Ol0o2o1m8q7n6
8830a60m6J1O9O8R0P9M6J1k5n6m3m9q6p2l1J4O4M5R9Q0O0J5j0m4r2n3n9o2l2j4
8860a83L3N8R8O8Q1L2j2m6o8q2o3o0k8J4PO2N2P9P9M1K3n4o0q0q6m6m8K3PN4N1
8891e4Q1N6O3K4j8m3q2q7p6l7oM4L4R6K0Q6O2qK1o4o4o2r7n2j3J8M5O7P7M7N0
8922A28K4%j6n3o9j14o4m5lQ5M3P4P0M3M9k5j6o5k4o9q6m7MK6Q7N4Q9P2PJl9k4
8954I7q0m0q6k9m3J4N4P9P7Q6M8pm9k7p2o0n8n1j9qL9O1J03P6L6K6j2p1n5n0r6
8985a17k8k6L2NL9R8P3O3L4k9k9p3o8p7k8j8J1K3L0O6R5L5L3L1l1m8p4p2q9l4
$$ plain form
8769 139 72 -34 -121 -168 -208 -175 -116 -57 26 66 141 163 158 131 88 -20 -119 -175 -190 -183 -140 -62 18 71 125 154 180 149 81 -3
8799 -3 -70 -174 -196 -181 -172 -67 14 75 144 175 158 131 121 76 -28 -107 -182 -189 -141 -79 -16 71 135 178 184 154 92 31 -17 -104 -160
8830 -160 -206 -195 -126 -58 32 111 157 168 143 87 44 -5 -91 -163 -194 -180 -116 -71 28 108 168 183 173 129 37 -16 -75 -137 -169 -183
8860 -183 -150 -92 6 74 155 187 175 129 61 -21 -84 -144 -172 -158 -151 -89 -37 42 121 162 185 131 71 -9 -95 -141 -189 -166 -159 -105 -54
8891 -54 27 83 146 170 152 109 27 -60 -136 -173 -179 -135 -101 -5 15 101 163 155 176 112 48 -14 -111 -163 -176 -158 -113 -46 31 78 128
8922 128 152 152 136 83 14 -100 -164 -209 -212 -127 -84 -10 60 103 152 127 111 46 22 -47 -133 -180 -176 -150 -63 -9 80 152 159 160 121 97
8954 97 17 -23 -109 -138 -181 -167 -113 -34 43 129 177 170 121 94 22 -38 -96 -147 -166 -174 -135 -74 29 105 141 167 155 84 29 -21 -117
8985 -117 -145 -171 -139 -134 -95 3 76 139 173 144 115 42 -26 -103 -131 -149 -138 -115 -85 -19 76 111 144 175 144 96 22 -50 -139 -173
9015a73K6J5P1K2N8O6L2K9j8n2n1p0r4j1n2L6P9N5O2N0L3K0j1l3n3n1p5n1m3K4
9045a60N1O7P5P4J1J4l0k8k7n5n5n6m2j9N2N5P2Q8K1M0%n0m3p1p1j8n0j8K1M2
9075a10O9P2L6Q9j5k8m8p5p7m7Rl2J5N2N5P4N3N3K2mm7p5p0o9l1rK2J8Q7K4M6
9106E9M3N2jl4n9o5p1p4j9J4N2O1P4L0N3jjk0l1p0o7n3k7j2L6O5L7Q1M2K4J0m4
9138H4k5l1o6p5k0j0J6N6L9P5P0N2ol3l2r9m6k4m3l8J7K7N8Q2O2L8K6k7k5p9p1
9169d8n4l8nJ8L2M0N9O4M6K3Pn0k9p7o3n7l0M1K9L3P0P5L5J2Mj6l9o1m7n5o3q
9201a52K1O2N6P1Q2mJ2n0j1p0n7o3k1m5J7O5O9N2O6J1L1l8l5o0p1j7l5k9L2OM9
9232e6P8M4P9L2j2p1m2q5m3o2K9K9RL5M1M5N6M1J9m5l3q8n2r1pJ2L0P8L6Q0K9
$$ plain form
9015 -173 -147 -132 -61 -39 19 85 117 146 128 76 25 -45 -139 -150 -202 -166 -87 -32 30 80 113 133 122 89 36 -15 -90 -141 -184 -160
9045 -160 -109 -42 33 107 118 132 102 74 47 -8 -63 -119 -161 -180 -128 -73 -1 87 108 148 148 98 55 -16 -87 -105 -155 -173 -152 -110
9075 -110 -41 31 67 156 141 113 65 -10 -87 -134 -125 -157 -142 -90 -35 39 92 145 167 163 116 41 -29 -98 -129 -138 -116 -98 -11 13 59
9106 59 102 154 153 119 60 -5 -76 -150 -169 -155 -103 -42 32 62 115 114 113 93 62 -8 -75 -128 -155 -167 -131 -66 -29 52 94 118 128 84
9138 84 59 28 -38 -113 -133 -143 -127 -71 -32 43 113 165 159 126 94 -5 -51 -75 -118 -156 -139 -112 -54 28 90 128 154 127 102 23 -48
9169 -48 -102 -140 -145 -127 -95 -55 4 68 114 137 144 94 65 -12 -75 -132 -162 -121 -92 -59 11 86 121 133 137 121 82 21 -26 -81 -144 -152
9201 -152 -131 -69 -13 58 140 136 148 98 87 17 -40 -103 -124 -169 -152 -87 -18 34 100 111 142 104 69 9 -62 -79 -114 -143 -111 -105 -56
9232 -56 22 66 145 177 165 94 52 -33 -76 -138 -109 -80 -71 -36 5 50 106 147 166 121 88 0 -52 -143 -150 -138 -108 -30 6 86 115
9263A15K1j8ln1n0o0p9m8J1K6K8J00P8M2JM5k3n5n8m6o1j6l2K3J8N9N8Q4K6L8
9293A73l9k3p0o8n1n9NK8J2L6N6O4O0J6jk6o0q0p1k9k6K9J2O5O8K8M8J2k4K5k5
9324H5q5p2m9k6lL4N2O8O9K4N9k1l6j8n5l8o9l7J4k2M1O6P0N3N3Lm6m2o5n7m1
9355i1l6j2M3J6L1O3N1N2M2k1l5n0p8q0k6j0J4N1M9L4O2M5%M5n5m7n8n1l9k7j0
9386a28M3M2N9N6N1J2jj8m6m6o5n2qk6L5K2N2P8K5N1Nl8l6o9n4l7k8j8L4K1N7
9417b7M9N6P8l0Jk4o1o0n2m4Kj0O7N3M6L7M0M7l8l9l5n0p9n1j3QO2M3P3K7N1J3
9449A40%m9m6o0m8k6j5oK0J8O1P8K9M6j4m7l0o1m5o9qjRM6O7N6M0M1RJn0n4n2
9482b0o3o2%L2O8N4L4N3J6Kj0l9j1q1l8n2j8OJ4Q6M6Q1PJ4k2k9o5l6o4ml0L0J8
$$ plain form
9263 115 136 118 115 64 14 -46 -125 -173 -162 -136 -108 -8 70 112 113 158 135 80 22 -24 -85 -101 -133 -110 -92 -33 25 109 135 173
9293 173 134 111 41 -27 -78 -137 -132 -104 -92 -56 0 64 124 140 139 113 53 -27 -98 -127 -153 -124 -112 -47 21 49 97 109 85 110 85
9324 85 0 -72 -121 -147 -150 -116 -64 4 73 97 156 135 99 81 26 -12 -81 -118 -104 -126 -85 -19 51 104 157 160 114 72 7 -50 -91
9355 -91 -127 -139 -96 -80 -49 14 65 117 159 138 103 53 -25 -105 -131 -141 -127 -76 -27 7 69 114 114 159 104 57 -1 -52 -91 -118 -128
9386 -128 -85 -43 16 72 123 135 134 116 70 24 -41 -93 -101 -127 -92 -70 -18 60 85 136 141 103 67 -2 -56 -93 -121 -139 -105 -84 -27
9417 -27 22 78 156 126 127 103 42 -18 -70 -114 -112 -122 -55 -2 44 81 121 168 130 91 56 6 -73 -124 -137 -129 -67 -24 49 76 127 140
9449 140 140 91 45 -15 -63 -89 -104 -110 -90 -72 -11 67 96 142 128 81 51 -10 -55 -124 -132 -133 -124 -78 -11 45 85 126 135 136 86 32 -20
9482 -20 -83 -145 -145 -113 -45 9 43 96 112 114 104 65 54 -27 -65 -117 -135 -129 -115 -29 17 98 105 119 97 68 3 -33 -97 -101 -131 -101 -83
9515h3L7M2N4M7L1j4k3m0p6m2m3j9K2J6N4Q2J4K7N3j7k6j8k8n3n6p5J2J2L7Q7
9545A4N0M7kqj5m1n0j0p1m5MJ0K7O4N1O3K4j1J7m0p3n0l1m9K0oO3L9N3L0J1L8
9577A23j5on8o2l6m8k3J3M3M2O6N2K9jk4j4n9k7o1l8j3kK3M8K6O5L5N5l4j6n9
9608B4o2No2j1j1M1L2M4M7K7K8K4j6k4p9m3l9j2j3OM4O1M7L4J3J8m0qo8l8k1n0
9640a02LJ7j1N7O6M8K1%Qn9n3m9m2j3k0PM8L2M8K5N7L1kj8o9k1o2n0jQK3L3O8
9673B8L7K9L4rk3o3l8j7o1j6MlL0M7O2N8M0k2k0n0l9p4k2k4j5K7L4L5M1M6N1j7
9705I0J0j7m7o2m1m9J4j2M1O9N8K9J4Pk2Jn7k8l8l3%j9L5J1Q1N2j7M9ol5o2m4
9737b8l7m3jj9N8L0L3M2K8J8lj4j3o9k0m3n9K3%M9O6N2J5N6nm5j9l9m8l5Nk0J6
$$ plain form
9515 -83 -46 -4 50 97 128 114 91 51 -25 -67 -110 -129 -107 -91 -37 45 59 86 139 122 96 78 50 -3 -59 -134 -122 -110 -73 14
9545 14 64 111 109 101 86 45 -5 -15 -86 -131 -127 -117 -90 -26 25 88 112 101 118 78 5 -45 -76 -125 -105 -111 -48 -9 44 74 85 123
9577 123 108 102 44 -18 -54 -102 -125 -112 -69 -27 39 91 120 119 95 81 22 -5 -66 -104 -117 -119 -96 -48 -22 43 78 133 99 83 24
9608 24 -38 -33 -95 -106 -117 -76 -44 0 47 74 102 126 110 86 7 -36 -75 -87 -100 -94 -50 11 58 92 105 123 83 75 7 -31 -52 -102
9640 -102 -99 -82 -93 -36 30 78 99 99 107 48 -5 -54 -96 -109 -129 -122 -74 -42 6 31 88 119 117 99 30 9 -53 -103 -104 -96 -73 -40 28
9673 28 65 94 128 119 96 33 -5 -22 -83 -99 -95 -98 -68 -21 41 99 139 117 97 47 8 -66 -88 -112 -127 -100 -66 -31 10 56 107 90
9705 90 100 83 36 -26 -67 -116 -102 -114 -73 -4 54 83 97 104 82 83 26 -2 -40 -73 -73 -92 -57 -46 35 87 70 119 113 78 16 -28
9737 -28 -65 -108 -109 -128 -70 -40 -7 35 63 81 78 64 51 -18 -38 -81 -140 -117 -117 -68 -2 50 65 121 116 71 52 13 -35 -70 -65 -85 -69
9770f9L3M3LO7L6J0Jk9o7n4m6m1QK3K8N5K6L5J9K7l5l8kp1j9n4k7J6K2O5L6O4
9802F5L8j0J0m0k1n0k8m6JnL5OM9N3K9M2j5k3m1k4o5l3l4J8RM3M6M0K0M1j8k3
9834F9l7l5m0m2l5KL6J5PO7M6L4k2kj7n1n7l5l0J3M7qL8N6K0M3L9k7j6n7k8k8
9866c5l6k2J8qN3L8L5Q0jj3m4l0n8l5j1k6j0J7L0L9K5O2K3mll8q0o4Pl3J9J0N2
9899d3N3J9L8RRl6Ln1l6l3k6l2K6J7Q2M9L1L1nj1k3n9k5n0k5k3NP8J5L5N2K7L
9932A04nk6l7o7m9k1k7K1K4N2O3M2L7J2rm1n4l9n4k2j9J1L5M0K7O0M9qRj0n3n6
9964a1l1p2rJ0K4M4L8N7M7J3k3J4o9l5m8m3j9k5K5K9M9O3M9J2K8k4k5o8n4n4k5
9995a33J4RM1O8J6M6K3L6k8k8l6l1q3lj2j0N9K9N4N2M8J2j9n6m1m6o6k4lJ4J7
$$ plain form
9770 -69 -36 7 10 77 113 123 124 95 28 -26 -72 -113 -105 -82 -54 1 27 62 81 108 73 35 33 -38 -57 -111 -138 -122 -100 -35 1 65
9802 65 103 93 103 63 42 -8 -36 -82 -81 -86 -51 -45 4 57 86 128 113 90 49 25 -40 -73 -107 -89 -80 -37 9 49 69 110 92 69
9834 69 32 -3 -43 -85 -120 -118 -82 -67 -60 7 53 87 65 63 46 -5 -62 -97 -127 -114 -67 -75 -37 19 39 82 121 94 78 21 -7 -35
9866 -35 -71 -93 -75 -83 -30 8 43 123 122 109 65 35 -23 -58 -69 -95 -105 -88 -58 -19 6 68 91 87 84 46 -34 -98 -91 -124 -105 -95 -43
9899 -43 10 29 67 76 85 49 52 1 -35 -68 -94 -126 -100 -83 -1 48 79 110 105 94 71 12 -13 -63 -88 -111 -106 -28 -13 22 74 101 104
9932 104 99 73 36 -31 -80 -101 -128 -107 -83 -31 32 74 111 123 114 73 19 -20 -74 -96 -115 -104 -69 -29 -2 58 107 99 108 98 45 -11
9964 -11 -42 -114 -123 -113 -89 -45 -7 50 97 110 87 101 32 -3 -51 -94 -113 -138 -113 -84 -35 28 77 89 117 93 68 0 -54 -108 -133
9995 -133 -119 -110 -69 -1 15 61 84 120 92 64 28 -3 -86 -89 -101 -111 -52 -23 31 83 131 143 124 68 27 -19 -85 -109 -112 -98 -81
10026h1N8L3M1K5M9l8rk3q4k8n5m8L3L8J8P6N7J9J0K7l9l4o1m4k6k1j2N4pR3J6
10057C7L6N4lrm9k9q7l7l7j0KO6O0M5M9K3Qj6p1qq7m2Jj1mK9K9O1M7J4N2J0n1
10090G2m3o2o6j9k0KN8O6N5K4N0J2k5k7n1o0l1l7j0pK5N9L8P1N1Qk4k3m4p3n4
10121h5l9k8NL8N0K9N6O3k1J4j7m2k3o9n0k4j9M8J2O4R6J9K8J9k0m6m5p2m3j0
10151a12j6L3L6N5M3M5L1pj8po0m3o6n3QnL7P3N9N2L7KKn0n4p6m7k3l4L6M5OQ1
10184A0N3L9j0J0j1m6n8m7l4l0j0K9P7L9O2M2rM7o9k1q6m3l7Nk3L9L4N2M0L5J6
10215I5jMl2p0m4m2m0rj4R3J7Q0O5L0nj5o2o9m2m6mkJ8K4P9L2L0N9k0J0j9n8p0
10248b8n2l7Pj6K3M3J07M6M4Lpn7m2o1p4j4k8K6K6K7P3L7K7N9ol7n3n8m2o5pp
$$ plain form
10026 -81 -23 10 51 76 125 87 78 55 -29 -57 -112 -160 -127 -89 -71 5 62 81 91 118 79 45 -16 -60 -86 -107 -119 -65 -72 21 37
10057 37 73 127 124 115 66 37 -50 -87 -124 -134 -132 -66 -6 39 88 111 119 103 32 24 -63 -105 -104 -115 -119 -90 -61 0 47 61 113 123 72
10090 72 29 -33 -99 -118 -138 -136 -78 -12 43 67 117 129 104 77 26 -34 -65 -102 -112 -119 -94 -35 3 74 125 133 109 86 42 -31 -85
10121 -85 -124 -152 -147 -109 -59 -30 26 89 68 82 65 23 0 -69 -119 -143 -162 -114 -102 -38 58 77 105 124 104 58 13 -59 -102 -112
10151 -112 -128 -95 -59 -4 39 84 115 108 90 83 23 -20 -86 -139 -131 -136 -99 -26 33 85 122 124 126 76 22 -54 -101 -124 -158 -122 -77 -71 10
10184 10 63 102 92 102 91 45 -13 -60 -94 -124 -134 -105 -28 11 73 115 106 153 84 63 -23 -66 -103 -98 -121 -82 -48 4 44 79 95
10215 95 94 98 66 -4 -48 -90 -130 -139 -153 -60 -43 37 102 132 127 112 50 -19 -61 -107 -111 -113 -95 -71 8 40 70 129 109 119 100 42 -28
10248 -28 -80 -117 -110 -126 -103 -60 47 93 137 140 133 76 34 -27 -101 -115 -143 -117 -91 -64 9 46 73 132 126 89 36 -22 -64 -129 -136 -143
10280a43M1N0N1R1K8K1l2k8n1n1n6k7k3%K4M9M5P0N4J5nk3k3n7n9m3n1k2QO4O3
10311b0P6N4K2j5Mo9o4n6m5k2J2MK3P1N1M2L6K3k2j3o6m7l6o4JJ0L2M3N6Q7M5
10342A53Rj0m6q7n2m5m5j9L4OO6N4M4M3Qjj7m5m8p0m5ol2J5N4O1Q3L6L8j6m4k7
10374D9o4q1l7l3oN2M9P3M5M8M3l4jm0m7n5m5k7%QJ7K9Q6N6M6Pl2l1n8o5n8pk6
10407a39kO3M3P0K8L8Rj7m5k4o8l2l5l4L2j5Q7M2N3N0K5j1ko6n5p7l4k7J5L2L8
10438e8P1M9N9L2l6k4k8o8o9l9j2kL6K1Q5PN7M3ok6l6n5m0p0m6oK5L7O4Q4L4L5
10470A18Lk8m8o1m0o4j9K7j7M8L8O8M9L6JRm4l0o1o0l7JQK9L5M2N1N5K3oo3m3
10502B0n3l9n2j9J2N2L7N7M4M1%j8j1l4o4j8n9k5%J4M7L3O8O6KML2o1q3m1o2k5
$$ plain form
10280 -143 -102 -52 -1 90 118 139 107 79 28 -23 -79 -106 -129 -129 -105 -56 -11 59 113 128 123 100 77 20 -39 -82 -133 -155 -147 -83 -20
10311 -20 56 110 132 117 121 52 -12 -68 -113 -135 -123 -119 -96 -25 26 68 104 127 105 92 26 -21 -57 -121 -120 -110 -78 -35 21 108 153
10342 153 162 152 106 19 -33 -78 -123 -142 -108 -102 -36 18 62 105 113 112 95 50 2 -68 -113 -119 -151 -136 -82 -21 62 98 136 120 76 49
10374 49 -15 -96 -133 -166 -172 -120 -71 2 47 95 138 104 103 63 16 -39 -84 -111 -111 -103 -86 -57 29 85 131 138 106 75 17 -48 -106 -113 -139
10407 -139 -141 -78 -35 35 63 101 110 93 48 24 -44 -76 -111 -145 -113 -128 -41 1 54 104 129 118 116 50 -5 -82 -116 -143 -128 -96 -58
10438 -58 13 62 121 153 117 93 65 -3 -72 -111 -123 -125 -89 -68 17 24 81 124 118 92 56 1 -39 -109 -155 -161 -136 -99 -35 49 83 118
10470 118 121 93 45 -16 -56 -120 -139 -112 -129 -81 -43 25 74 110 111 120 76 46 -15 -75 -112 -111 -103 -74 -39 3 54 109 132 126 63 20
10502 20 -33 -72 -124 -143 -131 -79 -42 15 59 100 100 82 71 37 -27 -45 -104 -129 -129 -115 -68 -35 33 99 101 105 137 76 -7 -48 -110 -135
10534a35qL8O3L2O9N6MRm1n3m3m4k4j9l7RP6K0N5L8L0Nmm7l0o0o6k0j3mK9P2O4
10567B1L8L5L8k9k9o0p0p0Pj4NM3O2L2P2J5KK1j3m7p0k7n2k5j0K6M7N7N4K4K7
10598A10K6m7n3n8l5m3l8%L6L4P0L5M5K1K0l4m5n8l7l5l6LL3J2N0N3K9M1J1l1
10628G9nm6n6n0j7l3K0mP7O9N3M0J6m5j8o8n0n2l3l8M7K5M2O1RO5j0J6l8k4k4
10659Hn6n6ojJ5J6P0N5M2J1K8l1l8l7r3l3qJL7J0N7P4K5K7nk1m8n2l7m4j1l7L1
10692a07O5J5M8O1lJ9k0jp8l5n1j4k3QJ9N7N1M9M9nJ2n7n0n4l6l9J8j4M1N0L2
10723GN2K2PJ8l5n3k3k9n5k5PM4L0L1K6N7L2k5mm1n1n8l5l1KK0N7P5J5K6K3J6
10755A02l0j7p9m3m5k3K9k6O7O7L2L1K8ppj8n8m1o0J0k8L5RN2M9M0K3K7j5m2k8
$$ plain form
10534 -135 -143 -105 -42 -10 59 115 119 128 87 34 -9 -53 -77 -96 -133 -124 -48 -28 27 65 95 100 96 49 19 -41 -107 -127 -140 -144 -115 -43 21
10567 21 59 94 132 103 74 14 -56 -126 -119 -133 -128 -85 -23 9 81 96 98 119 106 59 -11 -38 -90 -115 -125 -99 -52 5 59 83 110
10598 110 136 89 36 -22 -57 -100 -138 -138 -102 -68 2 37 82 103 123 89 44 -14 -51 -86 -122 -119 -86 -74 -24 29 58 99 110 79
10628 79 74 28 -28 -78 -95 -128 -108 -112 -35 34 87 127 143 98 80 12 -38 -90 -123 -161 -114 -89 -47 14 23 88 78 94 56 32 8
10659 8 -48 -104 -110 -111 -96 -80 -10 45 87 98 126 95 57 20 -73 -106 -114 -113 -76 -66 -9 65 90 117 112 91 43 -9 -46 -90 -101 -138 -107
10692 -107 -42 -27 21 82 79 98 78 77 -1 -36 -87 -101 -124 -116 -97 -40 11 60 109 104 116 59 9 -45 -81 -120 -102 -116 -75 -25 7
10723 7 59 81 88 106 71 18 -5 -34 -89 -114 -107 -63 -33 -2 24 81 113 88 84 43 -8 -66 -101 -132 -130 -110 -53 22 37 63 86 102
10755 102 72 55 -24 -67 -112 -135 -106 -132 -65 2 34 65 93 86 79 61 3 -38 -98 -88 -116 -81 -72 -20 29 69 92 119 104 62 34
10786C4n6n2l3mj1L4M3O5L7L4J6j9l9m1n4m6k7loL1O6L0K5N3RMj1l3o1k8j3n2
10818a08J5J9L0L0O1M6K7j5j6l3m8l5m4l3oL3L4N6M3J3L4J7n0m5l4p8Kl6kJ9L7
10849f7L3N9N2kKKm6l7k3l7Lm2J6J7L8K4O5K3JJ7k3l7l6p0n1okK8M7N3N0M2kN
10883I6j7m4n9m4l0j5J2M1K3J9L6M6mqK0o4l1n5qk6NkM3K0O6N3J6J0j7k1k6p0
10915c5k4l3j1LK9L5P0K0M3J6k4k8n6l7m0l3KK7K0L9L5N0KJ3nl5k4k6o3j6j1o
10947a03M1MK6M0N6L6l2rm0k3m9p4J1J1J6K3N6N5J3M7K6l3n2n0n5l2j9k3M9K5
10977e9M3J7N2J7J6k1m9k8n3j4k5k2L6K0K8M7L9L1oQm2k7l4l8k2l3K1oM4M2N9
11008D1K8K0J2m0m7k4n5m4j2J0K8K0R2L8K2K1j4l7l3l0n1m5oNL1L0K0N1K9lJ0
$$ plain form
10786 34 -22 -74 -107 -111 -122 -88 -45 20 57 91 107 88 49 8 -46 -92 -119 -122 -128 -97 -31 -1 24 77 86 90 79 46 -15 -43 -56 -108
10818 -108 -93 -74 -44 -14 47 93 120 105 89 56 8 -27 -71 -104 -110 -77 -43 13 56 69 103 120 70 25 -9 -87 -85 -121 -123 -104 -67
10849 -67 -34 25 77 75 77 79 33 -4 -27 -64 -61 -103 -87 -70 -32 -8 57 80 81 98 75 38 2 -68 -119 -125 -127 -99 -52 1 51 93 91 96
10883 96 79 35 -24 -68 -98 -113 -101 -60 -37 -18 18 64 60 52 72 8 -23 -78 -86 -112 -107 -109 -66 -46 20 73 89 99 82 61 35 -35
10915 -35 -59 -92 -103 -100 -71 -36 34 54 97 113 89 61 5 -32 -72 -105 -103 -76 -56 -17 18 68 70 83 78 43 19 -7 -70 -86 -97 -103
10947 -103 -62 -58 -32 8 64 100 68 59 19 -4 -53 -127 -116 -105 -89 -66 -10 45 58 105 131 98 46 -4 -59 -91 -110 -133 -84 -59
10977 -59 -16 1 53 70 86 65 16 -12 -65 -79 -104 -126 -90 -70 -42 5 44 75 69 77 35 8 -26 -64 -86 -119 -98 -104 -60 -18 41
11008 41 69 89 101 61 14 -10 -65 -109 -121 -111 -83 -63 29 67 89 110 96 59 26 -4 -55 -100 -106 -101 -70 -40 -20 31 60 57 67
11039F7k8l7m2l5jm6jJ2N2K1O4PL8J4rl4p1jm9l3oJ1L1L8N8L5K7K1l6qm1p4k7
11072h3j3j6J8J6K7P2M4J5K7k4l9n3m2l6Ol9OL8K9L0M8L5K1n0L1n2k4m7k2ql0
11103a15M2OM9L4M6POj2ro1j9n8j3%kO1NN9L0K4J3k7k6m5n1k3nk1LL5L9J7M9N0
11137H8jol0l3l7m3j4k8nM4J1M3L4N5mkj1l0n2n3oj4k2M9J1O5M9PJ8J2l2j6l4
11170A3o0m2j3KK3L1M3K6L9J0MMo0l5k3l0n8J9QL4L5O6J4L4Rk1m3l3l3n4JLMN
11204g8O5L4L2L3ppk8l4l9j2m8kQL3J8N8L2J1Ok4nm8j9m3k7O%L8j0O3L0K2J0p
11238F1Ll3k7n5k0l3J2J6N5L2L6K6OJ7k1l4n1k1k5k5kRL9L3M0jM6j7ll3k1m5j9
11271e5k5lLL1J2M2K4K0PRk2m4k7l1j2l7lN1L6L5M2Mjjnk9k8k9l9oK1LN2K1K6
$$ plain form
11039 67 39 2 -40 -75 -76 -122 -123 -111 -59 -38 26 33 71 85 76 42 -29 -30 -79 -112 -118 -107 -76 -38 20 55 82 103 67 59 18 -56 -83
11072 -83 -96 -112 -94 -78 -51 21 65 80 107 83 44 -9 -51 -87 -81 -120 -114 -76 -47 -17 31 66 87 37 68 16 -8 -55 -77 -85 -115
11103 -115 -73 -67 -18 16 62 69 75 63 54 -7 -26 -84 -97 -97 -99 -38 -33 26 56 80 93 66 40 -5 -56 -79 -84 -105 -102 -67 -28 -11 38 88
11137 88 87 81 51 18 -19 -62 -76 -104 -109 -65 -54 -11 23 78 74 72 61 31 -21 -74 -80 -94 -116 -67 -56 9 58 65 83 95 63 47 13
11170 13 -47 -89 -102 -100 -77 -46 -3 23 62 72 76 80 20 -15 -38 -68 -126 -107 -99 -65 -30 36 50 84 93 72 29 -4 -37 -91 -90 -87 -83 -78
11204 -78 -13 21 53 86 79 72 44 10 -29 -41 -89 -91 -83 -50 -32 26 58 69 75 51 46 -2 -21 -64 -91 -85 -85 -47 -57 6 36 58 68 61
11238 61 64 31 4 -51 -71 -104 -92 -76 -21 11 47 73 79 96 75 41 -10 -31 -56 -81 -83 -74 -35 -2 38 37 83 66 63 30 9 -36 -55
11271 -55 -80 -83 -80 -49 -37 5 29 49 56 65 43 -1 -28 -59 -71 -108 -111 -60 -24 11 53 57 56 55 50 21 -7 -36 -75 -81 -60 -57 -5 16 42
11306D2J0K7j3ml1l4k5m6j2oM1kM6L0K2J2Jj9ok6m1l8nj8J6L8L6PM1K0J9k8j0
11339D4l1n9qj7k6RJ3K3Q5J4J9K1Pk0m3m9Lm2mQJ0lM4M3j1L5J0l7m0jo2j8k3P
11373i9J9L0M3K6L8L1j2j8k0n2k7j8m4K0J6j1O5M3LM6j3J8m3l4l2j6l2j7K4%M7
11404a9M1L5NL3j5l9j8m8l8Lk4mK4L3K8K3L0K4Nk6o8j1k6j9j3J8jJ7L4N0NOJ5
11437F0kk5l0m7J1l9k7L6K2L5L6L8J0J2mm6l6k0l2j8j8lK7L1M6K1L3oj6mk1l6
11469a2m2Mm4j4N0J4L6L1L4J5kj7k1m9k7m1j5RJ1M4N8L5kK8J6n2nl4k6m5prJ2
11502f7J0L5M2L1K8J8k9m3l0l6om6J2J0K1K7N0J2L5Qk8k6l2km5n5J3QM2RL6M3
11534D5L4%j8Oj3n7m7l5J5k7K3L9K1M8K3L0J0m9rn7k9m0j2mNL9N6K7K3K4Nl4k3
$$ plain form
11306 42 52 79 66 62 31 -3 -28 -74 -86 -92 -51 -53 -7 23 45 57 58 39 33 7 -34 -72 -77 -95 -79 -41 -5 2 43 63 82 54 44
11339 44 13 -46 -54 -71 -97 -88 -75 -52 33 47 66 87 94 74 31 -18 -15 -57 -61 -53 -43 -46 -2 41 30 65 75 38 -2 -3 -65 -83 -106 -99
11373 -99 -80 -50 -7 19 57 88 76 58 38 -14 -41 -59 -103 -83 -67 -78 -13 30 33 79 66 84 41 7 -25 -41 -73 -90 -66 -66 -19
11404 -19 22 57 62 95 80 41 23 -25 -63 -60 -84 -88 -64 -31 -3 20 50 74 79 53 -15 -26 -52 -71 -84 -66 -67 -50 -16 34 39 45 60
11437 60 58 33 3 -44 -33 -72 -99 -63 -41 -6 30 68 78 90 86 40 4 -16 -48 -66 -84 -87 -60 -29 17 38 71 65 49 45 24 -12
11469 -12 -54 -50 -94 -108 -58 -44 -8 23 57 72 70 53 32 -17 -44 -85 -100 -91 -80 -36 22 57 55 83 99 47 42 8 -18 -63 -70 -79 -67
11502 -67 -57 -22 20 51 79 97 68 25 -5 -41 -47 -93 -81 -71 -50 -23 27 39 74 82 54 28 -4 -6 -51 -106 -93 -85 -43 -34 2 45
11534 45 79 79 61 67 54 -3 -50 -85 -70 -97 -74 -35 -14 34 57 87 97 48 39 -18 -47 -87 -99 -103 -98 -59 -3 24 47 71 76 42 19
11567A9j2o9k3j9J8qL4M4L1N2J6Jj3pn4l6k0m7J7J1LK9N6N9JNk0j5k8l8j6m5p
11600h1LPM3K7N0K5J9Ok5m7n8l3k4j5PMN4K2L3N0Nj1k3Mm0m5k5l6k9M6M2L5N3
11633D3L0J5j6J9m3l7n0l3k3J6j0M4K9N8K7j2K3%k5l0o9%o2NJ2J5O1L2N1K2%p
11665H5j6n4or0rKk6M6L9L6K2N9Jnj9j7m2l8m5m2L5L2K3L3M0M2J7j1k1j6k9m6
11697b0p3k4lK7K1K5P0K6K3KNn7j2n5k8n5M4qJ5M4M8K4K2Qnro3l2l1j7k8KN0M5
11731a9K7K4M4L7ol8l4l9m7m1%JK3L0N4L8M2Ppk8m8l1m8j2l0j4M5K5K2N9L1L1
11763I8j6k1k8l7m0j5l8MJ5N0K2L6N4POok6m7l2m4l0j6L3L2L0M3L7J9K7l5j7n5
11795A0k1n3l5k3J9K6K7O3L8J5J5J2k8j3p2n8k0j9K2J6J9M7M6J1M3J1j6m9qp2
$$ plain form
11567 19 7 -62 -85 -104 -86 -94 -60 -16 15 67 83 84 71 64 10 -26 -46 -93 -76 -65 -62 -33 23 82 83 88 68 53 25 -13 -29 -74 -81
11600 -81 -78 -71 -28 -1 49 74 93 99 74 27 -31 -64 -88 -103 -96 -92 -38 -16 17 67 72 61 38 42 2 -43 -68 -104 -133 -87 -45 -10 43
11633 43 73 88 72 91 48 11 -39 -72 -95 -79 -89 -45 -16 42 69 57 80 80 55 25 -44 -44 -106 -101 -89 -74 -13 19 70 92 92 85
11665 85 69 15 9 -81 -90 -88 -114 -68 -29 7 29 88 89 84 65 48 6 -32 -77 -119 -84 -52 -29 4 44 86 103 92 71 55 26 -20
11697 -20 -93 -117 -120 -93 -72 -47 23 49 72 74 79 22 10 -45 -73 -128 -84 -92 -77 -33 15 39 61 69 64 55 -8 -40 -71 -88 -116 -114 -64 -19
11731 -19 8 32 76 113 107 69 35 -4 -51 -92 -92 -91 -68 -38 16 54 96 103 96 68 20 -11 -59 -71 -101 -115 -70 -45 -23 36 67 98
11763 98 82 61 33 -4 -44 -59 -97 -93 -78 -28 -6 30 84 91 97 91 65 18 -14 -58 -88 -104 -71 -39 -9 34 71 90 117 82 65 10
11795 10 -11 -64 -99 -122 -103 -77 -50 13 51 66 81 93 65 52 -20 -78 -98 -117 -95 -79 -60 -13 33 44 87 98 82 33 25 -47
11825d7l5Rj8K5K8M4M0N5KNk4j9p8l4j6n2J5K4K0L1O5K8L4kj8m7j5n4m8k5J3K6
11857f8J4M2K4O0MK0j3j9n8k0l6m5J2roL9P4L9L0NRm0l0l5l6m8k7J9K5M3M2M4
11889E5J9J6k0j2l2l9m9k7l3K9j9M8O0L7M0L1j0m5Mm4n0l7k4oM2RN7L8M3K1Jj8
11921H5k6n7j9m2j1k0K6LM8N8L4J7O%k3m9o5k9m0KlN2L0M5L4L8lrl3m4l1m9l5
11954a10J0J1K5OP9J2K6L7ml5j1m1m2m9k3lK1M8M8O2mJ6K5j8n0k6m4j9k7j4J4
11985h0M0K5L8M9KK0j6k4m7n0jn3j1L8pM3P3M2j0J5Qn5j7m9m0ok7L7qP5M7RM4
12018A04K1k8j1m2n5m0l4J9j4K0M2N2K9PK5Pn2m3k1n5l1PJ2J9MM2M7K1K0j3On0
12050A5m2k0n0NRJ9K8L0N1PN3k7rJ0q0l1j9m1p%N4N3M5JN2J4n3Oo2l6m9j0lj1
$$ plain form
11825 -47 -82 -73 -91 -66 -38 6 46 101 103 108 84 65 -13 -47 -63 -115 -100 -76 -56 -25 40 68 102 100 82 35 20 -34 -82 -107 -94 -68
11857 -68 -54 -12 12 72 76 96 83 64 6 -14 -50 -95 -83 -92 -98 -59 15 54 84 89 98 58 28 -7 -43 -91 -118 -99 -74 -31 11 55
11889 55 74 90 70 58 26 -13 -62 -89 -122 -93 -112 -64 -4 33 73 104 94 49 53 9 -41 -78 -102 -108 -66 -57 0 38 81 102 103 85
11921 85 59 2 -17 -59 -70 -90 -64 -61 -13 45 79 96 102 102 79 30 -35 -64 -104 -102 -105 -53 -23 22 56 94 91 82 49 5 -26 -75 -110
11954 -110 -100 -89 -64 -58 21 33 59 96 92 57 46 5 -37 -86 -109 -112 -91 -43 5 67 63 79 104 86 36 10 -34 -53 -80 -94 -80
11985 -80 -40 -15 23 72 74 94 78 54 7 -43 -44 -97 -108 -70 -77 -34 39 81 71 86 94 39 22 -27 -67 -73 -100 -63 -71 4 51 60 104
12018 104 125 97 86 44 -11 -51 -85 -66 -80 -60 -18 34 63 70 95 102 50 7 -14 -69 -100 -93 -81 -62 -58 -16 31 52 72 59 65 15
12050 15 -27 -47 -97 -92 -83 -64 -36 -6 45 52 105 78 69 79 -1 -32 -51 -92 -99 -99 -45 8 53 54 106 120 67 73 11 -25 -74 -84 -87 -98
12084i8N5J2P3KJ7K2j1k4m0m3k4l8mKJ8M0L3O9OK2j9Jm7n2j8m8kj2N1QN3L0K6
12117F0J1K7m2k6n7k9j1l1J6J7L4M6nN8kJ3j6o2j8n5j2j7j4M1K6K0M9M9jJ5l0
12148E4j9l6k2n6Mj5QO2J7N4L0J3K1k6l1k5m7k6m4k6K8K6L9N7RLL9j7m2pn1k6
12180e2l1J0j1M4OO1J0L4J0j5j5nq2k4l6OOJ5K9K0M7K2K5K4m2k2l8n5j4p%J8J8
12213d4RO5L0nL2k9k8k7k9m3pk6L2L5K3K7L6L5mk3k6m6j8l8rl9K2K5P4j9O3J6
12245F4Ljl0k3n8nk3k6K0N4J3J4M1J0K9rk2l6l4k3k7KroM2L3L2L8NLmm6n7k5n
12280f6l6pM4K2K7PN9%kMk0k3m7k6rk2L0MN2K1M1J6pKl1Pp4l4Oj3J2J6K9K1M9
12315E2MK6l1l1ln9k7J2kl3M4J1M3M3OLOm5j5k6l6j8k3KJ1N1M9JN6j8j2Lk4l2
$$ plain form
12084 -98 -43 -31 42 44 61 83 72 48 8 -35 -59 -97 -101 -99 -81 -41 -8 61 67 89 70 71 24 -28 -46 -94 -96 -108 -57 -49 4 34 60
12117 60 71 98 56 30 -27 -56 -67 -98 -82 -65 -31 15 10 68 66 79 63 1 -17 -72 -84 -101 -115 -74 -48 -28 21 70 69 84 54
12148 54 35 -1 -23 -79 -75 -90 -82 -20 -3 51 81 94 115 89 58 33 -14 -40 -84 -110 -82 -56 -17 40 49 52 91 74 32 25 -26 -52
12180 -52 -83 -73 -84 -40 -34 27 37 71 81 66 51 46 -36 -60 -96 -90 -84 -69 -40 -20 27 49 74 98 56 34 -4 -59 -73 -80 -80 -62 -44
12213 -44 -35 30 60 55 87 58 30 3 -26 -69 -76 -102 -70 -35 -12 15 51 86 82 59 33 -13 -31 -69 -78 -117 -95 -70 4 -15 48 64
12245 64 67 66 36 13 -45 -50 -73 -99 -79 -25 -12 2 43 53 82 73 51 15 -19 -42 -69 -67 -76 -82 -40 -7 25 63 68 71 67 21 -36 -61 -66
12280 -66 -102 -109 -65 -43 -16 -9 50 50 48 52 32 9 -38 -64 -73 -95 -65 -61 -9 12 53 69 62 64 33 40 -34 -68 -62 -75 -63 -47 -18 3 52
12315 52 56 82 51 20 17 -42 -69 -57 -59 -92 -48 -37 6 49 55 58 64 19 4 -22 -58 -76 -99 -97 -86 -35 14 15 71 53 41 44 20 -12
12349a2l0j5l7J9J7L3J5N2J1J7J0k4k7k0n0j6j0Kj0K5M2K2M4QJj4j7m4m0j1j8
12380g7NQj2M6N5L5KMk7mk1m1l6%mKL1QL2K3L2Qkk7Jo1l7Jj8MM2J2J9M9K0k6J7
12417F3k2k3l2m6mmpMQ0mN8k7QJ5Mm1om7k6j9kK8K6K0J7L4K3j0j4j6k7l8k5k0
12451h0K9PK1K8J8K5L1ok5mn4ql0l5L2k6L1L4K7L2RjNm1j3l3j1j9k2J5J9M2J4
12484A1K0K9nK2j2l9j6k7l8Pk1L0J9L2J9J5K4j7knl3l0k0j7KM6j2J3L2L0J3Kj
12517G1n5j5k3l6j0rL3QL5J2L2J3K0m5Kj2n4mqk1%K5J3O5kK5rk2J4k2k6n0nj2
12551g2J5J4J8M6J5J5j5J9j3j4l9k6k5j6J9qN2NM0JL9k3Ln1Nm0j6j0rL7LKL0N5
12585E6Npj7lm3Mk5l1j4M1pN4J2M7Oj5lj2n2j6j6j9j3L0pJ6M7K1j8L1j7J2n1q
$$ plain form
12349 -12 -42 -57 -94 -75 -58 -25 -10 42 53 70 80 56 29 9 -41 -57 -67 -65 -75 -50 -8 14 58 66 67 53 36 -8 -48 -59 -77
12380 -77 -72 -64 -76 -30 25 60 62 66 39 35 14 -27 -63 -63 -67 -65 -34 -26 6 29 61 69 67 40 41 -20 -57 -56 -74 -70 -28 -16 3 52 72 46 63
12417 63 41 18 -14 -60 -64 -68 -75 -71 9 5 63 36 44 59 63 22 16 -31 -57 -76 -78 -50 -24 -4 13 47 70 60 46 30 3 -35 -60 -80
12451 -80 -51 -44 -23 5 23 48 79 73 48 44 -10 -18 -48 -83 -51 -77 -46 -12 15 47 56 55 60 19 6 -27 -38 -57 -79 -64 -45 -3 11
12484 11 31 60 55 77 65 26 10 -17 -55 -48 -69 -39 -20 12 31 46 70 53 51 46 13 -17 -37 -54 -52 -6 -18 -5 27 57 70 72 71
12517 71 16 1 -22 -58 -68 -77 -44 -36 -1 11 43 56 76 31 33 21 -33 -37 -45 -66 -66 -41 -28 37 35 60 51 29 43 21 -5 -55 -60 -72
12551 -72 -57 -43 -25 21 36 51 36 55 42 28 -11 -37 -62 -78 -59 -67 -15 -10 30 31 70 47 50 -1 4 -36 -52 -62 -71 -34 -31 -29 1 56
12585 56 61 54 37 34 -9 -5 -30 -61 -75 -34 -41 13 25 72 78 63 60 48 -4 -20 -36 -55 -68 -38 -45 -29 18 39 21 52 35 47 -4 -12
12619a2j9mm0OJ5K6N0oL5Nj9rj8k0ll7J1j5J5J1K1L8J4J7qRl3k7j5j3jj4j2K7
$$ plain form
12619 -12 -31 -35 -75 -69 -54 -28 22 16 51 56 37 28 10 -10 -13 -50 -39 -54 -39 -28 -7 31 45 62 54 63 30 3 -12 -25 -26 -40 -52 -25
$$ [...]
16383b2
##END NTUPLES=NMR FID
##END=
