##TITLE=abcd
##JCAMPDX= 6.0         $$ Bruker NMR JCAMP-DX V2.0
##DATA TYPE= NMR SPECTRUM
##DATA CLASS= NTUPLES
##ORIGIN= UXNMR, Bruker Analytische Messtechnik GmbH
##OWNER= root
$$ XWIN-NMR		Version 3.5
$$ Thu Oct 16 12:56:36 2025 Russian Standard Time (UT+4h)  servis@DPX200
##.OBSERVE FREQUENCY= 200.131235884673
##.OBSERVE NUCLEUS= ^1H
##.ACQUISITION MODE= SIMULTANEOUS
##.ACQUISITION SCHEME= undefined
##.AVERAGES= 32
##.DIGITISER RES= 18
##SPECTROMETER/DATA SYSTEM= spect
##.PULSE SEQUENCE= zg
##.SOLVENT NAME= CDCl3
##.SHIFT REFERENCE= (INTERNAL, CDCl3, 0, 16.4885)
##AUDIT TRAIL= $$ (NUMBER, WHEN, WHO, WHERE, WHAT)
$$ ##TITLE= Audit trail, XWIN-NMR		Version 3.5
$$ ##JCAMPDX= 5.01
$$ ##ORIGIN= Bruker BioSpin GmbH
$$ ##OWNER= servis
$$ F:\spectra/data/av/nmr/H1/1/pdata/1/auditp.txt
$$ ##AUDIT TRAIL=  $$ (NUMBER, WHEN, WHO, WHERE, WHAT)
(   1,<2025-10-16 12:54:44.45 +0400>,<servis>,<DPX200>,
      <created by zg, POWCHK disabled, PULCHK disabled
       configuration hash MD5:
       00 E9 B6 7A A2 85 ED C7 34 08 36 98 17 FE 4E 26
       data hash MD5: 32K
       9D 21 88 DB AF 36 B6 DA 7F 43 80 83 CC 47 AA E1>)
(   2,<2025-10-16 12:55:28.92 +0400>,<servis>,<DPX200>,
      <Start of raw data processing
       efp BC_mod = 2 LB = 0.05 FT_mod = 6 PKNL = 1 PHC0 = -271.6701 PHC1 = 2.101565 SI = 16K 
       data hash MD5: 16K
       DA BE 45 E0 86 A7 05 79 54 07 7E F2 1B 8A 69 FE>)
$$ ##END=
$$ 
$$ hash MD5
$$ B9 D6 92 16 D4 60 88 55 57 4E 2C 95 89 9B 2F DF
##$RELAX= 
##$RELAX= 
##$RELAX= 
##$RELAX= 
##$RELAX= 
##$RELAX= 
##$RELAX= 
##$RELAX= 
$$ Bruker specific parameters
$$ --------------------------
##$DU= <F:\spectra>
##$EXPNO= 1
##$NAME= <H1>
##$PROCNO= 1
##$TYPE= <nmr>
##$USER= <av>
##$AMP= (0..31)
100 100 100 100 100 100 100 100 100 100 100 100 100 100 100 100 100 100 
100 100 100 100 100 100 100 100 100 100 100 100 100 100 
##$AQSEQ= 0
##$AQ_mod= 1
##$AUNM= <au_zg>
##$AUTOPOS= <>
##$BF1= 200.13
##$BF2= 200.13
##$BF3= 200.13
##$BF4= 200.13
##$BF5= 500.13
##$BF6= 500.13
##$BF7= 500.13
##$BF8= 500.13
##$BYTORDA= 1
##$CFDGTYP= 0
##$CFRGTYP= 5
##$CHEMSTR= <none>
##$CNST= (0..31)
1 1 145 1 1 1 1 1 1 1 1 1 1 1 1 1 1 1 1 1 1 1 1 1 1 1 1 1 1 1 1 1 
##$CPDPRG= <>
##$CPDPRG1= <>
##$CPDPRG2= <>
##$CPDPRG3= <>
##$CPDPRG4= <mlev>
##$CPDPRG5= <mlev>
##$CPDPRG6= <mlev>
##$CPDPRG7= <mlev>
##$CPDPRG8= <mlev>
##$CPDPRGB= <>
##$CPDPRGT= <>
##$D= (0..31)
0 2 0 0 0 0 0 0 0 0.06 0 0 0 0 0 0 0.0002 0 0 0 0 0 0 0 0 0 0 0 0 0 0 
0 
##$DATE= 1760604883
##$DBL= (0..7)
120 120 120 120 120 120 120 120 
##$DBP= (0..7)
150 150 150 150 150 150 150 150 
##$DBP07= 0
##$DBPNAM0= <>
##$DBPNAM1= <>
##$DBPNAM2= <>
##$DBPNAM3= <>
##$DBPNAM4= <>
##$DBPNAM5= <>
##$DBPNAM6= <>
##$DBPNAM7= <>
##$DBPOAL= (0..7)
0.5 0.5 0.5 0.5 0.5 0.5 0.5 0.5 
##$DBPOFFS= (0..7)
0 0 0 0 0 0 0 0 
##$DE= 6
##$DECBNUC= <off>
##$DECIM= 32
##$DECNUC= <off>
##$DECSTAT= 4
##$DIGMOD= 1
##$DIGTYP= 9
##$DL= (0..7)
0 120 120 120 120 120 120 120 
##$DP= (0..7)
150 150 150 150 150 150 150 150 
##$DP07= 0
##$DPNAME0= <>
$$ [...]
##$SUBNAM4= <"">
##$SUBNAM5= <"">
##$SUBNAM6= <"">
##$SUBNAM7= <"">
##$SUBNAM8= <"">
##$SUBNAM9= <"">
##$SW= 20.6817932712277
##$SWIBOX= (0..15)
0 0 3 0 0 0 0 0 0 0 0 0 0 0 0 0 
##$SW_h= 4139.07284768212
##$TD= 32768
##$TD0= 1
##$TE= 0
##$TE2= 300
##$TE3= 300
##$TEG= 300
##$TL= (0..7)
0 120 120 120 120 120 120 120 
##$TP= (0..7)
150 150 150 150 150 150 150 150 
##$TP07= 0
##$TPNAME0= <>
##$TPNAME1= <>
##$TPNAME2= <>
##$TPNAME3= <>
##$TPNAME4= <>
##$TPNAME5= <>
##$TPNAME6= <>
##$TPNAME7= <>
##$TPOAL= (0..7)
0.5 0.5 0.5 0.5 0.5 0.5 0.5 0.5 
##$TPOFFS= (0..7)
0 0 0 0 0 0 0 0 
##$TUNHIN= 0
##$TUNHOUT= 0
##$TUNXOUT= 0
##$USERA1= <user>
##$USERA2= <user>
##$USERA3= <user>
##$USERA4= <user>
##$USERA5= <user>
##$V9= 5
##$VALIST= <valist>
##$VCLIST= <CCCCCCCCCCCCCCC>
##$VD= 0
##$VDLIST= <DDDDDDDDDDDDDDD>
##$VPLIST= <PPPPPPPPPPPPPPP>
##$VTLIST= <TTTTTTTTTTTTTTT>
##$WBST= 1024
##$WBSW= 30
##$XGAIN= (0..3)
0 0 0 0 
##$XL= 0
##$YL= 0
##$YMAX_a= 786379
##$YMIN_a= -388753
##$ZGOPTNS= <>
##$ZL1= 120
##$ZL2= 120
##$ZL3= 120
##$ZL4= 120
##$ABSF1= 0
##$ABSF2= 0
##$ABSG= 0
##$ABSL= 0
##$ALPHA= 0
##$AQORDER= 0
##$ASSFAC= 0
##$ASSFACI= 0
##$ASSFACX= 0
##$ASSWID= 0
##$AUNMP= <proc_1d>
##$AZFE= 0.1
##$AZFW= 0.1
##$BCFW= 0
##$BC_mod= 2
##$BYTORDP= 0
##$COROFFS= 0
##$CY= 18.4799938201904
##$DATMOD= 1
##$DC= 0
##$DFILT= <>
##$DTYPP= 0
##$F1P= 9.9274215381318
##$F2P= -0.165520771350173
##$FCOR= 1
##$FTSIZE= 16384
##$FT_mod= 6
##$GAMMA= 0
##$GB= 0
##$INTBC= 1
##$INTSCL= 4.127829e-11
##$ISEN= 128
##$LB= 0.05
##$LEV0= 0
##$LPBIN= 0
##$MAXI= 10000
##$MC2= 0
##$MEAN= 0
##$ME_mod= 0
##$MI= 50
##$NCOEF= 0
##$NC_proc= -7
##$NLEV= 6
##$NOISF1= 3.799351
##$NOISF2= 2.8
##$NSP= 0
##$NTH_PI= 0
##$NZP= 0
##$OFFSET= 16.48848
##$PC= 4
##$PHC0= -271.6701
##$PHC1= 2.101565
##$PH_mod= 1
##$PKNL= yes
##$PPARMOD= 0
##$PSCAL= 4
##$PSIGN= 0
##$REVERSE= no
##$SF= 200.130005582386
##$SI= 16384
##$SIGF1= 3
##$SIGF2= 2
##$SINO= 400
##$SIOLD= 16384
##$SREGLST= <1H.CDCl3>
##$SSB= 0
##$STSI= 16384
##$STSR= 0
##$SW_p= 4139.07284768211
##$SYMM= 0
##$S_DEV= 0
##$TDeff= 32768
##$TDoff= 0
##$TI= <>
##$TILT= no
##$TM1= 0
##$TM2= 0
##$TOPLEV= 0
##$USERP1= <user>
##$USERP2= <user>
##$USERP3= <user>
##$USERP4= <user>
##$USERP5= <user>
##$WDW= 1
##$XDIM= 16384
##$YMAX_p= 395776208
##$YMIN_p= -3310067
$$ End of Bruker specific parameters
$$ ---------------------------------
##NTUPLES= NMR SPECTRUM
##VAR_NAME=  FREQUENCY,     SPECTRUM/REAL,   SPECTRUM/IMAG
##SYMBOL=    X,             R,               I
##VAR_TYPE=  INDEPENDENT,   DEPENDENT,       DEPENDENT
##VAR_FORM=  AFFN,          ASDF,            ASDF
##VAR_DIM=   16384,         16384,           16384
##UNITS=     HZ,            ARBITRARY UNITS, ARBITRARY UNITS
##FACTOR=    0.252644378177508, 1,           1
##FIRST=     3299.83951724647, 0,            0
##LAST=      -839.233330435636, 0,           0
##MIN=       -839.233330435636, -3310067,    0
##MAX=       3299.83951724647, 395776208,    0
$$ Real data points
##PAGE= N=1
##DATA TABLE= (X++(R..R)), XYDATA
$$ [...]
5562D489927n20558J81953p992J70731K94112m90286j8136M13712m78658J50114
$$ 4489927 3969369 4151322 4143330 4314061 4608173 4117887 4099751 4513463 4034805 4184919
5552D184919N33k09572K25853Q6261l53445p4369J02159J21941l42893K60015
$$ 4184919 4185452 3975880 4201733 4287994 3934549 3860180 3962339 4084280 3741387 4001402
5542D001402J99687m38874N1203p0291K66711k11471M9618k89567j60175n6529
$$ 4001402 4201089 3762215 3813418 3743127 4009838 3798367 3847985 3558418 3398243 3341714
5532C341714Q9965M41781p36744Q6529M43910l51954k7625n7871o47173O16605
$$ 3341714 3431679 3873460 3136716 3223245 3667155 3315201 3287576 3229705 2582532 3199137
5522C199137l64974r3226k32913J50831n5805K51246p49772L45569K5649n86595
$$ 3199137 2834163 2740937 2508024 2658855 2603050 2854296 2104524 2450093 2475742 1889147
5512A889147N48452l23457j22819N4460k00163J17310j1968j76178n4129R0527
$$ 1889147 2437599 2114142 1991323 2045783 1845620 1962930 1950962 1774784 1720655 1811182
5502A811182K13038j14585l97830J1673L60624m9476k31835m6376O3980J0774
$$ 1811182 2024220 1909635 1511805 1523478 1884102 1834626 1602791 1556415 1620395 1631169
5492A631169L18203m54555L2314r5446L5963n8957j61349J720N00916k71919Q5276
$$ 1631169 1949372 1494817 1527131 1431685 1467648 1408691 1247342 1249062 1749978 1478059 1563335
5481A563335k57173Q5051j76942o826j9820K24447J75077k52708J68852m70728
$$ 1563335 1306162 1391213 1214271 1207445 1187625 1412072 1587149 1334441 1503293 1032565
5471A032565M17439k57364j47060N78964m90718M76729k75486M55523o88148M14880
$$ 1032565 1450004 1192640 1045580 1624544 1133826 1610555 1335069 1790592 1102444 1517324
5461A517324m17118j81134N60614n67746O51856m08498L31930k40095j31124K78946
$$ 1517324 1100206 919072 1479686 911940 1563796 1155298 1487228 1247133 1116009 1394955
5451A394955n01490K33463j97053L70727k74043K68383k96347K44240k43180J35643
$$ 1394955 893465 1126928 929875 1300602 1026559 1294942 998595 1242835 999655 1135298
5441A135298K47462l68730N92513m31455N5327j9819P3475J56455O1148m33565
$$ 1135298 1382760 1014030 1606543 1175088 1230415 1210596 1284071 1440526 1501674 1068109
5431A068109J20308Q1724k7601J27718k23430j76330K09955k7925k21097J42678
$$ 1068109 1188417 1270141 1242540 1370258 1146828 970498 1180453 1152528 931431 1074109
5421A074109L47583q5955l24953J94059n719j4690p840L9051l22505K67133R8096
$$ 1074109 1421692 1335737 1010784 1204843 1199124 1184434 1176594 1215645 893140 1160273 1258369
5410A258369l38230l605r6818K32615L04003j36744m6846j91272J58361k48841
$$ 1258369 920139 916534 819716 1052331 1356334 1219590 1172744 981472 1139833 890992
5400H90992N28179k88855j12012k00752O34519n60225j54396L92350O2436j54887
$$ 890992 1419171 1130316 1018304 817552 1452071 891846 737450 1129800 1192236 1037349
5390A037349K77796L7831j01050q4936J53121j32519M46089o10632K2497K62572
$$ 1037349 1315145 1352976 1251926 1166990 1320111 1187592 1633681 1023049 1045546 1308118
5380A308118J25081j88143l6491o9678K95435l58542R0412J90925j02994j62447
$$ 1308118 1433199 1245056 1208565 1138887 1434322 1075780 1166192 1357117 1254123 1091676
5370A091676R3485J30542l92987K29612J03555j99437Q8756K7535J49113k35956
$$ 1091676 1185161 1315703 922716 1152328 1255883 1056446 1145202 1172737 1321850 1085894
5360A085894o7312L06843k85353L51609l51401L30965N7818J88549l00853k94107
$$ 1085894 1018582 1325425 1040072 1391681 1040280 1371245 1429063 1617612 1316759 1022652
5350A022652N8538J20995k20253K19432O36980n82614J90153j47241K45383j09768
$$ 1022652 1081190 1202185 981932 1201364 1838344 1255730 1445883 1298642 1544025 1434257
5340A434257K44783r6884l60437K75014k09538k14879L54444k65016K51827K08191
$$ 1434257 1679040 1582156 1221719 1496733 1287195 1072316 1426760 1161744 1413571 1621762
5330A621762l18297k64742K20690M81149k14663j06974J68084k53113m6028J74332
$$ 1621762 1303465 1038723 1259413 1740562 1525899 1418925 1587009 1333896 1287868 1462200
5320A462200j28383O6812K02703j02172J41627R8971j48540k11665J05986n3082
$$ 1462200 1333817 1400629 1603332 1501160 1642787 1741758 1593218 1381553 1487539 1434457
5310A434457j06848L54628J35773n71438M51500M7829j29137l8864K71328m9150
$$ 1434457 1327609 1682237 1818010 1246572 1698072 1745901 1616764 1577900 1849228 1800078
5300A800078j12218j4949J56575J4715P1531l49001j72271K45652L3833O218R674
$$ 1800078 1687860 1672911 1829486 1844201 1915732 1566731 1394460 1640112 1673945 1680163 1689837
5289A689837k51750O43564k41873j68259J30125L45617o65573M37297M9123k04388
$$ 1689837 1438087 2081651 1839778 1671519 1801644 2147261 1481688 1918985 1968108 1763720
5279A763720K21443J64666j78629k010r6950L31599n5948J7826o9910K99177m17862
$$ 1763720 1985163 2149829 1971200 1969190 1872240 2203839 2147891 2165717 2095807 2394984 1977122
5268A977122K5883J1318J7502N41016m63946j37178R3295J20607j28628k1321
$$ 1977122 2003005 2014323 2031825 2572841 2108895 1971717 2065012 2185619 2056991 2035670
5258B035670J43253j40924M93711k37213j24380m19559K79836L97247j16000O7580
$$ 2035670 2178923 2037999 2531710 2294497 2170117 1750558 2030394 2427641 2311641 2379221
5248B379221k06236J41638L8063O9112l01326p2332L01717L29317j86477j31550
$$ 2379221 2172985 2314623 2352686 2421798 2120472 2048140 2349857 2679174 2492697 2361147
5238B361147l3259j49517o3069O19327l37185O6424j28485N71091m58480Q5516
$$ 2361147 2327888 2178371 2115302 2734629 2397444 2463868 2335383 2906474 2447994 2533510
5228B533510M21822k35132J4285k5857m166J23061k80303J91913L6670k93915
$$ 2533510 2955332 2720200 2734485 2708628 2704462 2827523 2547220 2739133 2775803 2481888
5218B481888N14033k82185N29856P5736l11910j95035M63166n66308J31516j3429
$$ 2481888 2995921 2713736 3243592 3319328 3007418 2812383 3275549 2709241 2840757 2827328
5208B827328L96605l88754O29457L10629p50439Q8129j92600P9891N56653n84
$$ 2827328 3223933 2835179 3464636 3775265 3024826 3112955 2920355 3000246 3556899 3556315
5198C556315k37702K52030n67773L74926J17602n00931J19283L61558P9548K45369
$$ 3556315 3318613 3570643 3002870 3377796 3495398 2994467 3113750 3475308 3554856 3800225
5188C800225N4771l22089O54546j46518m13736K77579K93579k35128k8289j68078
$$ 3800225 3854996 3532907 4187453 4040935 3627199 3904778 4198357 3963229 3934940 3766862
5178C766862J00453N52116J72887j04242n86148N21565k14493M03044p10814O86230
$$ 3766862 3867315 4419431 4592318 4488076 3901928 4423493 4209000 4612044 3901230 4587460
5168D587460k30079j637M07009J17815k58692O8047j06688N78260n0090p8883
$$ 4587460 4357381 4355744 4762753 4880568 4621876 4689923 4583235 5161495 5111405 5032522
5158E032522K03322k71444J10447J94209m76941L59291M22236m86146K74260K17205
$$ 5032522 5235844 4964400 5074847 5269056 4792115 5151406 5573642 5087496 5361756 5578961
5148E578961j72885K38266K16400l44127O45814j14353J49718m2782O7399l5462
$$ 5578961 5406076 5644342 5860742 5516615 6162429 6048076 6197794 6155012 6222411 6186949
5138F186949k7353J17238K08239k425K64068j40597q513L69997K58837p0095Q7820
$$ 6186949 6159596 6276834 6485073 6482648 6746716 6606119 6597606 6967603 7226440 7156345 7244165
5127G244165k05330K92297J30358J53911k04426L73511K79358l0868K07666L88122
$$ 7244165 7038835 7331132 7461490 7615401 7410975 7784486 8063844 8032976 8240642 8628764
5117H628764q0958L15036k86042M18688L36853q2575P99627j90703K16576N48593
$$ 8628764 8547806 8862842 8576800 8995488 9332341 9249766 10049393 9858690 10075266 10623859
5107A0623859n6609l01249Q40899K6929M09048j62627Q78451l93978N88192L57081
$$ 10623859 10567250 10266001 11106900 11133829 11542877 11380250 12258701 11864723 12452915 12809996
5097A2809996m23447Q18676l01899M11044J75621P81888J1926j96319O24167q0059
$$ 12809996 12386549 13205225 12903326 13314370 13489991 14271879 14283805 14087486 14711653 14631594
5087A4631594k2440J09354N16880q9887M84560Q6496j39719M13719m5644l38347
$$ 14631594 14609154 14718508 15235388 15145501 15630061 15716557 15576838 15990557 15944913 15606566
5077A5606566P54544m0772L8801K92227j68198j59827L06414m6844K38574M4474
$$ 15606566 16361110 16320338 16359139 16651366 16483168 16323341 16629755 16582911 16821485 16865959
5067A6865959J11733o35588O06062j10753O09933j67421K06695J2501K97104J88258
$$ 16865959 16977692 16342104 16948166 16837413 17447346 17279925 17486620 17499121 17796225 17984483
5057A7984483K70285M23996J49463J57798N25608J54022p7527L40019N57257P69788
$$ 17984483 18254768 18678764 18828227 18986025 19511633 19665655 19588128 19928147 20485404 21255192
5047B1255192J12285P14383o0862M09655K61948K62360L02312K60369J02684P27430
$$ 21255192 21367477 22081860 22020998 22430653 22692601 22954961 23257273 23517642 23620326 24347756
5037B4347756K38308J50667j03746N05546J09953o054J19731P3588L34254K5938
$$ 24347756 24586064 24736731 24632985 25138531 25248484 25242430 25362161 25435749 25770003 25795941
5027B5795941K80383p2839K83270K47838q2920J01682r0871J2468J08653k24697
$$ 25795941 26076324 26003485 26286755 26534593 26451673 26553355 26462484 26474952 26583605 26358908
5017B6358908J14526K99793L79264j80583k6288J28529K14674J95102k32086L01014
$$ 26358908 26473434 26773227 27152491 26971908 26945620 27074149 27288823 27483925 27251839 27552853
5007B7552853Q0037j26408K2391J92994K84950n43978m7690K42514M64693l13738
$$ 27552853 27632890 27506482 27528873 27721867 28006817 27462839 27415149 27657663 28122356 27808618
4997B7808618L01740L91802j4397J2997J76404L17233L34734q6272M94424P0678
$$ 27808618 28110358 28502160 28487763 28500760 28677164 28994397 29329131 29242859 29737283 29807961
4987B9807961M10612j10456M93612N38380K49267L9712P27105j80028Q3587M66598
$$ 29807961 30218573 30108117 30601729 31140109 31389376 31429088 32156193 31976165 32059752 32526350
4977C2526350N03637J74118R4754N14412R13O17508m40060M82749M83757J27545
$$ 32526350 33029987 33204105 33298859 33813271 33814184 34431692 33991632 34474381 34958138 35085683
4967C5085683M53131K79400L75455Q95960P50416K48318L74995J164230P94727
$$ 35085683 35538814 35818214 36193669 37089629 37840045 38088363 38463358 39627588 40422315
4958D0422315L66277J233989O56197R27800R18192P61124J045792J061062J156209
$$ 40422315 40788592 42022581 42678778 43606578 44524770 45285894 46331686 47392748 48548957
4949D8548957P15782J024182J026695O54691J318475P44118O74110Q55852O22584
$$ 48548957 49264739 50288921 51315616 51970307 53288782 54032900 54707010 55562862 56185446
4940E6185446M93519M14369N81325N4176P34449K47080M30998O79463O84326L52996
$$ 56185446 56678965 57093334 57674659 57728835 58463284 58710364 59141362 59820825 60505151 60858147
4930F0858147L28935L79378R31430M23623J310960N32171P55143N89994O95334
$$ 60858147 61187082 61566460 62497890 62921513 64232473 64764644 65519787 66109781 66805115
4921F6805115J277322M67232J369078R16325P96273J074615J345092O84431J309441
$$ 66805115 68082437 68549669 69918747 70835072 71631345 72705960 74051052 74735483 76044924
4912G6044924Q21538Q11405R78837Q71609J091036O72776O28203J418650O02208
$$ 76044924 76866462 77677867 78656704 79528313 80619349 81292125 81920328 83338978 83941186
4903H3941186J101765J044798J116199J097328J328879J112743J227928J146998
$$ 83941186 85042951 86087749 87203948 88301276 89630155 90742898 91970826 93117824
4895I3117824R36142J149663J107816J049992J531305J537487R86273J694356
$$ 93117824 94053966 95203629 96311445 97361437 98892742 100430229 101416502 103110858
4887A03110858J626398J415770J527661J711633K349815J126392J655370J399554
$$ 103110858 104737256 106153026 107680687 109392320 111742135 112868527 114523897 115923451
4879A15923451J654200J441705J224680R69842Q47333P45706L07106j8122k88051
$$ 115923451 117577651 119019356 120244036 121213878 122061211 122806917 123114023 123095901 122807850
4870A22807850o94328n42314j104909o62258j058428j099260j889323j113309
$$ 122807850 122113522 121571208 120466299 119804041 118745613 117646353 115757030 114643721
4862A14643721j540755n13963j589589j127706p34321p31439q87367o40886n05995
$$ 114643721 113102966 112589003 110999414 109871708 109137387 108405948 107518581 106877695 106371700
4853A06371700k59178r15819j82128N2360m83689m95030J53011k42193n70865
$$ 106371700 106112522 105196703 105014575 105066935 104583246 104088216 104241227 103999034 103428169
4844A03428169P7597J88078n87136m83090n7390j64850l75589L2492m49373J6233
$$ 103428169 103505766 103693844 103106708 102623618 102566228 102401378 102025789 102058281 101608908 101625141
4834A01625141l08588l69498n36789j18660m93030q52400m19540p18153o26624
$$ 101625141 101316553 100947055 100410266 100291606 99798576 98946176 98526636 97808483 97181859
4825I7181859r87253j227254q34221k086672n56796j583726j950166j068086j966832
$$ 97181859 96194606 94967352 94133131 92046459 91489663 89905937 87955771 86887685 84920853
4816H4920853j600507j955955j984463j859377j660120j890570j293321j823330
$$ 84920853 83320346 81364391 79379928 77520551 75860431 73969861 72676540 70853210
4808G0853210j963779j531662j582258j473293j023629j510934j108924j677102
$$ 70853210 68889431 67357769 65775511 64302218 63278589 61767655 60658731 58981629
4800E8981629q87995j019131j200133j630780p08038j212594j076100j365257
$$ 58981629 58093634 57074503 55874370 54243590 53535552 52322958 51246858 49881601
4792D9881601p96594j332924j214760j159021p10759n61736j262120o97946o85672
$$ 49881601 49085007 47752083 46537323 45378302 44667543 44105807 42843687 42145741 41460069
4783D1460069r76302o24002j250715j26021j196726m03394j03358j176838m18618
$$ 41460069 40483767 39859765 38609050 38483029 37286303 36882909 36779551 35602713 35184095
4774C5184095o53228q97594l62861k19182p41216j71118o68481m72462n92738
$$ 35184095 34530867 33633273 33270412 33051230 32310014 32138896 31470415 30997953 30405215
4765C0405215J75786j080152N4071n18574k49459l22146m62389K08502m78294
$$ 30405215 30581001 29500849 29554920 29036346 28786887 28464741 28002352 28210854 27732560
4756B7732560p7073l92987j55826k57779k36063M3541m59555M93952l02665m31771
$$ 27732560 27655487 27262500 27106674 26848895 26612832 26656373 26196818 26690770 26388105 25956334
4746B5956334L11572l96546k57137L6807o2153k13626r328K71766m85886J150553
$$ 25956334 26267906 25871360 25614223 25651030 25588877 25375251 25365923 25637689 25151803 26302356
4736B6302356r11033K84904m11263K26758k46543K62712L51418m19822J78443
$$ 26302356 25391323 25676227 25264964 25491722 25245179 25507891 25859309 25439487 25617930
4727B5617930K11535k66817L35433L78815k87864L45973l82558K42846k63796
$$ 25617930 25829465 25562648 25898081 26276896 25989032 26335005 25952447 26195293 25931497
4718B5931497Q0294K96534k00009o162j11402K69394k5552J56580J06977l46491
$$ 25931497 26011791 26308325 26108316 26102154 25990752 26260146 26234594 26391174 26498151 26151660
4708B6151660j01329L31541j90646Q4887r1440k90908N48062o59594M0429L77126
$$ 26151660 26050331 26381872 26191226 26276113 26184673 25893765 26441827 25782233 25822662 26199788
4698B6199788K24757J10635m14270J99716L08877n1903J65809K58350j13640L62727
$$ 26199788 26424545 26535180 26120910 26320626 26629503 26577600 26743409 27001759 26888119 27250846
4688B7250846n38993M15397Q65930K8927k06978M26168m82476L88880M06510o29549
$$ 27250846 26711853 27127250 27993180 28022107 27815129 28241297 27758821 28147701 28554211 27924662
4678B7924662K15100K19152M1757N44391q89625L91541k01304j00576m44883P8336
$$ 27924662 28139762 28358914 28400671 28945062 28055437 28446978 28245674 28145098 27700215 27778551
4668B7778551l16378l68566n44088j51405l67097m93206m4916p05258l893n98780
$$ 27778551 27462173 27093607 26549519 26398114 26031017 25537811 25492895 24787637 24783744 24184964
4658B4184964r075l65305m81329J26055j014256K11165o82889m86875k6331l33317
$$ 24184964 24175889 23810584 23329255 23455310 22441054 22652219 21969330 21482455 21456124 21122807
4648B1122807j05392r8475k15780K99399l76851K35256o5384k65893N06267j14220
$$ 21122807 21017415 20918940 20703160 21002559 20625708 20860964 20795580 20529687 21035954 20921734
4638B0921734K41529k3675m8080M41798K53766L40938l4874J15376J05711K48762
$$ 20921734 21163263 21139588 21091508 21533306 21787072 22128010 22093136 22208512 22314223 22562985
4628B2562985J64227Q57619K71985k42820N65136M4960L55552M05890j40139M88568
$$ 22562985 22727212 23584831 23856816 23613996 24179132 24224092 24579644 24985534 24845395 25333963
4618B5333963l43078O58355j00446K4045M93154R9422Q6878Q8233M22503K24801
$$ 25333963 24990885 25649240 25548794 25572839 26065993 26165415 26252293 26340526 26763029 26987830
4608B6987830m94579M41928J72171J78380M1542O1014K78686L2640l97837J48178
$$ 26987830 26493251 26935179 27107350 27285730 27327272 27388286 27666972 27699612 27301775 27449953
4598B7449953j96686K44817k15258K03498N38095l46496L55408n76721L53136
$$ 27449953 27253267 27498084 27282826 27486324 28024419 27677923 28033331 27456610 27809746
4589B7809746N32898k03917M72790N59400L63027m17750P27803J03842J22491
$$ 27809746 28342644 28138727 28611517 29170917 29533944 29116194 29843997 29947839 30070330
4580C0070330J71777J008539j2092J29071j24549L49746o47534P57895m83875
$$ 30070330 30242107 31250646 31238554 31367625 31243076 31592822 30945288 31703183 31219308
4571C1219308J51797k0138l27254n7194o9181K23464k34068O76096m43695j02908
$$ 31219308 31371105 31350967 31023713 30966519 30897338 31120802 30886734 31562830 31119135 31016227
4561C1016227M34300m0002Q4157K3838L03650j56040K51845m41750M09842p68648
$$ 31016227 31450527 31410525 31494682 31518520 31822170 31666130 31917975 31476225 31886067 31117419
4551C1117419O24923n04690l34044p24734J97928k10384o70620m88579j09546
$$ 31117419 31742342 31237652 30903608 30178874 30376802 30166418 29495798 29007219 28897673
4542B8897673J79999p14449O16697l13088k30080j59258L17824r9461o14230K45661
$$ 28897673 29077672 28363223 28979920 28666832 28436752 28277494 28595318 28495857 27881627 28127288
4532B8127288K93104n57857j9670k3700m94385j60533j713n24784n09407j57632
$$ 28127288 28420392 27862535 27842865 27819165 27324780 27164247 27162534 26637750 26128343 25970711
4522B5970711r51066l6699k90294o91695m3351k49452l79532m03562j78595n16554
$$ 25970711 25019645 24982946 24692652 24000957 23957606 23708154 23328622 22925060 22746465 22229911
4512B2229911l07623l4049l98221J58803n09619j52849j94320k56356n69356L16236
$$ 22229911 21922288 21888239 21490018 21648821 21139202 20986353 20792033 20535677 19966321 20282557
4502B0282557o64616j08672o37760K13832o44486j50088m11606l46563r0278K3328
$$ 20282557 19617941 19509269 18871509 19085341 18440855 18290767 17879161 17532598 17442320 17465648
4492A7465648k37189r78704L84617J63596o94182j36467j04661k02259k13027
$$ 17465648 17228459 16249755 16634372 16797968 16103786 15967319 15862658 15660399 15447372
4483A5447372l74430p520k20064l07814j10065n46620O1218l62056k07660j55585
$$ 15447372 15072942 15065422 14845358 14537544 14427479 13880859 13942077 13580021 13372361 13216776
4473A3216776k83460k10792M7747k86964j02789l90363k41868n77617M19465j98106
$$ 13216776 12933316 12722524 12770271 12483307 12380518 11990155 11748287 11170670 11590135 11392029
4463A1392029o45k54856k56608j79725j67844j2170k64234K89481J20214m50959
$$ 11392029 11391384 11136528 10879920 10700195 10532351 10520181 10255947 10545428 10665642 10214683
4453A0214683j29452n3122M6942m44643K06241r7095j99279J35573m02385J92862
$$ 10214683 10085231 10032109 10079051 9634408 9840649 9743554 9544275 9679848 9277463 9470325
4443I470325k58317K85374N9970l45328L2841p2354K80135J96485o76074K80053
$$ 9470325 9212008 9497382 9557352 9212024 9244865 9172511 9452646 9649131 8973057 9253110
4433I253110q8226K76320n3993J8960m80449j6161L64464n7447j56910l7667m5981
$$ 9253110 9164884 9441204 9387211 9406171 8925722 8909561 9274025 9216578 9059668 9022001 8976020
4422H976020K72010j66360L35064n44362M45951o9300K50171k28956N4253J04453
$$ 8976020 9248030 9081670 9416734 8872372 9318323 9249023 9499194 9270238 9324491 9428944
4412I428944J01434p9047j067k97154J40320j33885L21657j62143p2073L21445
$$ 9428944 9530378 9451331 9450264 9153110 9293430 9159545 9481202 9319059 9246986 9568431
4402I568431J45010K34091J12045j03210O9562J86715J60305p1006j48407M82611
$$ 9568431 9713441 9947532 10059577 9956367 10025929 10212644 10372949 10301943 10153536 10636147
4392A0636147k10822M21143P5642p780j17291L74492j68283J51154J24365N11187
$$ 10636147 10425325 10846468 10922110 10914330 10797039 11171531 11003248 11154402 11278767 11789954
4382A1789954j20699j08771J37149M0102M77230j79147N70268L8163j244L19631
$$ 11789954 11669255 11560484 11697633 11737735 12214965 12035818 12606086 12644249 12643005 12962636
4372A2962636K59063J5937N66196N7834m0191M71660M36648j17213j54056M02377
$$ 12962636 13221699 13237636 13803832 13861666 13821475 14293135 14729783 14612570 14458514 14860891
4362A4860891J18598M64225m6048L34362n9189K05290L82803J7376M36013Q8000
$$ 14860891 14979489 15443714 15397666 15732028 15672839 15878129 16260932 16278308 16714321 16802321
4352A6802321l3875M09255k79573N00318K22575M65742o85277M86404M13310l20170
$$ 16802321 16768446 17177701 16898128 17398446 17621021 18086763 17401486 17887890 18301200 17981030
4342A7981030j57274N01360k80795n5789P36013j33588L7173K23330L91435Q4092
$$ 17981030 17823756 18325116 18044321 17988532 18724545 18590957 18628130 18851460 19242895 19326987
4332A9326987L12016P81318J9957K61459M3476j75736N20967N33852N40115n76536
$$ 19326987 19639003 20420321 20440278 20701737 20745213 20569477 21090444 21624296 22164411 21587875
4322B1587875Q83220J05082K72661K69503K33040M77849J68585L51693K09263
$$ 21587875 22471095 22576177 22848838 23118341 23351381 23829230 23997815 24349508 24558771
4313B4558771j42857L59009L60900K68984j15594L50381k93976L70732l05341
$$ 24558771 24415914 24774923 25135823 25404807 25289213 25639594 25345618 25716350 25411009
4304B5411009K16028K68449K53073k86045J49094j78376J73890M64965l20227
$$ 25411009 25627037 25895486 26148559 25862514 26011608 25833232 26007122 26472087 26151860
4295B6151860q2466K76330K07889K91648j96613N17316j19194Q303K2876N12669
$$ 26151860 26069394 26345724 26553613 26845261 26648648 27165964 27046770 27055073 27077949 27590618
4285B7590618k7372R00401K13933M02891P08539J89680Q50968O89566K30112J288479
$$ 27590618 27563246 28463647 28677580 29080471 29789010 29978690 30829658 31519224 31749336 33037815
4275C3037815M09851J151830N75813J353265Q28327Q74586J524207J315069P31631
$$ 33037815 33447666 34599496 35175309 36528574 37356901 38231487 39755694 41070763 41802394
4266D1802394J603314J619438J203176J693594J667729J557520J526071J684237
$$ 41802394 43405708 45025146 46228322 47921916 49589645 51147165 52673236 54357473
4258E4357473K061219J532739K068809J981491J945452K108615J970533J942526
$$ 54357473 56418692 57951431 60020240 62001731 63947183 66055798 68026331 69968857
4250F9968857J900948K170291J596122K265467J320009K222773J027004J190978
$$ 69968857 71869805 74040096 75636218 77901685 79221694 81444467 82471471 83662449
4242H3662449J194182O26366L85844N53588L40221q352j83358k43985L2200q62530
$$ 83662449 84856631 85482997 85868841 86422429 86762650 86754298 86570940 86326955 86359155 85496625
4232H5496625j47960n38804m64789p12624n57423j413329p74025j266124j104710
$$ 85496625 85348665 84809861 84345072 83632448 83075025 81661696 80887671 79621547 78516837
4223G8516837j303763j878475j816654k263639j690286k045867k288026k454626
$$ 78516837 77213074 75334599 73517945 71254306 69564020 67518153 65230127 62775501
4215F2775501k282879j367489k352248k420127j593956j984323j911970j536485
$$ 62775501 60492622 59125133 56772885 54352758 52758802 50774479 48862509 47326024
4207D7326024j553199j493370j438681j452979j576933j001499j186683j208889
$$ 47326024 45772825 44279455 42840774 41387795 39810862 38809363 37622680 36413791
4199C6413791r10538q70937j059734q68491p69295j150216l69131j041773o35712
$$ 36413791 35503253 34632316 33572582 32704091 31934796 30784580 30415449 29373676 28737964
4190B8737964j087280m40308l65194m72835j069318j81535q14183k97340m99298
$$ 28737964 27650684 27210376 26845182 26372347 25303029 25121494 24307311 24009971 23510673
4181B3510673q60912R5692p01344m02981p61522L48840m90837m26199p21240n84654
$$ 23510673 22649761 22745453 22044109 21641128 20879606 21228446 20737609 20311410 19590170 19005516
4171A9005516m02201m48510n00187j84309k60075l96896k50331m19847k42857
$$ 19005516 18603315 18154805 17654618 17470309 17210234 16813338 16563007 16143160 15900303
4162A5900303j98710o59488O5916k32020M8635l08109k78312m91039o7276j3037
$$ 15900303 15701593 15042105 15108021 14876001 14924636 14616527 14338215 13847176 13779900 13766863
4152A3766863l61960J69415l34190K09870m68938J57126J55282o29610K19991
$$ 13766863 13404903 13574318 13240128 13449998 12981060 13138186 13293468 12663858 12883849
4143A2883849k47476j78316k57428K84682K5499o7007o8124j08705m49393J68787
$$ 12883849 12636373 12458057 12200629 12485311 12510810 12443803 12375679 12266974 11817581 11986368
4133A1986368k90814K32095l83593K23511j38822J21704l91126j31562N40860
$$ 11986368 11695554 11927649 11544056 11767567 11628745 11750449 11359323 11227761 11768621
4124A1768621n5407k65898m6726N78658l84314J59105j04488K54334j11672K90249
$$ 11768621 11713214 11447316 11400590 11979248 11594934 11754039 11649551 11903885 11792213 12082462
4114A2082462P9603m38691J90529K02935L92467j33757n281j42205L78962K18937
$$ 12082462 12162065 11723374 11913903 12116838 12509305 12375548 12370267 12228062 12607024 12825961
4104A2825961q3642P7827L01308l27002M11958J67510P9268J27451J43901J42600
$$ 12825961 12742319 12820146 13121454 12794452 13206410 13373920 13453188 13580639 13724540 13867140
4094A3867140O70283k93264J79611M6007K80886M85450j01992K71554L88661J30960
$$ 13867140 14537423 14244159 14423770 14469777 14750663 15236113 15134121 15405675 15794336 15925296
4084A5925296R5563J11945N3893N71599K44732k09479Q56941k76324j45466L23829
$$ 15925296 16020859 16132804 16186697 16758296 17003028 16793549 17650490 17374166 17228700 17552529
4074A7552529M45685L34233k65939N93307J43657k23296J91064l7602K26228M0945
$$ 17552529 17998214 18332447 18066508 18659815 18803472 18580176 18771240 18733638 18959866 19000811
4064A9000811K65144j06009j46443J6353k80869K78884n07128L72167n58479J67292
$$ 19000811 19265955 19159946 19013503 19029856 18748987 19027871 18520743 18892910 18334431 18501723
4054A8501723l31576l96510K17190P0462j50339k44556K01016Q7356k80257j96167
$$ 18501723 18170147 17773637 17990827 18061289 17910950 17666394 17867410 17954766 17674509 17478342
4044A7478342m5361J89212j27137k63010N13695l12004m0102O4641M14912N6354
$$ 17478342 17432981 17622193 17495056 17232046 17745741 17433737 17393635 17458276 17873188 17929542
4034A7929542j63832J431M98842j55510n2158L00179k45857L74747j69929L84053
$$ 17929542 17765710 17767141 18265983 18110473 18058315 18358494 18112637 18487384 18317455 18701508
4024A8701508k01413l778K37603L9444j8831L10430r0760k92689M01918r4648
$$ 18701508 18500095 18496317 18733920 18773364 18754533 19064963 18974203 18681514 19083432 18988784
4014A8988784j32169K72618J42954j43611J8860k86749k21127M43638l94947q192
$$ 18988784 18856615 19129233 19272187 19128576 19147436 18860687 18639560 19083198 18688251 18680059
4004A8680059n55351l9841o32250j83891j02823K7552n66476l6330m47853l41542
$$ 18680059 18124708 18084867 17452617 17268726 17165903 17193455 16626979 16590649 16142796 15801254
3994A5801254J2736l82771j32367m68966R0530n07226q8899p09935K67088j47557
$$ 15801254 15813990 15431219 15298852 14829886 14920416 14413190 14324291 13614356 13881444 13733887
3984A3733887l91446J9929k37098k41911k10128n5571j55242p0459k40848l26661
$$ 13733887 13342441 13362370 13125272 12883361 12673233 12617662 12462420 12391961 12151113 11824452
3974A1824452n1222K69901l29148J66872l88616k85323L36837o38422M04079o8872
$$ 11824452 11773230 12043131 11713983 11880855 11492239 11206916 11543753 10905331 11309410 11240538
3964A1240538k19371k99701K41604p6137r882l01173K49563k48658j16791J42917
$$ 11240538 11021167 10721466 10963070 10886933 10877051 10575878 10825441 10576783 10459992 10602909
3954A0602909j87169J03253n3255l08419k28786L24914m12815L20186K08825n67134
$$ 10602909 10415740 10518993 10465738 10157319 9928533 10253447 9840632 10160818 10369643 9802509
3944I802509o497Q3820J1565K17031l13692L49155l86326J76274k47995J56015
$$ 9802509 9796012 9879832 9891397 10108428 9794736 10143891 9757565 9933839 9685844 9841859
3934I841859m59600J60789J63391j25179K47261J4704k82581Q2572J45540k09736
$$ 9841859 9382259 9543048 9706439 9581260 9828521 9843225 9560644 9643216 9788756 9579020
3924I579020o3020j38326M78j28541K49408k26608J97566k00580m7159K0005r5875
$$ 9579020 9516000 9377674 9378152 9249611 9499019 9272411 9469977 9269397 9222238 9242243 9146368
3913I146368j58532N9433L13806M1663l25318K84654k83071J6574k56650J71854
$$ 9146368 8987836 9047269 9361075 9402738 9077420 9362074 9079003 9095577 8838927 9010781
3903I010781K57134q5794k2305J09907J1330j26683R4975j39515J70237P2466
$$ 9010781 9267915 9182121 9159816 9269723 9281053 9154370 9249345 9109830 9280067 9352533
3893I352533p574k56654J38372j32398N54756j25773m07095M49049j94393M54467
$$ 9352533 9344959 9088305 9226677 9094279 9649035 9523262 9116167 9565216 9370823 9825290
3883I825290J05054j13188q5578m81277K94123L95427j10299k21176L44529k31474
$$ 9825290 9930344 9817156 9731578 9250301 9544424 9939851 9829552 9608376 9952905 9721431
3873I721431K53399K5620J71596K4838k01343J88595n4742K80150O2137L38624
$$ 9721431 9974830 10000450 10172046 10196884 9995541 10184136 10129394 10409544 10471681 10810305
3863A0810305o933j8907k77770M65854l79785K70583j41886J97558n3294J70631
$$ 10810305 10803372 10784465 10506695 10972549 10592764 10863347 10721461 10919019 10865725 11036356
3853A1036356J06678M2555M9120M0109K80921K26577j13376n3435M96648r5819
$$ 11036356 11143034 11185589 11234709 11274818 11555739 11782316 11668940 11615505 12112153 12016334
3843A2016334K9351m704L23505K77076k60486L915K2034N15655o98449M43824
$$ 12016334 12045685 12040981 12364486 12641562 12381076 12384991 12407025 12922680 12224231 12668055
3833A2668055J46105J57153K1566R706R9800j7406K51539L89654P6223l05726
$$ 12668055 12814160 12971313 12992879 13002585 13102385 13084979 13336518 13726172 13802395 13496669
3823A3496669J99241k1089j895L05078J47666K83433M0098Q6941O859J83196K92023
$$ 13496669 13695910 13674821 13672926 13978004 14125670 14409103 14449201 14536142 14543001 14726197 15018220
3812A5018220l0289K04511j46906J62366J213L95390N6289p8656L26268L7554
$$ 15018220 14987931 15192442 15045536 15207902 15209115 15604505 15660794 15582138 15908406 15945960
3802A5945960K56810L08727K92259M99994J6452j82004J58146L80556J03342O37292
$$ 15945960 16202770 16511497 16803756 17303750 17320202 17138198 17296344 17676900 17780242 18417534
3792A8417534p9467k40307N11676j40209Q30010p5058J66127O15177p6057M41832
$$ 18417534 18338067 18097760 18609436 18469227 19299237 19224179 19390306 20005483 19929426 20371258
3782B0371258O64298k24175P30555N76578M1076M76172J2776N15181N80940K56870
$$ 20371258 21035556 20811381 21541936 22118514 22159590 22635762 22648538 23163719 23744659 24001529
3772B4001529L25436R76761J80337P78137N4018O04774O91072N48802M73804J251733
$$ 24001529 24326965 25303726 25484063 26262200 26316218 26920992 27612064 28160866 28634670 29886403
3762B9886403K08489Q47592O88059R41427Q54099P38978J099757N70184J086449
$$ 29886403 30094892 30942484 31630543 32571970 33426069 34165047 35264804 35834988 36921437
3753C6921437J035971J469738J314754J067785R47657J339071J487056J288186
$$ 36921437 37957408 39427146 40741900 41809685 42757342 44096413 45583469 46871655
3745D6871655J361239J779157J855047J956141J456853K235502J847940J653126
$$ 46871655 48232894 50012051 51867098 53823239 55280092 57515594 59363534 61016660
3737F1016660K072693J768336K584907J745933K333445K260774K936432J929875
$$ 61016660 63089353 64857689 67442596 69188529 71521974 73782748 76719180 78649055
3729G8649055K408557K229497K401195K604144K507018K134119K089015K441313
$$ 78649055 81057612 83287109 85688304 88292448 90799466 92933585 95022600 97463913
3721I7463913K053223K282466J834263J712498K062928J616041J486461J311815
$$ 97463913 99517136 101799602 103633865 105346363 107409291 109025332 110511793 111823608
3713A11823608J235926J539610J599394J297841J303065J460550J577348J337717
$$ 111823608 113059534 114599144 116198538 117496379 118799444 120259994 121837342 123175059
3705A23175059K123206J216697J808039J749486J975605K178092J865745J913191
$$ 123175059 125298265 126514962 128323001 130072487 132048092 134226184 136091929 138005120
3697A38005120J522496J721859K026216J237979J726127J089867J249709M43805
$$ 138005120 139527616 141249475 143275691 144513670 146239797 147329664 148579373 149023178
3689A49023178P01690k41365M66429r20015j121562j076659r23755j669185j695976
$$ 149023178 149724868 149483503 149949932 149029917 147908355 146831696 145907941 144238756 142542780
3680A42542780j898899j761123k245706j526358j754625j969955j218925j567452
$$ 142542780 140643881 138882758 136637052 135110694 133356069 131386114 130167189 128599737
3672A28599737j438617j133563j024787m34633j215344q41466q73724o35906o91129
$$ 128599737 127161120 126027557 125002770 124568137 123352793 122511327 121637603 121001697 120310568
3663A20310568o99913r95132q95186p76194q85342j123689j344008o71545j910208
$$ 120310568 119610655 118615523 117720337 116944143 116058801 114935112 113591104 112919559 111009351
3654A11009351j853635j712945j526168k227960j680136k373486j278620k248879
$$ 111009351 109155716 107442771 105916603 103688643 102008507 99635021 98356401 96107522
3646I6107522j498657j874688j523389q90625j309754o11225j099381n09554j141529
$$ 96107522 94608865 92734177 91210788 90320163 89010409 88399184 87299803 86790249 85648720
3637H5648720k87195j52594l86640N7933L77130K07270N42781O22778O19154P99290
$$ 85648720 85361525 85208931 84822291 84880224 85257354 85464624 86007405 86630183 87249337 88048627
3627H8048627J179045O96944J265382J727242R59271J389949J918798J409233
$$ 88048627 89227672 89924616 91189998 92917240 93876511 95266460 97185258 98594491
3619I8594491K004602J931352K046374K122654K020443K279339K107718K398944
$$ 98594491 100599093 102530445 104576819 106699473 108719916 110999255 113106973 115505917
3611A15505917K575748K210702K125180L036400K402776K205565K406844K146264
$$ 115505917 118081665 120292367 122417547 125453947 127856723 130062288 132469132 134615396
3603A34615396K861587K000277K398658K139450K139410K073077K191642J761122
$$ 134615396 137476983 139477260 141875918 144015368 146154778 148227855 150419497 152180619
3595A52180619J792092K119804K046071J211074J967418J257994J723967P31602
$$ 152180619 153972711 156092515 158138586 159349660 161317078 162575072 164299039 165030641
3587A65030641J065403J281747R23693R90152l9237J77665j40189l06116o96231
$$ 165030641 166096044 167377791 168301484 169291636 169252399 169430064 169289875 168983759 168287528
3578A68287528q78809j057903j303029j295143k061542j448557k037216k505324
$$ 168287528 167408719 166350816 165047787 163752644 161691102 160242545 158205329 155700005
3570A55700005k450590j896185k487124k888063k486785k768625k568466k639692
$$ 155700005 153249415 151353230 148866106 145978043 143491258 140722633 138154167 135514475
3562A35514475l097324k576315k632018k926021l021325k781682l537622k408002
$$ 135514475 132417151 129840836 127208818 124282797 121261472 118479790 114942168 112534166
3554A12534166k779881k790558k982607k916826k604516k595295k521459k568936
$$ 112534166 109754285 106963727 103981120 101064294 98459778 95864483 93343024 90774088
3546I0774088k557043k453133k122048j777729j877653j962423j736060j941281
$$ 90774088 88217045 85763912 83641864 81864135 79986482 78024059 76287999 74346718
3538G4346718j665143j841024j091567j288709j883249j006851q04589j175783
$$ 74346718 72681575 70840551 69748984 68460275 66577026 65570175 64765586 63589803
3530F3589803p20862o86522r64351p17337n25722n55954k68307j011256m05609
$$ 63589803 62868941 62182419 61218068 60500731 59975009 59419055 59150748 58139492 57733883
3521E7733883J1416l02322l84948J75516k32432J46430L29979J546J33843J6439
$$ 57733883 57745299 57442977 57058029 57233545 57001113 57147543 57477522 57479068 57612911 57629350
3511E7629350N83596M82168j03704R46128P11206O67009N57519N23323J217013
$$ 57629350 58212946 58695114 58591410 59537538 60248744 60915753 61473272 61996595 63213608
3502F3213608J153055Q17198J164609J281413J494337R38313J540680K119212
$$ 63213608 64366663 65183861 66348470 67629883 69124220 70062533 71603213 73722425
3494G3722425Q46511J861648J761094J826613K242598J644843J801315K414263
$$ 73722425 74568936 76430584 78191678 80018291 82260889 83905732 85707047 88121310
3486H8121310J502860K224571K548403J966668J699597K694213K201492J751802
$$ 88121310 89624170 91848741 94397144 96363812 98063409 100757622 102959114 104710916
3478A04710916K688003J567682K245407J761569J847272J841940J581614J651024
$$ 104710916 107398919 108966601 111212008 112973577 114820849 116662789 118244403 119895427
3470A19895427J516085J650162Q68401J370906J208453K104461J186493J101317
$$ 119895427 121411512 123061674 123930075 125300981 126509434 128613895 129800388 130901705
3462A30901705K136145J454168J290159J340539J898858J182454J963309J757488
$$ 130901705 133037850 134492018 135782177 137122716 139021574 140204028 142167337 143924825
3454A43924825J532284J553751J449074Q69494J240602Q78431Q43289N9812O60245
$$ 143924825 145457109 147010860 148459934 149329428 150570030 151448461 152291750 152351562 153011807
3445A53011807j24258k77657j93026j123107r54668j694849j239920j870703j229462
$$ 153011807 152887549 152609892 152416866 151293759 150339091 148644242 147404322 145533619 144304157
3436A44304157j757467j917973j385842j651945j312301j921996j951677j434523
$$ 144304157 142546690 140628717 139242875 137590930 136278629 134356633 132404956 130970433
3428A30970433q76464j484475j125195j497515j420966j204941j400368j252245
$$ 130970433 130093969 128609494 127484299 125986784 124565818 123360877 121960509 120708264
3420A20708264j619771j220399k002048j897942j276818k635925j611839k352715
$$ 120708264 119088493 117868094 115866046 113968104 112691286 110055361 108443522 106090807
3412A06090807k379291k409046k516985k878585k686431k722120k519777l258094
$$ 106090807 103711516 101302470 98785485 95906900 93220469 90498349 87978572 84720478
3404H4720478k658557k376195k235180k541543k310144k097551j996421k304016
$$ 84720478 82061921 79685726 77450546 74909003 72598859 70501308 68504887 66200871
3396F6200871j583227k103758j509785j763905j422520j454803j318145j419917
$$ 66200871 64617644 62513886 61004101 59240196 57817676 56362873 55044728 53624811
3388E3624811j051537j546068o82091j451708n84250j232022r07004q39879n44939
$$ 53624811 52573274 51027206 50345115 48893407 48309157 47077135 46170131 45330252 44785313
3379D4785313j396424m97092n57190m07913r18402m46669m45881m86390o94105
$$ 44785313 43388889 42891797 42334607 41926694 41008292 40561623 40115742 39629352 38935247
3370C8935247j47814n71064j019271O95858j061407m65033j92524j53942j79803
$$ 38935247 38787433 38216369 37197098 37892956 36831549 36366516 36173992 36020050 35840247
3361C5840247k95905R1941o0799o76248j38613j10561J31231k58716q5510J06555
$$ 35840247 35544342 35636283 35575484 34899236 34760623 34650062 34781293 34522577 34437067 34543622
3351C4543622m94468l35355N23412j64591j11407J7576J63099J42675J50886K21480
$$ 34543622 34049154 33713799 34237211 34072620 33961213 33978789 34141888 34284563 34435449 34656929
3341C4656929l76652P45P18367p6984j51956O00488l37202M71993q6395P16838
$$ 34656929 34280277 34281022 34999389 34922405 34770449 35370937 35033735 35505728 35419333 36136171
3331C6136171j5532L43019j15218L64950O06421k04801O15409L666P43225L44620
$$ 36136171 36120639 36463658 36348440 36713390 37319811 37115010 37730419 37734085 38477310 38821930
3321C8821930j4647K26074M33305K59086M78246L12185j98010L73674O16774K10000
$$ 38821930 38807283 39033357 39466662 39725748 40203994 40516179 40318169 40691843 41308617 41518617
3311D1518617n3181J10662Q12382O8963L29378l07598P22504N51165K92752j46556
$$ 41518617 41465436 41576098 42388480 42457443 42786821 42479223 43201727 43752892 44045644 43899088
3301D3899088M74379j13499P46013M39847j25825Q08442J66821J42933J78036
$$ 43899088 44373467 44259968 45005981 45445828 45320003 46128445 46295266 46438199 46616235
3292D6616235K97577L21119K41661K96443L54373M85115k24592K56667O5270J79068
$$ 46616235 46913812 47234931 47476592 47773035 48127408 48612523 48387931 48644598 48709868 48888936
3282D8888936J5978K27922n9151L0346o9999M96629J13029m4887k08753J90515
$$ 48888936 48904914 49132836 49073685 49104031 49034032 49530661 49643690 49598803 49390050 49580565
3272D9580565n9436L49146Q9355K71198M42572j68911N30394j90332O00403k8939
$$ 49580565 49521129 49870275 49959630 50230828 50673400 50504489 51034883 50844551 51444954 51416015
3262E1416015J13008Q45794j69796P41343j45974M18742O20755L19010N45452
$$ 51416015 51529023 52374817 52205021 52946364 52800390 53219132 53839887 54158897 54704349
3253E4704349L10547N53549M38787Q22697K25175P93694O88843J042680J16317
$$ 54704349 55014896 55568445 56007232 56829929 57055104 57848798 58537641 59580321 59696638
3244E9696638P10767J763461O75803J018632J196994R51481J281508J191563J847602
$$ 59696638 60407405 62170866 62846669 63865301 65062295 66013776 67295284 68486847 70334449
3235G0334449J500211J430005J184458J901442J691530K344583J428611K365871
$$ 70334449 71834660 73264665 74449123 76350565 78042095 80386678 81815289 84181160
3227H4181160K428235K042511K322975K420962K426067K198015K537076K604335
$$ 84181160 86609395 88651906 90974881 93395843 95821910 98019925 100557001 103161336
3219A03161336L062227K499188K814558K639812L113107K641528L068344K673203
$$ 103161336 106223563 108722751 111537309 114177121 117290228 119931756 123000100 125673303
3211A25673303K770542K710581K797681L030130J884895K761032K559600K150707
$$ 125673303 128443845 131154426 133952107 136982237 138867132 141628164 144187764 146338471
3203A46338471K173213K532645J709413K289661K097783J621424J797201J569151
$$ 146338471 148511684 151044329 152753742 155043403 157141186 158762610 160559811 162128962
3195A62128962J229898J730952Q03255P81480J126408M8885M21501M18944k13317
$$ 162128962 163358860 165089812 165893067 166674547 167800955 167849840 168271341 168690285 168476968
3186A68476968j89615p43518o03880j381488j017080j794543j671892j841371
$$ 168476968 168287353 167543835 166939955 165558467 164541387 162746844 161074952 159233581
3178A59233581j851521j908238k579696k420790j815892k435353k628715k333125
$$ 159233581 157382060 155473822 152894126 150473336 148657444 146222091 143593376 141260251
3170A41260251k456295j882797k851655k327344k527300k344200k381038k426156
$$ 141260251 138803956 136921159 134069504 131742160 129214860 126870660 124489622 122063466
3162A22063466k687428l009124k409480j987573l022550k754547k542088k889032
$$ 122063466 119376038 116366914 113957434 111969861 108947311 106192764 103650676 100761644
3154A00761644k177468k579628k422154k088822k682013k212407k021986k477083
$$ 100761644 98584176 96004548 93582394 91493572 88811559 86599152 84577166 82100083
3146H2100083k150342j799519j973543j582325j782665j425461k097445q00806
$$ 82100083 79949741 78150222 76176679 74594354 72811689 71386228 69288783 68487977
3138F8487977j340796j753082j212698j441689p50648j344385q23054j058230
$$ 68487977 67147181 65394099 64181401 62739712 61989064 60644679 59821625 58763395
3130E8763395o86330j318310q12946j80478j181156n30110q97270k62364l78993
$$ 58763395 58077065 56758755 55945809 55765331 54584175 54054065 53156795 52894431 52515438
3121E2515438q33747m98701m87151j30072m75327l12926m54358k84911p10988
$$ 52515438 51681691 51182990 50695839 50565767 50090440 49777514 49323156 49038245 48327257
3112D8327257j92171k17637L39917l80915m83632O5841N9710n89306J17184j66606
$$ 48327257 48135086 47917449 48257366 47876451 47392819 47458660 47518370 46929064 47046248 46879642
3102D6879642O40k49054J66663K82925l48080L47746r1806M8057M36090k37361
$$ 46879642 46880282 46631228 46797891 47080816 46732736 47080482 46988676 47036733 47472823 47235462
3092D7235462L05394m36704N68956K71243N36649L25839n18969O67369L85957
$$ 47235462 47540856 47104152 47673108 47944351 48481000 48806839 48287870 48955239 49341196
3083D9341196K85897L79594K81325n3011J022179J55158M70728O50549K79028
$$ 49341196 49627093 50006687 50288012 50235001 51257180 51412338 51883066 52533615 52812643
3074E2812643Q82311K70583J112124M47048Q54871Q13427Q15974P69366R92803
$$ 52812643 53694954 53965537 55077661 55524709 56379580 57193007 58008981 58778347 59771150
3065E9771150O16725J470106O55041J334854J136260J499373J376559J551025
$$ 59771150 60387875 61857981 62513022 63847876 64984136 66483509 67860068 69411093
3057F9411093J168291J819549J847741J747394J598876J584412K267482K050843
$$ 69411093 70579384 72398933 74246674 75994068 77592944 79177356 81444838 83495681
3049H3495681K657477K138743K299997K385294K747713K711290K653564L095353
$$ 83495681 86153158 88291901 90591898 92977192 95724905 98436195 101089759 104185112
3041A04185112L203229L340647K889465L764960K834884M027327L031777L794950
$$ 104185112 107388341 110728988 113618453 117383413 120218297 124245624 127277401 131072351
3033A31072351L534278L885764L632406L545150M279817L416162L926176L579646
$$ 131072351 134606629 138492393 142124799 145669949 149949766 153365928 157292104 160871750
3025A60871750M115536L477033M054604L431994L651615L273508L855595K617527
$$ 160871750 164987286 168464319 172518923 175950917 179602532 182876040 186731635 189349162
3017A89349162K898680J992500K185466J961320J726181J090392J564681J284593
$$ 189349162 192247842 194240342 196425808 198387128 200113309 201203701 202768382 204052975
3009B04052975J739587J769757J826957K018295K337708K585927K220359K927675
$$ 204052975 205792562 207562319 209389276 211407571 213745279 216331206 218551565 221479240
3001B21479240K959516K502657L003467L767765K961071L104371L570467L704424
$$ 221479240 224438756 226941413 229944880 233712645 236673716 239778087 243348554 247052978
2993B47052978L672263M064258M594999M332751N069481M724042N737893N799188
$$ 247052978 250725241 254789499 259384498 263717249 268786730 273510772 279248665 285047853
2985B85047853N894076N645573O519626O309804O140782O659889P074037O439122
$$ 285047853 290941929 296587502 303107128 309416932 315557714 322217603 329291640 335730762
2977C35730762O621236O391946P021670O484779N924758N680318N774950M820436
$$ 335730762 342351998 348743944 355765614 362250393 368175151 373855469 379630419 384450855
2969C84450855M256783L025432K737199J305939k88046j165222l040613n269767
$$ 384450855 388707638 391733070 394470269 395776208 395488162 394322940 391282327 386012560
2961C86012560o584924q315120j0068442j0777355j0700595j1330689j1355494
$$ 386012560 379427636 371112516 361044074 350266719 339566124 328235435 316879941
2954C16879941j1217799j0631485j0150820j0043164q871196r049376q139889
$$ 316879941 305662142 295030657 284879837 274836673 265965477 256916101 248776212
2947B48776212q132771p302348o686668p395844o328565o032661o293988n142970
$$ 248776212 240643441 233341093 226654425 219258581 212930016 206897355 200603367 195460397
2939A95460397o140142n377852m851907n605730m543652m829855m662335m153834
$$ 195460397 189320255 183942403 179090496 173484766 168941114 164111259 159448924 155295090
2931A55295090m245695m227063l843910l325047l562491k826179l295956k698517
$$ 155295090 151049395 146822332 142978422 139653375 136090884 133264705 129968749 127270232
2923A27270232l097848k226525k560701k705047k141441j789037k309657k022330
$$ 127270232 124172384 121945859 119385158 116680111 114538670 112749633 110439976 108417646
2915A08417646j781707j447070j722856j525930j448352j426870j686375j621534
$$ 108417646 106635939 105188869 103466013 101940083 100491731 99064861 97378486 95756952
2907I5756952j631891j435308j316762j604905j954759k025172j529760k367650
$$ 95756952 94125061 92689753 91372991 89768086 87813327 85788155 84258395 81890745
2899H1890745j818663k067434k048995k147592j465572j803556k157860j414110
$$ 81890745 80072082 78004648 75955653 73808061 72342489 70538933 68381073 66966963
2891F6966963j587671j790718o15644j659018p90104j559455j285389k57090j152780
$$ 66966963 65379292 63588574 62972930 61313912 60523808 58964353 57678964 57421874 56269094
2882E6269094j112632p44339r22101p65344q71186o45996m61057r85677q03071
$$ 56269094 55156462 54412123 53490022 52724678 51853492 51207496 50746439 49760762 48957691
2873D8957691J04887q87405m52739m96807l84491n97949j35504k20657o25988
$$ 48957691 49062578 48175173 47722434 47225627 46841136 46243187 46107683 45887026 45261038
2864D5261038j03709j82780p55832l3966j57376l31737j66479j80666r2853k14728
$$ 45261038 45157329 44974549 44218717 44184751 44027375 43695638 43529159 43348493 43255640 43040912
2854D3040912j017l34838K82499l68686K51781l94053J84286J38811l17910P14366
$$ 43040912 43039895 42705057 42987556 42618870 42870651 42476598 42660884 42799695 42481785 43196151
2844D3196151j82135N9399K51127j91771M10024N06304J24369r448L57495N28886
$$ 43196151 43014016 43073415 43324542 43132771 43542795 44049099 44173468 44164020 44521515 45050401
2834D5050401M2392J00349N01204M87829o6447R30198K82341N28641K46248N93575
$$ 45050401 45092793 45193142 45694346 46182175 46115728 47045926 47328267 47856908 48103156 48696731
2824D8696731P30984O84300O32608P95528O18473P28240J020062N78218J088277
$$ 48696731 49427715 50112015 50744623 51540151 52158624 52886864 53906926 54485144 55573421
2815E5573421J485377N34249J222133J005476J236163J206437J281655J102739
$$ 55573421 57058798 57593047 58815180 59820656 61056819 62263256 63544911 64647650
2807F4647650J148022J442158J729284J646371J457287J637621J407407J807173
$$ 64647650 65795672 67237830 68967114 70613485 72070772 73708393 75115800 76922973
2799G6922973J958733J910750J754313J933027K000404J598374K039907K188151
$$ 76922973 78881706 80792456 82546769 84479796 86480200 88078574 90118481 92306632
2791I2306632K600738K113846K534440J951476L122666K188868K324450L410898
$$ 92306632 94907370 97021216 99555656 101507132 104629798 106818666 109143116 112554014
2783A12554014K725218K577874K964980K958055L701042L386153L541824L265880
$$ 112554014 115279232 117857106 120822086 123780141 127481183 130867336 134409160 137675040
2775A37675040L331838M127005L670982L904351M061299M096743M316825M285485
$$ 137675040 141006878 145133883 148804865 152709216 156770515 160867258 165184083 169469568
2767A69469568M847760M310696M656627M924449M527739M833972M607972M870251
$$ 169469568 174317328 178628024 183284651 188209100 192736839 197570811 202178783 207049034
2759B07049034M627742M580234N523503M312330M651898M478424M996582M999525
$$ 207049034 211676776 216257010 221780513 226092843 230744741 235223165 240219747 245219272
2751B45219272M442154M440874M717736M228585M063167M571164L204386L691035
$$ 245219272 249661426 254102300 258820036 263048621 267111788 271682952 274887338 278578373
2743B78578373L433240L122145K432857K556633J934478J929759J267679O10132
$$ 278578373 282011613 285133758 287566615 290123248 292057726 293987485 295255164 295865296
2735B95865296Q68422P32580k92522j15491l22105j023546j650576j577889j357523
$$ 295865296 296733718 297466298 297173776 297058285 296736180 295712634 294062058 292484169 291126646
2726B91126646k484901k326813l218138k460307l264163m108582l585080l677249
$$ 291126646 288641745 286314932 283096794 280636487 277372324 273263742 269678662 266001413
2718B66001413l980568m504430m562988m836241m606709m664951n162660m316587
$$ 266001413 262020845 257516415 252953427 248117186 243510477 238845526 233682866 229366279
2710B29366279n290986m610450m664004m450645n208491m009140m820848m553563
$$ 229366279 224075293 219464843 214800839 210350194 205141703 201132563 196311715 191758152
2702A91758152m423203m121576m345253m170089m554834l929950m222826l412375
$$ 191758152 187334949 183213373 178868120 174698031 170143197 166213247 161990421 158578046
2694A58578046m014769l253877m175457l130544l587655l538932l007190k979645
$$ 158578046 154563277 151309400 147133943 144003399 140415744 136876812 133869622 130889977
2686A30889977l146726k900764k834149k707677k432542k953449k296501k756679
$$ 130889977 127743251 124842487 122008338 119300661 116868119 113914670 111618169 108861490
2678A08861490k099698k301808k110463j995641k123076k604062j277531k299771
$$ 108861490 106761792 104459984 102349521 100353880 98230804 95626742 94349211 92049440
2670I2049440k070623j429709j831077j746068j744335j814308j784493j426787
$$ 92049440 89978817 88549108 86718031 84971963 83227628 81413320 79628827 78202040
2662G8202040j654475j331041j527443j596227j446493j563160j347784j424699
$$ 78202040 76547565 75216524 73689081 72092854 70646361 69083201 67735417 66310718
2654F6310718j080752j552943p16085j450360j219897j498067o03704j310263
$$ 66310718 65229966 63677023 62960938 61510578 60290681 58792614 58188910 56878647
2646E6878647r87112j037817j153051p33855j718419m64569j187121q10474q62225
$$ 56878647 55891535 54853718 53700667 52966812 51248393 50783824 49596703 48786229 47924004
2637D7924004o51187n87316j271339n26737j373277j6626q97699p21429o58034
$$ 47924004 47272817 46685501 45414162 44887425 43514148 43497522 42599823 41878394 41220360
2628D1220360q86996o08514p22062m38002q45803n00598n65780m31906k53243
$$ 41220360 40333364 39724850 39002788 38564786 37718983 37218385 36652605 36220699 35967456
2619C5967456j081907l33145o80132m33808m07784o60117l63421l47504o14057
$$ 35967456 34885549 34552404 33872272 33438464 33030680 32370563 32007142 31659638 31045581
2610C1045581m96613j99418l06673n72073j00542l86281j83858o01612o35754
$$ 31045581 30548968 30349550 30042877 29470804 29370262 28983981 28800123 28198511 27562757
2601B7562757J55953o90100k88165J65611k88923n82692j78619N4302n58690n694
$$ 27562757 27718710 27028610 26740445 26906056 26617133 26034441 25855822 25910124 25351434 25345740
2591B5345740J68104k28737n89260J25906l30484k14191l0871j7341r7155l63887
$$ 25345740 25513844 25285107 24695847 24821753 24491269 24277078 24246207 24228866 24131711 23767824
2581B3767824P7848r5495r8623J45884j18622L00491n87918q9948M8226o1007
$$ 23767824 23845672 23750177 23651554 23797438 23678816 23979307 23391389 23301441 23349667 23288660
2571B3288660N3529Q09867p89562O20619l49979O27417j83724r2264K14816M14754
$$ 23288660 23342189 24152056 23362494 23983113 23633134 24260551 24076827 23984563 24199379 24614133
2561B4614133l05092N00289K97101J93016L79726j05194M50987r6598N90115M07686
$$ 24614133 24309041 24809330 25106431 25299447 25679173 25573979 26024966 25928368 26518483 26926169
2551B6926169m0158L07698M06599M69689J35835j05678N27849L06309N53816L04350
$$ 26926169 26886011 27193709 27600308 28069997 28205832 28100154 28628003 28934312 29488128 29792478
2541B9792478j49647L62045L13988P7071k08949k55440J60567o2896n75583n45
$$ 29792478 29642831 30004876 30318864 30395935 30186986 29931546 30092113 30029217 29453634 29453089
2531B9453089k75430l61967J92551J33570q12119L29645J49397o66799L38500
$$ 29453089 29177659 28815692 29008243 29141813 28329694 28659339 28808736 28141937 28480437
2522B8480437j2717j79768K77803J27013M16725J31559j48881P60376n79602J04681
$$ 28480437 28467720 28287952 28565755 28692768 29109493 29241052 29092171 29852547 29272945 29377626
2512B9377626K05020M73109L7339r9899N46353L37196J02898k39060L33662j75911
$$ 29377626 29582646 30055755 30093094 29993195 30539548 30876744 30979642 30740582 31074244 30898333
2502C0898333P97883m876j43443L82567O95267k54945J84991J80466L06350K94477
$$ 30898333 31696216 31691340 31547897 31930464 32625731 32370786 32555777 32736243 33042593 33337070
2492C3337070k30571L02138M44247O5750O4231J27439L53218J7783P5580K15435
$$ 33337070 33106499 33408637 33852884 33918634 33982865 34110304 34463522 34481305 34556885 34772320
2482C4772320J62076P0961N00143K05894l84130L55153k23670J64276J40204Q2109
$$ 34772320 34934396 35005357 35505500 35711394 35327264 35682417 35458747 35623023 35763227 35845336
2472C5845336J60147m7930k84998M04972L17165m68347L89914j20488j41746J24314
$$ 35845336 36005483 35957553 35672555 36077527 36394692 35926345 36316259 36195771 36054025 36178339
2462C6178339o5260L56491l78738Q1173o9316K63905n72484J01090J87669n1956
$$ 36178339 36113079 36469570 36090832 36172005 36102689 36366594 35794110 35895200 36082869 36030913
2452C6030913J46359J35435n53555k92125N84118J51095j95846m39213Q6756l8865
$$ 36030913 36177272 36312707 35759152 35467027 36051145 36202240 36006394 35567181 35653937 35615072
2442C5615072o3699k59190M0017J22087J66625k96590j32435K91650j19167J30568
$$ 35615072 35551373 35292183 35332200 35454287 35620912 35324322 35191887 35483537 35364370 35494938
2432C5494938q9168K1768o1814O1011M10774M75222j69760k94786L60748r670
$$ 35494938 35405770 35427538 35365724 35426735 35837509 36312731 36142971 35848185 36208933 36199263
2422C6199263J04884o807J67950N45398N70764j12223M52290l82596M95436M63065
$$ 36199263 36304147 36297340 36465290 37010688 37581452 37469229 37921519 37538923 38034359 38497424
2412C8497424Q43638J38740K08965N12006M67497M72353L14658O34891J93651
$$ 38497424 39341062 39479802 39688767 40200773 40668270 41140623 41455281 42090172 42283823
2403D2283823P38728N00138P32165N46817L06265L73794Q20266P35750J036338
$$ 42283823 43022551 43522689 44254854 44801671 45107936 45481730 46301996 47037746 48074084
2394D8074084O19452N72255R04595Q30791J048725O37021J137814Q52747P56049
$$ 48074084 48693536 49265791 50170386 51001177 52049902 52686923 53824737 54677484 55433533
2385E5433533O10557J284002J122046J110100J241077J017233J090592O50981
$$ 55433533 56044090 57328092 58450138 59560238 60801315 61818548 62909140 63560121
2377F3560121J674574J072452R51203Q84477J276270J996481M70269Q90972J045286
$$ 63560121 65234695 66307147 67258350 68142827 69419097 71415578 71885847 72776819 73822105
2368G3822105J548686J058750J074561J488168J031283J458925J561069J470045
$$ 73822105 75370791 76429541 77504102 78992270 80023553 81482478 83043547 84513592
2360H4513592J723246J682604K422841K658018J758142K717253K534605K588989
$$ 84513592 86236838 87919442 90342283 93000301 94758443 97475696 100010301 102599290
2352A02599290K694545K777899K951371K871612K805868L333193L354963L459155
$$ 102599290 105293835 108071734 111023105 113894717 116700585 120033778 123388741 126847896
2344A26847896L838334L341175L611904M022559L477636L770294L141790L577615
$$ 126847896 130686230 134027405 137639309 141661868 145139504 148909798 152051588 155629203
2336A55629203L473530L528571K505988K831784J315558O70069r52667j176556
$$ 155629203 159102733 162631304 165137292 167969076 169284634 169954703 169002036 167825480
2328A67825480j072902k152391j947883j827631j707684j502645j375682q17352
$$ 167825480 166752578 164600187 162652304 160824673 159116989 157614344 156238662 155421310
2320A55421310o10906n80652K3209k57344j69429j83266m84304K00947n09969
$$ 155421310 154810404 154229752 154252961 153995617 153826188 153642922 153158618 153359565 152849596
2311A52849596j92166q77135j019310j804866l256584l848595m814050m797605
$$ 152849596 152657430 151780295 150760985 148956119 145699535 141850940 137036890 132239285
2303A32239285n513832m920089n697407m951497n198553m404547m100875m062168
$$ 132239285 126725453 121805364 116107957 111156460 105957907 101553360 97452485 93390317
2295I3390317m138702l302691l426533l264369l358349k811122k693570k897563
$$ 93390317 89251615 85948924 82522391 79258022 75899673 73088551 70394981 67497418
2287F7497418k298792k352854k178071k389983k144875j852808j749824j989219
$$ 67497418 65198626 62845772 60667701 58277718 56132843 54280035 52530211 50540992
2279E0540992j528777j671658j599202j161611j140329j374852j493484j279721
$$ 50540992 49012215 47340557 45741355 44579744 43439415 42064563 40571079 39291358
2271C9291358j126017j002940j424678n16979j096511j328695m65932n57874j041045
$$ 39291358 38165341 37162401 35737723 35220744 34124233 32795538 32329606 31771732 30730687
2262C0730687o69339r80115p81192o68611p93211m39378m41861j008795p35463
$$ 30730687 30061348 29081233 28300041 27631430 26838219 26398841 25956980 24948185 24212722
2253B4212722k73947m86799n24619n51006l54158n22732n52339m02472n31050
$$ 24212722 23938775 23451976 22927357 22376351 22022193 21499461 20947122 20544650 20013600
2244B0013600l03386m88075m2331m58675j20713p17774o9040q50098k73467l57001
$$ 20013600 19710214 19222139 19179808 18721133 18600420 17882646 17813606 16963508 16690041 16333040
2234A6333040k24388j47920l88844k15621k85183l74581l29479N534m89404l32601
$$ 16333040 16108652 15960732 15571888 15356267 15071084 14696503 14367024 14372558 13883154 13550553
2224A3550553K47798p40596l91002P6416r77482O86808n37903l12375k81100m3238
$$ 13550553 13798351 13057755 12666753 12743169 11765687 12452495 11914592 11602217 11321117 11277879
2214A1277879p9978n00030j30933n60182M98286l29039j3252m98618k89064M4538
$$ 11277879 11197901 10697871 10566938 10006756 10505042 10176003 10162751 9664133 9375069 9419607
2204I419607j75926j1559k5077j82851j012103r0915L02253l76014N07425l72496
$$ 9419607 9243681 9232122 9207045 9024194 8012091 7921176 8223429 7847415 8354840 7982344
2194G982344q2677o12631M84537j95330J22837j25669l39332m11730M98437k10272
$$ 7982344 7899667 7287036 7771573 7576243 7699080 7573411 7234079 6822349 7320786 7110514
2184G110514k01493n5297m3971k21220k362K19578l81241k24716j87921j33062
$$ 7110514 6909021 6853724 6809753 6588533 6586171 6805749 6424508 6199792 6011871 5878809
2174E878809K96609k93714k65848L73080l77443K32095k98713m6098r4501R7751
$$ 5878809 6175418 5881704 5615856 5988936 5611493 5843588 5544875 5498777 5404276 5502027
2164E502027p2637k33311P3903M9467J60930k04336Q5793k43665K19041l64787
$$ 5502027 5429390 5196079 5269982 5319449 5480379 5276043 5361836 5118171 5337212 4972425
2154D972425j82251K23669K39136l98877r2231N22983p01694K24375J47620m39093
$$ 4972425 4790174 5013843 5252979 4854102 4761871 5284854 4583160 4807535 4955155 4516062
2144D516062K60948Q9337j4284j17544j11334k98782L68715r6919r9107j96258
$$ 4516062 4777010 4866347 4852063 4734519 4623185 4324403 4693118 4596199 4497092 4300834
2134D300834K20020k90066M71347k89343Q1072j16230K67303K22686K53655o73469
$$ 4300834 4520854 4230788 4702135 4412792 4493864 4377634 4644937 4867623 5121278 4447809
2124D447809K23243m42466L51557o6585K21891q6480k54774J36917K81180l978
$$ 4447809 4671052 4228586 4580143 4513558 4735449 4648969 4394195 4531112 4812292 4808314
2114D808314l46589R8336R3841O3809q4340K19517M0274k94792K49976J56953
$$ 4808314 4461725 4560061 4653902 4717711 4633371 4852888 4893162 4598370 4848346 5005299
2104E005299J70291l07301L34272j76367L36657q098m00971J35420M83603k46738
$$ 5005299 5175590 4868289 5202561 5026194 5362851 5354753 4953782 5089202 5572805 5326067
2094E326067J364P5093L774M5708M87919p82878L96408J57739K64071j22713n38678
$$ 5326067 5327431 5402524 5406298 5452006 5939925 5157047 5553455 5711194 5975265 5852552 5313874
2083E313874M47557K0217Q1987m19398K39093L5368j50435M21776m19334J98937
$$ 5313874 5761431 5781648 5863635 5444237 5683330 5718698 5568263 5990039 5570705 5769642
2073E769642J00300k34934n22432L86978j85682p021j60198j00445L82773j26922
$$ 5769642 5869942 5635008 5112576 5499554 5313872 5306851 5146653 5046208 5428981 5302059
2063E302059l46377K6715j63142K54693k60239m71011J38260K50699R0965l00764
$$ 5302059 4955682 4982397 4819255 5073948 4813709 4342698 4480958 4731657 4822622 4521858
2053D521858j55827k86173l8244n3731p9747l4537j78177k61879K24694m33454
$$ 4521858 4366031 4079858 4041614 3987883 3908136 3873599 3695422 3433543 3658237 3224783
2043C224783K39202o36052J26731M4848k30878J39472q8143K3293j53905n9700
$$ 3224783 3463985 2827933 2954664 2999512 2768634 2908106 2819963 2843256 2689351 2629651
2033B629651J1988m66009j52370j13190R8630L09266j87471l98195K7449K96862
$$ 2629651 2641639 2175630 2023260 1910070 2008700 2317966 2130495 1732300 1759749 2056611
2023B056611m81453L37103m15642J96378k38782k38995k3970k40785M69144m53699
$$ 2056611 1575158 1912261 1496619 1692997 1454215 1215220 1191250 950465 1419609 965910
2013I65910K74101P309n39941K90697k36195N83952l09100m87549K83697l23925
$$ 965910 1240011 1247320 707379 998076 761881 1345833 1036733 549184 832881 508956
2003E08956J22256k9079J26649k95952O5525L56447l40166n02907K29002j20108
$$ 508956 631212 602133 728782 432830 498355 854802 514636 11729 240731 120623
1993A20623J00145L82207j96046J2060O2383k38188p5584J74842o96915N82509
$$ 120623 220768 602975 406929 418989 481372 243184 167600 342442 -354473 228036
1983B28036k61390K74021K3038m25209k5903J22475j59248J72992l4293l25765
$$ 228036 -33354 240667 263705 -161504 -187407 -64932 -224180 -51188 -85481 -411246
1973d11246M44632j51262j44215R5545k99784L85133m74137L41808o84126R25701
$$ -411246 33386 -117876 -262091 -166546 -466330 -81197 -555334 -213526 -897652 28049
1963B8049k26609k92349O8779j44164m4398K74526O9790o7093m31374J18951K06432
$$ 28049 -198560 -490909 -422130 -566294 -610692 -336166 -266376 -333469 -764843 -645892 -439460
1952d39460j0274j63918J453p3395J46260k06339J13231l28147K05555M2030q635
$$ -439460 -449734 -613652 -612199 -685594 -539334 -745673 -632442 -960589 -755034 -713004 -721639
1941g21639K90405l05171K12231l91085K29838K5534K3330p467k20264J98809
$$ -721639 -431234 -736405 -524174 -915259 -685421 -659887 -636557 -644024 -864288 -665479
1931f65479l24089q4611J55767K26379k76796j07522L40154n7564k13614j93542
$$ -665479 -989568 -1074179 -918412 -692033 -968829 -1076351 -736197 -793761 -1007375 -1200917
1921a200917J41289r5950R7456J32984K61668j57036j3009l08852O54591m24832
$$ -1200917 -1059628 -1155578 -1058122 -925138 -663470 -820506 -833515 -1142367 -487776 -912608
1911i12608P06442q54311j0656j81632j60944M50255R3056K76915j92393R814
$$ -912608 -206166 -1060477 -1071133 -1252765 -1413709 -963454 -870398 -593483 -785876 -776062
1901g76062m9144J82902n91069K54132J96352R7165n34573J58631J62227o99513
$$ -776062 -825206 -642304 -1233373 -979241 -782889 -685724 -1220297 -1061666 -899439 -1598952
1891a598952K71145K88534P7467l76314J66929J19796l9472k53068J95115L55057
$$ -1598952 -1327807 -1039273 -961806 -1338120 -1171191 -1051395 -1090867 -1343935 -1148820 -793763
1881g93763l63674j45268M96774m35005J62221k1572L3100j33237N6139j35722
$$ -793763 -1157437 -1302705 -805931 -1240936 -1078715 -1100287 -1067187 -1200424 -1144285 -1280007
1871a280007K16249j6733J72466l08826K90733k35492O4126N3835r7830j7079
$$ -1280007 -1063758 -1080491 -908025 -1216851 -926118 -1161610 -1097484 -1043649 -1141479 -1158558
1861a158558N822j89606L00959J14693o3067j78445M03141m44097L85844k88530
$$ -1158558 -1152736 -1342342 -1041383 -926690 -989757 -1168202 -765061 -1209158 -823314 -1111844
1851a111844m2294k04824N11628j53156r5902k6165J09673Q4773j62938O49k78696
$$ -1111844 -1154138 -1358962 -847334 -1000490 -1096392 -1122557 -1012884 -928111 -1091049 -1090400 -1369096
1840a369096K71928K45710n94628L20908k74415K96733l45955k549k6409O21352
$$ -1369096 -1097168 -851458 -1446086 -1125178 -1399593 -1102860 -1448815 -1451364 -1477773 -856421
1830h56421j99092k76902J30582K14146k01228J78223J65802n52045L87989k99573
$$ -856421 -1055513 -1332415 -1201833 -987687 -1188915 -1010692 -844890 -1396935 -1008946 -1308519
1820a308519J90841J4115j46675k85358L03027N0972J17420j51149r4498L74169
$$ -1308519 -1117678 -1103563 -1250238 -1535596 -1232569 -1181597 -1064177 -1215326 -1309824 -935655
1810i35655o37178L8131K41549J45206J90459m85035J46436J99856K36096K7853
$$ -935655 -1572833 -1534702 -1293153 -1147947 -957488 -1442523 -1296087 -1096231 -860135 -832282
1800h32282l42947j05874R5927P6956l92625L46023m5978r3809J42915L27769
$$ -832282 -1175229 -1281103 -1185176 -1108220 -1500845 -1154822 -1200800 -1294609 -1151694 -823925
1790h23925j85722k19649L29610n87026J88313k06128N6494N58363m01606M15199
$$ -823925 -1009647 -1229296 -899686 -1486712 -1298399 -1504527 -1448033 -889670 -1291276 -876077
1780h76077k87908m7343k11969K91107O5423r8138J80133k46760k49959j96315
$$ -876077 -1163985 -1211328 -1423297 -1132190 -1066767 -1164905 -984772 -1231532 -1481491 -1677806
1770a677806J98608J45883k46958J30295J31789r1925K06955M1923k00953J425
$$ -1677806 -1479198 -1333315 -1580273 -1449978 -1318189 -1410114 -1203159 -1161236 -1362189 -1360764
1760a360764l22688R6122J31157K67656m36458M57817k25707q8549J21897k24216
$$ -1360764 -1683452 -1587330 -1456173 -1188517 -1624975 -1167158 -1392865 -1481414 -1359517 -1583733
1750a583733L63740k93376J48716m44044K07302L89772n2935o53740M21438K24952
$$ -1583733 -1219993 -1513369 -1364653 -1808697 -1601395 -1211623 -1264558 -1918298 -1496860 -1271908
1740a271908j33641k87383L36872l47015K24119k46790M59318j32251r6183j27697
$$ -1271908 -1405549 -1692932 -1356060 -1703075 -1478956 -1725746 -1266428 -1398679 -1494862 -1622559
1730a622559K07091l87235J44330J81619L7450J17540k93818n5848J17959J43492
$$ -1622559 -1415468 -1802703 -1658373 -1476754 -1439304 -1321764 -1615582 -1671430 -1553471 -1409979
1720a409979R4196k78434J74197J17810j63072j40761K96395k52235k2965o4510
$$ -1409979 -1315783 -1594217 -1420020 -1302210 -1465282 -1606043 -1309648 -1561883 -1584848 -1649358
1710a649358r9426q0484p6102J92675M65979k31160m44694N00385l15226K21493
$$ -1649358 -1748784 -1829268 -1905370 -1712695 -1246716 -1477876 -1922570 -1422185 -1737411 -1515918
1700a515918J95547n22344N24909l72046N1486j05317J08341r6842L91030M9543
$$ -1515918 -1320371 -1842715 -1317806 -1689852 -1638366 -1743683 -1635342 -1732184 -1341154 -1291611
1690a291611j66094k28130K31237L77499j79983j40533j28439m8929J23639j70629
$$ -1291611 -1457705 -1685835 -1454598 -1077099 -1257082 -1397615 -1526054 -1574983 -1451344 -1621973
1680a621973k20910P5355K06612J56237O7297m55867J92947M00168k00423j5748
$$ -1621973 -1842883 -1767528 -1560916 -1404679 -1337382 -1793249 -1600302 -1200134 -1400557 -1416305
1670a416305J23454k24743K14572J01814k63745N0683m9914r295J25843l59540
$$ -1416305 -1292851 -1517594 -1303022 -1201208 -1464953 -1414270 -1464184 -1473479 -1347636 -1707176
1660a707176L82795k67045K41500j38028m1649J76463j16225J48850r1348j23448
$$ -1707176 -1324381 -1591426 -1349926 -1487954 -1529603 -1353140 -1469365 -1320515 -1411863 -1535311
1650a535311o78936M91164L86131l75776J41118m29417L91317O7640R6196M69258
$$ -1535311 -2214247 -1723083 -1336952 -1712728 -1571610 -2001027 -1609710 -1542070 -1445874 -976616
1640i76616m85959k67124K97772K11159l75524J13284o9436j10663p391j61118
$$ -976616 -1462575 -1729699 -1431927 -1220768 -1596292 -1483008 -1552444 -1663107 -1670498 -1831616
1630a831616K55633K70158m26868N3519J06843m07952K76048o7076O7492Q0560
$$ -1831616 -1575983 -1305825 -1732693 -1679174 -1572331 -1980283 -1704235 -1771311 -1703819 -1623259
1620a623259n5820j16256K9873L71405m22310J17674j96149J51333L08027l94794
$$ -1623259 -1679079 -1795335 -1765462 -1394057 -1816367 -1698693 -1894842 -1743509 -1435482 -1830276
1610a830276K60161j48590j23296N16007k75456j10514q7723K5311O4407J35129
$$ -1830276 -1570115 -1718705 -1842001 -1325994 -1601450 -1711964 -1799687 -1774376 -1709969 -1574840
1600a574840J86068k38927l05573L66549p1861J77886n97321P46239j80659k62703
$$ -1574840 -1388772 -1627699 -1933272 -1566723 -1638584 -1460698 -2058019 -1311780 -1492439 -1755142
1590a755142j14307J9953L10431o0551o8434J69959k30372L62898p4708m81767
$$ -1755142 -1869449 -1849496 -1539065 -1599616 -1668050 -1498091 -1728463 -1365565 -1440273 -1922040
1580a922040Q3565L44338j58066L74N2048j51921m3022K81055k39676J55176k2893
$$ -1922040 -1838475 -1494137 -1652203 -1651829 -1599781 -1751702 -1794724 -1513669 -1753345 -1598169 -1621062
1569a621062n776j01947R7506K85476m68715K52275p8004k64167L09470k12927
$$ -1621062 -1626838 -1728785 -1631279 -1345803 -1814518 -1562243 -1640247 -1904414 -1594944 -1807871
1559a807871K42130j84208j58021K69834k19727K83241L9925k37297J54462J70328
$$ -1807871 -1565741 -1749949 -1907970 -1638136 -1857863 -1574622 -1534697 -1771994 -1617532 -1447204
1549a447204k21831m8789J20618j67015K72369k37122M16983r14555Q09150L18439
$$ -1447204 -1669035 -1717824 -1597206 -1764221 -1491852 -1728974 -1311991 -2226546 -1417396 -1098957
1539a098957m30206k24833K73297j31684j27837O8054J7103L51692M9626m88886
$$ -1098957 -1529163 -1753996 -1480699 -1612383 -1740220 -1672166 -1655063 -1303371 -1253745 -1742631
1529a742631j39126J67599k1913K10595o4079L86899o3096O6422j57240k7282
$$ -1742631 -1881757 -1714158 -1736071 -1525476 -1589555 -1202656 -1265752 -1199330 -1356570 -1383852
1519a383852k54090K7224j9090K7804O6916J88048n13482K40276M2513k439K39941
$$ -1383852 -1637942 -1610718 -1629808 -1602004 -1535088 -1347040 -1860522 -1620246 -1577733 -1580172 -1340231
1508a340231k7834j04525o008R9052l44387L95478O3594k43307K97694l88485
$$ -1340231 -1368065 -1472590 -1478598 -1379546 -1723933 -1328455 -1264861 -1508168 -1210474 -1598959
1498a598959J45774J89713R4447l12218j23126M13663n03540N92074K86694l53466
$$ -1598959 -1453185 -1263472 -1169025 -1481243 -1604369 -1190706 -1694246 -1102172 -815478 -1168944
1488a168944j19022O3842p9332J84634j25953k652l1691J22649N4817n647m6212
$$ -1168944 -1287966 -1224124 -1303456 -1118822 -1244775 -1247427 -1279118 -1156469 -1101652 -1107299 -1153511
1477a153511K80052j89221n9906J03561k15541J51659J19546P9651k2054L17592
$$ -1153511 -873459 -1062680 -1122586 -1019025 -1234566 -1082907 -963361 -883710 -905764 -588172
1467e88172l03889n0130K21510m12313O31431k81495l16324O06397p2746q7600
$$ -588172 -892061 -942191 -720681 -1132994 -501563 -783058 -1099382 -492985 -565731 -653331
1457f53331p5558J43074l994J73396K80359k88366J46878K85432j10349J24261
$$ -653331 -728889 -585815 -589809 -416413 -136054 -424420 -277542 7890 -102459 21802
1447B1802j81793j26358L4401M95073J86781k6858m05266J1033K83276j97880
$$ 21802 -159991 -286349 -251948 243125 429906 403048 -2218 8815 292091 94211
1437I4211m36955P22333m94923K93588k58710m47719K03091j78148L46975m08386
$$ 94211 -342744 379589 -115334 178254 -80456 -528175 -325084 -503232 -156257 -564643
1427e64643J4654J28063P1754o62092Q043K01388J97735K3405q3845n98752K24923
$$ -564643 -549989 -421926 -350172 -1012264 -1004221 -802833 -605098 -581693 -665538 -1264290 -1039367
1416a039367J87005l66153J5463k50395P0849M43063k9550l89645n1403R8744
$$ -1039367 -852362 -1218515 -1203052 -1453447 -1382598 -939535 -969085 -1358730 -1410133 -1311389
1406a311389j5471J6651M17395R599l46062K75430o26141P1499n5949J16118K81936
$$ -1311389 -1326860 -1310209 -892814 -883215 -1229277 -953847 -1579988 -1508489 -1564438 -1448320 -1166384
1395a166384l41172J51766q8971J7846M4327J27310j07703m8238L01292k81026
$$ -1166384 -1507556 -1355790 -1444761 -1426915 -1382588 -1255278 -1362981 -1411219 -1109927 -1390953
1385a390953k26965J16368k05628k8615J33005L40693K01521n45805n1410L49247
$$ -1390953 -1617918 -1501550 -1707178 -1735793 -1602788 -1262095 -1060574 -1606379 -1657789 -1308542
1375a308542j4767l46412R9859K0994m26702L42863L38392l75895L98894m37029
$$ -1308542 -1323309 -1669721 -1569862 -1548868 -1975570 -1632707 -1294315 -1670210 -1271316 -1708345
1365a708345O74007n38661K14303n2605j88492N851L0376J77391Q4749k46956
$$ -1708345 -1034338 -1572999 -1358696 -1411301 -1599793 -1593942 -1563566 -1386175 -1301426 -1548382
1355a548382N9834k52215k30115M80416j57091M705J30248L05552k28126q3657
$$ -1548382 -1488548 -1740763 -1970878 -1490462 -1647553 -1642848 -1512600 -1207048 -1435174 -1518831
1345a518831K02359l02810K47567m06285K97621J37983k21790j63108j49833L16918
$$ -1518831 -1316472 -1619282 -1371715 -1778000 -1480379 -1342396 -1564186 -1727294 -1877127 -1560209
1335a560209j77824J19743l82841O17709N0983m13638k41008P63060j79969j27092
$$ -1560209 -1738033 -1618290 -2001131 -1383422 -1332439 -1746077 -1987085 -1224025 -1403994 -1531086
1325a531086n161m9205q2539K10140j09878P2607n40832N22981l00903P8741m8870
$$ -1531086 -1536247 -1585452 -1667991 -1457851 -1567729 -1495122 -2035954 -1512973 -1813876 -1735135 -1784005
1314a784005K3292J00798j93412K64055m9223J49776m1182Q4963k78656L20305
$$ -1784005 -1760713 -1659915 -1853327 -1589272 -1638495 -1488719 -1529901 -1444938 -1723594 -1403289
1304a403289j78490K76363l55922M22614J8432k82353r3618j48101J85334l43938
$$ -1403289 -1581779 -1305416 -1661338 -1238724 -1220292 -1502645 -1596263 -1744364 -1559030 -1902968
1294a902968M00346K0017k81404K98167k41954K76359l39502j06171L78250l02203
$$ -1902968 -1502622 -1482605 -1764009 -1465842 -1707796 -1431437 -1770939 -1877110 -1498860 -1801063
1284a801063J41275J21245k26097J0230j71885M01407k60983Q6724J8827j69084
$$ -1801063 -1659788 -1538543 -1764640 -1754410 -1926295 -1524888 -1785871 -1699147 -1680320 -1849404
1274a849404L35496o61790K61335j4410L9988Q8158K39977J36730n39610K79189
$$ -1849404 -1513908 -2175698 -1914363 -1928773 -1888785 -1800627 -1560650 -1423920 -1963530 -1684341
1264a684341k78982o8469K91925j35305O4761k6921M68609o23593P2220L64247
$$ -1684341 -1963323 -2031792 -1739867 -1875172 -1810411 -1837332 -1368723 -1992316 -1920096 -1555849
1254a555849k21835m7525J26641k28575O1575J13527O3182P8204k82151J4785
$$ -1555849 -1777684 -1825209 -1698568 -1927143 -1865568 -1752041 -1688859 -1610655 -1892806 -1878021
1244a878021k5743K24587l69663N41202m77511N59234m62117M13558j32705o1708
$$ -1878021 -1903764 -1679177 -2048840 -1507638 -1985149 -1425915 -1888032 -1474474 -1607179 -1668887
1234a668887j77552L48553J18993l28206l89725O28673j05098q7157J63705l82937
$$ -1668887 -1846439 -1497886 -1378893 -1707099 -2096824 -1468151 -1573249 -1660406 -1496701 -1879638
1224a879638K94924j05269k58900M02462n45231R558L21653J76280l31258K98370
$$ -1879638 -1584714 -1689983 -1948883 -1546421 -2091652 -2082094 -1760441 -1584161 -1915419 -1617049
1214a617049m33043N33967o30228M31770J66046J57487l16127j3744J86246k28292
$$ -1617049 -2050092 -1516125 -2146353 -1714583 -1548537 -1391050 -1707177 -1720921 -1534675 -1762967
1204a762967P4816K37090o38625L57259j87259J71019k62213L83192k21331J64852
$$ -1762967 -1688151 -1451061 -2089686 -1732427 -1919686 -1748667 -2010880 -1627688 -1849019 -1684167
1194a684167j63029K28617k44178J65099l73904K18286n635j89102J84499p735
$$ -1684167 -1847196 -1618579 -1862757 -1697658 -2071562 -1853276 -1858911 -2048013 -1863514 -1871249
1184a871249k10479j5789L36793k94879K72643M00108n92795J99390K20855M0484
$$ -1871249 -2081728 -2097517 -1760724 -2055603 -1782960 -1382852 -1975647 -1776257 -1555402 -1514918
1174a514918l23730j795l4164K45464J09619K3242l43056K9307j90688L87328
$$ -1514918 -1838648 -1840443 -1874607 -1629143 -1519524 -1496282 -1839338 -1810031 -2000719 -1613391
1164a613391k88450K67176J26818R8562l17129j10449l56977L47603j28359q9718
$$ -1613391 -1901841 -1634665 -1507847 -1409285 -1726414 -1836863 -2193840 -1846237 -1974596 -2064314
1154b064314J76537l3876J81898Q7839J43081q0954l46534J30259O097J51657
$$ -2064314 -1887777 -1921653 -1739755 -1651916 -1508835 -1589789 -1936323 -1806064 -1799967 -1648310
1144a648310n3118k38612j08180q51L92474j02905M07054l08463k66008L14153
$$ -1648310 -1701428 -1940040 -2048220 -2049071 -1656597 -1759502 -1352448 -1660911 -1926919 -1612766
1134a612766k17701K39222L82396j74780m76222N71736m42953j14776j72094N20689
$$ -1612766 -1830467 -1591245 -1208849 -1383629 -1859851 -1288115 -1731068 -1845844 -2017938 -1497249
1124a497249k65961J48648l57033O12150l58598J05664N027j33998m37963P13939
$$ -1497249 -1763210 -1614562 -1971595 -1359445 -1718043 -1612379 -1607352 -1741350 -2179313 -1465374
1114a465374l21m06968K83916l50185L70684j26878J12378m2739k76851L67479
$$ -1465374 -1465695 -1872663 -1588747 -1938932 -1568248 -1695126 -1582748 -1625487 -1902338 -1534859
1104a534859k57055Q8369j37726k33520N04993R2831k40927j95952J32285k2685
$$ -1534859 -1791914 -1703545 -1841271 -2074791 -1569798 -1476967 -1717894 -1913846 -1781561 -1804246
1094a804246K35429P5042j51776k43263L07316k6712M5072j98625J66008k9023
$$ -1804246 -1568817 -1493775 -1645551 -1888814 -1581498 -1608210 -1563138 -1761763 -1595755 -1624778
1084a624778J16432l43849j8633J99384L42729k77263m32226Q60229j1826p00382
$$ -1624778 -1508346 -1852195 -1870828 -1671444 -1328715 -1605978 -2038204 -1177975 -1189801 -1890183
1074a890183N65277p95215M9014N16914j53089J00660k05968r2161L37547m3756
$$ -1890183 -1324906 -2120121 -2071107 -1554193 -1707282 -1606622 -1812590 -1904751 -1567204 -1610960
1064a610960j60712r5677k17433o2334K49293K0890j50919K45546K28872l61958
$$ -1610960 -1771672 -1867349 -2084782 -2147116 -1897823 -1876933 -2027852 -1782306 -1553434 -1915392
1054a915392L2209m3799K61808P3349j1433k54448J05055k92754J79194L6200
$$ -1915392 -1883183 -1926982 -1665174 -1591825 -1603258 -1857706 -1752651 -2045405 -1866211 -1830011
1044a830011J39494J65270j36473O9544j3223n56805P60389l07267m469j95490
$$ -1830011 -1690517 -1525247 -1661720 -1592176 -1605399 -2162204 -1401815 -1709082 -1713551 -1909041
1034a909041J88063J58588m12320J78636l4959O7998J18059k74466L80200R9085
$$ -1909041 -1720978 -1562390 -1974710 -1796074 -1831033 -1763035 -1644976 -1919442 -1539242 -1440157
1024a440157r9926K93179p02676K89817J55186K46957n54923o1114K28449k65801
$$ -1440157 -1540083 -1246904 -1949580 -1659763 -1504577 -1257620 -1812543 -1873657 -1645208 -1911009
1014a911009L75764r8113J59960j68658J02023m48793L44407k9662J75035k57575
$$ -1911009 -1535245 -1633358 -1473398 -1642056 -1540033 -1988826 -1644419 -1674081 -1499046 -1756621
1004a756621j03009j47821N53836k74441l40796M30075J08374m05260R29319p94192
$$ -1756621 -1859630 -2007451 -1453615 -1728056 -2068852 -1638777 -1530403 -1935663 -1006344 -1800536
994a800536J45522K59453m73684j644J65616K86775q62916O76408p7310o6960
$$ -1800536 -1655014 -1395561 -1869245 -1870889 -1705273 -1418498 -2281414 -1605006 -1682316 -1749276
984a749276J21485J93485J31821k29079k07455o041J10521J15304l56506l88441
$$ -1749276 -1627791 -1434306 -1302485 -1531564 -1739019 -1745060 -1634539 -1519235 -1875741 -2264182
974b264182L48923K81613K14259j73699m42461R5713L27130J31490n08185M14364
$$ -2264182 -1915259 -1633646 -1419387 -1593086 -2035547 -1939834 -1612704 -1481214 -1989399 -1575035
964a575035n28042K46470k9591n5213K02128m42275N47934m75911L73316J18458
$$ -1575035 -2103077 -1856607 -1886198 -1941411 -1739283 -2181558 -1633624 -2109535 -1736219 -1617761
954a617761m0445j94388K19697J57288n85951L36038k16164J86825J36644l04079
$$ -1617761 -1658206 -1852594 -1632897 -1475609 -2061560 -1725522 -1941686 -1754861 -1618217 -1922296
944a922296L65871l18624J66252J70175k39552N1645r8871l50930L81921M57972
$$ -1922296 -1556425 -1875049 -1708797 -1538622 -1778174 -1726529 -1825400 -2176330 -1794409 -1336437
934a336437k12697j54543R5984Q8473j86494n3448j41448K75099l48815M56037
$$ -1336437 -1549134 -1703677 -1607693 -1519220 -1705714 -1759162 -1900610 -1625511 -1974326 -1518289
924a518289j23467K3910o75449O46206K48597l69432L17898m33337J92000K47979
$$ -1518289 -1641756 -1617846 -2293295 -1647089 -1398492 -1767924 -1450026 -1883363 -1691363 -1443384
914a443384l06448O910k27610Q7827p4056L00546J88920k56475R778j43680L17482
$$ -1443384 -1749832 -1742922 -1970532 -1882705 -1956761 -1656215 -1467295 -1723770 -1713992 -1857672 -1540190
903a540190k18602j14538M6200J58132k11164K59360k28655J65292j70564K53040
$$ -1540190 -1758792 -1873330 -1827130 -1668998 -1880162 -1620802 -1849457 -1684165 -1854729 -1601689
893a601689j6406q5200j25629N73003m12520J15051j05527k53409K23347k55793
$$ -1601689 -1618095 -1703295 -1828924 -1255921 -1668441 -1553390 -1658917 -1912326 -1688979 -1944772
883a944772J82681l36766J45755K43575M96358m37179L41484m54385k67038M09017
$$ -1944772 -1762091 -2098857 -1953102 -1709527 -1213169 -1650348 -1308864 -1763249 -2030287 -1621270
873a621270N2004O7875m79709M55470M7474n88634J90304L45388j47952k54552
$$ -1621270 -1569266 -1501391 -1981100 -1525630 -1478156 -2066790 -1876486 -1531098 -1679050 -1933602
863a933602M19505j03567K14236p07039P55756k33487j33339L94089K5714k44149
$$ -1933602 -1514097 -1617664 -1403428 -2110467 -1354711 -1588198 -1721537 -1327448 -1301734 -1545883
853a545883M569k32201k14579O7049L97092j02541O97945l22458l25077k84504
$$ -1545883 -1541314 -1773515 -1988094 -1921045 -1523953 -1626494 -928549 -1251007 -1576084 -1860588
843a860588K01686J21027j00354L64723l46504J86545J01256n74176J32450P0158
$$ -1860588 -1658902 -1537875 -1638229 -1273506 -1620010 -1433465 -1332209 -1906385 -1773935 -1703777
833a703777J17250m22615K86576n7997K66562j14520N45972n39397L47064o59512
$$ -1703777 -1586527 -2009142 -1722566 -1780563 -1514001 -1628521 -1082549 -1621946 -1274882 -1934394
823a934394k90893M41781r3161K94490J39923j65152k01824R0326j62814L92220
$$ -1934394 -2225287 -1783506 -1876667 -1582177 -1442254 -1607406 -1809230 -1718904 -1881718 -1489498
813a489498j00542K93925k50772k4877k25135M6249K50631m50238L27987j1106
$$ -1489498 -1590040 -1296115 -1546887 -1571764 -1796899 -1750650 -1500019 -1950257 -1622270 -1633376
803a633376Q5879j8963m74141M69274J8404p7899k61837K31053J10903J7876k91935
$$ -1633376 -1547497 -1566460 -2040601 -1571327 -1552923 -1630822 -1892659 -1661606 -1550703 -1532827 -1824762
792a824762J96774K12992l83082j50234K53246k54512J49977k54119K30076J88160
$$ -1824762 -1627988 -1414996 -1798078 -1948312 -1695066 -1949578 -1799601 -2053720 -1823644 -1635484
782a635484K62322k14431l28645J33054K12347J0558j90315m9184K18136j31334
$$ -1635484 -1373162 -1587593 -1916238 -1783184 -1570837 -1560279 -1750594 -1799778 -1581642 -1712976
772a712976k64097j8082K99599k81523J80599N7330k1738M80736q36789J66128
$$ -1712976 -1977073 -1995155 -1695556 -1977079 -1796480 -1739150 -1760888 -1280152 -2116941 -1950813
762a950813K90416K14363l56l4822o59855P58494k70593k85914M26286l25829
$$ -1950813 -1660397 -1446034 -1446390 -1481212 -2141067 -1382573 -1653166 -1939080 -1512794 -1838623
752a838623k58355L59029k45887M01665P9792m17477J86713O1432L42118j79782
$$ -1838623 -2096978 -1737949 -1983836 -1582171 -1502379 -1919856 -1733143 -1671711 -1329593 -1509375
742a509375k85760K55773r757J30737n82630J04282L29039k49174M42343k41428
$$ -1509375 -1795135 -1539362 -1549119 -1418382 -2001012 -1896730 -1567691 -1816865 -1374522 -1615950
732a615950k8501P0859O8768p3298r9412m95237O25022m25065M50381k02772N4066
$$ -1615950 -1644451 -1573592 -1504824 -1578122 -1677534 -2172771 -1547749 -1972814 -1522433 -1725205 -1671139
721a671139J29860J27027n39789K45353K1453J20991p1019k30731J8014l0378
$$ -1671139 -1541279 -1414252 -1954041 -1708688 -1687235 -1566244 -1637263 -1867994 -1849980 -1880358
711a880358M27592j00665l36230L41464J72410k88837j35787J38167M0827q3863
$$ -1880358 -1452766 -1553431 -1889661 -1548197 -1375787 -1664624 -1800411 -1662244 -1621417 -1705280
701a705280J6282p4293k05458m3678K53717p3444r1327M73652r684l28210l9757
$$ -1705280 -1688998 -1763291 -1968749 -2012427 -1758710 -1832154 -1923481 -1449829 -1459513 -1787723 -1827480
690a827480O33856m22515k9802l92206Q1552Q7026K21727J19609j37487J38698
$$ -1827480 -1193624 -1616139 -1645941 -2038147 -1956595 -1869569 -1647842 -1528233 -1665720 -1527022
680a527022j96566l38777K82900k89602J77756J06237j05196J99343l86972Q92477
$$ -1527022 -1723588 -2062365 -1779465 -2069067 -1891311 -1785074 -1890270 -1690927 -2077899 -1185422
670a185422l60380j03633k45327M25643j54163m7720J05438m63636K49810L67959
$$ -1185422 -1545802 -1649435 -1894762 -1469119 -1623282 -1671002 -1565564 -2029200 -1779390 -1411431
660a411431N3003k31816k72580k5604N62842l71375q998N4627l22482L50509p5010
$$ -1411431 -1358428 -1590244 -1862824 -1888428 -1325586 -1696961 -1705959 -1651332 -1973814 -1623305 -1698315
649a698315j42965K02630O4333o20508O39737J98685o1896j32150J26238j76134
$$ -1698315 -1841280 -1638650 -1574317 -2194825 -1555088 -1356403 -1418299 -1550449 -1424211 -1600345
639a600345q9836J46235j17340o5238J09545m46861M61935M2985m12625O10899
$$ -1600345 -1690181 -1543946 -1661286 -1726524 -1616979 -2063840 -1601905 -1558920 -1971545 -1360646
629a360646k93441k44133K16473K00732R919l94215L59726k12695O0893R5834
$$ -1360646 -1654087 -1898220 -1681747 -1481015 -1471096 -1865311 -1505585 -1718280 -1657387 -1561553
619a561553M180m10512k6413J17909P7079j51543K83809k69692k10985K40430
$$ -1561553 -1557373 -1967885 -1994298 -1876389 -1799310 -1950853 -1667044 -1936736 -2147721 -1907291
609a907291N35365l85601r5537K55504k86085k39090N81689p262k21158Q2922
$$ -1907291 -1371926 -1757527 -1853064 -1597560 -1883645 -2122735 -1541046 -1548308 -1769466 -1686544
599a686544K13745K0061m86526O14778l94953l01772O7837K30157k16297M00571
$$ -1686544 -1472799 -1452738 -1939264 -1324486 -1719439 -2021211 -1953374 -1723217 -1939514 -1538943
589a538943L08576n42120K7589L0946j89246M44323l85409q954L44724j43977
$$ -1538943 -1230367 -1772487 -1744898 -1713952 -1903198 -1458875 -1844284 -1853238 -1508514 -1652491
579a652491J91569N744l04776K27494k88608O01125l02672k18211J78083k18235
$$ -1652491 -1460922 -1455178 -1759954 -1532460 -1821068 -1219943 -1522615 -1740826 -1562743 -1780978
569a780978k1178P14138m64007q1345J49892k49791K05032O3057L0007m55452
$$ -1780978 -1802156 -1088018 -1552025 -1633370 -1483478 -1733269 -1528237 -1465180 -1435173 -1890625
559a890625n9729M92344J5238l07393K63775l9385j34039j08587M40442j56540
$$ -1890625 -1950354 -1458010 -1442772 -1750165 -1486390 -1525775 -1659814 -1768401 -1327959 -1484499
549a484499o11204R74622k48020k12599k98772L79853L67141n72521K63113l22401
$$ -1484499 -2095703 -1121081 -1369101 -1581700 -1880472 -1500619 -1133478 -1705999 -1442886 -1765287
539a765287j7195J38203O7647j68988L95538m1784m1569n02432K85195j64083
$$ -1765287 -1782482 -1644279 -1576632 -1745620 -1350082 -1391866 -1433435 -1935867 -1650672 -1814755
529a814755L86519l98045K9871j01824J87055M42234n54140k49148L56354K97683
$$ -1814755 -1428236 -1826281 -1796410 -1898234 -1711179 -1268945 -1823085 -2072233 -1715879 -1418196
519a418196n22487J37658j26577l9003K88670l50395O02179k73539Q213J14112
$$ -1418196 -1940683 -1803025 -1929602 -1968605 -1679935 -2030330 -1428151 -1701690 -1693477 -1579365
509a579365n6906L18558j29040o7596R3356j64756j92674J59711O4244j87059
$$ -1579365 -1636271 -1317713 -1446753 -1514349 -1420993 -1585749 -1778423 -1618712 -1554468 -1741527
499a741527K86711l66275p0395J27507K53335j0890n3426K75656n59627M84937
$$ -1741527 -1454816 -1821091 -1891486 -1763979 -1510644 -1521534 -1574960 -1299304 -1858931 -1373994
489a373994q0765j46203K46440m23467k7420K12079j96220p3820M66735J43996
$$ -1373994 -1454759 -1600962 -1354522 -1777989 -1805409 -1593330 -1789550 -1863370 -1396635 -1252639
479a252639j03635k5816m55288L16548k47414J40928l67381K39791K14607q9517
$$ -1252639 -1356274 -1382090 -1837378 -1520830 -1768244 -1627316 -1994697 -1754906 -1540299 -1629816
469a629816m7790N3049k45888j24690J17128k3786J38296M5060J09313k95939
$$ -1629816 -1677606 -1624557 -1870445 -1995135 -1878007 -1901793 -1763497 -1718437 -1609124 -1905063
459a905063K43935J13079k79283j59988K52262K28144n589q3103m983j61708J61985
$$ -1905063 -1661128 -1548049 -1827332 -1987320 -1735058 -1506914 -1512503 -1595606 -1600589 -1762297 -1600312
448a600312l55416M74661j58472r7208J4540M78701p25113N15821J5917l34443
$$ -1600312 -1955728 -1481067 -1639539 -1736747 -1722207 -1243506 -1968619 -1452798 -1436881 -1771324
438a771324K10202l50113K83454k41561L90344k07995o3421L2463k1075K24319
$$ -1771324 -1561122 -1911235 -1627781 -1869342 -1478998 -1686993 -1750414 -1717951 -1739026 -1514707
428a514707k44374m2408L51247k16358k46286J64598m3023J75678K8786l17011
$$ -1514707 -1759081 -1801489 -1450242 -1666600 -1912886 -1748288 -1791311 -1615633 -1586847 -1903858
418a903858N4035M26242n23843L57449m85097J73114K13487j783k55374M51115
$$ -1903858 -1849823 -1423581 -1947424 -1589975 -2075072 -1901958 -1688471 -1690254 -1945628 -1494513
408a494513K4037k66499q7977j57327J10635K70281J28966O2551l71517J56456
$$ -1494513 -1470476 -1736975 -1824952 -1982279 -1871644 -1601363 -1472397 -1409846 -1781363 -1624907
398a624907N4643J26282m75412O8084M8133j03659j77248J75868m6019J21196
$$ -1624907 -1570264 -1443982 -1919394 -1851310 -1803177 -1906836 -2084084 -1908216 -1954235 -1833039
388a833039L8096M78283J3643l68424J20795j8459J37200m24292L39579p2394
$$ -1833039 -1794943 -1316660 -1303017 -1671441 -1550646 -1569105 -1431905 -1856197 -1516618 -1589012
378a589012k03146J1545J69784m2368L73635n63793L10644J37817j35744p597
$$ -1589012 -1792158 -1780613 -1610829 -1653197 -1279562 -1843355 -1532711 -1394894 -1530638 -1538235
368a538235n1649l9014J52177l05704L43931Q7268l56385n7470N6325j12749K28574
$$ -1538235 -1589884 -1628898 -1476721 -1782425 -1438494 -1351226 -1707611 -1765081 -1708756 -1821505 -1592931
357a592931J95565k68986o9067K16525k52173R0517N8460k13286j16145P81261
$$ -1592931 -1397366 -1666352 -1735419 -1518894 -1771067 -1680550 -1622090 -1835376 -1951521 -1170260
347a170260n31074L73118m70179L1485M70325m53j68551k38155k96911q6635p297
$$ -1170260 -1701334 -1328216 -1798395 -1766910 -1296585 -1297038 -1465589 -1703744 -2000655 -2087290 -2094587
336b094587L34597N1518j15825K91426j55494q8683n550k289J18334K90660j91090
$$ -2094587 -1759990 -1708472 -1824297 -1532871 -1688365 -1777048 -1782598 -1784887 -1666553 -1375893 -1566983
325a566983n5227Q0583j33593l28939M86120l10706L2365k17124l3930K94522
$$ -1566983 -1622210 -1541627 -1675220 -2004159 -1518039 -1828745 -1796380 -2013504 -2047434 -1752912
315a752912K64374p118m4692j59388j72332J14077K34185j56471J84090k87447
$$ -1752912 -1488538 -1495656 -1540348 -1699736 -1872068 -1757991 -1523806 -1680277 -1496187 -1783634
305a783634J63193j01577K40371j21631J0334Q6284j03086k80899J49550k16451
$$ -1783634 -1620441 -1722018 -1481647 -1603278 -1592944 -1506660 -1609746 -1890645 -1741095 -1957546
295a957546M15647l52012J96358R063J57291J10807m46043J61603K08567l73409
$$ -1957546 -1541899 -1893911 -1697553 -1688490 -1531199 -1420392 -1866435 -1704832 -1496265 -1869674
285a869674M23773j42770J53611n12227M34688k15388o0636J61739L9343j83551
$$ -1869674 -1445901 -1588671 -1435060 -1947287 -1512599 -1727987 -1788623 -1626884 -1587541 -1771092
275a771092j49527K33274K36806k8403m14699N81451j46949k6183l46355L39725
$$ -1771092 -1920619 -1687345 -1450539 -1478942 -1893641 -1312190 -1459139 -1485322 -1831677 -1491952
265a491952m39105N23242M1444l77812j29045L12052K24835k90936j01737O01963
$$ -1491952 -1931057 -1407815 -1366371 -1744183 -1873228 -1561176 -1336341 -1627277 -1729014 -1127051
255a127051n78884k06627J48153M0164K11685m44266M55427l73641L46832p5150
$$ -1127051 -1705935 -1912562 -1764409 -1724245 -1512560 -1956826 -1501399 -1875040 -1528208 -1603358
$$ [...]
##END NTUPLES=NMR SPECTRUM
##END=
