##TITLE=abcd
##JCAMPDX= 6.0         $$ Bruker NMR JCAMP-DX V2.0
##DATA TYPE= NMR FID
##DATA CLASS= NTUPLES
##ORIGIN= UXNMR, Bruker Analytische Messtechnik GmbH
##OWNER= root
$$ XWIN-NMR		Version 3.5
$$ Tue Jun 10 18:12:32 2025 Russian Standard Time (UT+4h)  servis@DPX200
##.OBSERVE FREQUENCY= 200.131235884673
##.OBSERVE NUCLEUS= ^1H
##.DELAY= (6, 6)
##.ACQUISITION MODE= SIMULTANEOUS
##.ACQUISITION SCHEME= undefined
##.AVERAGES= 32
##.DIGITISER RES= 18
##SPECTROMETER/DATA SYSTEM= spect
##.PULSE SEQUENCE= zg
##.SOLVENT NAME= CDCl3
##.SHIFT REFERENCE= (INTERNAL, CDCl3, 0, 16.5164)
##AUDIT TRAIL= $$ (NUMBER, WHEN, WHO, WHERE, WHAT)
$$ ##TITLE= Audit trail, XWIN-NMR		Version 3.5
$$ ##JCAMPDX= 5.01
$$ ##ORIGIN= Bruker BioSpin GmbH
$$ ##OWNER= servis
$$ F:\spectra/data/av/nmr/H1/1/audita.txt
$$ ##AUDIT TRAIL=  $$ (NUMBER, WHEN, WHO, WHERE, WHAT)
(   1,<2025-06-10 18:12:11.98 +0400>,<servis>,<DPX200>,
      <created by zg, POWCHK disabled, PULCHK disabled
       configuration hash MD5:
       00 E9 B6 7A A2 85 ED C7 34 08 36 98 17 FE 4E 26
       data hash MD5: 32K
       D4 15 B5 8F 45 41 6A 41 52 FC 83 89 9D 58 91 1A>)
$$ ##END=
$$ 
$$ hash MD5
$$ 28 E2 0F 06 5E B1 A8 8F F0 ED 11 ED 93 CC 47 80
##$RELAX= 
##$RELAX= 
##$RELAX= 
##$RELAX= 
##$RELAX= 
##$RELAX= 
##$RELAX= 
##$RELAX= 
$$ Bruker specific parameters
$$ --------------------------
##$DU= <F:\spectra>
##$EXPNO= 1
##$NAME= <H1>
##$PROCNO= 1
##$TYPE= <nmr>
##$USER= <av>
##$AMP= (0..31)
100 100 100 100 100 100 100 100 100 100 100 100 100 100 100 100 100 100 
100 100 100 100 100 100 100 100 100 100 100 100 100 100 
##$AQSEQ= 0
##$AQ_mod= 1
##$AUNM= <au_zg>
##$AUTOPOS= <>
##$BF1= 200.13
##$BF2= 200.13
##$BF3= 200.13
##$BF4= 200.13
##$BF5= 500.13
##$BF6= 500.13
##$BF7= 500.13
##$BF8= 500.13
##$BYTORDA= 1
##$CFDGTYP= 0
##$CFRGTYP= 5
##$CHEMSTR= <none>
##$CNST= (0..31)
1 1 145 1 1 1 1 1 1 1 1 1 1 1 1 1 1 1 1 1 1 1 1 1 1 1 1 1 1 1 1 1 
##$CPDPRG= <>
##$CPDPRG1= <>
##$CPDPRG2= <>
##$CPDPRG3= <>
##$CPDPRG4= <mlev>
##$CPDPRG5= <mlev>
##$CPDPRG6= <mlev>
##$CPDPRG7= <mlev>
##$CPDPRG8= <mlev>
##$CPDPRGB= <>
##$CPDPRGT= <>
##$D= (0..31)
0 2 0 0 0 0 0 0 0 0.06 0 0 0 0 0 0 0.0002 0 0 0 0 0 0 0 0 0 0 0 0 0 0 
0 
##$DATE= 1749564731
##$DBL= (0..7)
120 120 120 120 120 120 120 120 
##$DBP= (0..7)
150 150 150 150 150 150 150 150 
##$DBP07= 0
##$DBPNAM0= <>
##$DBPNAM1= <>
##$DBPNAM2= <>
##$DBPNAM3= <>
##$DBPNAM4= <>
##$DBPNAM5= <>
##$DBPNAM6= <>
##$DBPNAM7= <>
##$DBPOAL= (0..7)
0.5 0.5 0.5 0.5 0.5 0.5 0.5 0.5 
##$DBPOFFS= (0..7)
0 0 0 0 0 0 0 0 
##$DE= 6
##$DECBNUC= <off>
##$DECIM= 32
##$DECNUC= <off>
##$DECSTAT= 4
##$DIGMOD= 1
##$DIGTYP= 9
##$DL= (0..7)
0 120 120 120 120 120 120 120 
##$DP= (0..7)
150 150 150 150 150 150 150 150 
##$DP07= 0
##$DPNAME0= <>
##$DPNAME1= <>
##$DPNAME2= <>
##$DPNAME3= <>
##$DPNAME4= <>
##$DPNAME5= <>
##$DPNAME6= <>
##$DPNAME7= <>
##$DPOAL= (0..7)
0.5 0.5 0.5 0.5 0.5 0.5 0.5 0.5 
##$DPOFFS= (0..7)
0 0 0 0 0 0 0 0 
##$DQDMODE= 0
##$DR= 18
##$DS= 0
##$DSLIST= <SSSSSSSSSSSSSSS>
##$DSPFIRM= 0
$$ [...]
##$SUBNAM0= <"">
##$SUBNAM1= <"">
##$SUBNAM2= <"">
##$SUBNAM3= <"">
##$SUBNAM4= <"">
##$SUBNAM5= <"">
##$SUBNAM6= <"">
##$SUBNAM7= <"">
##$SUBNAM8= <"">
##$SUBNAM9= <"">
##$SW= 20.6817932712277
##$SWIBOX= (0..15)
0 0 3 0 0 0 0 0 0 0 0 0 0 0 0 0 
##$SW_h= 4139.07284768212
##$TD= 32768
##$TD0= 1
##$TE= 0
##$TE2= 300
##$TE3= 300
##$TEG= 300
##$TL= (0..7)
0 120 120 120 120 120 120 120 
##$TP= (0..7)
150 150 150 150 150 150 150 150 
##$TP07= 0
##$TPNAME0= <>
##$TPNAME1= <>
##$TPNAME2= <>
##$TPNAME3= <>
##$TPNAME4= <>
##$TPNAME5= <>
##$TPNAME6= <>
##$TPNAME7= <>
##$TPOAL= (0..7)
0.5 0.5 0.5 0.5 0.5 0.5 0.5 0.5 
##$TPOFFS= (0..7)
0 0 0 0 0 0 0 0 
##$TUNHIN= 0
##$TUNHOUT= 0
##$TUNXOUT= 0
##$USERA1= <user>
##$USERA2= <user>
##$USERA3= <user>
##$USERA4= <user>
##$USERA5= <user>
##$V9= 5
##$VALIST= <valist>
##$VCLIST= <CCCCCCCCCCCCCCC>
##$VD= 0
##$VDLIST= <DDDDDDDDDDDDDDD>
##$VPLIST= <PPPPPPPPPPPPPPP>
##$VTLIST= <TTTTTTTTTTTTTTT>
##$WBST= 1024
##$WBSW= 30
##$XGAIN= (0..3)
0 0 0 0 
##$XL= 0
##$YL= 0
##$YMAX_a= 123267
##$YMIN_a= -67171
##$ZGOPTNS= <>
##$ZL1= 120
##$ZL2= 120
##$ZL3= 120
##$ZL4= 120
##$ABSF1= 10
##$ABSF2= 0
##$ABSG= 5
##$ABSL= 3
##$ALPHA= 0
##$AQORDER= 0
##$ASSFAC= 0
##$ASSFACI= 0
##$ASSFACX= 0
##$ASSWID= 0
##$AUNMP= <proc_1d>
##$AZFE= 0.1
##$AZFW= 0.1
##$BCFW= 1
##$BC_mod= 2
##$BYTORDP= 0
##$COROFFS= 0
##$CY= 19
##$DATMOD= 1
##$DC= 2
##$DFILT= <>
##$DTYPP= 0
##$F1P= 11.0000007629395
##$F2P= -0.999999237060547
##$FCOR= 0.5
##$FTSIZE= 0
##$FT_mod= 4
##$GAMMA= 1
##$GB= 1
##$INTBC= 1
##$INTSCL= 1
##$ISEN= 128
##$LB= 0.05
##$LEV0= 0
##$LPBIN= 0
##$MAXI= 10000
##$MC2= 0
##$MEAN= 0
##$ME_mod= 0
##$MI= 0
##$NCOEF= 0
##$NC_proc= 0
##$NLEV= 6
##$NOISF1= 0
##$NOISF2= 0
##$NSP= 1
##$NTH_PI= 0
##$NZP= 0
##$OFFSET= 16.51637
##$PC= 1
##$PHC0= -269.0715
##$PHC1= 1.101538
##$PH_mod= 0
##$PKNL= yes
##$PPARMOD= 0
##$PSCAL= 4
##$PSIGN= 0
##$REVERSE= no
##$SF= 200.13
##$SI= 16384
##$SIGF1= 0
##$SIGF2= 0
##$SINO= 400
##$SIOLD= 16384
##$SREGLST= <1H.CDCl3>
##$SSB= 0
##$STSI= 0
##$STSR= 0
##$SW_p= 4139.07284768211
##$SYMM= 0
##$S_DEV= 0
##$TDeff= 0
##$TDoff= 0
##$TI= <>
##$TILT= no
##$TM1= 0
##$TM2= 0
##$TOPLEV= 0
##$USERP1= <user>
##$USERP2= <user>
##$USERP3= <user>
##$USERP4= <user>
##$USERP5= <user>
##$WDW= 1
##$XDIM= 8192
##$YMAX_p= 0
##$YMIN_p= 0
$$ End of Bruker specific parameters
$$ ---------------------------------
##NTUPLES= NMR FID
##VAR_NAME=  TIME,          FID/REAL,        FID/IMAG
##SYMBOL=    X,             R,               I
##VAR_TYPE=  INDEPENDENT,   DEPENDENT,       DEPENDENT
##VAR_FORM=  AFFN,          ASDF,            ASDF
##VAR_DIM=   16384,         16384,           16384
##UNITS=     SECONDS,       ARBITRARY UNITS, ARBITRARY UNITS
##FACTOR=    0.0002416,     1,               1
##FIRST=     0,             0,               0
##LAST=      3.9581328,     0,               0
##MIN=       0,             -67171,          0
##MAX=       3.9581328,     123267,          0
$$ Real data points
##PAGE= N=1
##DATA TABLE= (X++(R..R)), XYDATA
$$ [...]
8998A8l2P5ML%O1m0k2K6q5rj7J8m6J07P4o1o2J8n7P0j01J59j05j13J56m2j1m5
$$ 18 -14 61 65 68 68 129 89 67 93 8 -1 -18 0 -46 61 135 74 12 30 -27 43 -58 101 -4 -117 39 -3 -14 -59
9027e9Q6j10OO4j1J1nJ38k15J00o6O5l7N3m0K8J7j8l9p8M8n6J39N4j11n0O3N5
$$ -59 27 -83 -77 -13 -24 -13 -18 120 -95 5 -61 4 -33 20 -20 8 25 7 -32 -110 -62 -118 21 75 -36 -86 -23 32
9055C2m6L3m1N5o9L9p2q0R3J63j18j19J50r8J30k1l8k3l2K4j0J21l4q9K2P1O4
$$ 32 -14 19 -22 33 -36 3 -69 -149 -56 107 -11 -130 20 -78 52 31 -7 -30 -62 -38 -48 73 39 -50 -28 43 107
9082A07j04N1n9L4j15O6N4j63J51r6j1J54j12K19j35J2j50P8K8K6j08N3J19J14
$$ 107 3 54 -5 29 -86 -20 34 -129 22 -74 -85 69 -43 176 41 53 -97 -19 9 35 -73 -20 99 213
9106B13j18lj50Q7j08N9K4l3p0N8LJ14j4k1J25j09o8K4R3j23J9j54K28n5j97K28
$$ 213 95 92 -58 29 -79 -20 4 -29 -99 -41 -38 76 62 41 166 57 -11 13 106 -17 2 -152 76 21 -176 52
9132E2q2j7P8j9r9N4J00J1q9l2j52K74j32q1J04N4L2j1rq0Q3o5P1J37k43Q6j8
$$ 52 -30 -47 31 12 -87 -33 67 78 -11 -43 -195 79 -53 -134 -30 24 56 45 36 -44 39 -26 45 182 -61 25 7
9159Go2L3J13k4o1n1J03r4m6Q9j16J69j57K20j39M2j9n8O4j40Q0J06m4k4j3p1
$$ 7 -55 -22 91 67 6 -45 58 -36 -82 7 -109 60 -97 123 -16 26 7 -51 13 -127 -47 59 15 -9 -22 -93
9185i3J01P2j49J12P3j52J10p0l3q6J10N8p3Q6Q0j84LR5j3J0p6J23o4Q9L0j78
$$ -93 8 80 -69 43 116 -36 74 4 -29 -115 -5 53 -20 66 146 -38 -35 60 47 57 -19 104 40 129 159 -19
9211a9k4r0J13K2k4p7K6Q6j0j41J84nj6nj4%n8K9p0k3OJ44k7J10j57mJ66j88R2
$$ -19 -43 -133 -20 2 -22 -99 -73 13 3 -138 46 41 25 20 6 6 -52 -23 -93 -116 -110 34 7 117 -40 -44 122 -66 26
9240B6k2k6J20p0m3J7J3o9J12O6k57R1o8J22L7j52M3L6J8j7o1P8k2L9p6j6R5o0
$$ 26 4 -22 98 28 -15 2 15 -54 58 124 -133 -42 -110 12 49 -103 -60 -24 -6 -23 -84 -6 -28 11 -65 -81 14 -46
9268d6l9R8j06P0RM9j24Q8k4N9rLo9O8Or1J45j46P1l5L8j05J43j20Q2K3p6K4J03
$$ -46 -85 13 -93 -23 -14 35 -89 -1 -25 34 25 28 -41 27 33 -58 87 -59 12 -23 15 -90 53 -67 15 38 -38 -14 89
9297H9j00r1P6m4O7R2l4j63J15n9j8J14J0r5j07J07O1o5o7J64n5jm4j11J12L7
$$ 89 -11 -102 -26 -70 -3 89 55 -108 7 -52 -70 44 54 -41 -148 -41 20 -45 -112 52 -3 -4 -48 -159 -47 -10
9323a0P6r8M7r0J43k70J79M9j33L4R1O2j48O8k1J59K3j93K0J45k25P7j8P0J3j21
$$ -10 66 -32 15 -75 68 -202 -23 26 -107 -73 18 80 -68 0 -21 138 161 -32 -12 133 -92 -15 -33 37 50 -71
9349g1J84%j43r8K52p9n9N1k1j11J22j03k0J91j93R5q2J04K2j4l5j8k3mJ16nP5
$$ -71 113 113 -30 -128 124 45 -14 37 16 -95 27 -76 -96 95 -98 -3 -85 19 41 27 -8 -26 -49 -53 63 58 133
9376A33j72N7l6M8n7r3K26r2j02P5Q0N4j88P0K4j6n8J37j28m5QJ26p8J03Mq1R
$$ 133 -39 18 -18 30 -27 -120 106 14 -88 -13 67 121 -67 3 27 11 -47 90 -38 -83 -75 51 -27 76 80 -1 8
9403Hn5j2M3j32J48o1L6O2n5q1N8n2M8Q4jr8K2J0N3j09J54n2R8j17q4J28n6n3
$$ 8 -47 -59 -16 -148 0 -61 -25 37 -18 -99 -41 -93 -45 39 38 -60 -38 -28 25 -84 70 18 116 -1 -85 43 -13 -66
9431f6J15j44J01n5j7O7j0L5j76J97j23J46j09O4j4L8o3M5Q7p1l7O1j05J60j93
$$ -66 49 -95 6 -49 -66 1 -9 26 -150 47 -76 70 -39 25 11 49 -14 31 118 47 10 71 -34 126 -67
9456f7rJ39p8J10k4J8k55J77j7K0n7N7O8k08J13k6q4J2R6oPl1J8J1O0r5J09N7
$$ -67 -76 63 -15 95 71 89 -166 11 -6 14 -43 14 82 -126 -13 -39 -123 -111 -15 -21 -14 -45 -27 -16 44 -51 58 115
9484A15n0j6q3NN6j18Q4l7p3J40M1O6n4j12J38j56MJ72n2j25O5j5j1l5l0J59m5
$$ 115 65 49 -34 -29 27 -91 -7 -44 -117 23 64 130 76 -36 102 -54 -50 122 70 -55 10 -5 -16 -51 -81 78 33
9511C3j79J99j01J00j56J61p6M7j23R9k7j5J28j32J20n2N3l3j38J28M9p5J19j30
$$ 33 -146 53 -48 52 -104 57 -19 28 -95 4 -23 -38 90 -42 78 26 79 46 -92 36 85 10 129 -1
9535aJ8R9j10k7J07j0p6n7K1j8J03J8p9NP6n9ro1J10j55P4K0j6J78j84L2O5K6
$$ -1 17 116 6 -21 86 76 0 -57 -36 -54 49 67 -12 -7 69 10 1 -60 50 -105 -31 -11 -27 151 -33 -1 64 90
9563I0k09R2mn5J30k3q9N6M3j34J34j5j03J15j43J16Lp1O0K5m4J05P2q9n2R0J6
$$ 90 -119 -27 -31 -86 44 21 -68 -12 31 -103 31 16 -87 28 -115 1 4 -67 -7 18 -26 79 151 62 10 100 116
9590A16j07p1J24R4k62J00P4j22M3M1l1m1p6J43J3n7J09r8m3J28K2j22L7J15j73
$$ 116 9 -62 62 156 -106 -6 68 -54 -11 30 -1 -42 -118 25 38 -19 90 -8 -51 77 99 -23 14 129 -44
9615d4J3J12j04L5j8R9j26P9N4J4j04Lj22K18k24J54P9r3K1j16J81r9J77k07m
$$ -44 -31 81 -23 12 -6 93 -33 46 100 114 10 13 -109 109 -115 39 118 25 46 -70 111 12 189 -18 -22
9640b2j8K5%J3P9r1k2M6q2J10l4O5l8K3q3P1j59N0L2P3l2mOL3j54P1N9m9K5q2
$$ -22 -40 -15 -15 -2 77 -14 -36 10 -72 38 4 69 31 54 -29 42 -117 -67 -35 38 6 2 8 41 -113 -42 17 -32 -7 -89
9670h9J43j10L4L0J15j22l4oP8M0j23K7J0R1j2j12n1J32o7K1R0k1L5j69m3J73
$$ -89 54 -56 -22 8 123 1 -33 -39 39 79 -44 -17 -7 84 72 -40 -91 41 -26 -5 85 64 99 -70 -113 60
9696F0q7l1J27r9o2N3J5n5J11j27J39o4k2%O3j19pN4K0P8j39J28k9N5k6p1Q7n1
$$ 60 -27 -58 69 -30 -92 -39 -24 -79 32 -95 44 -20 -42 -42 21 -98 -105 -51 -31 47 -92 36 7 62 36 -35 52 1
9724AK5L6j17J03j33L7O1j01N5l3J28j08J35j54J24Ko5K4j4jl4P7R3j69j9j12
$$ 1 26 62 -55 48 -85 -48 13 -88 -33 -66 62 -46 89 -65 59 61 -4 20 6 5 -29 48 141 -28 -47 -159
9750a59J13l9R6m7KK3J07j09K7N1j06J02j21K6J35m3p0L1m9p4N5O8N7m7jj18R8
$$ -159 -46 -85 11 -36 -34 -11 96 -13 14 65 -41 61 -60 -34 101 58 -12 19 -30 -104 -49 19 76 29 28 -90 8
9777HrL0l2o4j9J20j20J63j04J51o4lj00J4J00l9o3%l1L3pp3J19o4K09j99j4l6
$$ 8 -1 29 -3 -67 -86 34 -86 77 -27 124 60 57 -43 -29 71 32 -31 -31 -62 -29 -36 -109 10 -54 155 -44 -58 -94
9805i4J01k3l6N3O8pp2j26J46L8j55K32k30M4J41qj9k5Ko5J63j03l0pm1P4j21
$$ -94 7 -16 -52 1 69 62 -10 -136 10 48 -107 125 -105 -61 80 72 53 28 30 -35 128 25 -5 -12 -53 21 -100
9832a00J61m8l8j24O1l6R5Pj5J83n7p0Rj32Q8K0r8J34j00N5O1j21kJ73j29j0p5
$$ -100 61 13 -25 -149 -88 -124 -29 -22 -37 146 89 19 28 -104 -16 4 -94 40 -60 -5 56 -65 -67 106 -23 -33 -108
9859a08J35j3J65k04K2lJ14m4j77J78k3j3r5O4j5Q3m3n6P2m7Qj5J0Q4j2p5k8J06
$$ -108 27 14 179 -25 -3 -6 108 64 -113 65 42 29 -66 -2 -17 66 23 -33 39 -8 0 -15 -5 79 67 -8 -36 70
9887G0r7PJ3R2j07L3j7M3k1n6L7l7M8n7N4NL2n7m5l6J97j45R9k05J51n2JN5LK
$$ 70 -27 -20 -7 85 -22 11 -6 37 16 -40 -3 -40 8 -49 5 10 42 -15 -60 -96 101 -44 55 -150 1 -51 -50 5 8 10
9917A0Q6Qj9n9j48K18j42k0Q1R2j26N8J31j51j59O4L4K0j13J21L4Qn9j19J83j18
$$ 10 96 104 85 26 -122 96 -46 -66 15 107 -19 39 170 19 -140 -76 -42 -22 -135 -14 20 28 -31 -150 33 -85
9943h5P8k3L2j02J15Nr6N2m6M6J3k8J03Lo3nJ93k88q9K84o8L2m6j06m1Q2J01J4
$$ -85 -7 -30 2 -100 15 20 -76 -24 -70 -24 -11 -39 64 67 4 -1 192 -96 -185 99 31 63 17 -89 -130 -48 53 67
9971F7k7r4J35j25k3J03j01Q8p0q6J13O2j7POJ7p6N0l3l6j63L06l7j2j05R8q6
$$ 67 40 -54 81 -44 -67 36 -65 23 -47 -133 -20 42 25 32 38 55 -21 29 -4 -40 -203 103 66 54 -51 47 -39
9998c9Q9p9J2j2o3Q3Q1L0l8k3n2P8o7q3Q6O6l2K7j02Rj05N6J7l2N7K3O6m7j1r2
$$ -39 50 -29 -17 -29 -92 -9 72 102 64 41 -11 67 0 -83 3 69 37 64 -38 -29 -134 -78 -61 -93 -36 -13 53 6 -5 -97
10028i7J66K8mj61O2K7q7P7p9P5j16J06L9l9l7o2P9l8M2qj2N0j46J62O0j42P3
$$ -97 69 97 93 -68 -6 21 -66 11 -68 7 -109 -3 36 -3 -40 -102 -23 -61 -19 -27 -39 11 -135 27 87 -55 18
10055A8n9P4k6j01L9n5Q3Kq9J64r7lk6n9P3nL8O8M8o1o6j7L1L1p2KL5j25J40L0
$$ 18 -41 33 7 -94 -55 -110 -27 -25 -114 50 -47 -50 -76 -135 -62 -67 -29 39 87 26 -40 -57 -26 5 -67 -65 -30 -155 -15 15
10085A5o9J85j67k1J9M9Qn9M3j46J27L6o0Q4n5J07j19o1M2P0k1o8P3O3j10p4J41
$$ 15 -54 131 -36 -57 -38 11 19 -40 3 -143 -16 20 -40 44 -11 96 -23 -84 -42 28 7 -61 12 75 -35 -109 32
10112C2R8k21P2n9J52o5r8L7N2k7l1N0K5l9n3K9K5O2ok0p9Q3n0k2R2qm9r9L8L8
$$ 32 130 -91 -19 -78 74 9 -89 -52 0 -27 -58 -8 17 -22 -75 -46 -21 41 35 15 -64 19 -31 -53 39 31 -18 -117 -79 -41
10142d1j05K23j66Q7k5Q0j70J39r9Q1N4j09M9L9M3j41j8o8J09Q0l7N4o7L1M0j03
$$ -41 -146 77 -89 -2 -27 53 -117 22 -77 4 58 -51 -2 37 80 -61 -79 -147 -38 42 5 59 -8 23 63 -40
10168d0O1n0m9P0r6O5K3o0Kj36L40M3j50p9m7L7pN7N5j26J20pJ18j41q9M9J30
$$ -40 21 -29 -78 -8 -104 -39 -16 -76 -74 -210 130 173 23 -56 -103 -66 -73 -16 39 -87 33 26 144 3 -86 -37 93
10195I3k7L6j64N8L5n1k5R8n4%L5J48k71J54j8q4O1q1R4QroJ6O7j18j77J10J35
$$ 93 66 102 -62 -4 31 -20 -45 53 -1 -1 34 182 -89 65 47 -37 24 -57 37 45 36 30 46 113 -5 -182 -72 63
10223F3p5J20q9j1mR7q1m1L2pK3r1N7L5j60J86k7k0n0J84o2j10K02l13J92k7k5
$$ 63 -12 108 19 8 4 101 20 -21 11 4 27 -64 -7 28 -132 54 27 7 -43 141 79 -31 171 -142 50 23 -2
10250bKK4j1k2JL7q3kj2n6K33q3n3J01p4o4J27n3j38j2J54n8NJ07q0k3Q1q6P8
$$ -2 0 24 13 -9 -8 29 -54 -56 -68 -124 109 26 -27 74 0 -64 63 10 -128 -140 14 -44 -39 68 -12 -35 46 -40 38
10279C8o1J31k1j00R4r3j7m1N8K7nK6J2j62J82km3m6QQ7n6M0r6J0J9P7j00JJ12
$$ 38 -23 108 87 -13 81 -12 -29 -70 -12 15 10 36 48 -114 68 66 23 -23 -15 72 16 56 -40 -30 -11 66 -34 -33 79
10308G9m6j22J06M6j27P3K4j5o3n4P8p6O4P0Qm3N2l7l2O6J1m4p1L2M6o4M3L6j8
$$ 79 33 -89 17 63 -64 9 33 18 -45 -99 -21 -97 -33 37 45 2 54 17 -15 51 62 18 -53 -21 25 -39 4 40 22
10337B2nl4k6j2R4olp9j5K02j30j9j12J93N3m7r6p7K4J2J1M5K7oK2r4M8J27k9
$$ 22 17 -17 -43 -55 39 33 30 -49 -64 138 8 -11 -123 70 123 76 -20 -97 -73 -61 -50 -5 22 16 38 -56 -8 119 90
10366I0k9k5q2j4J0k0O8q2N7l8n1pQ1PpL3m6P5n2L2n4L8L2p4J7O6J38k54J06j37
$$ 90 61 36 -46 -60 -50 -70 -2 -84 -27 -65 -116 -123 -42 -35 -42 -9 -55 20 -32 0 -54 -16 16 -58 -41 25 163 -91 15 -122
10396a22J90j0jk02J38L4n0N6j35J6J76j41L3k6o5R5j3L4J1J4j43J55m5N6Kl9
$$ -122 68 58 57 -145 -7 27 -23 33 -102 -86 90 -51 -18 -44 -109 -14 -27 7 18 32 -111 44 -1 55 57 18
10422A8j39L3J6J37r7nN6O1p7L4j1mQM5l8j05o0J53ko0J06j02rJ1P8k9J61j69
$$ 18 -121 -88 -72 65 -32 -37 19 80 3 37 26 22 30 75 37 -68 -128 25 23 -37 69 -33 -42 -31 47 18 179 10
10450A0M3ml1j6k7J38j09M2m2N2n4O0n4K2p4J7lj7O3NJ1r9nJ5L5NK9j3P4o3N9
$$ 10 53 49 18 2 -25 113 4 46 4 56 2 62 8 30 -44 -27 -30 -47 16 21 32 -67 -72 -57 -22 -17 12 -1 73 10 69
10481F9j67R0lK6j1P6l0o4l0N3N9M9N7k02j4rK2j44L30k35M9P3J07j37N2j51R0
$$ 69 -98 -8 -11 15 4 80 50 -14 -44 9 68 117 174 -28 -42 -51 -29 -173 157 -78 -29 44 151 14 66 -85 5
10508EK9j9N4L2p6j16%J46O4o5m1M8j05J46j13j26Q4j1J9r9J80j00Q1j14J78K6
$$ 5 34 15 69 101 25 -91 -91 55 119 54 13 61 -44 102 -11 -137 -53 -64 -45 -144 36 -64 17 -97 81 107
10534A07J1r2l2j23J69j11O6M3j79j1P8J5N2L0J1k0j13m6J05n8O0K1j52K09K8
$$ 107 118 26 -6 -129 40 -71 -5 38 -141 -152 -74 -59 -7 23 34 14 -99 -145 -40 -98 -38 -17 -169 40 68
10559F8j47R5j5k6m1P4J48k00N2P0p0j08R1j67J49pK9R3k6j71J02N2j04J98k27
$$ 68 -79 16 1 -25 -66 8 156 -44 8 78 8 -100 -9 -176 -27 -34 -5 88 62 -109 -7 45 -59 139 -88
10584h8J16M0q8Q9k7rk5J7J8j6M8J00j56j04M8k8M3K7l3L8O5j4o6L7l9m2k8M4
$$ -88 28 68 -20 69 42 33 8 25 43 27 75 175 19 -85 -37 -65 -22 5 -28 10 75 61 -5 32 -7 -49 -77 -33
10612c3R0j9p9m3nP5m1M1L9j03O2n1J00j09M1J0P4j35K33q5K9o2m0KM6m6M0k0
$$ -33 57 38 -41 -84 -89 -14 -55 -14 25 -78 -16 -67 33 -76 -35 -25 49 -86 147 62 91 29 -11 -9 37 -9 31 11
10640A1JJ19k15R9J1l1p9M5J9J3k4K2l6N1p3qL7l3p6J32M5j70J41j7K7p8R3M5
$$ 11 12 131 -84 15 26 -5 -84 -39 -20 -7 -31 -9 -45 6 -67 -75 -38 -71 -147 -15 30 -140 1 -16 11 -67 26 71
10668G1j51O3J0J28j19l3Q4p5M8Rm4j8L2R1j40K4r5K15lL2j35j06J30p2K7L2k6
$$ 71 -80 -17 -7 121 2 -31 53 -22 26 35 -9 -27 5 96 -44 -20 -115 100 97 129 -6 -112 18 -54 -27 5 -21
10695b1j0J40j20j81K55r3O2q9j24K26j60R3K5K0m2K2O4m5j5J9LkQ2m2k9j02m7
$$ -21 -31 109 -11 -192 63 -30 32 -57 -181 45 -115 -22 3 23 -19 3 67 22 7 26 29 27 109 67 38 -64 -111
10722a11O3O0N5o8M1q0k1J78j75L0NJ07j25Q2M3m3mn5R6k3k8k3m9j04J84Mp7R8
$$ -111 -48 12 67 -1 40 -40 -61 117 -58 -28 -23 84 -41 41 84 41 37 -18 78 55 27 4 -45 -149 35 39 -38 60
10750F0Lpj58R1O3J0j14J50j10Jq5Q1L3R1r6o8J51m6l4N5n1j35J4l4K02N5j65
$$ 60 63 56 -102 -11 52 62 -52 98 -12 -11 -96 -15 18 109 13 -55 96 50 16 71 20 -115 -101 -135 67 122 -43
10777d3J0O9ln1K4M0jK2j50J39p4J27q4n5rMQ5o7Q6L3m1m8J8j5J18j02j20J6r3
$$ -43 -33 36 33 -18 6 46 45 67 -83 56 -18 109 25 -30 -39 -35 50 -17 69 102 61 13 31 16 134 32 -88 -72 -165
10806a65J37j02J42M0p2k4m2KMN6NM9j04P5L4n1q4O2k6NR1KK1mN2j21L0O1l6m6
$$ -165 -28 -130 12 52 -20 -44 -86 -84 -80 -24 -19 30 -74 1 35 -16 -100 -38 -64 -59 32 34 55 51 103 -18 12 73 37 -9
10836iJ40j96R3m1Q2m6J07q2N5p6j03J27j47K0J06p8J27l0m4O8j03J02j64J79
$$ -9 131 -65 28 -13 69 23 130 48 103 27 -76 51 -96 -76 30 -48 79 49 5 73 -30 72 -92 87
10860H7j11p2l8J14j6N6N7k33J39Q4j84J72j12J6R2j33j35J60Q2j9l9J09j35k8
$$ 87 -24 -96 -134 -20 -36 20 77 -156 -17 67 -117 55 -57 -41 51 -82 -217 -57 25 6 -33 76 -59 -87
10884h7J80k26K43o1j4l1m3K3n6pJ06j1m4K5n8J47j25j9RM8k5l4P1k1p9OM8O4
$$ -87 93 -133 110 49 35 4 -39 -16 -72 -79 27 16 -28 -3 -61 86 -39 -58 -49 -1 -26 -60 11 -10 -89 -83 -35 29
10912B9n4l9j01J61J62j32k3j4K1k9m6m9N2O1m3J21n2O7j27Q5k9J03k99J48j0
$$ 29 -25 -64 -165 -4 158 26 3 -11 10 -19 -65 -114 -62 -1 -44 77 25 92 -35 50 21 124 -175 -27 -37
10937c7N2j6%n9J44j01np2P8L0K6j69J36L2j12J51j34N9J0k3j87K47L3j52J20
$$ -37 15 -1 -1 -60 84 -17 -22 -94 -16 14 40 -129 7 39 -73 78 -56 3 13 -10 -197 50 83 -69 51
10962E1j03o7J19M4Q8j39l1L2qM4P1j9j05q6O9N9J7n9j11J14Q9r0L0J19j45M0
$$ 51 -52 -119 0 44 132 -7 -38 -6 -14 30 101 82 -23 -109 -40 19 36 -23 -134 -20 69 -21 9 128 -17 23
10988B3j11J14o8M9m6J40k8j32P7l3l2Q8p8j6J66j91P6j03J37j26J5R0J12j08
$$ 23 -88 26 -42 7 -39 101 73 -59 18 -15 -47 41 -37 -53 113 -78 -2 -105 32 -94 -79 11 123 15
11012A5j31J23j47J10j04J46J8j10J09r2O5m1O6j9o4j6J53L0j67jJ11n7r0J53
$$ 15 -116 7 -140 -30 -134 12 30 -80 29 -63 2 -39 27 8 -56 -72 81 111 -56 -57 54 -3 -93 60
11036F0j05L8o7N7n4l2J53N8j18OP8j93N4N3J7r3P6OL0m1o0Q7m4M0m6J31j86Q2
$$ 60 -45 -7 -74 -17 -71 -103 50 108 -10 -4 74 -119 -65 -12 5 -88 -12 -6 24 -17 -77 10 -34 6 -40 91 -95 -13
11064a3k6M4p2J03j23N0J6J50k01L5J04p8R7o6P3j37k9Q5j32P0qJ2JOn2j2J47
$$ -13 -39 5 -67 36 -87 -37 -21 129 -72 -37 67 -11 86 20 93 -44 -73 12 -120 -50 -58 -46 -45 -39 -91 -103 44
11091D4M8q9j01J15j01R9Po8r6K25j12mN4o8K9P9l6j2j0N0L9n3o2J04Q2j60N9
$$ 44 92 3 -98 17 -84 15 22 -46 -142 83 -29 -33 21 -47 -18 61 25 13 3 53 92 39 -23 81 163 3 62
11118F2nJJ6R7j08J3l8m5q5M9K4o7N4O7Jq3J41j16N4j06P5q9P1J6M1m9M0p8J5
$$ 62 57 58 74 171 63 76 38 -7 -92 -43 -19 -86 -32 35 36 -47 94 -22 32 -74 1 -88 -17 -1 40 -9 31 -47 -32
11147c2N9rr8k0J07Rn5L9o5N4L7q8J0O3j4J06m1k5k9jp1R7j46R1l0R8K2j34J42
$$ -32 27 18 -80 -100 7 16 -39 0 -65 -11 26 -62 -52 11 -3 103 62 37 8 7 -64 33 -113 -22 -52 46 68 -66 76
11176G6j12q3J60m5J3J0o7O1l1O0Ql3o4N5m0k0l9L8O8j44K28p5K3Q1j63n4J54
$$ 76 -36 -119 41 -4 9 19 -48 13 -18 42 50 17 -47 8 -32 -52 -91 -53 15 -129 99 24 47 128 -35 -89 65
11203F5RLp1n5k8J06k8j29Q2P7l3N9k6l8k6J6M9m7l2o7J60j09N4M8O2j70J18Q0
$$ 65 74 77 6 -49 -77 29 1 -128 -46 31 -2 57 31 -7 -33 -17 32 -15 -47 -114 46 -63 -9 39 101 -69 49 129
11231A29j79RR0No1N9o1MN2q2K6l2M8R8ko4j14J92j68L8R9j11M8k3n1K4%M3r1
$$ 129 -50 -41 49 54 -7 52 -9 -5 47 -35 -9 -41 7 105 103 39 -75 117 -51 -13 86 -25 23 0 -51 -27 -27 16 -75
11260g5J22lK9j48J13q8k9Q9j26N4J37q6J09r6JN7j11J03k44J71o4K18j42k6O2
$$ -75 47 44 73 -75 38 -50 -79 10 -116 -62 75 -11 98 2 3 60 -51 52 -192 -21 -85 133 -9 -35 27
11285B7o7J26n5k6J9o7L0j12Q3N7J3q0J40j45j0P0o3j7O5K3p5J49r9Q7m4o7L4
$$ 27 -40 86 31 5 24 -43 -13 -125 -42 15 28 -52 88 -57 -67 3 -60 -77 -12 11 -64 85 -14 73 29 -38 -4
11312dr2J96ll2p6OKN6qP2Mk45K13m4o0LQ4m9j6K9m4k9r2N3J3PP9j21N3J8j20
$$ -4 -96 100 97 65 -11 -5 -3 53 45 117 121 -124 89 45 -15 -12 72 23 7 36 -8 -37 -129 -76 -63 -56 23 -98 -45 -27 -147
11343a47J47P6J16j73Nk2ln8Q6O7o7j39L00j01p0P8r2J43j87N6Rm5K9N3j45P0
$$ -147 0 76 192 19 24 2 -1 -59 27 94 27 -112 188 87 17 95 3 146 -41 15 24 -21 8 61 -84 -14
11369a4K6j08R1o5N3N6L6n4j31N9R1Mm7J02j70J31j5K4j25N3n5N1m2PK2k6M0n3
$$ -14 12 -96 -5 -70 -17 39 75 21 -110 -51 40 44 -3 99 -71 60 45 69 -56 -3 -58 -7 -49 -42 -20 -46 -6 -59
11397e9O7j0JJ9p1J38nn2N9j21R8j00J9L3p0p1J52Lj8kJ22j53j05P7J43o4p9Q7
$$ -59 8 -2 -1 18 -53 85 80 28 87 -34 64 -36 -17 16 -54 -125 27 30 12 10 132 -21 -126 -49 94 30 -49 38
11425C8P8j14N6k5o9J19j54P4r2J57m2r1P4m9J08q7o7J71k13J53N8j77J08jq5
$$ 38 116 2 58 33 -36 83 -71 3 -89 68 26 -65 9 -40 68 -19 -86 85 -128 25 83 -94 14 13 -72
11450g2P1m0o8R0J0k4M2j04O5L6j4Q0j28J15m2m8j3N2O2Q0j61o4K9L2Q5N5j28
$$ -72 -1 -41 -109 -19 -9 -33 9 -95 -30 6 -8 72 -56 59 17 -31 -44 8 70 150 -11 -75 -46 -14 71 126 -2
11477bq3J92j66P7M0m2q2pJ40j42J16n2q4j7K94j14pK6j19J12Qj75R2M0j9kl8
$$ -2 -85 107 -59 18 58 16 -66 -73 67 -75 41 -11 -95 -112 182 68 61 87 -32 80 88 -87 5 45 26 24 -14
11504a4N4o2lK5J01j15r0KJ32q5P8k8O7O1j90M2JlK7J6p8P8J32j82J14j43M7P
$$ -14 40 -22 -25 0 101 -14 -104 -102 30 -55 23 -5 62 123 -67 -25 -24 -27 0 16 -62 16 148 -34 80 -63 -16 -9
11532ij27J85K8p4M0p7k0j10J67prK4n3N6MK1k1n5Q3l6O7oL7j10K3j5L7l8Rk7
$$ -9 -136 49 77 3 43 -34 -54 -164 3 -4 -13 11 -42 14 18 39 18 -37 46 10 77 71 108 -2 21 6 43 5 14 -13
11562a3N8o7L8q0J26k08J10l3R5l4L5ML4P7j63RJ7j19P3k2J17No2J3O4j42J00
$$ -13 45 -22 16 -64 62 -146 -36 -69 26 -8 27 31 65 142 -21 -12 5 -114 -41 -63 54 59 -3 10 74 -68 32
11589C2L5p6O5rp0k4k0J03m5n5M5K9J19j19q1M6l9J09n5m0nJ4J49rm0m5K0j10
$$ 32 67 -9 56 47 -23 -47 -67 36 -9 -64 -19 10 129 10 -71 -25 -64 45 -10 -50 -55 -41 108 99 59 14 34 -76
11617g6k2J63M7k04K8N0L8o7RP9j26O3J48n9q9jnp0Q5O8j51K3J3J5K0L3J6p2J
$$ -76 -98 65 112 -92 -64 -14 24 -43 -34 45 -81 -18 130 71 -18 -19 -24 -94 -9 59 -92 -69 -56 -41 -21 12 28 -44 -43
11646d3k6k9J5P4PqR5j07P8q0p0J59j73J32m2J12j56R3j4J26j25k0n0J57o5j07
$$ -43 -69 -98 -83 -9 -2 -10 85 -22 56 -24 -94 65 -108 24 -18 94 -62 31 17 143 18 -2 -52 105 40 -67
11672f7K8Kq1Q9K0J3n8J8j5P0K6o6j7R4k0p7Q5o8L8j52J1J57m6MLm5K5n7J22N2
$$ -67 -39 -37 -118 -29 -9 4 -54 -36 -51 19 45 -21 -38 56 36 -41 44 -24 14 -138 -127 30 -16 -12 -9 -54 -29 -86 36 88
11702H8j75O9j06K29r7j9j9kJ61k10J24j11J56k0q6QM6K8o3j46O0J22j60K17j42
$$ 88 -87 -18 -124 105 8 -11 -30 -32 129 -81 43 -68 88 68 -18 -10 36 64 1 -145 -85 37 -123 94 -48
11727d8l9L2J15j06M2j20J62J3l2j00J15N5j10p3J69n3r0l7P4O8j06J05N7j90
$$ -48 -87 -55 60 -46 -4 -124 38 51 19 -81 34 89 -21 -94 75 22 -68 -105 -31 37 -69 36 93 -97
11751i7J88q9K2k9j27J59q8l1J60L8j35j7p2M8J19k4J72k70M8p9P3M7J01m7j04
$$ -97 91 2 24 -5 -132 27 -61 -92 68 106 -29 -46 -118 -70 49 25 197 -73 -25 -104 -31 16 117 70 -34
11776c4j0k5M2kJ7j9KJ33j55O9j23N1j3R2Qj06J19p5Q6rm0p7N3J34j56J11n1L1
$$ -34 -44 -69 -27 -29 -12 -31 -29 104 -51 18 -105 -54 -67 25 33 -73 46 -29 57 48 8 -69 -16 118 -38 73 22 53
11804E3j9K5M9l9j46J68j19N4Q1q0l2q8L4J08p7J45j81O4M6L0n5l5o7K7O6K1j54
$$ 53 34 59 108 69 -77 91 -28 26 107 27 -5 -93 -59 49 -28 117 -64 0 46 76 21 -14 -81 -54 12 33 -121
11831a21J25J5Q8j93K0J53j39P6o1k7O1J9o4J02p0j02J22Qn3R5o7p7KQ4K4J7J1
$$ -121 4 19 107 -86 -66 87 -52 24 -37 -64 -3 16 -48 54 -16 -118 4 12 -41 54 -13 -90 -88 -4 20 37 48
11858D8L4j21O7p2k3k6J47j17P8m3l5m8J24o3KK8P6L0j77N6J0j0j7J99p9q9M7
$$ 48 82 -39 28 -44 -67 -93 54 -63 15 -28 -63 -111 13 -50 -48 -20 56 86 -91 -35 -25 -35 -52 147 68 -21 26
11885B6K9j36J31j03N1J77k27J17p1OO5q0P9o5J1j6j01K11rj52l5J08j33J89k02
$$ 26 55 -81 50 -53 -2 175 -52 65 -6 0 65 -15 64 -1 10 -6 -107 104 95 -57 -92 16 -117 72 -130
11910a30K13o2j5l5j9R8k2j06J65k00J02L9l9Mo8J7QL0OL0m8M9O4j31O1n0J62
$$ -130 83 21 6 -29 -48 50 28 -78 87 -113 -11 28 -11 -7 -75 -58 -50 -20 -14 16 -32 17 81 -50 11 -39 123
11937A23m9j13P5o3k6J5J27j40J60j19M8j9P9r1J38j61P8q4j04O7L4J01j15l7
$$ 123 74 -39 36 -27 -53 -38 89 -51 109 -10 38 19 98 7 145 -16 62 -22 -126 -59 -25 76 -39 -76
11961g6J61j63Q2Nk8M9j00J56klr5l5L8N3j18Q0N0Rnj2l8RN3q4n4J28j48J79r2
$$ -76 85 -78 4 9 -19 30 -70 86 84 81 -14 -49 -11 42 -76 4 54 63 58 46 8 17 70 -14 -68 60 -88 91 -1
11990am8n5J96j11j3l3J09j01m9J82j78J63m7p5L1N5J6n4l9M4j20J04J00k1n8
$$ -1 -49 -104 92 -19 -32 -65 44 -57 -106 76 -102 61 14 -61 -30 25 41 -13 -52 -8 -128 -24 76 55 -3
12015cp0J55j89J37l7M6k72K45j51K27j39P5Mj23J72q8R9r3j52J89k3l5J29j59
$$ -3 -73 82 -107 30 -7 39 -233 12 -139 88 -51 24 28 -95 77 -11 88 -5 -157 32 9 -26 103 -56
12039e6Q9m6MM4j8l5j29O0K6Om3M0J8L6J1j26J91r5R6M6r9O0j53J50J4j02M2j25
$$ -56 33 -13 -9 35 17 -18 -147 -87 -61 -55 -98 -58 -40 -4 7 -119 72 -23 73 119 20 80 -73 77 91 -11 31 -94
12067i4O3L4K0pl5pp8J16o0j0M9lK9q4J44j1k7OM1om6K8j43J05J6m2Q6q0n5K8
$$ -94 -31 3 23 16 -19 -26 -104 12 -48 -58 -9 -12 17 -67 77 66 39 45 86 80 34 62 -81 24 40 -2 84 4 -51 -23
12097b3k0J22j45nN2M6k0J02j48J34j31P4Rj06qO5M8Qj20QJ46m5J9l4l4p0P8J9
$$ -23 -43 79 -66 -71 -19 27 7 109 -39 95 -36 38 47 -59 -67 -2 46 54 -66 -58 88 43 62 28 -6 -76 2 21
12125B1qLO9j22J00L0j20KP1m7JO0j38J03j7m2PL6K8L1j66N4L0r5k7j0J42jk6
$$ 21 13 16 85 -37 63 93 -27 -25 46 -1 0 60 -78 25 8 -34 -27 9 37 68 -98 -44 -14 -109 -136 -146 -4 -5 -31
12154c1j4Q2l1j5M4p6p1J72m6O8q6j9k8J88o4k8k7j44J73j10P4J4kN6N8r7k0j9
$$ -31 -45 37 6 -9 35 -41 -112 60 14 82 -4 -23 -51 137 73 45 18 -126 47 -63 11 25 23 79 137 40 20 1
12182AJ7LKQQJ8n7O3j88J14J01j02j35J2J05m2O9k7n6K4R7j37J10n2N4lm5J24
$$ 1 18 21 23 31 39 57 0 63 -125 -11 90 -12 -147 -135 -30 -72 -3 -30 -86 -62 35 -102 8 -44 10 7 -38 86
12210H6j67J47p1qNk4L6n4K9Q8j3KK9o8J8q4k8P1l8K6J25q4k8j00L9J46n5J5J8
$$ 86 -81 66 -5 -13 -8 -32 4 -50 -21 67 54 56 85 17 35 -49 -77 -6 -44 -18 107 23 -5 -105 -66 80 25 40 58
12239E8l5ML8r5M7o0j09J47l0M9n4ONJ8Q0j46O0o6Q0l2O1k8n2M1K1O5L1m1q2L8
$$ 58 23 27 65 -30 17 -43 -152 -5 -35 14 -40 -34 -29 -11 69 -77 -17 -83 -3 -35 26 -2 -54 -13 8 73 104 63 -19 19
12269A9L9K2j09M0n2J05o1NnJ0lm3j0q3J71pj07N1M9j10K5J2L9K5l8L2N4p3k7
$$ 19 58 80 -29 11 -41 64 3 8 3 13 10 -33 -43 -126 45 38 -69 -18 31 -79 -54 -42 -3 22 -16 16 70 -3 -30
12298c0P6j93J41j24N9J76j21kKjM0L5l9k6N8M5j84N9pM2J09k1j72K02n9n1J1
$$ -30 46 -147 -6 -130 -71 105 -16 -18 -16 -17 23 58 19 -7 51 96 -88 -29 -36 6 115 94 -78 124 65 14 25
12325B5j02N9Q7n0kJ04j48L4OK5j47J64j76R8M4n2m8N9P2mj38K3J11j83R6N3j15
$$ 25 -77 -18 69 19 17 121 -27 7 13 38 -109 55 -121 -23 21 -31 -79 -20 52 48 -90 -67 44 -139 -43 10 -105
12352a05J54n4N8o7mM1l1K2p0J76j25J19l7j28N9j1Rl5N0O9p5N4j68J33O4m0j53
$$ -105 49 -5 53 -14 -18 23 -8 14 -56 120 -5 114 77 -51 8 -3 6 -29 21 90 15 69 -99 34 98 58 -95
12379i5J18p0l6J56q4O0j49O9J00o8N1p9j6N6p4N2n8%N1N7p3O0k1p5L6Q0%M1j07
$$ -95 23 -47 -83 73 -11 49 -100 -31 69 1 52 -27 -43 13 -61 -9 -67 -67 -16 41 -32 28 7 -68 -32 48 48 89 -18
12408a8K2J10j26o7J66j00Q8K3j23O7j6p6K4N8j36P1J93j45L0j02J10k7K8r8q
$$ -18 4 114 -12 -79 87 -13 75 98 -25 42 26 -50 -26 32 -104 -33 160 15 45 -57 53 26 54 -44 -52
12433e2J00n2J08m3r8L1P9k71J85N8q4M7J6q5q8J76j08J35p9O2L4q3Q7k6j41J42
$$ -52 48 -4 104 61 -37 -6 73 -198 -13 45 -39 8 24 -61 -149 27 -81 54 -25 37 71 -12 75 49 -92 50
12459E0m9o2N2J16r5m0J5k2K7l1O0M3n9P9p3r9Nj3P6RM3j60Q5K7q6O0J03j45j0
$$ 50 1 -61 -9 107 12 -28 -13 -35 -8 -39 21 64 5 84 11 -88 -83 -96 -20 -11 32 -128 -43 -16 -102 -42 61 -84 -94
12488i4R7N5j66M9P5m8n3Q3m1O9n9R0k3M9k5j50R7OK1KL4j20O4p2N6L3o8J57n7
$$ -94 3 58 -108 -59 16 -32 -85 -2 -43 26 -33 57 34 83 58 -92 5 11 32 34 68 -52 12 -60 -4 29 -39 118 61
12517F1o0r5J61O6j82J36r8k2Q1r1J2oJ20j10J07j26mK3J02q4m7M4m8p2J27K3
$$ 61 1 -94 67 133 -49 87 -11 -33 48 -43 -31 -37 83 -27 80 -46 -50 -27 75 -9 -56 -12 -60 -132 -5 18
12543A8k5j0m0K6K8Q0n1j05j24K05k5O2j35M8J2K1r3K3R9j14J24Mj05O9l8P2j
$$ 18 -7 -17 -57 -31 -3 77 26 -79 -203 2 -23 39 -96 -48 -36 -15 -108 -85 14 -100 24 28 -77 -8 -46 26 25
12570B5rK5l0mj03K2O1j2R9pk08J67k1n7O4k5p3J16r2Nl3M4k5%n7J02p1K02kj49
$$ 25 16 41 11 7 -96 -74 -13 -25 74 67 -141 26 5 -52 12 -13 -86 30 -62 -57 -90 -46 -71 -71 -128 -26 -97 105 103 -46
12600d6N0N0p0R7j07O6l9l4N8nk1L8p6k3r8J28O4j05J08K2j10Q2Rj28J63o8N3
$$ -46 4 54 -16 81 -26 40 1 -33 25 20 -1 37 -39 -62 -160 -32 32 -73 35 57 -53 29 38 -90 73 5 58
12627E8o4j04K01r0j23Q3J1l8P4N1l0j21J63j42J66q3Rp6L0P0j08K26j92L7%l9
$$ 58 -6 -110 91 1 -122 -39 -28 -66 8 59 29 -92 71 -71 95 12 21 -55 -25 45 -63 163 -29 8 8 -31
12653c1J3lM8M3o3K8j2j0j5k0Nj9R3j17R0J5k07J99k3j21J29oj59l2J59J73k05
$$ -31 -18 -21 27 70 7 35 23 13 -2 -22 -17 -36 57 -60 30 45 -162 37 14 -107 22 16 -143 -175 -16 157 -48
12680d8P4on5J42jj40P9m9Mp1J03j10O1n6J80j9j24L6J34o5j25m6K41r4k3mq3
$$ -48 26 20 -35 107 106 -34 45 -4 0 -71 32 -78 -17 -73 107 88 -36 0 134 69 -56 -102 139 45 22 18 -65
12707f5J05n6l6R0J27j39j09P8N8o3n6j2J8P1N3r9j8M8N6j1r8M9OLq5l8Q4l5n7
$$ -65 40 -16 -52 38 165 26 -83 -5 53 -10 -66 -78 -60 11 64 -35 -53 -5 51 40 -58 -9 -3 0 -85 -123 -39 -74 -131
12736a31J54O2j81J00OK5l1m6J5J2p0K28k45J08RJ4M5j15j0l2K8ok5K6PK5l5J20
$$ -131 23 85 -96 4 10 35 4 -42 -27 -15 -85 143 -102 6 15 29 74 -41 -51 -83 -55 -61 -86 -60 -53 -28 -63 57
12764E7r0N6m2j5P7n9O3j24J00K2j62J25%r6J39m1P9q4k2j5%q7J45j52J14m2L9
$$ 57 -33 23 -19 -34 43 -16 47 -77 23 45 -117 8 8 -88 51 10 89 5 -17 -32 -32 -119 26 -126 -12 -54 -15
12791a5N5q7k8Q5J05l6j01n1O1l6P4K0m0l3J4j02J10m7J67j91J34n3K4k9j24J41
$$ -15 40 -47 -75 10 115 79 -22 -73 -12 -48 26 46 6 -27 -13 -115 -5 -52 115 -76 58 5 29 0 -124 17
12817A7j08Q8L9o0K5j42K14q6p0q7P5k5J45j8K7Rj52J66M4j6r3j8L1o5Q5o2%p
$$ 17 -91 -3 36 -24 1 -141 73 -13 -83 -170 -95 -120 25 7 34 43 -109 57 101 85 -8 -26 5 -60 25 -37 -37 -44
12845d4O5jL8Lk09J09J16L3J9m0r3J27j00p3KM9J2j10J29O1k3j71KJ43r2J28j12
$$ -44 21 20 58 61 -148 -39 77 110 129 89 -4 123 23 -50 -48 1 13 -97 32 93 70 -101 -99 44 -48 80 -32
12872c2j38K72j94N9MJ04o5m9O4qM0j13K7J24k9j34J7R8j07k6J14pK2m5j11J10
$$ -32 -170 102 -92 -33 -29 75 10 -39 25 17 57 -56 -29 95 66 -68 -51 47 -60 -86 28 21 43 -2 -113 -3
12898coP2Q3j36k7j08j1N8J79q8L9L5j00J8j55J81q6j9K6l3P3qq7J22j01J14L
$$ -3 -9 63 146 10 -17 -125 -136 -78 101 13 52 87 -13 5 -150 31 -55 -74 -48 -81 -8 -16 -103 19 -82 32 35
12925C5n1j13O4J1J14j39OJ07o4o9Q8KL9p9J64j17J00j74J39j12M4J00j58R6n5
$$ 35 -16 -129 -65 -54 60 -79 -73 34 -30 -99 -11 -9 30 -49 115 -2 98 -76 63 -49 -5 95 -63 33 -22
12950b2N0q9Q8r4L9l7R7r0mN1K6OJ1O9p7j4o1n8L6P9L6j51J01j7KM1q7j9O2m1
$$ -22 28 -61 27 -67 -28 -65 32 -58 -62 -11 15 21 32 101 24 10 -51 -109 -73 6 42 -109 -8 -25 -23 18 -69 -88 -26 -67
12980f7J10j6R1k19l0J43q2K39k24N4J2N3r3J50p7j6m8J9P1j12Q6j16J72p2m7
$$ -67 43 27 118 -101 -131 12 -70 169 -55 -1 11 64 -29 121 44 28 -20 -1 70 -42 44 -72 100 28 -19
13005a9q3K26q9J2K1j8j56J04K5o5K6Mp4mL6J47k5p4n0J8k1N9o8N3M6k6m5J20
$$ -19 -102 124 35 47 68 50 -106 -2 23 -42 -16 -12 -86 -90 -54 93 68 -6 -56 -38 -59 0 -68 -15 31 5 -40 80
13033H0q2L8l8j24j1O7J05K1l7k7m4R3j06K17k57J53p7k1J23Jj6p1m5R3j34l8
$$ 80 -2 36 -2 -126 -137 -70 35 56 19 -8 -52 41 -65 152 -105 48 -29 -50 73 74 58 -13 -58 35 -99 -137
13059a37R6l5K9M2L8L3LL7j70N2n8N1l9L1k3PP4j40Q1N9j20P9R2p2j21J11J8L7
$$ -137 -41 -76 -47 -5 33 66 69 106 -64 -12 -70 -19 -58 -27 -50 -43 31 -109 -28 31 -89 -10 82 10 -111 0 18 55
13087E5m0j9L8Np2J09j6M5j65R9m6P6r4L6m5M2j7j07M5p9Q3J70j23R3m7l4L3r3
$$ 55 15 -4 34 39 -33 76 60 105 -60 39 -7 69 -25 11 -34 8 -9 -116 -71 -150 -67 103 -20 73 26 -8 25 -68
13115f8M6j9P6j22rP2J01o8p9L4O4rq7k0J55o7M5RKN9o6r9P4o6J42j28Q5j4q7
$$ -68 -22 -41 35 -87 -96 -24 77 9 -70 -36 28 19 -68 -88 67 0 45 54 56 115 49 -50 24 -42 100 -28 57 43 -44
13144d4R6L2j35N2k2P6K4p2K7j3j8r9L1L5l9M5N8j16%L2Q9M4j88J43r5J9J6K4
$$ -44 52 84 -51 1 -21 55 79 7 34 21 3 -96 -65 -30 -69 -24 34 -82 -82 -50 39 83 -105 38 -57 -38 -22 2
13172Bk0P5n1J7Op7K8J06Qn9j42O6R0m2q0J44j88J68P0n4n0K6%P0l9%o0Rm5p5
$$ 2 -18 57 6 23 29 -48 -20 86 94 35 -107 -41 49 7 -73 71 -117 51 121 67 17 43 43 113 74 74 14 23 -22 -97
13202i7J34p2M4q5R2j65J34J01n6k04O5P3J28j38q9J32j1K4m0l1M1%J02j35J11
$$ -97 37 -35 9 -76 16 -149 -15 86 30 -174 -109 -36 92 -46 -135 -3 -14 10 -30 -61 -20 -20 82 -53 58
13227E8P2j76J19p4m9O7P6n7j00J44R7j97o5J62j00L5p9J20j60N4O4P2j73Q2J19
$$ 58 130 -46 73 -1 -50 17 93 36 -64 80 177 -20 -85 77 -23 12 -67 53 -107 -53 11 83 -90 -8 111
13252A11j10L6m1o3J5n6P9m9Q4q4K51k51J21o4N4p2KK3m2k4J08P0j42q2J61Q2
$$ 111 1 37 -4 -67 -52 -108 -29 -78 6 -78 173 -78 43 -21 33 -39 -37 -14 -56 -80 28 98 -44 -126 35 117
13278A17q0M2j03L3j5n1K7M9l7J37k8j36J99r5N0lk49J44L7L8j90R3J25j16M2
$$ 117 37 79 -24 9 -6 -57 -30 19 -18 119 91 -45 154 59 109 106 -143 1 38 76 -114 -21 104 -12 30
13303C0o5M5n8jl3j7L3J68r4n3N6k5r0K03j38J07q1j7ll6K7P6j8N8j54M9P6p9
$$ 30 -35 10 -48 -49 -82 -99 -66 102 8 -45 11 -14 -104 99 -39 68 -13 -30 -33 -69 -42 34 16 74 -80 -31 45 -34
13331c4j8N0J03j34q0J00J27k2N9j93l3L2om7J64n9jp9J14o8o5O8Rk16J93K4l8
$$ -34 -52 -2 101 -33 -113 -13 114 92 151 -42 -75 -43 -49 -96 68 9 8 -71 43 -25 -90 -22 -13 -229 -36 -12 -50
13358e0P6n8o9L3M8rJ14l5j54R4J10m5o7j1R4k35N8K2J60n3k6J28j15L8k7k5k4
$$ -50 26 -32 -101 -68 -20 -29 85 50 -104 -10 100 55 -12 -23 71 -164 -106 -84 76 23 -3 125 10 48 21 -4 -28
13385b8l0J43q4OO2j47J17k0k6m0o9J53O2k93J35o2J72n4p7Q1j79J14J15o2R8
$$ -28 -58 85 1 7 69 -78 39 19 -7 -47 -116 37 99 -194 -59 -121 51 -3 -80 1 -178 -64 51 -11 87
13410H7K5k03L2l6nJ17m3k3L8OK1M3j2nN1j23K1n9J65j56J89j50J9j7P5M9j32
$$ 87 112 -91 -59 -95 -100 17 -26 -49 -11 -5 16 59 47 42 93 -30 -9 -68 97 -59 130 -20 -1 -18 57 106 -26
13437b6k8J00J2q2oO8o3L3K4K5j12j3m3J63Rj6j81J07P9q7J34j05N3j16K1rJ3
$$ -26 -54 46 58 -24 -30 38 -25 8 32 57 -55 -68 -111 52 61 45 -136 -29 50 -37 97 -8 45 -71 -50 -59 -46
13464d6KJ17J0j1j20mJ40j16o6J65j10R4q3J0L9j28J29M7j9j61J95p9l0l3j6K1
$$ -46 -44 73 83 72 -48 -52 88 -28 -94 71 -39 55 -28 -18 21 -107 22 69 50 -111 84 5 -25 -58 -74 -53
13490e3r6N4j47K19Oj6qo1J64l9Mj16J37j15J21lm4K2J10n5j13O0p7pJ7R2m7P4
$$ -53 -149 -95 -242 -23 -17 -33 -41 -102 62 23 27 -89 48 -67 54 51 7 29 139 84 -29 31 -46 -53 -36 56 9 83
13518H3m5r5R2o9K2L8K7p7Q8J9m9J40m4j39K06l16J47n1M9r5J80l8j77O9M9p4
$$ 83 38 -57 35 -34 -12 26 53 -24 64 83 34 174 130 -9 197 -119 28 -23 26 -69 111 73 -104 -35 14 -60
13544f0N9K7j35L9RN6O1p1J29l53J84O6N7o1o3L3j1R3j00O2J2N6k5k9m7k6K9O1
$$ -60 -1 26 -109 -70 -61 -5 56 -15 114 -239 -55 11 68 7 -56 -23 -34 59 -41 21 33 89 64 35 -12 -38 -9 52
13572E2l4j06M7P2j53J38n1L6M9k7Nn9K0Lr3J75r8j7P6j36J2J27K6l1k4rj22J39
$$ 52 18 -88 -41 31 -122 16 -35 1 50 23 28 -31 -11 -8 -101 74 -24 -41 35 -101 -89 38 64 33 9 0 -122 17
13600A7o4J7P6j11j4kM8P0j08Q2Pk9L6k1K8K1k7Nk13J19Q4m1J17j43l1J38r3O5
$$ 17 -47 -30 46 -65 -79 -81 -33 37 -71 11 18 -11 25 4 32 53 26 31 -182 -63 21 -20 97 -46 -77 61 -32 33
13628C3J04k72J54k4l1m3J15l7M2L4No1J3K5j62P3l1P1n7o5J14J15n4j21K7J7
$$ 33 137 -135 19 -5 -36 -79 36 -1 41 75 80 19 32 57 -105 -32 -63 8 -49 -114 0 115 61 -60 -33 -16
13654a6L0m6k0L4J03j98J95k04J52J95j73k7N4n0Q5j69J0J8K3N6j15Q1J6j55J2
$$ -16 14 -32 -52 -18 85 -113 82 -122 30 225 52 25 79 29 114 -55 -45 -27 -4 52 -63 18 34 -121 -109
13679a09J72j02L7j7Q4K0o4j72O9J59n2j8j8k8Q2r6N3%LM0m6kj5l0M6m1J20j26
$$ -109 63 -39 -2 -19 65 85 21 -151 -82 77 25 7 -11 -39 43 -53 0 0 3 43 -3 -5 -20 -50 -4 -45 75 -51
13707e1Q8o6l2P0n3J17p2r0K1M8k3J00j13L9R8o8n4J2M5k4o1k8L0R7j20J09Mo1
$$ -51 37 -29 -61 9 -44 73 1 -89 -68 -20 -43 57 -56 -17 81 13 -41 -29 16 -8 -69 -97 -67 30 -90 19 23 -38
13735c8n8J35m7p1J34j56J28j67J77M0j08M2l1k5J35j27O0j00J50j65L3O1J84
$$ -38 -96 39 -8 -79 55 -101 27 -140 37 77 -31 11 -20 -45 90 -37 23 -77 73 -92 -59 2 186
13758A86j89r2o5J02M0N7p8O9rPM6j41J11Jj16N2P2ql5l7Q9j07N0N9j32k3J16
$$ 186 -3 -95 -160 -58 -18 39 -39 30 21 28 74 -67 44 45 -71 -19 53 45 10 -27 62 -45 5 64 -68 -91 25
13785B5K0n1P2r1j07J07R5n7J6L1q4N7j11K6Q9p4P8o6N9K6r7l4R7M7j24L7Q2l5
$$ 25 45 -6 66 -25 -132 -25 70 13 29 60 -24 33 -78 -52 37 -37 41 -25 34 60 -37 -71 26 73 -51 -14 68 33
13813C3q3m3KJ6N0O9mr1qJ50n5N6o3n1p5m4P7J25Q0j48ln8K7l8n7j2R9O8r7Q3
$$ 33 -50 -93 -91 -75 -25 44 40 -51 -59 91 36 92 29 -22 -97 -141 -64 61 141 -7 -10 -68 -41 -79 -136 -148 -49 19 -78 5
13843EJ32k21J32o5p2J15k0K2o8j5L6m7N7jJ22m9k6QQm3r5J1J05n3j53J01O2K3
$$ 5 137 -84 48 -17 -89 26 6 28 -40 -55 -19 -66 -9 -10 112 63 37 45 53 10 -85 -74 31 -22 -175 -74 -12 11
13871A1q0J05q9mj5P1nl5L9N1n9Kj27J47j4n4n4P8NJ1o6J49j02J6p8M1J49j6q8
$$ 11 -69 36 -53 -57 -72 -1 -6 -41 -2 49 -10 -8 -135 12 -2 -56 -110 -32 -27 -16 -82 67 -35 -19 -97 -56 93 77 -11
13900a1P1l0K0j60J24r0J09j11L8P3j46R5j8M7j61J12r0J18k1P2j45M7jN1o1R2
$$ -11 60 30 50 -110 14 -76 33 -78 -40 33 -113 -18 -36 11 -150 -38 -128 -10 -31 41 -104 -57 -58 -7 -68 24
13926B4r1K0L1k1n0J10%k8L7j02j0J94n1j29M9k9R4M6j08p7R7nO1j0n2r1J29q
$$ 24 -67 -47 -16 -37 -87 23 23 -5 32 -70 -80 114 63 -66 -17 -46 48 94 -14 -91 6 1 62 52 0 -91 38 30
13954C0M1L7Pr0J9o1J48k18P9m5K5m0J12K8j40nJ0J9J74j54j4J6L1j20J27j12
$$ 30 71 108 115 25 44 -17 131 -87 -8 -53 -28 -68 44 72 -68 -73 -63 -44 130 -24 -38 -22 9 -111 16 -96
13980i6KM8M2j47K28o0p6L2K3N3%m8L6K3o9M4j4J07j38lqQj82J06J22j1o8m6J92
$$ -96 -94 -46 -4 -151 77 17 -59 -27 -4 49 49 1 37 60 -9 35 21 128 -10 -13 -21 -13 -195 -89 33 22 -46 -92 100
14009A00q1q8P6K3q5Q1m8r9J54Lj31P9J4k5k0J63m6j33M7o0R3%j96P0J29o1J05
$$ 100 19 -69 7 30 -55 26 -22 -121 33 36 -95 -16 -2 -27 -47 116 70 -63 -16 -76 17 17 -179 -109 20 -41 64
14036F4j0o1M9r2rj50K48p6M9L4l2o0k7Q3M0k8M6k10J25O2n3p8L8Q0j08K9Q4P3
$$ 64 54 -7 42 -50 -59 -209 39 -37 12 46 14 -46 -73 10 50 22 68 -142 -17 45 -8 -86 -48 32 -76 -47 37 110
14064A10j63L3l8N8L8J8p9J5n3J33j80J80j40J08j06j6K4o8J88p5l1%Q9Lm5p7
$$ 110 -53 -20 -58 0 38 56 -23 -8 -61 72 -108 72 -68 40 -66 -82 -58 -126 62 -13 -44 -44 45 48 3 -74
14090g4J68o2j4p1j4J2O7n0j0K08j52j7k6q1Q2j2L6n4P5QJ25j26Kk7J1O3p4L4
$$ -74 94 32 18 -53 -67 -55 12 -38 -48 160 8 -9 -35 -116 -34 -46 -10 -64 11 19 144 18 20 -7 4 67 -7 27
14118B7m8M3j5p3J92m8r5P5p5L5l9J9j19R0N5m3k1O3o8K1L8M7j46j5J91J4jj70
$$ 27 -21 22 7 -66 126 78 -17 58 -17 18 -21 -2 -121 -31 24 -19 -40 23 -45 -24 14 61 -85 -100 91 105 104 -66
14146f6J53j01jo3rO2K8O7j12L8n1P3l2J6%N1K7j35L4q7L7O3M7j07J91o0j49J22
$$ -66 87 -14 -15 -78 -87 -25 3 70 -42 -4 -55 18 -14 2 2 53 80 -55 -21 -108 -71 -8 39 -68 123 63 -86 36
14174C6J00j73J00j9r0l0jP8j13J98r6j50J70qJ7J0M2j00n8J38j16K1L3q8J59
$$ 36 136 -37 63 44 -46 -76 -77 1 -112 86 -10 -160 10 2 19 29 71 -29 -87 51 -65 -44 -11 -99 60
14199F0j90J42j4N9j11K08j43lm8K7l5J4O0n6J6j35M4K45j32m1Q7J9KPm9N5j19
$$ 60 -130 12 -2 57 -54 154 11 8 -40 -13 -48 -34 26 -30 -14 -149 -105 140 8 -33 54 73 75 82 33 88 -31
14226c1K7J35j84O0l1m8Q4Oj1K6l7L6j3j20L8R7lq3K5J4Qn3M3j4Kl7N9M9o7L5
$$ -31 -4 131 -53 7 -24 -72 12 18 7 33 -4 32 19 -101 -63 34 31 -52 -27 -13 -5 -58 -15 -29 -27 -64 -5 44 -23 12
14256A2j12O5Q0k26K34j38j4Q7r9L4J0N6k5p1L0N0k5J01n3j41J83J4j33K7M9N9
$$ 12 -100 -35 45 -181 53 -85 -99 -12 -111 -77 -67 -11 -36 -107 -77 -27 -52 49 -4 -145 38 52 -81 -54 -5 54
14282E4O3k25J89o4l1J78j81J66k92J44J3q7J75j65K15j54L1r4M8r1K11j28L7
$$ 54 117 -108 81 17 -14 164 -17 149 -143 1 14 -73 102 -63 152 -2 29 -65 -17 -108 103 -25 12
14305A2j8j6N4l6R6j93J74Q4j70P0o1m2R0l6k8Q1K0j30k7Q3R4o8Rj69J86Q6j97
$$ 12 -6 -22 32 -4 92 -101 73 157 -13 57 -4 -46 44 8 -20 61 81 -49 -76 7 101 33 42 -127 59 145 -52
14332e2J22j00P0K7K1l5k8j2J7r4m7L8J1p2K23mj42M0l6L9L6Kl4o3J6P2j44L8
$$ -52 70 -30 40 67 88 53 25 13 30 -64 -111 -73 -62 -134 89 85 -57 -17 -53 -14 22 24 -10 -73 -57 15 -129 -91
14360i1lN0N2j8N8m1M2k2j65J68k8N2j62Q5N3j21O4M1L2m9j32J80q5M4m4j1K4
$$ -91 -94 -44 8 -10 48 7 49 27 -138 30 2 54 -108 -23 30 -91 -27 14 46 -3 -135 45 -40 4 -40 -51 -27
14387b7M1j01J22k7n6o2K49p2j59J94j77k6J64j7M0j09P9j94J54j02K8k5K8J14
$$ -27 14 -87 35 8 -48 -110 139 67 -92 102 -75 -101 63 46 86 -23 56 -138 16 -86 -58 -83 -55 59
14411E9l4j2l0J13l1m9l7Qq4K8m3K28j80J50j82J49q1kM7QK5j46R5l1%j05O4M
$$ 59 25 13 -17 96 65 16 -21 -13 -97 -69 -112 116 -64 86 -96 53 -28 -30 17 25 50 -96 -1 -32 -32 -137 -73 -69
14439f9J34j28L1O3M9j08LJ02j24L7o3J30r8K2KPJ18j36J19k6j70J32q3j15J57
$$ -69 65 -63 -32 31 80 -28 -25 77 -47 -10 -73 57 -41 -19 -17 -10 108 -28 91 65 -105 27 -56 -171 -14
14464a4j18J83o1q4J69j91J19ro5Rk1m7J76m4j13J51O4j20J2j05J18o3L1J14j07
$$ -14 -132 51 -10 -94 75 -116 3 -6 -71 -62 -83 -130 46 2 -111 40 104 -16 -4 -109 9 -54 -23 91 -16
14489a6Kn8J5J44m9j6j1N7j05N3k7qN1j8j27O8P6k9o0l5K10j41L5L2r0J04j62
$$ -16 -14 -72 -57 87 38 22 11 68 -37 16 -11 -19 32 14 -113 -45 31 2 -58 -93 117 -24 11 43 -47 57 -105
14516a05M0JL5Q3%L2o4j6j82J81m8N3J1k8O4o9k3nQ0O8j35J01K9m1r5q0R9o6J67
$$ -105 -65 -64 -29 54 54 86 22 6 -176 5 -43 10 21 -7 57 -12 -35 -40 40 108 -27 74 103 62 -33 -113 -14 -80 87
14545H7j40j6j55K30j21K9J17q9J27Mj05N8m6M6P3j64Q7L0p2k2Kk8P9N4j6j01
$$ 87 -53 -69 -224 6 -115 -86 31 -58 69 73 -32 26 -20 26 99 -65 22 52 -20 -42 -40 -68 11 65 49 -52
14571e2R2K8M2j71O6LPo2J05M4p3N6p1j1J10n5j11K1L6ql5j0j4oM1k2PJ33j16
$$ -52 40 68 110 -61 5 8 15 -47 58 102 29 85 14 3 113 58 -53 -32 4 -4 -39 -49 -63 -69 -28 -50 -43 90 -26
14600b6j4J9J37j54Klm7P2J00j5j64J46j34J6J42j97N1J53K3j19pJ27j57M9kN6
$$ -26 -40 -21 116 -38 -36 -39 -86 -14 86 71 -93 53 -81 -65 77 -120 -69 84 107 -12 -19 108 -49 0 -2 54
14626E4Np6O7o3M9j57Q0Q9P0q3j23N5O0l3L9m9jJ07p9op1qM3k1k6K9m5J14k2n9
$$ 54 59 -17 50 -13 36 -121 -41 48 118 35 -88 -33 27 -6 33 -16 -17 90 11 5 -66 -74 -31 -52 -78 -49 -94 20 -2 -61
14656f1J17j69J74n6%j08R3JMl8O0j49J64j30K7N5J26m0j71P7Q6k1Pn5j6N4m7
$$ -61 56 -113 61 5 5 -103 -10 -9 -5 -43 17 -132 32 -98 -71 -16 110 70 -101 -24 62 41 48 -7 -23 31 -16
14683a6J7R3n4n5J8j02K2O0k2J1Mrl9P6mj5j5k9J50j69PJ35J8r2M3R2m7L3q6l6
$$ -16 1 94 40 -15 3 -99 -77 -17 -39 -28 -24 -33 -72 4 0 -15 -30 -59 91 -78 -71 64 82 -10 33 125 78 111 25 -11
14713a1L3J11j02M7p1K5j5p4P6Pm5r0O3M9j0r5N3J6O5J2lj16R5p7Q0o0Q0j25Q4
$$ -11 22 133 31 78 7 32 17 -57 19 26 -19 -109 -46 3 -7 -102 -49 -33 32 44 41 -75 20 -57 23 -37 43 -82 2
14742BR6j95N9J2p1J08p1M9J02L6j7j54K3r4J61j10L8k4K32k17O7LL4Jj44J38
$$ 2 98 -97 -38 -26 -97 11 -60 -11 91 127 110 -44 -21 -115 46 -64 -26 -50 182 -35 32 35 69 70 -74 64
14768F4r7R8j53N4Qj2K3M4J5p9J19j09l2J11j45J73p9j4k1J1L7N8Nj16rJ05j17
$$ 64 -33 65 -88 -34 -26 -38 -15 29 44 -35 84 -25 -57 54 -91 82 3 -11 -32 -21 16 74 79 -37 -46 59 -58
14795e8P8o8L9P5r4P3j3Mj37J13Nl9M8j40P1J66j66Ml3M6J0oL2o3P5L9j61J15
$$ -58 20 -48 -9 66 -28 45 32 36 -101 12 17 -22 26 -114 -43 123 -43 -39 -72 -26 -16 -22 10 -53 22 61 -100 15
14823A5M4Qr2qo4M7J2Q7j16J86r6L5J6j36q2J45K0n3J53j11o7r8L1kJ77l2O3j18
$$ 15 59 67 -25 -33 -97 -50 -38 49 -67 119 23 58 74 -62 -144 1 21 -32 121 10 -57 -155 -124 -126 51 19 82 -36
14851c6O8j23J20r0J01K3n6m7M3J23n4m8q6l3m7K04l3p6O9l3M9J1q6Nl0N9L0l7
$$ -36 32 -91 29 -61 40 63 7 -40 3 126 72 24 -62 -95 -142 62 29 -47 22 -11 38 49 -37 -32 -62 -3 27 -10
14879a0J6ON9j47J88m2j16Q5mQ8o7r1lPQ3q5N3r6O8J07r0k7N6jj17J85r3j27J69
$$ -10 6 12 71 -76 112 70 -46 39 35 123 56 -35 -38 -31 52 -33 20 -76 -8 99 9 -18 38 37 -80 105 12 -115 54
14908E4j31N6J7K4l8L5P2J4r8l5O3LN0J0Rj22m3J55j50J68j45N2j5l2PR9m7p7
$$ 54 -77 -21 -4 20 -18 17 89 103 5 -30 33 36 86 96 105 -17 -60 95 -55 113 -32 20 5 -27 -20 79 32 -45
14936d5L2k0L1o8J9r2J48o0n3R5k0%Q9j22j0J29Plk2L8k9j54J54q3N6l0N8l3R7
$$ -45 -13 -33 -2 -70 -51 -143 5 -55 -108 -13 -33 -33 56 -66 -76 53 60 57 35 73 44 -110 44 -39 17 -13 45 12 109
14965A09q9o8J64q6k2j05J32nKj5k9k7m1J29O9r6j62R8M7K9k3Qk1O7K6j10p5P8
$$ 109 20 -48 116 30 8 -97 35 30 32 17 -12 -39 -80 49 118 22 -140 -42 5 34 11 19 -2 65 91 -19 -94 -16
14993a6l1K4N0j21K02r8Lj31J94j16P8j9P3m9n5J5J22j78J76j51K4O3m9N0o7L9
$$ -16 -47 -23 27 -94 108 10 13 -118 76 -40 38 19 92 43 -12 3 125 -53 123 -28 -4 59 10 60 -7 32
15019C2J0m7o8Q7J27m2j58q1J62l2j50K27Op9m8o1J70j58O7J69j52k1L1O5q7O4
$$ 32 42 -5 -73 14 141 99 -59 -140 22 -10 -160 67 73 -6 -54 -115 55 -103 -36 133 -19 -40 -9 56 -31 33
15045C3q4J18l7j13Q0m6l5lJ6k5J66n8N7n1o1RO8J08n8n1M7Ro3q0J31j14RP1k4
$$ 33 -51 67 30 -83 -3 -49 -84 -87 -71 -96 70 12 69 18 -43 -34 34 142 84 33 80 89 26 -54 77 -37 -28 43 19
15074A9j53J60ml0k2j6j19K22j97P3m0J01Kj2p4Q1m2M2K6o6n1j2O2J28j13nqJ4
$$ 19 -134 26 22 -8 -30 -46 -165 57 -140 -67 -107 -6 -4 -16 -90 -9 -51 -9 17 -49 -100 -112 -50 78 -35 -40 -48 -34
15102c4O4j03J55q1mQ0k17J82K9j47L4J11K1j05N9m0p4J06l1q6J23J5L8j10J5
$$ -34 30 -73 82 1 -3 77 -140 42 71 -76 -42 69 90 -15 44 4 -70 36 5 -81 42 57 95 -15 0
15127@Oj5M3j15J11J5k5r4nJ15rjn3j9J98j17K4j43J0J43q4j4O3J29k99j0R4J54
$$ 0 6 -9 34 -81 30 45 20 -74 -79 36 27 26 -27 -46 152 35 59 -84 -74 69 -15 -29 34 163 -136 -146 -52 102
15155A02j68O0ol3L5K7j3o4J01J4j2p4J60l05J38J6j3j3Q7p9J23L2k15J33rjp5
$$ 102 -66 -6 -12 -45 -10 17 4 -60 41 55 43 -31 129 -176 -38 -22 -35 -48 39 -40 83 115 -100 33 24 23 -52
15182e2k7J74j07m3pK8m0l6J89k4p6L6m7L1Q4r2pO5m2QJ5q6rN7n6O0r6O0J36N3
$$ -52 -79 95 -12 -55 -62 -34 -74 -110 79 55 -21 15 -32 -1 83 -9 -16 49 7 15 30 -56 -65 -8 -64 -4 -100 -40 96 149
15212A49n3kj91J10MmJ8n1l4p8Q8P5j19J33j18N0J28r5r3k2J21m9j2M8o1k7Q7
$$ 149 96 94 -97 13 17 13 31 -20 -54 -132 -44 31 -88 45 -73 -23 105 10 -83 -105 16 -33 -45 3 -58 -85 2
15239Bl4l1J41mo4l0lR8o8M4j5J6j0o9j18J84o2P1j40L8j7J02o0N8m0nq0J73o8
$$ 2 -32 -63 78 74 10 -20 -23 75 7 51 36 52 42 -27 -145 39 -23 48 -92 -54 -71 31 -29 29 -11 -16 -96 77 9
15268IR1o9j56qJ38J3j2K2l5o4J22k2n7q4J38L8r7q8J02l5m2O0lQ9l5l2k7P5K5
$$ 9 100 31 -125 -133 5 18 6 28 -7 -71 51 29 -28 -112 26 64 -33 -121 -19 -54 -96 -36 -39 50 15 -17 -44 31 56
15297E6K5r0J4K4l6p4N5O0k3K1k5o6P3K6k8jj10Q5Ok1kM6O6j50P0k6j59J01O8
$$ 56 81 -9 5 29 -7 -81 -26 34 11 32 7 -59 14 40 12 11 -99 -14 -8 -29 -31 15 81 -69 1 -25 -184 -83 -15
15326a5K7j79J79P7j60N7j41J20pJ44j78Q3M7o0O6j13M4Q0n0n1L0kom7P9l0P9
$$ -15 12 -167 12 89 -71 -14 -155 -35 -42 102 -76 7 54 -6 60 -53 -9 71 21 -30 0 -2 -8 -55 24 -6 73
15353G3K0K3j1j95J79j48N3k4K5j2o4NJ43k0j51L4L1R9j90j0jR8P9j28M1J43j16
$$ 73 93 116 105 -90 89 -59 -6 -30 -5 -17 -81 -76 67 47 -104 -70 -39 60 -130 -140 -141 -43 36 -92 -51 92 -24
15380b4q3J56K2o2O9l7Pj92R4N6qL5o3Q5Lj01J38q5m0M3j03J34N5o2n4O0N7l4
$$ -24 -107 49 71 9 78 41 48 -144 -50 6 -2 33 -30 55 58 -43 95 10 -30 13 -90 44 99 37 -17 43 100 66
15408F6Mj78M6J04p6M3pK5o7J1k4Q4q0m8J16Mk65J76j6J89j73J05j2Q3o1Mj64
$$ 66 70 -108 -62 42 -34 9 2 27 -40 -29 -53 31 -49 -97 19 23 -242 -66 -82 107 -66 39 27 110 49 53 -111
15435a11jJ00O4q0K4p5J14p6M8J3M9p6Q2j38m2J35p9mM8J42j75N5J4k8N5j2o8
$$ -111 -112 -12 52 -28 -4 -79 35 -41 7 20 69 -7 75 -63 -105 30 -49 -53 -5 137 -38 17 31 3 58 46 -22
15462b2K0r0p6K48j02j2P2j10N1R4r7J29r0j5p7J06j02%J90l7o3J72j92J20Rp0
$$ -22 -2 -92 -168 80 -22 -34 38 -72 -21 73 -24 105 15 0 -77 29 -73 -73 117 80 17 189 -3 117 126 56
15488E6j1L3j90M5L3M6OK3ql1P1o1n4J23q8O2j0P0j70L8M2l9N5N7j95R8o2Q3l0
$$ 56 45 78 -112 -67 -34 12 18 41 33 2 73 12 -42 81 -7 55 45 115 -55 -17 25 -14 41 98 -97 1 -61 22 -8
15517hl2O4k5q5K2K8j7Q8o4Q5n7K6Oj6p1Q9j31O5K2JM4M6j07mR0L2k12J07O5o0
$$ -8 -40 24 -1 -86 -64 -36 -53 35 -29 56 -1 25 31 15 -56 33 -98 -33 -11 -10 34 80 -27 -31 59 91 -121 -14 51 -9
15547iP1Nj28Q2j37J58j20k0J91J9j02l6P5L1j29K6l5m6Q3j2kQp4J13L4p8J1j3
$$ -9 62 67 -61 21 -116 42 -78 -98 93 112 10 -26 49 80 -49 -23 -58 -104 -21 -33 -35 -27 -101 12 46 -32 -21 -34
15575c4JM8M1M9k13J33L1q9J3p1J46%K3m3p8J95j12n3r5J07k9l8j6J44Jr8l4J97
$$ -34 -33 15 56 105 -108 25 56 -33 -20 -91 55 55 78 35 -43 152 40 -13 -108 -1 -30 -68 -84 60 61 -37 -71 126
15603A26k61pK63j62L0n0J8lL1K1L2mK3mj44R7j02N7q3K88k21K8j3K9J11j32M3
$$ 126 -135 -142 121 -41 -11 -61 -43 -46 -15 6 38 34 57 53 -91 6 -96 -39 -122 166 -55 -27 -40 -11 100 -32 11
15630A1K7r6J08j21J64j12R5o8J38j37P3Oj9k6j4p4Lj0P6j16K64k48L8K6j07K4
$$ 11 38 -58 50 -71 93 -19 76 8 146 9 82 88 69 43 29 -45 -42 -52 24 -92 172 -76 -38 -12 -119 -95
15656i5J49p5L8j5r8R5qj36J22k8J1O1M7m8n2q2Q8k4J17L1j8j28N2l5jj1O6l1
$$ -95 54 -21 17 2 -96 -1 -9 -145 -23 -51 -40 21 68 20 -32 -114 -26 -50 67 98 80 -48 4 -31 -32 -43 23 -8
15684hj1L8j45J28jJ13j00L8j1N4k3j7j6r0J82j43l3K4j1M7J2l3n6L0M1l4m4J05
$$ -8 -19 19 -126 2 1 114 14 52 41 95 72 55 39 -51 131 -12 -45 -21 -32 15 27 -6 -62 -32 9 -25 -69 36
15712C6o3L8L4J8j35P4q0L3J3l0r0K63j34n9J01o8M8j1Q2o7O9q8J6Q1j16K7K9
$$ 36 -27 11 45 63 -72 2 -78 -45 -32 -62 -152 111 -23 -82 19 -49 -1 -12 70 3 72 -16 0 81 -35 -8 21
15739B1K4o5p5R9J12j27No7J08k09J01n3J88j14N1O5m1N2j52J02n4L3q8R9p3J67
$$ 21 45 -20 -95 4 116 -11 -6 -73 35 -174 -73 -126 62 -52 -1 64 23 75 -77 25 -29 4 -84 15 -58 109
15765A09r5r7J19j12O4P7j48J05j06J03l1N6o2L3R9j71K12k66K1J7M9O8p1o5J03
$$ 109 14 -83 36 -76 -12 65 -83 22 -84 19 -12 44 -18 15 114 -57 155 -111 -90 -73 -24 44 -27 -92 11
15790A1L1L4K0j36J72K1k88Q5N0q3M7J19j44L8J55j68R2rj04J19n3K0n9K7J03
$$ 11 42 76 96 -40 132 153 -135 -50 0 -83 -36 83 -61 -23 132 -36 56 47 -57 62 9 29 -30 -3 100
15815A00k8k43L13j82K10j82NK1n1m5O5L9L4J24j66J12r1k6M1pp0L9R9k08L8n5
$$ 100 72 -171 142 -40 170 -12 -7 14 -37 -82 -17 22 56 180 14 126 35 9 50 43 -27 12 111 -97 -59 -114
15841a14J42J1n0m2J05qn9K4p8L1K5k5nO9o0OO5o8N0M6j32R5q7M8J6K4p3P3J8
$$ -114 28 39 -11 -53 52 44 -15 9 -69 -38 -13 -38 -43 26 -34 -28 37 -31 19 65 -67 28 -59 -11 5 29 -44 29 47
15870D7P7j08j24K44k12K6k5R4No4j10J53P8kn3j2K6o3l8K1J96j57Lqo5R5k7l2
$$ 47 124 16 -108 136 -76 -50 -75 19 24 -40 -150 3 81 79 26 14 40 -23 -61 -40 156 -1 2 -6 -71 24 -3 -35
15898c5J11j70j2J04M4k18J50R7n6q3o8K5K08j08J07l8M7q2m3o9M4J64k35M1J38
$$ -35 76 -94 -106 -2 42 -176 -26 71 15 -68 -136 -111 97 -11 96 58 105 23 -20 -89 -45 119 -116 -75 63
15923F3K2j2p6KMjP0j21L7P3o9J06j30l5p1M6O9K8m9Q2M4j11M5k6K3m6N6j26J84
$$ 63 85 73 -3 -1 3 2 72 -49 -12 61 -8 98 -32 -67 -138 -92 -23 5 -44 38 82 -29 16 -10 13 -33 23 -103 81
15952H1r1j32K3J93k8p0jJ36j74J71o4j49P3l5K6m4N3O1K8p1R9r8P0o6o0J17J1
$$ 81 -10 -142 -119 74 46 -24 -25 111 -63 108 44 -105 -32 -67 -41 -85 -32 29 57 -14 85 -13 57 -9 -69 48 59
15979E9r0J7k2J7N0K5m5n2J30j19J06q7M5Q%j1j0pj28J22o1J3N5M5j82J3M5mO9
$$ 59 -31 -14 -36 -19 31 56 11 -41 89 -30 76 -11 34 42 42 31 21 14 -114 8 -53 -40 15 60 -122 -109 -64 -68 1
16008Al2J2L2o7L5l1R6m2J7J21j83K02m0l5o5m8l1L9L9j8qJ2J8m5L5Kl2j3l4N1
$$ 1 -31 -19 13 -54 -19 -50 46 4 21 142 -41 161 121 86 21 -27 -58 -19 20 2 -6 6 24 -21 14 16 -16 -29 -63 -12
16038a2M0m5oR9j65K16r3o0JQ0n0L4K3p3j25J74j01OM4L9m3rj4K4j2j60K24j01
$$ -12 28 -17 -23 76 -89 127 34 -26 -25 55 5 39 62 -11 -136 38 -63 -57 -13 26 -17 -26 -40 -16 -28 -188 36 -65
16066f5J19r7P4J8r1L7J17j39O9j15O4o6Q4k3P0ml7J3o7J60j58Q7l0N3m3j15J42
$$ -65 54 -43 31 49 -42 -5 112 -27 42 -73 -9 -75 9 -14 56 52 15 28 -39 121 -37 50 20 73 30 -85 57
16093E7LKj54O9K8R5k66J88k21L20k20J18m1j29J83k8K8j74O7J23J9j32J44j9
$$ 57 60 62 -92 -23 5 100 -166 22 -199 121 -99 19 -22 -151 32 4 32 -142 -75 48 67 -65 79 60
16117F0j3L8l4J2p3k5j14J50r1L1k2j7J44r8N1L1M2K7k25J04l2Q5j07M0O7K1j3
$$ 60 47 85 51 63 -10 -35 -149 1 -90 -59 -81 -98 46 -52 -1 30 72 99 -126 -22 -54 31 -76 -36 31 52 39
16144C9j04J01K3K1l4q9P0q9N2p7J19lJ4k2R6j76P3J3RK9m8O8q0J3j42J5Q1OJ28
$$ 39 -65 36 59 80 46 -43 27 -62 -10 -87 32 29 43 21 117 -59 14 27 36 65 17 85 5 18 -124 -109 -28 -22 106
16173A06j83K4N5oo6N8N8j7l2p1J69nj75J01M5L4j34q7k7M3J8P8NQ3j24j6m0J51
$$ 106 -77 -53 2 -4 -70 -12 46 29 -3 -74 95 90 -85 16 61 95 -39 -126 -153 -110 -92 -14 -9 74 -50 -66 -106 45
16201D5pq7J03O5j06p7J74j44N4k2n0J40j22L4r6J69M3oj71m7Q0l5j7J60j41J3
$$ 45 38 -49 54 119 13 -64 110 -34 20 -2 -52 88 -34 0 -96 73 116 110 -61 -108 -28 -63 -80 80 -61 -48
16227d8k2K24j05o2lP4Mj68J43q8M5l4l3J14m2m0LNJ1q5J71Rk07K18Jj30K7K7
$$ -48 -70 154 49 -13 -16 58 62 -106 37 -51 -6 -40 -73 41 -1 -41 -38 -33 -22 -107 64 73 -134 84 85 -45 -18 9
16255IO7k5m5j0m7M7l7l7P6%qJ25j69J31J3k16J43L6j69K18m9n5J7K4j5j06O1
$$ 9 76 51 6 -4 -51 -4 -41 -78 -2 -2 -10 115 -54 77 90 -126 17 53 -116 102 53 -2 15 39 24 -82 -21
16282b1m2q2J10N9j8Lk1k0J19k42J27k3O3q5J54q9J09j51pK8OK1pL7M7j12k8R9
$$ -21 -63 -145 -35 24 6 9 -12 -32 87 -155 -28 -51 12 -73 81 -8 101 -50 -57 -29 -23 -2 -9 28 75 -37 -65 34
16310C4j5o1k0MQ0j11R2k7o5J99j36M5K9m9n8JPJ11R6j60j07R4%o6J41Qm2m8J
$$ 34 19 -42 -62 -58 22 -89 3 -24 -89 110 -26 19 48 -1 -59 -58 -51 60 156 -4 -111 -17 -17 -83 58 66 24 -24 -23
16339b3k2OO7j51Q9rJ8L5j10J02no4N4j5k9J67m8m6%o1J5J28j04O5P1j72M6M0
$$ -23 -45 -39 28 -123 -34 -43 -25 10 -100 2 -3 -67 -13 -28 -57 110 62 16 16 -45 -30 98 -6 59 130 -42 4 44
16367D4j20K2J07j35P0%j33J05Q2q7J72j43M5j3K0K7
$$ 44 -76 -54 53 -82 -12 -12 -145 -40 42 -45 127 -16 29 16 36 63
16383F3
$$ Imaginary data points
##PAGE= N=2
##DATA TABLE= (X++(I..I)), XYDATA
0@%%%%%%%%%%%%%%%%%%%JrK9n3O4o4O4o5P7r7J18j32J44j64J91k16K41k71L02
$$ 0 0 0 0 0 0 0 0 0 0 0 0 0 0 0 0 0 0 0 0 1 -8 21 -32 32 -32 32 -33 44 -53 65 -67 77 -87 104 -112 129 -142 160
38A60l41L83m25M72n24N78o38P06p82Q63r53J050j156J276j407J549j709J893
$$ 160 -181 202 -223 249 -275 303 -335 371 -411 452 -501 549 -607 669 -738 811 -898 995
56I95k100K336k607K928l308L771m353N099o105P539r758J3723k2985Q9088M9004
$$ 995 -1105 1231 -1376 1552 -1756 2015 -2338 2761 -3344 4195 -5563 8160 -14825 74263 123267
71A23267r0187j6386l7483k4509m407K5930R548K3740j586m1050l4048K2595J3557
$$ 123267 33080 16694 -20789 -45298 -49705 -23775 -14227 9513 7927 -33123 -67171 -44576 -31019
84c1019l715K0525L5993r94j2754j1033j6228J876L9794K2433m580J3386J6145
$$ -31019 -34734 -14209 21784 20790 8036 -2997 -19225 -17349 22445 44878 40298 53684 69829
97F9829l1004m2336j4177o526m549J4370M787j0865R199J4419k1957j9815J9005
$$ 69829 38825 -3511 -17688 -24214 -28763 -14393 -9606 -20471 -11272 3147 -18810 -38625 -19620
110a9620J7761n181M062Q835k831N210O788j8658j0547K4394J2489j5040N839
$$ -19620 -1859 -7040 -2978 5857 3026 8236 15024 -3634 -14181 10213 22702 7662 13501
123A3501K4938P29j4598j2290k4304k0247M030j720j1310K1606L6909o30j8233
$$ 13501 38439 39168 24570 12280 -12024 -32271 -28241 -29961 -41271 -19665 17244 16614 -1619
136a619J025q63r627N662R020m53J2072J0471k5299k7043J0430J5410R03J5237
$$ -1619 -594 -1457 -11084 -5422 3598 3145 15217 25688 389 -26654 -16224 -814 89 15326
150A5326K2360j487j4642j9079l5014k1414K0040K3630O270K0254K5713q625k7351
$$ 15326 37686 36199 21557 2478 -32536 -53950 -33910 -10280 -4010 16244 41957 33332 5981
163E981j6009j2094k961J9731J4046p167L127Q160k0524k3999R790K1097J1589
$$ 5981 -10028 -22122 -25083 -5352 8694 1527 4654 12814 -7710 -31709 -21919 -822 10767
176A0767J4872P545j3207j1452p473k3500j4254K2575K3925q22J740O913j0489
$$ 10767 25639 33184 19977 8525 1052 -22448 -36702 -14127 9798 8976 10716 17629 7140
189G140j4008k881n773M63K1416J1212j4574n465P676r831j4349N924R531N269
$$ 7140 -6868 -9749 -15522 -15059 6357 17569 2995 -2470 5206 -4625 -18974 -13050 -3519 1750
203A750J2977M794j3420m103N886j4568j7476R304J4234J395O910R900l278k318
$$ 1750 14727 19521 6101 1998 7884 -6684 -24160 -14856 -622 773 7683 17583 14305 11987
217A1987J149j5585j5745R930R519r443j734J0278l201q341J659P4K727J9055
$$ 11987 13136 -2449 -18194 -8264 1255 -8188 -9922 356 -2845 -11186 -9527 -9453 -6726 12329
231A2329J1801j0344n076L250j4709j9528L249J1876Q543J4503Q698j0233q933
$$ 12329 24130 13786 8710 11960 -2749 -22277 -19028 -7152 1391 15894 24592 14359 5426
244E426k884j6929j4938J2545J8008K933L221M595r604r937R96l826n56J8987
$$ 5426 2542 -14387 -29325 -16780 1228 4161 7382 11977 2373 -7564 -6568 -10394 -10950 8037
258H037J3953r966r398o15j1099j1086O461R275P603J5547O495j5226j1079J460
$$ 8037 21990 12024 2626 2011 -9088 -20174 -13713 -4438 3165 18712 25207 9981 -1098 362
272C62q876j0025R555J3142J085J602j259j3293o251O859q14k061J6539J3916
$$ 362 -8514 -18539 -8984 4158 5243 6845 5586 -7707 -13958 -7099 -7913 -9974 6565 20481
286B0481p019p743j735r362p394N787L226J722J3841P420j2788r778J770o541
$$ 20481 13462 5719 3984 -5378 -12772 -6985 -3759 -2037 11804 19224 6436 -3342 -1572 -8113
300h113q252O812Q544J960P136L049j1649n987O157k056n279J0184J0370l935
$$ -8113 -16365 -9553 -1009 951 8087 11136 -513 -6500 -343 -2399 -7678 2506 12876 8941
314H941l863k680j1317o124P313K631J17J3833J0708q471q911j717p858o049O817
$$ 8941 5078 2398 -8919 -15043 -7730 -5099 -4982 8851 19559 11088 2177 460 -7398 -13447 -6630
329f630N353J084R077M093j3186r273L956j378l320J0276J0213r69M84k131j3115
$$ -6630 -1277 -193 8884 12977 -209 -9482 -5526 -6904 -10224 52 10265 9296 9780 7649 -5466
344e466o704P484K449j439J1176Q437p908q293l191q892l812R526N974R47R226
$$ -5466 -12170 -4686 -2237 -3676 7500 15937 8029 -264 -3455 -12347 -16159 -6633 -659 288 9514
359I514N514j1235r103J937k078j635R440O526k792J183q94j3349p479P109L295
$$ 9514 15028 3793 -5310 -3373 -5451 -7086 2354 8880 6088 7271 6377 -6972 -14451 -7342 -4047
374d047j54R561P573n521m328k339r407l291R807N036j378O657M101j0288r056
$$ -4047 -4201 5360 12933 7412 3084 745 -8662 -11953 -2146 2890 1512 8169 12270 1982 -7074
389g074j20l217j08J0731O644j598L558J236j2075p815M946J924K2Q761N552n579
$$ -7074 -7194 -10411 -10519 212 6856 5258 8816 10052 -2023 -9838 -4892 -2968 -2946 5815 11367 5788
405E788k951k020j0312m323Q872N001n31O881M231q306n969L97m331k82J0892
$$ 5788 2837 817 -9495 -13818 -4946 55 -476 6405 10636 2330 -3639 -3242 -7573 -7855 3037
420C037N379l401J831N31j1240p372L883J410J968J0353N184n218j534j130j0151
$$ 3037 8416 5015 6846 7377 -3863 -11235 -7352 -5942 -3974 6379 11563 6345 4811 3681 -6470
435f470n158P681M695Q0O285K674q230n494j216o053j281J0482N944j213L867
$$ -6470 -11628 -3947 748 828 7113 9787 1557 -3937 -5153 -11206 -12487 -2005 3939 2726 6593
450F593K454q412n497L200k14R21Q804L330o203k067j050r579m416O684L778Q52
$$ 6593 9047 635 -4862 -1662 -1876 -955 7849 11179 4976 2909 1859 -7720 -12136 -5452 -1674 -822
466h22O646J916q363m295Q9n196l26J0806O442m92L209K12r797n692J561j814
$$ -822 5824 7740 -623 -4918 -4829 -10025 -10351 455 6897 6405 9614 9826 29 -5663 -4102 -5916
482e916O62J0232M883m319k41o1q748m858M586J394Q6O011J614p621k790P45n253
$$ -5916 -5254 4978 9861 5542 5301 5240 -3508 -8366 -3780 -2386 -2300 3711 5325 -2296 -5086 -4341 -9594
499i594r71R334N348n29L833P77p841l266K848j428J178R089L365n154j897k702
$$ -9594 -10565 -1231 4117 3588 7421 8198 357 -2909 -61 -1489 -311 8778 12143 6989 5092 2390
515B390j0031n104M267J729J525P938L140n755k390j09n397r09Q330M963M35M892
$$ 2390 -7641 -12745 -8478 -6749 -5224 2714 5854 99 -2291 -2400 -7797 -8706 -376 4587 5022 9914
531I914R18q107m055J263l059p79P401K907l862j91j058p736k574M822J063Q26
$$ 9914 10832 2725 -1330 -67 -3126 -3905 3496 6403 2541 2350 1292 -6444 -9018 -4196 -3133 -2307
547b307P014J585o687k595j24n173l36Q187M372P14M937K89q459l654R97l023
$$ -2307 4707 6292 -395 -2990 -3114 -8287 -8623 -436 3936 4650 9587 9876 1417 -2237 -1240 -4263
563d263J09Q027L437k981J91j683q774l758K926J13J168P641L005m134l49N56
$$ -4263 -4154 3873 7310 4329 4520 2837 -5937 -9695 -6769 -6656 -5488 2153 5158 1024 675 1231
579A231n053o79O760K465k76L560p28p827l274Q77l016Q72P593K504l246L34j636
$$ 1231 -3822 -4501 2259 4724 4448 8008 7280 -547 -3821 -2944 -5960 -5088 2505 5009 1763 2097 461
596D61p430j963M547J701K972P716J897n110j918j603o864j862N306J909L20M543
$$ 461 -6969 -8932 -4385 -2684 288 8004 9901 4791 2873 1270 -5594 -7456 -2150 -241 79 4622
612D622L86o275j703J306l125J95O695K055k429J405o05o115j163L729l91Q51
$$ 4622 5008 -1267 -2970 -1664 -4789 -4594 2101 4156 1727 3132 2527 -3588 -4751 -1022 -1413 -562
628e62O201R65m891p22n69n408q76N211J256J92M461l45o211k107K51l493K78
$$ -562 5639 6604 1713 991 422 -4986 -5862 -651 605 797 5258 4913 -1298 -3405 -3154 -6647 -6369
645f369O456K626m65K703m68o412j790K631j159J453P074K353l593p49k123p129
$$ -6369 87 2713 2248 4951 4483 -1929 -3719 -1088 -2247 -794 6280 8633 5040 4291 2168 -4961
661d961k263K944M6P65N737O12n015r17R85k741J152O702K487o24J538k275p232
$$ -4961 -7224 -4280 -4234 -3469 2268 2880 -2135 -3052 -2067 -4808 -3656 3046 5533 4909 6447 4172 -3060
678c060j792K766m55K395P022J219m482k120l090o594o47M945J866K192N262p7
$$ -3060 -4852 -2086 -2541 -146 6876 8095 3613 1493 -1597 -8191 -8838 -3893 -2027 165 5427 5350
694E350n355j551K15l098J045N569R19j745J551j513n464K39L851J57J569N004
$$ 5350 -5 -1556 -1341 -4439 -3394 2175 3094 1349 2900 1387 -4077 -3838 13 170 1739 6743
710F743m44m353p24j820n270J49M157k17k10M007K81l892K85R23k569R77M279
$$ 6743 6299 1946 1222 -598 -5868 -5719 -1562 -1779 -1989 2018 2299 -1593 -1308 -385 -2954 -1977 2302
727B302l26j014L099l03m817n85J612k023M19M394O08j642J101j547n948j146
$$ 2302 1976 962 4061 3758 -1059 -1644 -32 -2055 -1636 2758 3366 1724 2825 1278 -4670 -5816
743e816K460n43J254O034J963k613Qj352m934o84L729K91j8L610o29n138j136
$$ -5816 -3356 -3899 -2645 3389 5352 2739 2747 1395 -3539 -4223 -494 -203 -221 3389 2760 -2378 -3514
760c514J056j088K747O453J436k120k43l443p379j576K983J126L029N689K35m064
$$ -3514 -2458 -3546 -799 5654 7090 4970 4727 1284 -6095 -7671 -4688 -3562 -533 5156 5391 1327
776A327j229k015m253J330N778R96j1K501j717n108m69J806m44K762N017j250
$$ 1327 98 -1917 -6170 -4840 938 1934 1923 4424 2707 -2401 -2870 -1064 -1508 1254 6271 5021
792E021l860o66k734m869R26M244J165K078L799j157l675K43l00l177J072L672
$$ 5021 1161 495 -2239 -7108 -6182 -1938 -773 1305 5104 3947 272 515 215 -2962 -1890 1782
808A782j070j387J553j153l034J705J956j247J438L829j244k345J031j045l848
$$ 1782 712 -675 878 -275 -3309 -1604 352 -895 543 4372 3128 783 1814 769 -3079
823c079O2J629j415J064M218o8j751J469n86m495n54K024n83Q67M031L68k500
$$ -3079 -3017 -1388 -2803 -1739 2479 2411 660 2129 1543 -2952 -3506 -1482 -2065 -1198 2833 3201 701
840G01N99j16l407Q60L768j47j149J449k031n239p96J386k83L285O211P52k048
$$ 701 1300 1184 -2223 -1363 2405 2258 1109 2558 527 -4712 -5508 -4122 -4405 -1120 5091 5843 3795
857C795j94k468n295k47K949K03J833L434j480m070k01q4j747K366M967K59j386
$$ 3795 3601 1133 -4162 -4409 -1460 -1257 576 4010 2530 -1540 -1741 -1825 -3572 -1206 3761 4020 2634
874B634K17l169m921O52K544M15K894M384j133l455p59j929l459J336L538o0Q79
$$ 2634 2851 -318 -5239 -4587 -2043 -1628 1266 5650 4517 1062 303 -1626 -5085 -3749 -211 -271 608
891F08K722j717l217J441J163j545J443K975j783k379M16k195l144J880K316o33
$$ 608 3330 1613 -1604 -163 1000 -545 898 3873 2090 -289 127 -2068 -5212 -3332 -1016 -1649
907a649J821L610o83j981Q60r70l111M99J699j698N37L144q75k043J359Q6k556
$$ -1649 172 3782 3099 1118 1978 1008 -2103 -1604 95 -1603 -1066 2078 1203 -840 519 605 -1951
924a951P47K383r87l25K408j405l207P61J030j586J585L749j87j317N47k205m190
$$ -1951 -1204 1179 192 -133 2275 870 -2337 -1576 -546 -2132 -547 3202 3015 1698 2245 40 -4150
941d150K01J784n48J919M271k58k138L32p45k779J091K916n83l95J447k415l943
$$ -4150 -3949 -2165 -2713 -794 3477 3219 1081 1413 668 -2111 -1020 1896 1313 918 2365 -50 -3993
958c993M15J233p01K876M107m37j462K47k389l765R66K325l27J472L102j514k702
$$ -3993 -3578 -2345 -3046 -170 3937 3500 2038 2285 -104 -3869 -2903 -578 -905 567 3669 2155 -547
975e47N54p42k243J937K819j085l25J395j815k858J291J481p26J995K926j654
$$ -547 7 -735 -2978 -1041 1778 693 368 1763 -52 -2910 -1619 -138 -864 1131 4057 2403
991B403k066O38k187l078J381J861m54J220K936q44j542J165o30k201J425J865
$$ 2403 337 975 -1212 -4290 -2909 -1048 -1502 -282 2654 1810 268 1433 803 -1398 27 1892
1007A892j515l31J704j731k532J011M12j245J729K681q70q81J390j426k969J115
$$ 1892 377 46 1750 19 -2513 -1502 -1090 -2335 -606 2075 1205 324 1714 288 -2681 -1566
1023a566J347r39J524K677j022j776R85j261k700J218J988r34L63K113j502k090
$$ -1566 -219 -1158 366 3043 2021 245 1230 -31 -2731 -1513 475 -459 -96 2017 515 -1575
1039a575J062P5j260K045K641j237r65R20k259k941R02J369q15J989K841j114
$$ -1575 -513 -438 -1698 347 2988 1751 786 1706 -553 -3494 -2592 -1223 -2038 -49 2792 1678
1055A678j285R59j072k150J302J840j100M13J809k211k226R36l7j438J898K516
$$ 1678 393 1352 280 -1870 -568 1272 172 585 2394 183 -2043 -1107 -1144 -2582 -684 1832
1071A832j147m18J155j563k427J650J072q76J795K266j507j734P77j416k272J374
$$ 1832 685 267 1422 -141 -2568 -918 154 -722 1073 3339 1832 98 875 -541 -2813 -1439
1087a439J463q24P46J774j635j581J263Q5j433J888K248j317m42Q61j946k297
$$ -1439 24 -800 -54 1720 85 -1496 -233 -148 -1581 307 2555 1238 796 1657 -289 -2586
1103b586J169P47j038J789K302j357j075J100j284j950J717J260j014R90J696
$$ -2586 -1417 -670 -1708 81 2383 1026 -49 1051 -233 -2183 -466 794 -220 770 2466
1118B466j936j721Q69m14j561J768J926j196P1J180j620j655J429O03q76J742
$$ 2466 530 -1191 -322 -736 -2297 -529 1397 201 272 1452 -168 -1823 -394 209 -667 1075
1134A075J729j601j098O59j643j858J521J138r75R75J745j572j407J268k97j222
$$ 1075 2804 1203 105 764 -879 -2737 -1216 -78 -1053 -78 1667 95 -1312 -44 -341 -1563
1150a563J905J821j187J57J059k049j828R57J39j098J593J652j291o43J031j238
$$ -1563 342 2163 976 1133 2192 143 -1685 -728 -589 -1687 -94 1558 267 -376 655 -583
1166e83j578J749R01q44J175J478j602j443R85q00j422J660J562j388L61J198
$$ -583 -2161 -412 489 -355 820 2298 696 -747 238 -562 -1984 -324 1238 -150 211 1409
1182A409j737j454J346K85q26J670J717j518o15P48j667j815J664O85j008J401
$$ 1409 -328 -1782 -436 -151 -977 693 2410 892 277 1025 -642 -2457 -793 -108 -1116 285
1198B85J457j553r05J065q50j116J960J293j300L58J256j788j555J168m23j006
$$ 285 1742 189 -716 349 -501 -1617 343 1636 336 694 1950 162 -1393 -225 -648 -1654
1214a654J555J349j594j79J177j412j084J703Q59o95J167J415j894j023O55j157
$$ -1654 -99 1250 -344 -523 654 -758 -1842 -139 720 25 1192 2607 713 -310 345 -812
1230h12j188J666R80j120N19J142j673j218J297k63o78J777J336j146L7P92j411
$$ -812 -2000 -334 646 -474 45 1187 -486 -1704 -407 -670 -1348 429 1765 619 656 1448 37
1247C7j307J310J92j005J200J045j841n49J070j001r09J852Q89q48O41Q46j936
$$ 37 -1270 40 232 -773 427 1472 -369 -918 152 -849 -1758 94 983 135 776 1622 -314
1264c14r84J310n72q47J658J107j422j0R30j641p62J706L46o88J444R45j638q19
$$ -314 -1298 12 -560 -1407 251 1358 -64 -74 856 -785 -1547 159 505 -183 1261 2206 568 -251
1282b51P92j294j106J440M99j097R57Q96j475o78J314m03p65J767R63j218L71
$$ -251 541 -753 -1859 -419 80 -1017 -60 836 -639 -1317 -3 -406 -1171 596 1559 341 712
1299G12Q29j320r76J276j64j135J238O03j590l47P65j248o06J791P61q27J043
$$ 712 1541 221 -755 521 357 -778 460 1063 -527 -874 -109 -1357 -1963 -172 589 -238 805
1316H05R67j716q54J058p36q52J515Q56j139L37Q41j562q51J406o4o88J259R51
$$ 805 1772 56 -798 260 -476 -1328 187 1043 -96 241 1082 -480 -1331 75 11 -677 582 1533
1334A533j436j12Q14j376q17J547P6j100J031P18j675o23J248m07m87J823O95
$$ 1533 97 -15 799 -577 -1394 153 229 -871 160 878 -797 -1420 -172 -579 -1066 757 1452
1351A452j024M19M66j462o45J067j95q34J161P00j512l14Q55j316n40J679L09
$$ 1452 428 847 1313 -149 -794 273 78 -756 405 1105 -407 -721 134 -1182 -1722 -43 266
1368B66o87J138Q27j566l18J074q54p16J354L61j332N16O89j526l93J191k30p02
$$ 266 -421 717 1544 -22 -340 734 -120 -836 518 879 -453 63 752 -774 -1167 24 -206 -908
1386i08J562N21j341L15O28j123n97J490j22r61J055L48j612r1R94j007k90J485
$$ -908 654 1175 -166 149 777 -346 -943 547 425 -536 519 867 -745 -836 158 -849 -1139 346
1404C46M77q27O92O79j599k05R73n89q65J357K53j279K36P02j137n21J458M3p42
$$ 346 823 -4 688 1367 -232 -437 536 -53 -918 439 692 -587 -351 351 -786 -1307 151 194 -548
1423e48J090O37j309J7P32o86o92J219J78j183O95L22j464k27J241n70l12J449
$$ -548 542 1179 -130 -113 619 -67 -759 460 638 -545 150 472 -992 -1219 22 -548 -860 589
1441E89M47j124L34Q74j324l16J042k26r21J036L52j466mP42q20m58J288M12q15
$$ 589 1036 -88 246 1120 -204 -520 522 296 -625 411 763 -703 -707 35 -785 -1243 45 457 -358
1460c58Q75L38j183r7J021o44m05J258J82j252K36N77j568j64J256j60o37J256
$$ -358 517 855 -328 -425 596 -48 -453 805 987 -265 -29 548 -1020 -1184 72 -88 -725 531
1478E31N36j444K12O52p55l45J222j3j058O73K86j467N4J055o73j33J369J62r99
$$ 531 1067 -377 -165 487 -268 -613 609 596 -462 211 497 -970 -916 139 -534 -667 702 864 -135
1497a35M58M05j060k9J057n30n71R85n2j407L26N60r31p4J325r8n51Q05M33j256
$$ -135 323 728 -332 -361 696 166 -405 580 528 -879 -553 7 -924 -998 327 229 -322 483 916 -340
1517c40L81P84o87l34J122j47j237N96J83j106j50J007n52n84J046K87r47N46
$$ -340 41 825 138 -196 926 779 -458 138 321 -785 -935 72 -480 -1064 -18 269 -678 -132
1535a32Q65r35l2J074k74q81Q86K30j286O7P28q08l4J110J8q57O29K83j224j52
$$ -132 733 -202 -234 840 566 -315 571 801 -485 -418 310 -498 -532 578 596 -261 368 651 -573 -725
1555g25P65m18m89J161K32j026K72M14r73o3J118j44n37R21L06j025M82P51p87
$$ -725 40 -378 -867 294 526 -500 -228 186 -787 -850 268 124 -413 508 814 -211 271 1022 235
1574B35k43R00l06j007L21J46j155o5J013m75j25J002K9r86O18O70r37Q9J390
$$ 235 -8 892 586 -421 -100 46 -1109 -1174 -161 -636 -761 241 270 -716 -98 572 -365 -276 1114
1593A114k97n98P97o4j362K09N51r72n7J045l47p51P05K56r04J68J019o32l58
$$ 1114 817 219 1016 952 -410 -201 350 -622 -679 366 19 -732 -27 229 -675 -507 512 -120 -478
1612d78Q64k2q17O07M47p86N6Q89n41q02Q59j3q63M49O66n79j34R53l81p09N02
$$ -478 386 364 -453 154 601 -185 -129 760 219 -583 276 263 -600 -151 515 -64 -198 755 374 -335 167
1633A67j7j173K14P00o61r6J219O7o74Q03K95r36lQ57p55l23Q37o7q54L25M74
$$ 167 150 -1023 -809 -109 -770 -866 353 420 -254 549 844 -92 -95 762 7 -316 521 454 -400 -75 399
1654C99j033J8P24m29m13Q17k7o03N45P08m87p6R65m20p60K13Qr69K25Q50n44
$$ 399 -634 -616 108 -321 -734 83 56 -547 -2 706 219 143 1108 688 -72 141 149 -820 -595 255 -289
1675b89k45P73r4r35O02L61p01K31R75k89l77P94p8r86L95M89r33j96Q52m14o71
$$ -289 -534 239 145 -790 -188 173 -528 -297 678 389 12 806 728 -258 137 626 -307 -503 349 -65 -736
1696g36O37K86n85K01P44o72m60P09l09o04P05K55m71K52Q02n35m18O55k39o96
$$ -736 -99 187 -398 -197 547 -125 -585 124 -185 -789 -84 171 -300 -48 754 219 -199 456 217 -479
1716d79L42O31o39K57P85m80n51M72j09j121J28N73p13r6Q62J99n36O98L90n22
$$ -479 -137 494 -145 112 897 417 -134 338 229 -892 -764 -191 -904 -1000 -138 61 -475 223 613 91
1736I1J15P52n99l90O89j80p08M16N26r02j48N72m53p65O78O9o60N14Q29n69O
$$ 91 206 958 359 -31 658 478 -230 186 712 -190 -338 234 -219 -984 -306 -237 -897 -383 446 -123 -117
1757a17P67k92n79L89J47o95K22O36m90j62O39n1p91M00M30p01j74P84l13m17
$$ -117 650 358 -221 168 315 -380 -158 478 -12 -174 465 414 -377 23 453 -248 -422 362 49 -368
1777c68P27K0q73L40N43p81k58O02k96m04P01M92o43M61N81n74k72O41l35p73
$$ -368 359 379 -494 -154 389 -392 -650 -48 -344 -748 -47 445 -198 263 844 270 -2 639 304 -469
1797d69M43L86p10R8P27n89m04N72J7p78L90N70n99O8Q03l97m05P19R4p70K11
$$ -469 -26 360 -350 -252 475 -114 -518 54 71 -707 -317 253 -346 -278 525 128 -277 442 536 -234 -23
1818b3M87r59j15O30m2m97P79L67n73J49M56m46m60M01J3n21L44M63q06Q1N17
$$ -23 464 -495 -610 20 -22 -519 260 627 54 203 659 213 -247 154 167 -354 -10 453 -353 -272 245
1839B45n27n69O32J29n62N32N79m01K1P01k65o33M65K49q23rN42m36k92N77o7
$$ 245 -282 -851 -219 -90 -652 -120 459 58 79 780 515 -118 347 596 -227 -236 306 -130 -422 155 88
1860H8o41N22L19n42j44O08k47l74O48J56o94N13M14q79n2N21k31o75P03K88m99
$$ 88 -553 -31 288 -254 -398 210 -37 -411 237 393 -301 212 626 -253 -305 216 -15 -690 13 301 -198
1881a98K75N41m37l03O16j87o95L27L60p18n0O61m79l18P09j46n20M15M98n12
$$ -198 77 618 181 -122 494 307 -388 -61 299 -419 -469 192 -287 -605 104 -42 -562 -147 351 -161
1901a61m2O12j91m92O47K76p28K82J12n96l17N55j62n59P47M23o62J77N94n65
$$ -161 -203 409 218 -274 373 649 -79 203 315 -281 -598 -43 -205 -764 -17 406 -256 -79 515 -50
1921e0l03O34j49m44N29L02n71j66N31l84m54O48N9m38K37M06m41j71O06M6n68
$$ -50 -353 281 132 -312 217 519 -52 -218 313 -71 -525 123 182 -256 -19 387 -54 -225 381 427 -141
1942a41N55p8n93K03K68o46j97N60Ql29M79L62o59J24M77m38j70N49O8n58L50
$$ -141 414 336 -257 -54 214 -432 -629 -69 -61 -390 89 451 -208 -84 393 -45 -215 334 402 -156 194
1963A94L49q01m4M44l43l24M93J91n51K53M86l51k31P16q3n25L87K49o97KM04
$$ 194 543 -258 -302 142 -201 -525 -32 159 -392 -139 347 -4 -235 481 398 -127 260 509 -188 -186 218
1984B18k79n57P23R8n75M65L49o97P7M00j67l87O71L1o11K11L82o16j98N04q1
$$ 218 -61 -618 105 203 -372 93 442 -255 -178 222 55 -332 339 370 -241 -30 352 -264 -462 42 -39
2005c9m57N12J42m33J20N92m36o2N04m8m24J47K99p08j98N72l22l00P43p3m40
$$ -39 -496 16 158 -275 -155 437 1 -61 443 395 -29 118 417 -291 -489 83 -239 -539 204 131 -309
2026c09L02L39m91n4N41n6m07M54J91n27j2L37m17l89M44rl07M01J83m63n5P23
$$ -309 -7 332 -159 -213 328 272 -135 319 510 -17 -29 308 -109 -498 -54 -63 -370 31 214 -249 -304 419
2048D19l31k07M46O8m55L7L58o40p5M56K2n81N73K35o59L9M64l81n4N51k8k71
$$ 419 88 -119 327 395 -60 -23 335 -305 -380 76 98 -483 90 325 -334 -295 169 -212 -266 285 257 -14
2070a4K78J90o01p6L51l47l40N39P5l84K48L40l13j58O49k12m81O66k1n28n2M52
$$ -14 264 454 -147 -223 128 -219 -559 -20 55 -329 -81 259 -54 -212 437 225 -256 410 389 -139 -191 261
2092B61m64k5L95j46k81L34L5n76J33N29k24j63O93n1n07K97J63p64J04L03k96
$$ 261 -203 -228 167 21 -260 74 109 -467 -334 195 -29 -192 501 450 -57 240 403 -361 -257 46 -250
2113b50l03N46K17n21J09L24l34k4O59l27k20M36Q8m87R0N82o50k10M15O8n02
$$ -250 -553 -7 210 -311 -202 122 -212 -236 423 96 -124 312 400 -87 3 585 -65 -275 140 208 -294
2134b94K25M3n22J80M87j65j42N63j18n22K25J62m84O8M87k31j23L80M9m64Q2
$$ -294 -69 -26 -548 -368 119 -46 -188 375 257 -265 -40 122 -362 -294 193 -38 -161 219 268 -196 -114
2155a14L67l83j84O79j41m36L43K50n28j41M92m49k04L60m4l76L25L37l30K6N36
$$ -114 253 -130 -314 365 224 -212 131 381 -147 -288 204 -245 -449 -89 -133 -509 -184 153 -177 -151 385
2176C85n6k88M76j0n64J43J09k92m0M17k24l17K51o9o07J66L70l03J57M73M9l17
$$ 385 329 41 517 507 -57 86 195 -97 -137 280 56 -261 -10 -79 -686 -520 -150 -453 -296 177 226 -91
2198i1M51N1n52R4M17k72m20N16Pl87J48L10m60l0M78k17k90L32J56n81J39L96
$$ -91 360 411 -141 -47 370 98 -322 194 201 -186 -38 272 -188 -218 260 43 -247 85 241 -340 -201 195
2220A95l18o0M72k06l80Q4K62l82J26M99j5k29M51o3m09m9L14o35J23M14k28k72
$$ 195 -123 -183 289 83 -297 -213 49 -333 -207 292 277 48 499 436 27 -22 292 -343 -220 194 -34 -306
2242c06L87M6n52J46K12k31J9O09k49k99M65J34n32J41M57m25j21K67j68n00L06
$$ -306 81 127 -425 -279 -67 -298 -279 330 81 -218 247 381 -151 -10 447 22 -99 168 0 -500 -194
2263a94J81l45L47K92l8k71M02j40l78j7L55l91n5N45j16m27K28J27m83j3L69
$$ -194 -13 -358 -11 281 243 -28 374 234 -144 -161 194 -197 -252 293 177 -250 -22 105 -378 -391 -22
2284b2j60l4N14j09k26K23K72n10k2M65l53l40L95q6m96L14K83j59q0M01j83k65
$$ -22 -182 -216 298 189 -37 186 458 -52 -74 391 38 -302 93 7 -489 -175 108 -51 -131 270 87 -178
2306a78L30K3m34L02K00k13q2K65p0m51L02J42o07K38L51j43j44N61q7m32J60
$$ -178 152 175 -259 43 243 30 -52 213 143 -308 -6 136 -471 -233 118 -25 -169 392 305 -127 33
2327C3J21l52PL16k66j53K91L4l76J91L34k70j6L83k41k05K68K42m94J84K89j59
$$ 33 154 -198 -191 125 -141 -294 -3 31 -345 -154 180 -90 -106 277 36 -169 99 341 -153 31 320 161
2349A61l49M50k19m65K35J85n21L95L64k30L6L82k6n23N1K88k97m2M38k06k71
$$ 161 -188 262 43 -422 -187 -2 -523 -128 236 6 42 424 398 -125 -74 214 -83 -125 313 107 -164
2370a64L42m0m12J59L04k19k15M50j10k60J76J89l51P5M51m29j83L66j15m59J74
$$ -164 178 138 -274 -115 189 -30 -245 205 95 -165 11 200 -151 -76 375 -54 -237 129 14 -445 -271
2391b71L94k95J6M62k57j87L19L3l74K70J45k66j04L67j26l33R5J43l81J44L50
$$ -271 123 -172 -156 306 49 -138 181 214 -160 110 255 -11 -115 252 126 -207 -112 31 -350 -206 144
2412A44j55j05K77L1k84K72Ql14L3M08k05l64L17O1m75K09K63k30l1K86q6l17
$$ 144 -11 -116 161 192 -92 180 188 -126 -93 315 110 -254 63 124 -351 -142 121 -109 -140 146 60 -257
2434b57L18J89l69J98J76l06rK27j65l65K81O7l44K11L26j88j71M63q1l87K72
$$ -257 61 250 -119 79 255 -51 -60 167 2 -363 -82 -15 -359 -148 178 -10 -181 282 201 -186 86
2455H6K42l96MK66r9l76L87m4k24O9K38k82K7K63j25k01K35K43l39o6M15k87k48
$$ 86 328 -68 -64 202 103 -273 114 70 -154 -85 153 -129 -102 161 36 -165 70 313 -26 -92 323 36 -212
2478b12K95j63k17J82K92l65j9L73m1k79K23K23m13J46K99l93L9J85j51m17L70
$$ -212 83 -80 -297 -115 177 -188 -207 166 125 -154 69 292 -121 25 324 -69 -30 155 4 -413 -43
2499d3J03m12K29M26l23k75L96n5k86K45K62k62N6K92l61j92J19J11l52L07P4
$$ -43 60 -352 -123 303 -20 -295 101 46 -240 5 267 5 61 353 -8 -200 -81 30 -322 -15 59
2520E9k09k9L22j75j47J59J82k79Q0K88k75j31L74j73k61J21L48o80K66K74k17
$$ 59 -150 -179 143 -32 -179 -20 162 -117 -37 251 -24 -155 219 46 -215 -94 254 -426 -160 114 -103
2541a03p3K34J10k56K48P0k25j68M80m41j32L38m9m00J90L27l42N5K96m4n16N45
$$ -103 -176 58 168 -88 160 230 5 -163 317 -124 -256 82 33 -367 -177 150 -192 -137 159 115 -401 144
2563A44O1k81n1L93k70j87L04p8l26J20K22j15j55L76k42k02N06q7l22J93L52
$$ 144 205 -76 -127 266 -4 -191 113 35 -291 -171 51 -64 -219 157 -85 -287 219 132 -190 3 355
2584C55l53l1K91k60k27K84J06m14N6M44k97k09M34j91j97J73L17l96N9L25k87
$$ 355 2 -29 262 2 -225 59 165 -249 -193 251 -46 -255 179 -12 -209 -36 281 -115 -56 269 -18
2605a8j72K99j22k75K02J34k94J50J28n6q8K26J12k97J93K25k93j12K44j71k30
$$ -18 -190 109 -13 -288 -86 48 -246 -96 32 -24 -112 114 226 -71 122 347 54 -58 186 15 -215
2626b15J87J13k98P7L01l33j73N25o6k55K06K02k30j65M15k84j56L65p7l70J72
$$ -215 -28 85 -213 -136 165 -168 -341 184 118 -137 69 271 41 -124 291 7 -149 216 139 -231 -59
2647e9J69k12r9L85j43j14J32m1j33m2M08k91j85L88l9l68K07J63l70M8L04j75
$$ -59 110 -102 -201 184 41 -73 59 18 -115 -157 251 -40 -225 163 124 -244 -37 126 -244 -196 108 -67
2669f7k59K88Q0j71L32R9l51r7K99j69k13J88J42l15J07K35j89p6K09n7l20L54
$$ -67 -326 -38 42 -129 203 302 -49 -146 153 -16 -229 -41 101 -214 -107 128 -61 -137 72 15 -305 49
2691D9J74k97Q8J68j20k36K60P1l39K67J34l35j5K50j05k50K65J48k79j0L23k18
$$ 49 223 -74 14 182 62 -174 86 157 -182 85 219 -116 -131 119 14 -236 29 177 -102 -112 211 -7
2713gj54K63j70k51M06m3k52k6L14j67j57K70O1j94Q4J11n8n4K75j08k97K72K
$$ -7 -161 102 -68 -319 87 44 -208 -234 80 -87 -244 26 87 -107 -23 88 30 -24 251 143 -154 118 120
2736A20l38K5L03l36J27K41r6k77L09J54l71K82J74l54j61M40n6m35K02J34k67
$$ 120 -218 -193 110 -226 -99 142 46 -231 78 232 -139 143 317 -37 -198 242 186 -249 -47 87 -180
2757a80J2K06q5j01K73L6k20K44Q7l16J1J02j27j18K71j13j54J02K20k95j01L59
$$ -180 -168 38 -47 -148 125 161 -59 185 272 -44 -33 69 -58 -176 95 -18 -172 -70 150 -145 -246 113
2779A13K2l38K79Q0k57Q9K46p5j97J67O6n03L83R0l36o0K99m3k48L41J8j12P2
$$ 113 135 -203 76 156 -101 -12 234 159 -38 129 195 -308 75 165 -171 -231 68 25 -223 118 136 24 96
2802I6K41l04j96K29o1q9J85M9k00m0J75j87L9N6j4j25K01J98k86K8K08j88j29
$$ 96 337 33 -163 66 5 -84 101 150 -50 -90 85 -102 -63 -7 -21 -146 55 253 -33 -5 203 15 -114
2825a14J67J94m96J48J47j57p3K45k3k90M13l5j72l6L36j80j28J59K4k65J70M
$$ -114 53 247 -249 -101 46 -111 -184 61 38 -252 161 126 -46 -82 254 74 -54 105 129 -136 34 38
2847C8p3o7J56p9n9J89qk74K46K33l20k6J91p8k25K56r1k71J78P5k21l7L30p3
$$ 38 -35 -102 54 -25 -84 105 97 -177 69 302 -18 -44 147 69 -156 100 9 -262 -84 -9 -230 -267 63 -10
2871a0k23K75J18k35m0L32k00k29K34J24k61J6J91k64R4J50m5k45K90J0j32J83
$$ -10 -233 42 160 -75 -115 217 17 -212 22 146 -115 -99 92 -172 -78 72 27 -218 72 82 -50 133
2893A33R8j56m3J30l5l32K85K1k97J98l3j59M0L18j37k02O1K53j93k7K39j25k08
$$ 133 231 75 32 162 127 -205 80 101 -196 2 -31 -190 -150 168 31 -171 -110 143 -50 -77 162 37 -171
2916a71L23o6k72J88O2k85M9K17P7k02M4L9o0O4K88l76pJ72P1l37J46J99k55j1
$$ -171 152 86 -186 2 64 -221 -172 45 122 -80 -36 3 -57 7 295 -81 -88 84 155 -182 -36 163 -92 -103
2940a03J56j5j72J05P8k01N1L44k57J50L9r8j21J15q3k15K54m2pKmP3k09O4J77
$$ -103 53 38 -134 -29 49 -152 -101 243 -14 136 175 77 -44 71 -12 -227 27 -15 -22 -20 -24 49 -160 -96 81
2965H1j37J86O2j53j14Q7J54k76R8J01j07j89J95Oj02L18j60j48J51N6o5k0K64
$$ 81 -56 130 192 39 -75 12 166 -110 -12 89 -18 -207 -12 -6 -108 210 50 -98 53 109 44 24 288
2988B88j48j65J29N0k64N1R4p2n3L8N9r7J41J03j03q8J84p4j02K06qj82O1J21
$$ 288 140 -25 104 154 -110 -59 35 -37 -90 -52 7 -90 51 154 51 -37 147 73 -29 177 169 -13 48 169
3012A69k36m7K06r5k07L37j21q6rK76k10j15L82k13j9P8L8k24j7J47o6j42J01
$$ 169 -67 -114 92 -3 -210 127 6 -80 -89 187 -23 -138 244 31 12 90 128 -96 -113 34 -32 -174 -73
3035g3Mj0J2J63j23K6K08j44r6Q4m4j32J26j8j5j31J26lj16R8K09j51q1K63q4
$$ -73 -69 -79 -67 96 -27 -1 207 63 -33 51 7 -125 1 -17 -32 -163 -37 -40 -156 -58 151 0 -81 182 98
3060I8j83K19jl52K34Kj35%J84j10j51J96P1q9J30J3j81j9K88j45j43J01R9q4
$$ 98 -85 134 133 -219 15 17 -118 -118 66 -44 -195 1 72 -17 113 126 -55 -74 214 69 -74 27 126 42
3084D2nk3Jk56K39O2l86L38O1o0J79N4j99p4R2J03k88R6M5k75J05K66k5k08J34
$$ 42 37 14 15 -241 -2 60 -326 12 73 13 192 246 47 -27 65 168 -120 -24 21 -254 -149 117 92 -116 18
3109A8k9j23K01m6n0j96M20n2j69Q7l0l8L7J01j34k06K59j31o0Q9J98j78k0K01
$$ 18 -11 -134 67 21 -29 -225 195 143 -26 61 31 -7 30 131 -3 -209 50 -81 -141 -52 146 -32 -52 149
3133A49j63l8J61O3k45J16M8n2j51N7P3k08K38R0j91J16J66k71k31K63K4l2N0
$$ 149 -14 -52 109 172 -73 43 91 39 -112 -55 18 -190 48 138 -53 63 229 -42 -273 -10 14 -18 32
3156C2J80k33l3L0m8j85L27n5l2j24L32j72j56K68q6m4J51j86O1j05K03k68j2
$$ 32 212 -21 -54 -24 -72 -257 70 15 -17 -141 191 19 -137 131 45 1 152 -34 27 -78 125 -143 -155
3179a55J11N0o1N0J12j44J31Q8j16j00O7k0j10J04R9j88o1K01k23j5L9K52r5j
$$ -155 -44 6 -55 -5 107 -37 94 182 66 -34 33 13 -97 7 106 -82 -143 58 -165 -180 -141 111 16 15
3203A5M6j17j04L86j80j21P0J70k44l0K46k37K3J66o4j04J24O3j46J8J72j39r6
$$ 15 61 -56 -160 226 46 -75 -5 165 -79 -109 137 -100 -77 89 25 -79 45 108 -38 -20 152 13 -83
3226h3J40J12j99O1M8q7N5M5j05k07K71O5k50K03N4j33j00K29O9j87K4J07k01
$$ -83 57 169 -30 31 79 -8 47 92 -13 -220 51 116 -134 69 123 -10 -110 119 188 1 25 132 -69
3249f9k4J84j16k93L90j8j86J29N0j16L2J76l0k80K34J61k02j4R2k02l5P9P5j21
$$ -69 -93 91 -25 -318 72 54 -132 -3 47 -69 -37 139 109 -171 63 224 22 8 100 -102 -137 -58 17 -104
3273a04R4J45j76N9J06j11j44L96j73j82K55K8k93o5J20l1j86J90L5j06P3J67
$$ -104 -10 135 -41 18 124 13 -131 265 92 -90 165 193 -100 -165 -45 -76 -262 -72 -37 -143 -70 97
3295I7k05Q5m0N3j57J37Q6l7m5O8k97R6J65Pj99J65L0p9l5K13qj06R2P2k34J45
$$ 97 -108 -23 -63 -10 -167 -30 56 19 -26 42 -255 -159 6 13 -186 -21 9 -70 -105 108 100 -6 86 158 -76 69
3321F9Q1k20j04K43r5j97K69%l6k0J72j77j9J08Q0j45Q6Qj40o7J37k7j85J82r
$$ 69 150 -70 -174 69 -26 -223 46 46 10 -10 162 -15 -34 74 154 9 95 103 -37 -104 33 6 -179 3 -6
3346fj11J99o9qj5J27j02o9J19%j41K6J44j66kQ0J8j15K24J9j92L8J24k23Q2J35
$$ -6 -117 82 13 5 -10 117 15 -54 65 65 -76 -50 94 -72 -74 6 24 -91 133 152 -40 -2 122 -101 -19 116
3372A16j23nP5J14k99J46K7j08o4J98o3k0r4J04Kj58J83qk9LP0j46O2k5j6NP9
$$ 116 -7 -12 63 177 -122 24 51 -57 -121 77 14 -6 -100 4 6 -152 31 23 -6 -3 67 -79 -17 -42 -58 -53 26
3399B6P9k21R9J12k39M3J27O0r6m2N5l0O8L5j53J0R6J1n4o1J85l00J92p5l7L0
$$ 26 105 -116 -17 95 -144 -101 26 86 -10 -52 3 -27 41 76 -77 -67 29 40 -14 -75 110 -190 2 -73 -110 -80
3425h0K35j59%Q1n8no0N3K1j68K08K0k77K19j15p6J16J45q6j14J74K1j19k4J30
$$ -80 155 -4 -4 77 19 14 -46 7 28 -140 68 88 -189 30 -85 -161 -45 100 14 -100 74 95 -24 -48 82
3450H2j55q5J46O3k57K06J36k24M6K43k98J52j6J21j81M9J59l34J17j0O9j38J91
$$ 82 -73 -158 -12 51 -206 0 136 -88 -42 201 -97 55 39 160 -21 28 187 -147 -30 -40 29 -109 82
3473H2j7j55P6Rj09J18R4k6l8O7Lr0j04L8Qk7J98%k26J97p4j37N5J73p5l9J19
$$ 82 65 -90 -14 -5 -114 4 98 72 34 101 104 14 -90 -52 -44 -71 127 127 -99 98 24 -113 -58 115 40 1 120
3500A20l2j19m6J88j02j27K30j8k55J45M1k66J92R5p7O4L4J02k14q4K14j92L3
$$ 120 88 -31 -77 111 9 -118 112 94 -161 -16 25 -241 -49 46 -31 33 67 169 -45 -129 85 -107 -74
3523g4J92j01o4J18m2k60K18M3r8l9J48p3R8N5j2j45j5L2Kj10K48j01l4J36j20
$$ -74 118 17 -47 71 29 -231 -13 30 -68 -107 41 -32 66 121 109 -36 -51 -19 -17 -127 121 20 -14 122 2
3548Bj68J13P0J0l2K41j36k4J4nj35J19LN8k30J33M0q4mJ17j35j2J34j2L4jl6
$$ 2 -166 -53 17 27 -5 236 100 76 90 85 -50 69 72 130 -100 33 73 -11 -15 102 -33 -45 89 77 111 110 74
3575G4j50J54J05k07K6m7P7k52K16M9q5oK5M6m8J57m7j34J36o8MJ8Rj35ln9K99
$$ 74 -76 78 183 -24 2 -45 32 -220 -4 45 -40 -46 -21 25 -23 134 87 -47 89 21 25 43 52 -83 -86 -145 154
3602A54l28J76J0j49J91J41q1j67J4J25j02j3J85k72K5PJ28m2O5j7j14J6J89k3
$$ 154 -174 2 12 -137 54 195 114 -53 -39 86 -16 -29 156 -116 -91 -84 44 2 67 50 -64 -48 141 118
3626A18k00J17N6j34KM7k1j7J20o7j2n6R5j41j10K90j9m0l7Q3m8L1m4r6N2lN4
$$ 118 -82 35 91 -43 -41 6 -15 -32 88 21 9 -47 48 -93 -203 87 68 28 -9 74 26 57 13 -83 -31 -34 20
3653B0j3J3j0k55J96J04q2p4K22p1p2J38j6j59O8Q7j17j6J70j04j80K44j74M7
$$ 20 7 20 10 -245 -49 55 -27 -101 121 50 -22 116 100 -59 9 96 -21 -37 133 29 -151 93 -81 -34
3677c4j9J40p4r0J49j51R4J6K6p3L6P0j27L0j9j66%l4J71J7oJ40oj43N1J25q5
$$ -34 -53 87 13 -77 72 -79 15 31 57 -16 20 90 -37 -7 -26 -192 -192 -226 -55 -38 -44 96 90 -53 -2 123 38
3704C8k1J43j85j3J09l1j49J91l3p7J04J12k29PJ13j90M2J48L9n7m3J22n1k33
$$ 38 17 160 -25 -38 71 40 -109 82 49 -28 76 188 -41 -34 79 -111 -69 79 118 61 18 140 89 -144
3728a44L4J1M4l9J36j94R5K20m9k47J08Q9j27J55m5N2q4o0Q0j32l5J65j79L4K03
$$ -144 -110 -99 -55 -94 42 -152 -57 163 114 -133 -25 64 -63 92 47 99 15 -45 35 -97 -132 33 -146 -112 91
3753I1J6k05J28R7j71O0k2K7rj3J1q0J37r1l0j1M2J41j52Q7j21m3J51O9j56J0
$$ 91 107 -98 30 127 -44 16 -6 21 12 -1 10 -70 67 -24 -54 -65 -23 118 -34 53 -68 -111 40 109 -47 -37
3779c7J47o8j53J2O3j67J48J73j91OJ05j7j18M7J14o4KN9J8j76J31O5k97K73q5
$$ -37 110 42 -111 -99 -36 -203 -55 118 -73 -67 38 21 -97 -50 64 0 2 61 79 -97 34 99 -198 75 -10
3804a0q0N3J87j30n5J08K7j26J6N2o4j16K71j19j38O7P5p0n0J52r6l3P8k0j21
$$ -10 -90 -37 150 20 -35 73 100 -26 -10 42 -22 -138 133 14 -124 -57 18 -52 -102 50 -46 -79 -1 -21 -142
3829a42K31j13J15j42J28r2J6J91j61l9r2K42p4j45J61q4p1J44m7o7Q5K0M0o7
$$ -142 89 -24 91 -51 77 -15 1 192 31 -8 -100 142 68 -77 84 0 -71 73 26 -41 44 64 104 37
3853C7L9o9j12J64On5q3K50k33M8j5J12j51M9J02j40J6Q7o8j54K47j4p1j7ko2
$$ 37 76 7 -105 59 65 10 -73 177 -56 -8 -23 89 -62 -13 89 -51 -35 52 -16 -170 77 63 -8 -25 -27 -89
3879h9o6J72K2j51K17l2%j11J67k94R7L2n6j3J4J21j81J83o4l7k7M7M6j2L7J58
$$ -89 -155 17 39 -112 105 73 73 -38 129 -165 -68 -36 -92 -105 -91 30 -151 32 -32 -69 -96 -49 -3 -15 22 180
3905A80j46M5r5J18k21J08Q9m3j58J05Qj4L5o4oL8J05k5j28J40j15ON1l5j1lM6
$$ 180 34 79 -16 102 -119 -11 78 35 -123 -18 -10 -24 11 -53 -59 -21 84 59 -69 71 -44 -38 13 -22 -33 -36 10
3932A0j29MJ19kn3Q9m2L8N3L5j21l6J6M2q8q8J19l1J28P4j90kJ52r9k3J84j27
$$ 10 -119 -115 4 2 -51 38 -4 34 87 122 1 -35 -19 23 -65 -153 -34 -65 63 137 -53 -55 97 -2 -25 159 32
3959C2q1K1O3K2k33R1J66j46L2N1j38J14n8O4j49K05J31k50J41K4j11r1L8J12
$$ 32 -49 -28 35 57 -176 -85 81 -65 -33 18 -120 -6 -64 0 -149 56 187 -63 78 102 -9 -100 -62 50
3983E0j01J24n8qq8P0j4l7M4N7j13J29K6l8j06Q6l3nN5k3J1M5P6j70n3J40q2J7
$$ 50 -51 73 15 7 -81 -11 -25 -62 -18 39 -74 55 81 43 -63 23 -10 -15 40 17 28 73 149 -21 -74 66 -16 1
4011Ar4K78k35k1J10kj70J34o7k4k1J38j04L5O6rQ0j31L0k3M1Q5p2o9J32qk11
$$ 1 -93 185 -50 -71 39 37 -133 1 -66 -90 -111 27 -77 -42 24 15 95 -36 -6 -29 12 97 25 -44 88 80 -131
4038a31J12Q0o3o8J15q3N9N1N3j92K7J49p1j25R9m1P3m2n2m6K8K01k06Q4MK6j67
$$ -131 -19 61 -2 -70 45 -38 21 72 125 -67 -40 109 38 -87 12 -29 44 2 -50 -96 -68 133 -73 11 15 41 -126
4065a26N7R4j17R1p1J47j31J01o4j38J07J13j71N1J37j09N2j9Ro6Q5O4n3O1r6
$$ -126 -69 25 -92 -1 -72 75 -56 45 -19 -157 -50 63 -108 -57 80 -29 23 4 13 -53 32 96 43 104 8
4090HL2m0M5mj23J0J46j18j71K02k0N9J35r7jj32Q8J12j86J46m2pj33J57j63J27
$$ 8 40 0 45 41 -82 -72 74 -44 -215 -13 -33 26 161 64 63 -69 19 131 -55 91 49 42 -91 66 -97 30
4116C0j04P2J1n9Q5n6O6l2mj52J43j25O1K15j73k1mJ60j52o3J52m8m6J40j03l5
$$ 30 -74 -2 9 -50 35 -21 45 13 9 -143 0 -125 -64 151 -22 -43 -47 113 -39 -102 50 2 -44 96 -7 -42
4142d2J64j14K2j03O0O5j31nJ98l48K40N2o4L9n9J00k1Qmj44nM3L3j61J25J64
$$ -42 122 8 30 -73 -13 52 -79 -84 114 -234 6 58 -6 33 -26 74 53 61 57 -87 -92 -49 -16 -177 -52 112
4168A12j17j15P7K8r3J33o0j1J05O6j31j11K53n7k16K46kj36l8J51j6k03J74j3
$$ 112 -5 -120 -43 -15 -108 25 -35 -46 59 125 -6 -117 136 79 -137 109 107 -29 -67 84 68 -135 39 26
4192B6J9l0m7l3J4Q9o0N4K9J2j98K00k9j06J03q1r4O3J06q6N6M3j50J29j06J0
$$ 26 45 15 -32 -65 -51 38 -22 32 61 73 -125 75 46 -60 43 -38 -132 -69 37 -49 7 50 -100 29 -77 -67
4218f7K14k77J11J27k02J24jo5K4J41m4o9m8lL2o3J15M6N5j77L7j37J86j2o5r2
$$ -67 147 -130 -19 108 -94 30 29 -36 -12 129 85 16 -32 -35 -3 -66 49 95 150 -27 10 -127 59 47 -18 -110
4244a10J0J06o2N1N9N2n6L2L1j86O7m4o2R0lj38J48P0j11J4J33j06J2O7r6l9M2
$$ -110 -100 6 -56 -5 54 106 50 82 113 -73 -6 -50 -112 -22 -25 -163 -15 55 -56 -42 91 -15 -3 64 -32 -71 -29
4271b9K7k0K5m3J00n6n3O5pl2Q4j05q3J38K6L3r1O2oj25P1Q8n8O7j6j34L5P0o
$$ -29 -2 -22 3 -40 60 4 -49 16 9 -23 61 -44 -127 11 37 70 -21 41 35 -90 -19 69 11 78 62 -72 -37 33 27
4300B7k8L7N5k41J70L0j4J4J5n3l3p2K7Mj7J35p0o4nJ06j57K08k1l3m8J50j7k00
$$ 27 -1 36 91 -150 20 50 36 50 65 12 -21 -93 -66 -62 -79 56 -14 -78 -83 23 -134 74 53 20 -28 122 105 -95
4328i5J96k8q7O5J31k72KR7JJ4Kj67J23j44J11L0r9J85q5p0K7J12k25J11q8J18
$$ -95 101 73 -14 51 182 -90 -88 9 10 24 26 -141 -18 -162 -51 -21 -120 65 -20 -90 -63 49 -176 -65 -153 -35
4354c5k9N6J02kj38M9p7Q2J60k06j4j14K14m3Kj03k4M2R1N2k5J1j42J4O5J40m3
$$ -35 -64 -8 94 92 -46 3 -74 8 168 -38 -52 -166 48 5 7 -96 -120 -78 13 65 40 51 -91 -77 -12 128 85
4381H5j06J60j85N2pJ8n2J9j11mO1L6L2L3l4J00j01M4K1n9J9p3Q0j01m9J5J9n
$$ 85 -21 139 -46 6 -1 17 -35 -16 -127 -131 -70 -34 -2 31 -3 97 -4 40 61 2 21 -52 28 -73 -122 -107 -88 -93
4409i3K3J20j53O5k0r7J02N8pk5J05om3m7J06l4j33J34j28J67K1l9n6j7J08j22
$$ -93 -70 50 -103 -38 -58 -155 -53 5 -2 -27 78 72 29 -18 88 54 -79 55 -73 94 115 76 20 3 111 -11
4435a1RL9kQ2j42M2Pj20J15p4M1L3m0j12J70o7m7J32n6M6m9m1O7p6p2K03r6r9
$$ -11 -2 37 35 117 -25 17 24 -96 19 -55 -14 19 -21 -133 37 -30 -77 55 -1 45 -4 -45 22 -54 -126 77 -19 -118
4463a18J30l3j44J60N4k1l5Lj07J33O5q6nK6l2j09J25o3l0N9q0J10pJ9M1o1k1
$$ -118 12 -21 -165 -5 49 28 -7 -4 -111 22 87 1 -4 22 -10 -119 6 -57 -87 -28 -108 2 -5 14 55 -6 -27
4490b7O8q6Mk1Q4j38J35p2oQ3Pl9o1J35p2o9l4J85o1JP5j60l2J34J5p8k2Q0N9
$$ -27 41 -45 -41 -62 22 -116 19 -53 -59 24 31 -8 -69 66 -6 -75 -109 76 15 16 91 -69 -101 33 48 -30 -52 28 87
4519H7l06K21l2l2Q6K02l62K29k0n6l9M4l3K2J20j50k5J36j79J35o0r8Q6j4P9
$$ 87 -219 2 -30 -62 24 226 -136 93 73 17 -22 22 -11 11 131 -19 -44 92 -87 48 -12 -110 -24 -38 41
4544D1n9J10j61k0P4j3Q2m6p4P9l0M4Kn3J6P1j27J31O0k8l0J2j15p6J12k9q9J81
$$ 41 -18 92 -69 -89 -15 -28 54 8 -66 13 -17 27 29 -24 -8 63 -64 67 127 99 69 81 -34 -110 2 -27 -116 65
4572F5l7OM8q0n2R2O4r3j32J66j11J87l3j67m5Q6n1J21k4N0o3p6N3j3O3j5L0j21
$$ 65 28 34 82 2 -50 42 106 13 -119 47 -64 123 90 -77 -122 -36 -87 34 10 60 -3 -79 -26 -39 24 9 39 -82
4600h2J01l7J4J7%M4r5l5J64p0r4K4J3O7jJ5r2P6m9M6o3JM3M2k8K1M6j26P0rL
$$ -82 19 -18 -4 13 13 57 -38 -73 91 21 -73 -49 -36 31 30 45 -47 29 -20 26 -37 -36 7 49 21 42 88 -38 32 23 26
4631B6r9O8Nj1J49j53P2j01P2J5J2j39J26k0j41J93j44R5q8P6kj05J11j7P0q9
$$ 26 -73 -5 0 -11 138 -15 57 -44 28 43 55 -84 42 22 -119 74 -70 25 -63 13 11 -94 17 0 70 -19
4657a9o7L1J9J44m3O9j50P2m2O6o1oJ5o4j00J85o7PJ04p9k1J2N3r6N4q8Q3lLM2
$$ -19 -86 -55 -36 108 65 134 -16 56 14 80 19 13 28 -36 -136 49 -18 -11 93 14 -7 5 58 -38 16 -72 11 8 11 53
4687E3m5R6r4j7j4J05j36R7K5j2j65M4J09j53P7J29l2r8p3Q4L2m2J18j7q6L1L
$$ 53 8 104 10 -7 -21 84 -52 45 70 58 -107 -63 46 -107 -30 99 67 -31 -104 -20 12 -30 88 71 -15 16 19
4714A9j62J95o0J6o3J04p5R2j01K7k0K6Q9l9LL5l2j49J7P3n0N0j1j15L2P8P0o
$$ 19 -143 52 -8 8 -55 49 -26 66 -35 -8 -28 -2 87 48 51 86 54 -95 -78 -5 -55 -5 -16 -131 -99 -21 49 43
4742D3J1j00k1J63j27qJ61j04p2L0o7J26m0k5rQ0j5m2J17j36L8M7q5j2J65j17
$$ 43 54 -46 -67 96 -31 -39 122 18 -54 -24 -91 35 -5 -30 -39 41 26 -16 101 -35 3 50 -35 -47 118 1
4768AL2OQ3j46N2k5J22j76J06k9q2Q6j3N8r3l5n6J71l8J01j67qK9R2k79J40L3
$$ 1 33 39 122 -24 28 3 125 -51 55 26 -56 30 17 75 -18 -53 -109 62 24 125 -42 -50 -21 71 -208 -68 -35
4795c5J1J11J0j17m8J28K4j18L9J12j43r3J40r5k2J27n5M5K5n5p0O0j02J45K9
$$ -35 -24 87 97 -20 -68 60 84 -34 5 117 -26 -119 21 -74 -96 31 -24 21 46 -9 -79 -19 -121 24 53
4820E3JL1Jj22J22k1j00R2j60oJ21R1j31j1J13n7o3J37p4L6j38N0J68j13k7j28
$$ 53 54 85 86 -36 86 65 -35 57 -103 -109 12 103 -28 -39 74 17 -46 91 17 53 -85 -35 133 20 -7 -135
4846a35J67j08J18j41J7J7R9j1o4J16j07L3N1n9Q2k0J4j43N5m6k5M5P3P6o7K2
$$ -135 32 -76 42 -99 -82 -65 34 23 -41 75 -32 1 52 -7 75 55 69 -74 -19 -65 -90 -45 28 104 37 59
4872E9j32J7P5N8k9k29K03p8J27j61P3j2o1K03j57M9r7R0j9M3K8L5j3m9j7LJ26
$$ 59 -73 -56 19 77 48 -181 22 -56 71 -90 -17 -29 -90 113 -44 5 -92 -2 -21 22 50 85 72 23 6 9 135
4899A35j52l3M4J39j70o1J31m0NJ09j68Jj4M7J73j67O9n5j1j04R8L6O7j01L2p5
$$ 135 -17 -50 -6 133 -37 -98 33 -7 -2 107 -61 -60 -74 -27 146 -21 48 -7 -18 -122 -24 12 79 -22 10 -65
4925f5QK1o8Q0O6l6J08j06j1j39K33j16J6J50k30J52q7J28k11O1j0J08j56J47
$$ -65 -57 -36 -104 -24 42 6 114 8 -3 -142 91 -25 -9 141 -89 63 -24 104 -107 -46 -56 52 -104 43
4949D3j23M7o9O3J01p8k4J18j17n0J64q9P2j57Q1n5R8k9N5j05N7j20J76r5R4j37
$$ 43 -80 -33 -102 -39 62 -16 -40 78 -39 -89 75 -14 58 -99 -18 -73 25 -4 51 -54 3 -117 59 -36 58 -79
4975g9O0J0K8j01N4R9J20k23J23o1j17J38l7nR2p5m8K7l7N9j15J35j03l6P6K1
$$ -79 -19 -9 19 -82 -28 71 191 -32 91 30 -87 51 14 9 101 26 -22 5 -32 27 -88 47 -56 -92 -16 5
5001Er9Q4L6j61J50M3j00J2J32n2m7o5J11l7J8N5j2j00K0L8K1j15pO2k1M9j51
$$ 5 -94 -10 26 -135 15 58 -42 -30 102 50 3 -62 49 12 30 85 73 -27 -7 31 52 -63 -70 -8 -29 20 -131
5028a31J88j07P3o3k7k3J11jKN0l34K84J11j01M0j35N6J42j17Kq6ML0N5RK6j09
$$ -131 57 -50 23 -40 -67 -90 21 20 22 72 -262 22 133 32 72 -63 -7 135 18 20 -66 -62 -32 23 32 58 -51
5055e1J6K24j60m4R8j66N8M4m6o5k9J90j18MR4l6p0J37j52J6l2Q6M2n1m9n5Q6
$$ -51 -35 189 29 -15 83 -83 -25 19 -27 -92 -121 69 -49 -45 49 13 -57 80 -72 -56 -88 -2 40 -11 -60 -115 -29
5082b9O9k1K5p2J50k1n9k25K02P7j38J63q1k1K6O0j51N6o2J03o4L3l5pR0m3n2
$$ -29 40 19 44 -28 122 101 42 -183 19 96 -42 121 40 19 45 105 -46 10 -52 51 -13 20 -15 -22 68 25 -27
5109b7q9O5M7J99k24m1R8%m5N1k8l4K1p4J17o4n4J32k2k8k6Q1Q6o6r6nL6JO8m9
$$ -27 -116 -51 -4 195 -29 -70 28 28 -17 34 6 -28 -7 -81 36 -28 -82 50 28 0 -26 55 141 75 -21 -26 10 11 79 30
5139C0J38j27l0L5j20P8J12k25J71k8k9l4Q0o1J31q9O5Oj29l0k5O9L2O5j35P6
$$ 30 168 41 11 46 -74 4 116 -109 62 34 5 -29 51 -10 121 32 97 103 -26 -56 -81 -12 20 85 -50 26
5165B6N1j52P0J19j04j02mO2qP5n5L6m3Lm2K5j0m4J65m9L2M4q6L0j44J03L9J18
$$ 26 77 -75 -5 114 10 -92 -96 -34 -42 33 -22 14 -29 -26 -68 -43 -53 -97 68 19 51 95 9 39 -105 -2 37 155
5193A55j22L1J9p8M1r0J88j82J37j4j96J21j29J94j20j7J15j47O8j46J20L2j71
$$ 155 33 64 83 5 46 -44 144 -38 99 85 -111 10 -119 75 -45 -62 53 -94 -26 -172 -52 -20 -191
5216a91J55N3k4kp3nJ21j60J21J15j45nJ4rk3km5O6k4K6P2J8M9Jq2j2O4j04o2
$$ -191 -36 17 -7 -9 -82 -87 34 -126 -5 110 -35 -40 -26 -35 -58 -60 -105 -39 -63 -37 35 53 102 103 21 9 73 -31 -93
5245i3J75KO2j90M2p9M6O7J1j81J38n2nP1m0j9R2q2L6k1j12J53j48J46m3J09l2
$$ -93 82 84 146 -44 -2 -81 -35 32 43 -138 0 -52 -57 14 -26 -45 47 -35 1 -20 -132 21 -127 19 -24 85 53
5272E3j86P3J19n1M0j25P1pJ1M0j37K06J4j03j14m1J68j46m4J37pQ8o4M0j2r4
$$ 53 -133 -60 59 8 48 -77 -6 -13 -2 38 -99 107 121 18 -96 -137 31 -115 -159 -22 -29 59 -5 35 23 -71
5298g1M5J9J24j52r6N5k5Q6j27J97o8L2q8N8R7o1q9l2P5Q9j17L7J18j67o1Q3N6
$$ -71 -26 -7 117 -35 -131 -76 -101 -15 -142 55 -13 19 -69 -11 86 25 -64 -96 -21 68 -49 -12 106 -61 -122 -39 17
5325A7j58L19j53q0J15p8n7KJ16M7j40j26J53J5J35r0o0m4R3K6J2M0j18J02m2
$$ 17 -141 178 25 -55 60 -18 -75 -73 43 90 -50 -176 -23 -8 127 37 -23 -67 26 52 64 104 -14 88 46
5350D6k2j23P5M8O5Qj88K03j94j4J57j28p6jR8O1m1J89j30k8k0K3jk0Q1M6j30
$$ 46 24 -99 -24 24 89 97 -91 112 -82 -96 61 -67 -143 -144 -46 15 -26 163 33 5 -15 8 7 -13 68 114 -16
5377a6J45r7lQ4j66N7K7J1P9k21K67j57m1J74j56M3j5P3k01J42o4Pm1J07l8Nj
$$ -16 129 32 29 113 -53 4 31 42 121 -100 167 10 -31 143 -13 30 15 88 -113 29 -35 -28 -69 38 0 5 4
5404Dn9m5J34OMp7J3J08qj52N1Q7j57J08J6j6O0Rk30J39L4m9L4N3j4r1J50j00
$$ 4 -55 -100 34 40 44 -33 -20 88 80 -72 -21 66 -91 17 33 17 77 86 -144 -5 29 -20 14 67 53 -38 112 12
5432A2K0pn0J6j07N1M6m5K9m5J19o4P2q4J8L3m7r2k0J09ML8J02p5LM2j05K3j26
$$ 12 32 25 -25 -9 -116 -65 -19 -64 -35 -80 39 -25 47 -37 -19 14 -33 -125 -145 -36 -32 6 108 33 36 78 -27 -4 -130
5461a30J35J5p9J04L7j35pj0k4j3J32J0m2L6p0J49k02J38L7n4j5q4KR5j43J37
$$ -130 5 20 -59 45 82 -53 -60 -70 -94 -107 25 35 -7 29 -41 108 -94 44 81 27 12 -72 -70 25 -118 19
5487A9n0M4OM2J1J2j20J13J3r9k6rR6p8J47o3q4J16j49O7l9K1mO3j2j08J09n0
$$ 19 -31 13 19 61 72 84 -36 77 90 -9 -35 -44 52 -26 121 58 -26 90 -59 8 -31 -10 -14 49 37 -71 38 -12
5515a2n9K6k0O9k3M8j20R6r8J24n5K0mo4J7J40j49K0J1O9M1q6m0N5J07k24K3O3
$$ -12 -71 -45 -65 4 -19 29 -91 5 -93 31 -24 -4 -8 -72 -55 85 -64 -44 -33 36 77 -9 -49 6 113 -111 -88 -25
5543b5m1O9K4r2J04l9n3R1j05N9j08J02R1j18j3M4P2k06LJ96k27J58O0J6k2o3
$$ -25 -66 3 27 -65 39 0 -53 38 -67 -8 -116 -14 77 -41 -54 -10 62 -144 -141 55 -172 -14 46 62 40 -23
5569b3N6L6n9j32MJ34J2J20p9r4L6L3R8m2m2j96K9R1L7r0J55q2J25j04J0Oj69
$$ -23 33 69 10 -122 -118 16 28 148 69 -25 11 44 142 100 58 -138 -109 -18 19 -71 84 2 127 23 33 39 -130
5596a30K33j22P5q3L2m6M5M6l1%k0k5N6L7J8j4q2K3j24RJ13j23O1J24m8mJ2MO9
$$ -130 103 -19 56 -27 5 -41 4 50 19 19 -1 -26 30 67 85 71 -11 12 -112 -103 10 -113 -52 72 24 20 32 36 105
5625A05j46J6l6j5J37j14J25j02J80j67j9L0Q0j21q0J71R7j84J14N0q3l3Plr0
$$ 105 -41 -25 -61 -76 61 -53 72 -30 150 -17 -36 -6 74 -47 -127 44 141 -43 71 121 38 5 12 9 -81
5650h1L6N4mm6J23j60J7P0J6n9K7N8o2Q9j82P8K7oQ7j24N4m2L9N5l4j07K33oL
$$ -81 -45 9 5 -41 82 -78 -61 9 25 -34 -7 51 -11 78 -104 -26 1 -5 82 -42 12 -30 9 64 30 -77 156 150 153
5679A53j98P5jP3Nq5Q0p4j6qM8j6l8j21P1J29j89K54k97J88J6j2m1k3rJ21pJ4
$$ 153 -45 30 29 102 107 22 102 28 12 4 52 36 -2 -123 -52 77 -112 142 -155 33 49 37 -4 -27 -36 85 78 92
5707I2j26Pk1J4Q1n5L4l2k5L2P5j52J10K7J4p3J2lO2j73J61l2k8p2K46j95J6J11
$$ 92 -34 -27 -48 -34 47 -8 26 -6 -31 1 76 -76 34 61 75 2 14 11 73 -100 61 29 1 -71 175 -20 -4 107
5735A07q3j31J22n3l7J9R4o1j49J78L6l1pP8j07O2L7l2j91J52m8L5j01M5o7J1
$$ 107 24 -107 15 -38 -75 -56 38 -23 -172 6 42 11 4 82 -25 37 74 42 -149 3 -45 -10 -111 -66 -133 -122
5761a22J88k48K54j3o3k0O1p4R6j04K2M0l7J84o3o4O6j54n1P6Q0j1l4Q1l4j22
$$ -122 66 -182 72 59 -4 -24 37 -37 59 -45 -23 17 -20 164 101 37 103 -51 -102 -26 54 43 9 90 56 -66
5787f6J31n7J36j68j4L6p6J07r7M8j14K75k59P5K9J2r4K2J42j45K5L3K8r6J76
$$ -66 65 8 144 -24 -38 -2 -78 29 -68 -20 -134 141 -118 -43 -14 -2 -96 -74 68 -77 -52 -19 9 -87 89
5812H9o2o0J29j24M2j20J24J4j05J14l1K3j2p8J38n4j73R5M6R1J9j10N7j6p6l5
$$ 89 27 -33 96 -28 14 -106 18 32 -73 41 10 33 21 -57 81 27 -146 -51 -5 86 105 -5 52 36 -40 -75
5838g5J03N6j57l9J24N0q4J4N7j33M4p2O0k5R1j2m7J6N6m4j30K17q9L1M7j67O6
$$ -75 28 84 -73 -112 12 62 -22 -8 49 -84 -40 -112 -52 -77 14 2 -45 -29 27 -17 -147 70 -19 12 59 -108 -42
5865d2J81j26j5M5P6r4m8K2lJ29o3O0j56O2l0j2n5J01q8j5j8K8P0J25j20N8j07
$$ -42 139 13 -2 43 119 25 -23 -1 -4 125 62 122 -34 28 -2 -14 -69 32 -56 -71 -89 -61 9 134 14 72 -35
5892c5L4j4p2M5M1j6m6J80j35N0J00j61q3J72Kk4j36J07L8j29R8q0rP4k3N5r1
$$ -35 -1 -15 -87 -42 -1 -17 -63 117 -18 32 132 -29 -112 60 62 38 -98 9 47 -82 16 -64 -73 1 -22 33 -58
5919e8P4K8o9L0J09o4r2lqLJ46r1M5k11R8j3J05j23R1j5M5J4r3J05rk3q2k5M1
$$ -58 16 44 -25 5 114 50 -42 -45 -53 -50 96 5 50 -161 -63 -76 29 -94 -3 -18 27 41 -52 53 44 21 -61 -86 -45
5948d5L3l7kR3j6j61K09p8Rl1J52l6n8P4j38Rj23R8J39r8l6rj1Q4j0M1o9o7pJ77
$$ -45 -12 -49 -51 42 26 -135 74 -4 5 -26 126 90 32 106 -32 -23 -146 -48 91 -7 -43 -52 -63 21 11 52 -17 -84 -91 86
5978H6j14N3rn2M0lK6j36L5Q2n6J35k05J38m2O1rR4j33R5j59O8J69j45q1N7O3
$$ 86 -28 25 16 -36 4 1 27 -109 -74 8 -48 87 -118 20 -22 39 30 124 -9 86 -73 -5 164 19 -62 -5 58
6005E8K6kp7m5M3m2R6m0k9J52j11L7K6l0p5M7n8P7j28l2J41k9N4O6j28jL6l0Q8
$$ 58 84 82 5 -40 3 -39 57 17 -12 140 29 66 92 62 -13 34 -24 53 -75 -107 34 5 59 125 -3 -4 32 2 90
6034I0j70J79k18L6pJ11K8j2K9j25j1q5K15j33J05Q2k6j8j71Q4K4j5l6RP4k8O6
$$ 90 -80 99 -119 -83 -90 21 49 37 66 -59 -70 -155 60 -73 32 114 88 70 -101 -17 7 -8 -44 -35 39 11 77
6061G7p8k4K0k7l7N0L7P8j03Q5p7m2O5n8J70j58K1P9j00q3R6K4k5O4m1O1p8j78
$$ 77 -1 -25 -5 -32 -69 -19 18 96 -7 78 1 -41 24 -34 136 -22 -1 78 -22 -105 -9 15 -10 54 13 74 -4 -182
6089a82P2Q9L4N0p0j00J68j53J09O0j05P8j45K32n0q2j2J05K9K8j84jP2r1J8L5
$$ -182 -110 -21 13 63 -7 -107 61 -92 17 77 -28 50 -95 137 87 5 -7 98 127 155 -29 -30 42 -49 -31 4
$$ [...]
16383H9
##END NTUPLES=NMR FID
##END=
